##TITLE=1H_EC-3254(4-33)oc
 DMSO, 8 sc, 
 6.07.2021
##JCAMPDX= 6.0         $$ Bruker NMR JCAMP-DX V2.0
##DATA TYPE= NMR SPECTRUM
##DATA CLASS= NTUPLES
##ORIGIN= UXNMR, Bruker Analytische Messtechnik GmbH
##OWNER= root
$$ XWIN-NMR		Version 3.5
$$ Tue Jul  6 09:23:05 2021 Russian Standard Time (UT+4h)  she@DPX200
##.OBSERVE FREQUENCY= 200.131506
##.OBSERVE NUCLEUS= ^1H
##.ACQUISITION MODE= SIMULTANEOUS
##.ACQUISITION SCHEME= undefined
##.AVERAGES= 8
##.DIGITISER RES= 18
##SPECTROMETER/DATA SYSTEM= spect
##.PULSE SEQUENCE= zg30
##.SOLVENT NAME= DMSO
##.SHIFT REFERENCE= (INTERNAL, DMSO, 0, 17.5154)
##AUDIT TRAIL= $$ (NUMBER, WHEN, WHO, WHERE, WHAT)
$$ ##TITLE= Audit trail, XWIN-NMR		Version 3.5
$$ ##JCAMPDX= 5.01
$$ ##ORIGIN= Bruker BioSpin GmbH
$$ ##OWNER= she
$$ F:/spectra/data/she/nmr/H-F/1/pdata/1/auditp.txt
$$ ##AUDIT TRAIL=  $$ (NUMBER, WHEN, WHO, WHERE, WHAT)
(   1,<2021-07-06 09:21:19.09 +0400>,<she>,<DPX200>,
      <created by zg, POWCHK disabled, PULCHK disabled
       configuration hash MD5:
       00 E9 B6 7A A2 85 ED C7 34 08 36 98 17 FE 4E 26
       data hash MD5: 16K
       44 6C BE 3B 25 09 41 E6 44 EB B3 9B CA 59 A2 A8>)
(   2,<2021-07-06 09:21:21.42 +0400>,<she>,<DPX200>,
      <Start of raw data processing
       efp BC_mod = 2 LB = 0.24 FT_mod = 6 PKNL = 1 PHC0 = -11912.09 PHC1 = 10.40099 SI = 16K 
       data hash MD5: 16K
       14 DC B3 A3 1B A4 E2 67 20 26 5B A9 7B ED C1 D4>)
(   3,<2021-07-06 09:21:54.26 +0400>,<she>,<DPX200>,
      <pk PHC0 = -7.633973 PHC1 = 5.599999 
       data hash MD5: 16K
       8A A0 E7 B8 99 FE 45 F2 EC 16 F9 35 89 C8 2F C9>)
(   4,<2021-07-06 09:21:58.04 +0400>,<she>,<DPX200>,
      <abs ABSG = 5 
       data hash MD5: 16K
       CA 56 F8 65 68 94 F0 2F 51 40 47 23 2D 8E 95 90>)
$$ ##END=
$$ 
$$ hash MD5
$$ 13 72 2C F2 1D F2 2B 1E 28 E6 20 6A F4 52 1B C8
##$RELAX= 
##$RELAX= 
##$RELAX= 
##$RELAX= 
##$RELAX= 
##$RELAX= 
$$ Bruker specific parameters
$$ --------------------------
##$DU= <F:/spectra>
##$EXPNO= 1
##$NAME= <H-F>
##$PROCNO= 1
##$TYPE= <nmr>
##$USER= <she>
##$AMP= (0..31)
100 100 100 100 100 100 100 100 100 100 100 100 100 100 100 100 100 100 
100 100 100 100 100 100 100 100 100 100 100 100 100 100 
##$AQSEQ= 0
##$AQ_mod= 1
##$AUNM= <au_zg>
##$AUTOPOS= <>
##$BF1= 200.13
##$BF2= 200.13
##$BF3= 200.13
##$BF4= 200.13
##$BF5= 200.13
##$BF6= 200.13
##$BF7= 200.13
##$BF8= 200.13
##$BYTORDA= 1
##$CFDGTYP= 0
##$CFRGTYP= 5
##$CHEMSTR= <none>
##$CNST= (0..31)
1 1 145 1 1 1 1 1 1 1 1 1 1 1 1 1 1 1 1 1 1 1 1 1 1 1 1 1 1 1 1 1 
##$CPDPRG= <>
##$CPDPRG1= <>
##$CPDPRG2= <>
##$CPDPRG3= <>
##$CPDPRG4= <mlev>
##$CPDPRG5= <mlev>
##$CPDPRG6= <mlev>
##$CPDPRG7= <mlev>
##$CPDPRG8= <mlev>
##$CPDPRGB= <>
##$CPDPRGT= <>
##$D= (0..31)
0 1.2 0 0 0 0 0 0 0 0.06 0 0.03 0 0 0 0 0.0002 0 0 0 0 0 0 0 0 0 0 0 0 
0 0 0 
##$DATE= 1625548878
##$DBL= (0..7)
120 120 120 120 120 120 120 120 
##$DBP= (0..7)
150 150 150 150 150 150 150 150 
##$DBP07= 0
##$DBPNAM0= <>
##$DBPNAM1= <>
##$DBPNAM2= <>
##$DBPNAM3= <>
##$DBPNAM4= <>
$$ [...]
##$SUBNAM3= <"">
##$SUBNAM4= <"">
##$SUBNAM5= <"">
##$SUBNAM6= <"">
##$SUBNAM7= <"">
##$SUBNAM8= <"">
##$SUBNAM9= <"">
##$SW= 20.0188882624521
##$SWIBOX= (0..15)
0 0 2 0 0 0 0 0 0 0 0 0 0 0 0 0 
##$SW_h= 4006.41025641026
##$TD= 16384
##$TD0= 1
##$TE= 0
##$TE2= 300
##$TE3= 300
##$TEG= 300
##$TL= (0..7)
0 120 120 120 120 120 120 120 
##$TP= (0..7)
150 150 150 150 150 150 150 150 
##$TP07= 0
##$TPNAME0= <>
##$TPNAME1= <>
##$TPNAME2= <>
##$TPNAME3= <>
##$TPNAME4= <>
##$TPNAME5= <>
##$TPNAME6= <>
##$TPNAME7= <>
##$TPOAL= (0..7)
0.5 0.5 0.5 0.5 0.5 0.5 0.5 0.5 
##$TPOFFS= (0..7)
0 0 0 0 0 0 0 0 
##$TUNHIN= 0
##$TUNHOUT= 0
##$TUNXOUT= 0
##$USERA1= <user>
##$USERA2= <user>
##$USERA3= <user>
##$USERA4= <user>
##$USERA5= <user>
##$V9= 5
##$VALIST= <valist>
##$VCLIST= <CCCCCCCCCCCCCCC>
##$VD= 0
##$VDLIST= <DDDDDDDDDDDDDDD>
##$VPLIST= <PPPPPPPPPPPPPPP>
##$VTLIST= <TTTTTTTTTTTTTTT>
##$WBST= 1024
##$WBSW= 4
##$XGAIN= (0..3)
0 0 0 0 
##$XL= 0
##$YL= 0
##$YMAX_a= 91011
##$YMIN_a= -118277
##$ZGOPTNS= <>
##$ZL1= 120
##$ZL2= 120
##$ZL3= 120
##$ZL4= 120
##$ABSF1= 17.50199
##$ABSF2= -2.51705
##$ABSG= 5
##$ABSL= 3
##$ALPHA= 0
##$AQORDER= 0
##$ASSFAC= 0
##$ASSFACI= 0
##$ASSFACX= 0
##$ASSWID= 0
##$AUNMP= <proc_1d>
##$AZFE= 0.1
##$AZFW= 0.1
##$BCFW= 0
##$BC_mod= 2
##$BYTORDP= 0
##$COROFFS= 0
##$CY= -3
##$DATMOD= 1
##$DC= 0
##$DFILT= <>
##$DTYPP= 0
##$F1P= 0
##$F2P= 0
##$FCOR= 1
##$FTSIZE= 16384
##$FT_mod= 6
##$GAMMA= 0
##$GB= 0
##$INTBC= 1
##$INTSCL= 1.334414e-10
##$ISEN= 128
##$LB= 0.24
##$LEV0= 0
##$LPBIN= 0
##$MAXI= 10000
##$MC2= 0
##$MEAN= 0
##$ME_mod= 0
##$MI= 1.114404
##$NCOEF= 0
##$NC_proc= -7
##$NLEV= 6
##$NOISF1= 3.799351
##$NOISF2= 2.8
##$NSP= 0
##$NTH_PI= 0
##$NZP= 0
##$OFFSET= 17.51544
##$PC= 1
##$PHC0= -11919.72
##$PHC1= 16.00099
##$PH_mod= 1
##$PKNL= yes
##$PPARMOD= 0
##$PSCAL= 0
##$PSIGN= 0
##$REVERSE= no
##$SF= 200.130003840109
##$SI= 16384
##$SIGF1= 3
##$SIGF2= 2
##$SINO= 5.538805
##$SIOLD= 16384
##$SREGLST= <1H.CDCl3>
##$SSB= 0
##$STSI= 16384
##$STSR= 0
##$SW_p= 4006.41025641026
##$SYMM= 0
##$S_DEV= 0
##$TDeff= 16384
##$TDoff= 0
##$TI= <>
##$TILT= no
##$TM1= 0
##$TM2= 0
##$TOPLEV= 0
##$USERP1= <user>
##$USERP2= <user>
##$USERP3= <user>
##$USERP4= <user>
##$USERP5= <user>
##$WDW= 1
##$XDIM= 16384
##$YMAX_p= 484354401
##$YMIN_p= -673705
$$ End of Bruker specific parameters
$$ ---------------------------------
##NTUPLES= NMR SPECTRUM
##VAR_NAME=  FREQUENCY,     SPECTRUM/REAL,   SPECTRUM/IMAG
##SYMBOL=    X,             R,               I
##VAR_TYPE=  INDEPENDENT,   DEPENDENT,       DEPENDENT
##VAR_FORM=  AFFN,          ASDF,            ASDF
##VAR_DIM=   16384,         16384,           16384
##UNITS=     HZ,            ARBITRARY UNITS, ARBITRARY UNITS
##FACTOR=    0.24454680195387, 1,            1
##FIRST=     3505.36507189606, 0,            0
##LAST=      -501.045184514204, 0,           0
##MIN=       -501.045184514204, -673705,     0
##MAX=       3505.36507189606, 484354401,    0
$$ Real data points
##PAGE= N=1
##DATA TABLE= (X++(R..R)), XYDATA
$$ [...]
$$ plain form
7967 265102 470951 428721 578784 276892 397934 307467 195595 197894 63624 285482
7957 285482 280708 118835 175560 256161 259172 24072 216272 489787 613253 573444 450255
7946 450255 431123 439791 343824 92257 264143 322400 270577 379369 290082 68391 111836
7935 111836 80470 502487 266119 -6256 893 15346 62778 136404 216982 259227 26480
7924 26480 53407 297855 367223 245933 158348 52761 221340 367278 275075 259872 364734
7913 364734 249460 246848 164861 99983 19344 134688 232604 271075 309416 6933 245752
7902 245752 142210 168549 229583 354728 408336 441977 537312 384269 226498 240065 148507
7891 148507 225176 391521 357038 345998 287763 497210 503191 541532 544675 561884 535355 426433
$$ packed form
7967B65102K05849m2230J50063l01892J21042r0467j11872K299j34270K21858
7957B85482m774j61873N6725Q0601L011k35100J92200K73515J23466l9809j23189
7946D50255j9132Q668r5967k51567J71886N8257n1823J08792q9287k21691M3445
7935A11836l1366M22017k36368k72375P149J4453M7432P3626Q0578M2245k32747
7924B6480K6927K44448O9368j21290q7585j05587J68579J45938r2203j5203J04862
7913C64734j15274k612q1987o4878q0639J15344R7916L8471L8341l02483K38819
7902B45752j03542K6339O1034J25145N3608L3641R5335j53043j57771J3567r1558
7891A48507P6669J66345l4483j1040n8235K09447N981L8341L143J7209k6529j08922
$$ plain form
7879 426433 96259 378248 512120 406897 594986 461315 347123 251867 361912 299598
7869 299598 125419 226875 332619 235332 251390 267504 310104 463256 501402 519114 558652
7858 558652 355583 380685 165217 311122 460342 186135 83200 183227 208010 110026
7848 110026 29689 338085 466434 1042734 952585 856140 729222 511371 474997 331227
7838 331227 664452 558342 528052 557848 681369 497830 529739 523918 522473 445300 270769
7827 270769 284006 382742 382361 330868 372259 248034 -14771 362745 452092 260540 397284
7816 397284 365780 204829 377263 274450 137209 395771 246804 54325 181204 457576
7806 457576 461296 347224 61478 136856 379417 324838 432828 273497 309806 336710 381092
$$ packed form
7879D26433l30174K81989J33872j05223J88089j33671j14192r5256J10045o2314
7869B99598j74179J01456J05744r7287J6058J6114M2600J53152L8146J7712L9538
7858E58652k03069K5102k15468J45905J49220k74207j02935J00027K4783r7984
7848A10026q0337L08396J28349N76300r0149r6445j26918k17851l6374j43770
7838C31227L33225j06110l0290K9796J23521j83539L1909n821j445p7173j74531
7827B70769J3237R8736l81n1493M1391j24225k62805L77516Q9347j91552J36744
7816C97284l1504j60951J72434j02813j37241K58562j48967j92479J26879K76372
7806D57576L720j14072k85746P5378K42561n4579J07990j59331L6309K6904M4382
$$ plain form
7795 381092 232406 300603 413276 401478 400749 476081 373794 328688 396093 292013 181037
7784 181037 457109 396850 134418 61754 114207 319387 107760 146016 495413 493615 528741
7773 528741 295516 329462 238184 94582 476933 256352 152672 38001 292692 288622
7763 288622 333716 446469 501485 451120 330886 474119 518127 411518 460729 278765 246248
7752 246248 185065 357824 286693 64373 104755 259292 321785 31272 -57685 181196 317914
7741 317914 329908 220871 327137 473361 172730 198528 147497 200063 458141 324942
7731 324942 436323 474176 469380 624549 418498 241530 255822 608047 528460 381197 513418
7720 513418 559065 377255 244701 420084 498830 397828 536843 633842 414559 436248
$$ packed form
7795C81092j48686O8197J12673j1798p29P5332j02287m5106O7405j04080j10976
7784A81037K76072o0259k62432p2664N2453K05180k11627L8256L49397j798L5126
7773E28741k33225L3946r1278j43602L82351k20581j03680j14671K54691m070
7763B88622M5094J12753N5016n0365j20234J43233M4008j06609M9211j81964l2517
7752B46248o1183J72759p1131k22320M0382J54537O2493k90513q8957K38881J36718
7741C17914J1994j09037J06266J46224l00631K5798n1031N2566K58078j33199
7731C24942J11381L7853m796J55169k06051j76968J4292L52225p9587j47263J32221
7720E13418M5647j81810j32554J75383P8746j01002J39015R6999k19283K1689
$$ plain form
7710 436248 384821 526372 505034 275447 288053 221464 268626 260417 457145 396669 440791
7699 440791 596953 571662 427058 702064 622358 395716 434373 438433 564271 387881 454845
7688 454845 600754 728709 552701 371174 410282 489370 628845 462789 526179 405961
7678 405961 537640 713068 626391 515374 328950 673473 782396 786825 604579 678065
7668 678065 405415 308385 613197 770954 725902 434287 392880 302575 220999 31909 67399
7657 67399 251594 182011 338891 75709 47515 218290 412980 614582 689512 561107
7647 561107 430717 457370 346071 200157 295009 227079 183065 144810 369116 477692 538405
7636 538405 637450 551965 426845 389699 352463 265225 213342 -95687 -7568 154335 297651
$$ packed form
7710D36248n1427J41551k1338k29587J2606o6589M7162q209J96728o0476M4122
7699D40791J56162k5291j44604K75006p9706k26642L8657M060J25838j76390O6964
7688D54845J45909J27955j76008j81527L9108P9088J39475j66056O3390j20218
7678D05961J31679J75428q6677j11017j86424L44523J08923M429j82246P3486
7668F78065k72650r7030L04812J57757m5052k91615m1407r0305q1576j89090L5490
7657F7399J84195o9583J56880k63182k8194J70775J94690K01602P4930j28405
7647E61107j30390K6653j11299j45914R4852o7930m4014l8255K24306J08576O0713
7636E38405R9045q5485j25120l7146l7236q7238n1883l09029Q8119J61903J43316
$$ plain form
7625 297651 194147 125903 81197 337527 367555 347162 229206 18945 149673 50322 172143
7614 172143 256220 59652 231008 164619 181066 95671 89817 180857 257078 281484 179724
7603 179724 122370 162865 100379 -88453 69829 163735 61841 180842 -6559 80144 125851
7592 125851 29876 -140455 67252 215985 32512 -54683 85111 378268 403134 328856
7582 328856 176721 169817 4434 -10056 -115657 -145252 2818 48286 -50900 33583 64043
7571 64043 -78762 112708 138261 40414 279329 259786 288705 107296 -56197 149720 236436
7560 236436 136168 190423 347471 98918 1611 35856 -139400 47526 138705 -99339
7550 -99339 -93216 -16777 153250 -51632 -133786 -59641 -131301 -293179 13768 -2410 -192419
$$ packed form
7625B97651j03504o8244m4706K56330L0028k0393j17956k10261J30728r9351J21821
7614A72143Q4077j96568J71356o6389J6447q5395n854R1040P6221K4406j01760
7603A79724n7354M0495o2486j88832J58282R3906j01894J19001j87401Q6703M5707
7592A25851r5975j70331K07707J48733j83473q7195J39794K93157K4866p4278
7582C28856j52135o904j65383j4490j05601k9595J48070M5468r9186Q4483L0460
7571F4043j42805J91470K5553r7847K38915j9543K8919j81409j63493K05917Q6716
7560B36436j00268N4255J57048k48553r7307L4245j75256J86926R1179k38044
7550i9339O123P6439J70027k04882q2154P4145p1660j61878L06947j6178j90009
$$ plain form
7539 -192419 -91522 -78564 -244577 -51281 -226475 -79123 223311 -139463 -95659 -40463
7529 -40463 93128 23877 40429 26796 41982 340083 161026 117941 78066 12796 27451
7518 27451 -45517 -223360 -92668 140373 -13766 -228731 -491885 -174805 -48764 71509
7508 71509 124711 -107422 -86999 74151 -67808 13423 1422 187615 164848 144296 -49414
7497 -49414 -5437 -59131 -19284 -212375 -70865 -32071 -191349 25096 221069 37207 -4058
7486 -4058 128686 201422 113969 -116160 -95062 2138 -7047 -174536 -58120 -104519 -128788
7475 -128788 -219743 -294661 -172425 -133652 -132099 -151608 -194005 -240659 -374549 -249375 -189707
7464 -189707 -97199 -82401 -153940 -27858 40428 -160829 -131183 121421 328881 260579 30949
$$ packed form
7539a92419J00897J2958j66013J93296j75194J47352L02434l62774M3804N5196
7529d0463J33591o9251J6552j3633J5186K98101j79057m3085l9875o5270J4655
7518B7451p2968j77843J30692K33041j54139k14965k63154L17080J26041J20273
7508G1509N3202k32133K0423J61150j41959Q1231j2001J86193k2767k0552j93710
7497d9414M3977n3694L9847j93091J41510L8794j59278K16445J95973j83862m1265
7486d058J32744P2736q7453k30129K1098R7200r185j67489J16416m6399k4269
7475a28788r0955p4918J22236L8773J553j9509m2397m6654j33890J25174N9668
7464a89707R2508J4798p1539J26082O8286k01257K9646K52604K07460o8302k29630
$$ plain form
7453 30949 -13618 -108107 206934 191828 96003 145334 -55328 -99790 -196920 -91854 35647
7442 35647 43313 -157410 42799 34933 53785 85732 186599 142538 -84759 -97478 53637
7431 53637 -21645 43631 307972 294776 31076 -58183 180014 32379 13413 -64454 -248468
7420 -248468 -71634 -36169 -150383 -334857 -211606 -242453 -305176 -122933 -123870 -66782 27200
7409 27200 4536 -152054 -95425 -164707 -268790 -133250 -45380 46394 16024 48184 -155280
7398 -155280 -75224 236481 319200 131801 -73781 176841 200215 92836 169215 64130
7388 64130 99697 29298 -111426 -114936 120839 338155 218630 337664 93917 -58198 122532
7377 122532 37243 -93403 7247 -55378 -364153 -196509 -34439 -59071 -256509 -275715
$$ packed form
7453C0949m4567r4489L15041j5106r5825M9331k00662m4462r7130J05066J27501
7442C5647P666k00723K00209p866J8852L1947J00867m4061k27297j2719J51115
7431E3637p5282O5276K64341j3196k63700q9259K38197j47635j8966p7867j84014
7420b48468J76834L5465j14214j84474J23251l0847o2723J82243r37N7088R3982
7409B7200k2664j56590N6629o9282j04083J35540Q7870R1774l0370L2160k03464
7398a55280Q0056L11705Q2719j87399k05582K50622K3374j07379P6379j05085
7388F4130L5567p0399j40724l510K35775K17316j19525J19034k43747j52115J80730
7377A22532q5289j30646J00650o2625l08775J67644J62070k4632j97438j9206
$$ plain form
7367 -275715 -426397 -510459 4330 236632 142943 116277 -127777 -242430 -296482 -277002 -92849
7356 -92849 -22520 5882 -156334 -97644 -117073 145869 279506 -122500 -155614 -85895 -25964
7345 -25964 145541 94891 156142 221689 12877 -281581 -229072 -75970 -133170 6503 -73239
7334 -73239 53219 177513 67622 -125447 -400584 -444568 -150119 -111232 -135506 -202165 -8055
7323 -8055 122964 38950 -122242 -15653 136668 67628 -115705 -74602 -100195 -125444 -20098
7312 -20098 4917 168333 125997 109282 -334417 -307305 -112131 121653 -115449 -65099 -247708
7301 -247708 -374879 -383713 -182242 -127080 -72822 2462 6747 3847 -9241 -24055 156937 186174
7289 186174 217230 114579 -223471 2644 -128188 -282556 -166520 -166057 221583 250283 189889
$$ packed form
7367b75715j50682q4062N14789K32302r3689k6666k44054j14653n4052J9480J84153
7356i2849P0329K8402j62216N8690j9429K62942J33637m02006l3114O9719N9931
7345b5964J71505n0650O1251O5547k08812k94458N2509J53102n7200J39673p9742
7334g3239J26458J24294j09891j93069k75137m3984K94449L8887k4274o6659J94110
7323h055J31019q4014j61192J06589J52321o9040j83333M1103k5593k5249J05346
7312b0098K5015J63416m2336j6715m43699K7112J95174K33784k37102N0350j82609
7301b47708j27171q834K01471N5162N4258P5284M285k900j3088j4814J80992K9237
7289A86174L1056j02651l38050K26115j30832j54368J16036M63L87640K8700o0394
$$ plain form
7278 189889 -37023 -196127 -90895 -159467 -189023 -160178 -48111 130044 224327 -26207
7268 -26207 66902 22714 97430 247878 177527 -37968 -186116 -158411 -28508 -98122 169341
7257 169341 104081 -242667 -364270 -66703 11740 -5212 44193 96261 25394 145452 128613
7246 128613 -44511 -16824 109432 24864 11673 86296 75649 165232 -73351 38246 85291
7235 85291 -60754 -30565 -101821 137461 104198 -73482 -65676 -220503 -258810 -19637 49184
7224 49184 -33560 -345247 -297664 57450 163620 245254 87872 -4 -111212 8929 90061
7213 90061 35940 -486 -170722 -170926 -148677 -248281 131090 31688 49873 -45185 -93372 -58681
7201 -58681 -138364 79971 156945 26112 -72290 -41947 -149246 -131598 -158226 -175102 -207608
$$ packed form
7278A89889k26912j59104J05232o8572k9556K8845J12067J78155R4283k50534
7268b6207R3109m4188P4716J50448p0351k15495j48148K7705J29903o9614K67463
7257A69341o5260l46748j21603K97567P8443j6952M9405N2068p0867J20058j6839
7246A28613j73124K7687J26256q4568j3191P4623j0647Q9583k38583J11597M7045
7235H5291j46045L0189p1256K39282l3263j77680P806j54827l8307K39173O8821
7224D9184q2744l11687M7583L55114J06170Q1634j57382q7876j11208J20141Q1132
7213I0061n4121l6426j70236k04K2249r9604L79371r9402J8185r5058m8187L4691
7201e8681p9683K18335P6974j30833r8402L0343j07299J7648k6628j6876l2506
$$ plain form
7190 -207608 -35486 -146088 -181388 -109105 -12897 -385 -167368 -67561 -87325 -160068 -76290
7179 -76290 -122978 -305398 -291017 -119301 -350325 -240121 3140 -187085 -129272 42139
7169 42139 111858 -80069 -156044 -34969 57768 -47145 -121555 -216554 -202955 -86218 -129280
7158 -129280 -271054 -295261 -184565 -41674 -81484 -186818 -48531 -58409 36519 60662 104211
7147 104211 14244 -41631 10142 -131724 -134649 38836 2155 -158057 -332419 -189477 513
7136 513 4486 -69399 -97229 -32784 -94114 -117646 113062 82767 -216786 -89354 -62602 -254834
7124 -254834 -155594 138006 92501 -66024 -82606 -149485 65791 80703 -139491 132779 16979
7113 16979 170959 44198 -199884 -34241 42787 16897 -54944 205522 319142 72102
$$ packed form
7190b07608J72122j10602l5300P2283R6208J2512j66983R9807j9764p2743Q3778
7179g6290m6688j82420J4381J71716k31024J10204K43261j90225N7813J71411
7169D2139O9719j91927p5975J21075R2737j04913p4410r4999J3599J16737m3062
7158a29280j41774k4207J10696J42891l9810j05334J38287r878R4928K4143M3549
7147A04211q9967n5875N1773j41866k925J73485l6681j60212j74362J42942J89990
7136E13L973p3885k7830O4445o1330k3532K30708l0295k99553J27432K6752j92232
7124b54834R9240K93600m5505j58525j6582o6879K15276J4912k20194K72270j15800
7113A6979J53980j26761k44082J65643P7028k5890p1841K60466J13620k47040
$$ plain form
7103 72102 81570 175648 -312229 -120606 -5588 -297446 -341269 -456563 -504086 -223790 -234086
7092 -234086 -272268 -139439 9130 202661 102960 30685 -60550 -140980 -90930 -167570 -138200
7081 -138200 -47800 -172851 -180088 -280307 178389 125147 -81863 25617 248090 173073 -100636
7070 -100636 -150254 36697 922 -187293 -274418 -224312 -121787 -147676 -28477 -38483 -48697
7059 -48697 -143487 17574 76304 26078 -154505 -292434 -349864 -381288 -176559 145415 -191789
7048 -191789 -329467 50767 5153 -101272 -61874 -311548 -319114 -135788 -1458 97379 47608
7037 47608 -181745 -291281 -302053 -262383 -269323 -179902 -248112 -197952 1900 163992 27185
7026 27185 -326483 -219103 -124394 -70713 -159312 -31274 164403 15801 63069 -17079 23623
$$ packed form
7103G2102R468R4078m87877J91623J15018k91858m3823j15294m7523K80296j0296
7092b34086l8182J32829J48569J93531r9701p2275r1235q0430N0050p6640K9370
7081a38200R0400j25051p237j00219M58696n3242k07010J07480K22473p5017k73709
7070a00636m9618J86951l5775j88215q7125N0106J02525k5889J19199j0006j0214
7059d8697r4790J61061N8730n0226j80583j37929n7430l1424K04729L21974l37204
7048a91789j37678L80234m5614j06425L9398k49674p566J83326J34330R8837m9771
7037D7608k29353j09536j0772L9670o940Q9421o8210N0160J99852J62092j36807
7026B7185l53668J07380R4709N3681q8599J28038J95677j48602M7268q0148M0702
$$ plain form
7015 23623 134386 71704 49993 -50928 -77834 17866 -233546 -165739 -149961 -327402 13954
7004 13954 -78640 -196917 -133382 -154703 -31581 -72126 5113 -38115 125291 81297 -46621
6993 -46621 -41294 -208865 -112276 -170036 -11543 21934 277548 109486 54999 -7291 144150
6982 144150 73735 -102681 -195227 -332028 -153593 -13213 -5382 30528 -328792 -257951 -242003
6971 -242003 32779 27848 -163876 -22665 2242 6268 -196286 -223733 -361281 -295875 -183913
6960 -183913 -187328 -88985 -48308 -133232 -274499 -340311 -254050 -62898 -71573 -169014 -267766 -139335
6948 -139335 47067 -198045 -172108 -94462 -71021 -49280 26879 52730 43579 150575 -3739
6937 -3739 -107753 22905 -51615 -26878 -99372 -45807 -125812 -240691 -140714 -134198 -175216 -149966
$$ packed form
7015B3623J10763o2682k1711j00921k6906R5700k51412O7807J5778j77441L41356
7004A3954r2594j18277O3535k1321J23122m0545P7239m3228J63406m3994j27918
6993d6621N327j67571R6589n7760J58493L3477K55614j68062n4487o2290J51441
6982A44150p0415j76416r2546j36801J78435J40380P831L5910l59320P0841J5948
6971b42003K74782m931j91724J41211K4907M026k02554k7447j37548O5406J11962
6960a83913l415R8343M0677q4924j41267o5812Q6261J91152q675r7441r8752J28431
6948a39335J86402k45112K5937P7646K3441K1741P6159K5851r151J06996j54314
6937c739j04014J30658p4520K4737p2494N3565q0005j14879R9977O516m1018K5250
$$ plain form
6925 -149966 -125517 -112560 25026 91861 -116107 46341 276965 185913 -73069 -222575
6915 -222575 -196666 164048 146863 206225 53868 60389 186215 -2844 -88419 -112339 7
6904 7 -424409 -247183 27628 12238 201306 -286790 -137982 -226436 -72402 -233375 -253036
6893 -253036 105002 220695 233400 64247 60541 -95367 -73697 -4306 -30914 79428 -16182
6882 -16182 -161456 -382581 -203839 -39353 -103286 -225883 -336556 -168579 -105086 -103941 -254250
6871 -254250 -51602 -16669 -203963 -71317 -197904 -238884 -200797 -135252 61683 -89090
6861 -89090 -168647 172328 -102710 -229195 -153542 -99576 -7312 -3612 -45336 -278306 -13318
6850 -13318 -293656 -202738 -98997 69086 199961 97420 56610 -124893 -45795 -173634
$$ packed form
6925a49966K4449J2957J37586O6835k07968J62448K30624r1052k58982j49506
6915b22575K5909L60714j7185N9362j52357O521J25826j89059q5575k3920J12346
6904Gm24416J77226K74811j5390J89068m88096J48808q8454J54034j60973j9661
6893b53036L58038J15693J2705j69153l706j55908K1670O9391k6608J10342r5610
6882a6182j45274k21125J78742J64486o3933j22597j10673J67977O3493J145j50309
6871b54250K02648L4933j87294J32646j26587m0980L8087O5545J96935j50773
6861h9090p9557L40975k75038j26485P5653N3966R2264L700m1724k32970K64988
6850a3318k80338R0918J03741J68083J30875j02541m0810j81503P9098j27839
$$ plain form
6840 -173634 -145734 20871 -72471 -112282 -565698 -305144 -24666 -84326 -321968 -258309 -236415
6829 -236415 -365874 -302366 -12538 -63167 -117346 -184440 -202410 68698 212469 90956 -17715
6818 -17715 -127045 120047 -98504 166656 196440 95329 -24972 -218116 -198555 -118563
6808 -118563 41893 -25082 -40520 -44807 114562 6016 -87353 -141568 -344149 -357388 -236640
6797 -236640 -226893 -78412 -167944 -297702 -98792 61971 -125354 -179288 -34396 -68665 -271353
6786 -271353 -247371 -270754 -271513 -190102 -161141 -32507 33932 107478 -15219 -216263 -73377
6775 -73377 -151306 -224946 103196 -966 -11396 104754 77706 -72887 -57081 -18092 -70010
6764 -70010 22957 -65670 111711 -128811 -79074 -113131 211987 260871 212176 136980 83033
$$ packed form
6840a73634K7900J66605r3342l9811m53416K60554K80478n9660k37642O3659K1894
6829b36415j29459O3508K89828n0629n4179o7094j7970K71108J43771j21513j08671
6818a7715j09330K47092k18551K65160K9784j01111j20301j93144J9561P9992
6808a18563J60456o6975j5438m287J59369j08546r3369n4215k02581j3239J20748
6797b36640R747J48481q9532j29758J98910J60763j87325n3934J44892l4269k02688
6786b71353K3982k3383p59Q1411K8961J28634O6439P3546j22697k01044J42886
6775g3377p7929p3640L28142j04162j0430J16150k7048j50593J5806L8989n1918
6764g0010R2967q8627J77381k40522M9737l4057L25118M8884m8695p5196n3947
$$ plain form
6753 83033 -162840 -31321 -137233 -188578 -2378 79250 50454 -120821 -19764 33552 -210858
6742 -210858 -148380 -210751 -105969 -61195 3721 133618 83201 281252 116105 157268 216418
6731 216418 303865 -84245 -148611 17767 194418 174482 -42558 -84946 -67443 98697 4150
6720 4150 -12908 -97018 -157125 -1637 -7394 -184524 -12472 -78838 -62399 -307255 -274073
6709 -274073 158832 72310 -143309 -68095 -111524 -282437 -180540 -106824 123839 -2040
6699 -2040 -237027 -215967 16600 -64160 110971 211966 140362 -121975 -93346 -27125 -10656
6688 -10656 -38171 -25309 386654 105063 -97569 -78532 17698 -3204 64538 -172709 -154876
6677 -154876 -32565 -108594 7174 -29411 -35752 11488 16024 -192931 -123144 -259908 -221604
$$ packed form
6753H3033k45873J31519j05912n1345J86200Q1628k8796j71275J01057N3316k44410
6742b10858O2478o2371J04782M4774O4916J29897n0417J98051j65147M1163N9150
6731B16418Q7447l88110o4366J66378J76651j9936k17040m2388J7503J66140r4547
6720D150j7058q4110o0107J55488n757j77130J72052o6366J6439k44856L3182
6709b74073M32905q6522k15619P5214m3429j70913J01897P3716K30663j25879
6699b040k34987K1060K32567q0760J75131J00995p1604k62337K8629O6221J6469
6688a0656k7515J2862M11963k81591k02632J9037R6230k0902O7742k37247J7833
6677a54876J22311p6029J15768l6585o341M7240M536k08955O9787j36764L8304
$$ plain form
6666 -221604 -248263 -149862 -74821 1528 -154175 -108136 -22867 109147 272367 84108 -81098
6655 -81098 -184623 13685 162639 46695 12387 -107373 -72209 -116608 -41726 -19143 -145281
6644 -145281 -203895 -110740 18532 99645 137515 -164785 -69170 -108418 -47455 66268 -6488
6633 -6488 38200 -27629 -33178 -44554 135991 56385 -75981 -35550 -61055 -12753 217369 94034
6621 94034 15331 -110293 -233036 -391658 -445090 -82535 -148078 -10515 12938 28991 100363
6610 100363 -233574 -261621 21488 -197483 -319427 -240846 -133992 -90032 -69666 34400
6600 34400 120210 -61630 -197936 104224 -57361 -147977 -4107 -56490 91928 -101705
6590 -101705 167761 113661 55965 -77667 -224733 -121957 -228414 -235479 -118328 160015
$$ packed form
6666b21604k6659R8401P5041P6349j55703M6039Q5269J32014J63220j88259j65206
6655h1098j03525J98308J48954j15944l4308j19760L5164m4399P4882K2583j26138
6644a45281n8614R3155J29272Q1113L7870l02300R5615l9248O0963J13723p2756
6633f488M4688o5829n549j1376J80545p9606j32366M0431k5505M8302K30122j23335
6621I4034p8703j25624j22743j58622n3432L62555o5543J37563K3453J6053P1372
6610A00363l33937k8047K83109k18971j21944P8581J06854M3960K0366J04066
6600C4400Q5810j81840j36306L02160j61585r0616J43870n2383J48418j93633
6590a01705K69466n4100n7696j33632j47066J02776j06457p065J17151K78343
$$ plain form
6580 160015 -34456 -11444 -114851 -63182 -43005 -219721 -205859 -196607 -166596 6167 -56268
6569 -56268 -120607 -76722 -82302 -46448 155335 88577 22832 -29703 -192080 106379 60632
6558 60632 33201 -8046 -205102 -268291 -33680 -61291 -106295 -232539 -117037 -91812 -1552
6547 -1552 -151197 -309003 -168730 -33903 71594 -225197 1587 -114181 12135 23470
6537 23470 46955 32179 129174 195905 -19482 9286 -193201 -265631 -301088 -39812 90095
6526 90095 197553 151898 12756 101322 99086 71863 302226 102746 -81349 -227906 -56644
6515 -56644 284603 173031 174481 229062 38295 75447 226321 70244 33179 216158 178767
6504 178767 101142 36349 -206623 -106114 -170880 -127035 -11839 17768 129006 279600 -102730
$$ packed form
6580A60015j94471K3012j03407N1669K0177j76716J3862R252L0011J72763o2435
6569e6268o4339M3885n580L5854K01783o6758o5745n2535j62377K98459m5747
6558F0632k7431m1247j97056o3189K34611k7611m5004j26244J15502K5225R0260
6547a552j49645j57806J40273J34827J05497k96791K26784j15768J26316J1335
6537B3470K3485j4776R6995O6731k15387K8768k02487p2430l5457K61276J29907
6526I0095J07458m5655j39142Q8566k236k7223K30363j99480j84095j46557J71262
6515e6644L41247j11572J450N4581j90767L7152J50874j56077l7065J82979l7391
6504A78767p7625o4793k42972J00509o4766M3845J15196K9607J11238J50594l82330
$$ plain form
6493 -102730 -79577 -79675 -33624 -129126 136382 56350 -108227 8298 -99249 -46194 -15730
6482 -15730 81647 92020 53884 48792 76273 53206 272802 25731 95125 46098 31933 108606
6470 108606 230453 126091 -175540 -195899 -76838 -129449 -149984 42117 230150 194840
6460 194840 139083 185670 220274 -1338 18184 -7503 -39698 -17155 153497 96407 -22168
6449 -22168 62946 58784 182647 220727 423701 431309 304226 33484 113522 99645 -46909
6438 -46909 -53854 -101041 -25828 -25056 -190823 -17358 453 -44870 18972 194785 568 57165
6426 57165 -221204 -351231 44978 6864 2133 19559 58312 -73972 128777 87665 10704
6415 10704 26273 -24993 -31691 28298 -50038 -253922 -198276 -97860 -145611 -16184 19039
$$ packed form
6493a02730K3153r8M6051r5502K65508q0032j64577J16525j07547N3055L0464
6482a5730R7377J0373l8136n092K7481k3067K19596k47071O9394m9027j4165P6673
6470A08606J21847j04362l01631k0359J19061n2611k0535J92101J88033l5310
6460A94840n5757M6587L4604k21612J9522k5687l2195K2543J70652n7090j18575
6449b2168Q5114m162J23863L8080K02974P608j27083k70742Q0038j3877j46554
6438d6909o945m7187P5213P72j65767J73465J7811m5323O3842J75813j94217N6597
6426E7165k78369j30027L96209l8114m731J7426L8753j32284K02749m1112p6961
6415A0704J5569n1266o698N9989p8336k03884N5646J00416m7751J29427L5223
$$ plain form
6404 19039 -103852 -118952 -239075 -208233 -62630 -207094 -33626 -22654 -77166 -28928 75958
6393 75958 37336 11804 76860 129245 -137926 -76703 -21606 -185777 -76715 45444 21417
6382 21417 -142638 34171 -206225 -361836 -219304 -182982 -129894 -58261 -24072 160078 -30425
6371 -30425 19844 61513 273050 32133 -25099 191713 53252 -240153 -121857 -51137 337544
6360 337544 76597 24416 -52469 -60190 -52034 -123988 -34081 -141361 44608 -177003 82758
6349 82758 35138 -27582 -23390 -29211 42811 22391 -24156 -17176 16768 -136755 -182667 -56656
6337 -56656 19982 182592 228055 435217 393843 163268 214123 265577 -27514 3681 -106114
6326 -106114 -47246 -50378 219718 -57140 122183 62308 -246863 -127945 40829 79553 269677
$$ packed form
6404A9039j22891j5100j20123L0842J45603j44464J73468J0972n4512M8238J04886
6393G5958l8622k5532O5056N2385k67171O1223N5097j64171J09062J22159k4027
6382B1417j64055J76809k40396j55611J42532L6322N3088P1633L4189J84150j90503
6371c0425N0269M1669K11537k40917n7232K16812j38461k93405J18296P0720L88681
6360C37544k60947n2181p6885p721Q156p1954Q9907j07280J85969k21611K59761
6349H2758m7620o2720M192n821P2022k0420m6547O980L3944j53523m5912J26011
6337e6656P6638J62610M5463K07162m1374k30575N0855N1454k93091L1195j09795
6326a06114N8868l132K70096k76858J79323n9875l09171J18918J68774L8724J90124
$$ plain form
6315 269677 290078 156899 41847 211801 391157 197482 -25569 -61276 -146238 20423
6305 20423 283047 201095 -33020 -37402 106001 -43831 72804 5709 -66678 -165050 -59747
6294 -59747 110343 -86765 -98843 53834 78345 93493 253152 357133 194891 132603 134155
6283 134155 270572 -27762 44456 -161781 32541 -85219 21644 -21471 -262988 -151415
6273 -151415 -64660 -50992 -41805 -302949 -352632 120731 121820 -149100 -195348 -38514 147559
6262 147559 300431 412854 148692 105809 -28086 28671 -31499 -69168 8245 60790 156633
6251 156633 -71592 -152091 -102782 -25417 81854 23654 112773 324532 389178 290614 48806
6240 48806 149440 197765 253136 41424 -70211 -229931 -37758 -62627 -143407 121540 258436
$$ packed form
6315B69677K0401j33179j15052J69954J79356j93675k23051l5707q4962J66661
6305B0423K62624q1952k34115m382J43403j49832J16635o7095p2387r8372J05303
6294e9747J70090j97108j2078J52677K4511J5148J59659J03981j62242o2288J552
6283A34155J36417k98334P2218k06237J94322j17760J06863m3115k41517J11573
6273a51415Q6755J3668R187k61144m9683M73363J089k70920m6248J56834J86073
6262A47559J52872J12423k64162m2883j33895N6757o0170l7669P7413N2545R5843
6251A56633k28225q0499M9309P7365J07271n8200Q9119K11759O4646r8564k41808
6240D8806J00634M8325N5371k11712j11635j59720J92173k4869q0780K64947J36896
$$ plain form
6229 258436 258867 63517 27207 73038 31274 -81139 -44001 -215738 -179004 -130034 -109161
6218 -109161 46171 -41819 221446 137286 239728 133655 -20499 -75533 2149 218905
6208 218905 393845 31643 -179510 42681 118597 -195745 -92484 -63945 228471 327106
6198 327106 -32594 119067 4087 -244448 -139619 150560 176825 281855 223171 145029
6188 145029 239301 176133 22247 -13409 -107645 -30600 105030 257466 206534 127048 -103364
6177 -103364 -49225 -121747 -178814 -68937 -11201 -10863 -192928 -213536 80010 25976 90291
6166 90291 121503 92535 217128 148769 200004 51753 13749 -18124 306582 263441 -43579
6155 -43579 -20095 30099 -29370 36149 154152 292889 221585 -131722 -207057 -226180 -16988
$$ packed form
6229B58436M31j95350l6310M5831m1764j12413L7138j71737L6734M8970K0873
6218a09161J55332q7990K63265q4160J02442j06073j54154n5034P7682K16756
6208B18905J74940l62202k11153K22191P5916l14342J03261K8539K92416R8635
6198C27106l59700J51661j14980k48535J04829K90179K6265J05030n8684p8142
6188A45029R4272o3168j53886l5656r4236P7045J35630J52436n0932p9486k30412
6177a03364N4139p2522n7067J09877N7736L38j82065k0608K93546n4034O4315
6166I0291L1212k8968J24593o8359N1235j48251l8004l1873L24706m3141l07020
6155d3579K3484N0194n9469O5519J18003J38737p1304l53307p5335j9123K09192
$$ plain form
6144 -16988 82103 -145879 -96327 -112130 48251 259208 -148605 -349942 -259175 -88452 -39325
6133 -39325 -39432 70088 74552 -55168 -117000 -220091 -363676 -182532 162916 -10678 -44856
6122 -44856 -187353 78468 446735 369622 296312 69651 -124992 2747 41059 -36742 15591
6111 15591 -171064 -57269 -17763 203321 139787 160828 41719 21784 -119298 -36038 174532
6100 174532 80400 153322 212338 67308 -30951 -15971 9091 -35415 91162 272021 259817
6089 259817 76805 25221 158054 -17265 -143793 -212845 -14222 -183433 -178970 -169706 -210347
6078 -210347 -143806 -28813 -116201 -19972 69144 37285 94313 125783 93985 135904 106059
6067 106059 223760 159882 35066 -40803 -18017 124810 -45076 27802 222326 3577
$$ packed form
6144a6988R9091k27982M9552j5803J60381K10957m07813k01337R0767J70723M9127
6133c9325j07J09520M464j29720o1832j03091j43585J81144L45448j73594l4178
6122d4856j42497K65821L68267p7113p3310k26661j94643J27739L8312p7801N2333
6111A5591j86655J13795L9506K21084o3534K1041j19109j9935j41082Q3260K10570
6100A74532r4132P2922N9016j45030r8259J4980K5062m4506J26577J80859j2204
6089B59817j83012n1584J32833j75319j26528o9052J98623j69211M463R264m0641
6078b10347O6541J14993q7388R6229Q9116l1859N7028L1470l1798M1919k9845
6067A06059J17701o3878j24816p5869K2786J42827j69886P2878J94524k18749
$$ plain form
6057 3577 93576 100106 36886 -146733 -132187 34663 14573 -59368 10223 183307 160474 212025
6045 212025 18021 -2548 65258 194997 39489 76000 65069 143487 64500 220766 -46159
6034 -46159 -279572 -77104 -13128 -61722 170911 105180 -54356 370799 373382 63459 141320
6023 141320 343967 89121 134077 3340 115511 120575 91023 15633 30092 84811 105326
6012 105326 59764 142315 158316 170964 295527 123187 195200 104483 298548 133785 52900
6001 52900 71252 52861 244960 320387 240320 152638 -62252 -112956 267160 248788 297663
5990 297663 141422 -6715 103321 137268 112495 148182 -55395 -174677 -7985 137147
5980 137147 458045 404863 -61417 70907 32066 28519 109901 153351 52664 135188 172003
$$ packed form
6057C577Q9999O530o3220j83619J4546J66850k0090p3941O9591J73084k2833N1551
6045B12025j94004k0569O7806J29739j55508L6511j0931P8418p8987J56266k66925
6034d6159k33413K02468O3976m8594K32633o5731j59536M25155K583l09923P7861
6023A41320K02647k54846M4956j30737J12171N064k9552p5390J4459N4719K0515
6012A05326m5562Q2551J6001J2648J24563j72340P2013r0717J94065j64763q0885
6001E2900J8352j8391J92099P5427q0067q7682k14890n0704L80116j8372M8875
5990B97663j56241j48137J10036L3947k4773L5687k03577j19282J66692J45132
5980A37147L20898n3182m66280J32324l8841l547Q1382M3450j00687Q2524L6815
$$ plain form
5969 172003 32754 80101 -133109 -18162 149857 176134 23540 96744 220093 143001
5959 143001 115774 51078 -13337 58467 123261 298325 331370 319955 -103507 -45868 -57980
5948 -57980 -52251 -184971 -140237 136225 34168 -63872 371391 506671 239522 156400 227624
5937 227624 101430 228372 301305 202119 193567 33030 143503 3711 187914 34499
5927 34499 -98855 -81603 -34933 -52315 15662 14500 -99630 86951 130197 -75134 -83043
5916 -83043 80674 303746 240564 354906 -40666 -321472 125141 -51974 216819 150422
5906 150422 121063 -51794 -220956 -9791 288696 242733 -112044 -104236 -234950 44179
5896 44179 158670 153503 184078 194497 223749 118018 135091 113382 185344 45223 81421
$$ packed form
5969A72003j39249M7347k13210J14947J68019K6277j52594P3204J23349p7092
5959A43001k7227o4696o4415P1804O4794J75064L3045j1415m23462N7639j2112
5948e7980N729j32720M4734K76462j02057r8040M35263J35280k67149q3122P1224
5937B27624j26194J26942P2933r9186q552j60537J10473j39792J84203j53415
5927C4499j33354J7252M6670j7382O7977j162j14130J86581M3246k05331p909
5916h3043J63717K23072o3182J14342l95572k80806M46613j77115K68793o6397
5906A50422k9359j72857j69162K11165K98487m5963l54777P808j30714K79129
5896D4179J14491n167L0575J0419K9252j05731J7073k1709P1962j40121L6198
$$ plain form
5885 81421 229780 101813 18071 77342 238242 347513 334792 14 -20105 166371 253111
5874 253111 330395 297750 232462 6486 -146478 10484 93284 124425 97105 -30536 90597
5863 90597 176587 -71424 172783 185709 329731 218858 176262 92039 177907 101244 117455
5852 117455 196566 85545 364726 321102 346952 153607 -111706 306078 562179 449972
5842 449972 246013 168141 7768 -92959 13622 35354 124996 193318 58120 177496
5832 177496 231810 213559 273091 204744 165777 119234 227869 320834 462425 394372 272510
5821 272510 280076 209334 94793 55583 368959 341101 54951 221612 212929 217603 196204
5810 196204 8809 133356 113631 -26839 -15688 214280 490861 281043 106213 28159
$$ packed form
5885H1421J48359j27967q3742N9271J60900J09271j2721l34778k0119J86476Q6740
5874B53111P7284l2645o5288k25976j52964J56962Q2800L1141k7320j27641J21133
5863I0597Q5990k48011K44207J2926J44022j10873m2596q4223Q5868p6663J6211
5852A17455P9111j11021K79181m3624K5850j93345k65313M17784K56101j12207
5842D49972k03959p7872j60373j00727J06581K1732Q9642O8322j35198J19376
5832A77496N4314j8251N9532o8347l8967m6543J08635R2965J41591o8053j21862
5821B72510P566p0742j14541l9210L13376k7858k86150J66661q683M674k1399
5810A96204j87395J24547j9725j40470J1151K29968K76581k09818j74830p8054
$$ plain form
5800 28159 350476 256503 322229 353160 38378 82550 45230 102872 289588 301581 274384
5789 274384 14001 211176 158478 57418 158625 146837 76143 180729 -85227 12614
5779 12614 109691 -44963 116917 33032 68403 243766 475395 292343 195045 206844 156945
5768 156945 144848 477043 397744 133134 25991 17807 -39206 38298 227704 103220 246277
5757 246277 337771 339415 47404 -19900 181007 -38834 -3055 203976 141940 161778 -40797
5746 -40797 17641 54945 23017 131055 98940 158036 137554 50103 -9843 191194 150166
5735 150166 50384 67277 94484 46435 -182536 -93201 39932 -27729 178282 -49615 124597
5724 124597 253240 299116 351633 224820 368206 358763 218310 131057 9507 -88564 138138
$$ packed form
5800B8159L22317r3973O5726L0931l14782M4172l7320N7642J86716J1993k7197
5789B74384k60383J97175n2698j01060J01207j1788p0694J04586k65956R7841
5779A2614R7077j54654J61880q3885L5371J75363K31629j83052r7298J1799m9899
5768A56945j2097L32195p9299k64610j07143q184n7013P7504J89406j24484J43057
5757B46277R1494J644k92011o7304K00907k19841L5779K07031o2036J9838k02575
5746d0797N8438L7304l1928J08038l2115N9096k0482q7451n9946K01037m1028
5735A50166r9782J6893K7207m8049k28971Q9335J33133o7661K06011k27897J74212
5724A24597J28643M5876N2517j26813J43386r443j40453q7253j21550r8071K26702
$$ plain form
5713 138138 -40146 -80505 93912 235288 81670 67566 121651 119008 177063 304061 280768
5702 280768 251459 213246 -129782 -104106 22681 29675 229687 242917 195507 144635 229812
5691 229812 19791 134422 182560 184649 224118 248155 314158 101866 266851 207500 230757
5680 230757 180818 292406 115789 320158 254534 269934 175501 173237 113930 243259 356832
5669 356832 63498 -40526 220770 306843 100175 374203 297179 456809 243198 280399
5659 280399 236016 311144 345072 366876 237579 206261 367554 181089 179468 241445 398592
5648 398592 287581 198905 234594 443272 591651 352477 333759 359583 293965 203241 280616
5637 280616 365978 290202 475840 119249 46353 141922 488222 524144 183395 -87117 48035
$$ packed form
5713A38138j78284m0359J74417J41376j53618j4104N4085k643N8055J26998k3293
5702B80768k9309l8213l43028K5676J26787O994K00012J3230m7410n0872Q5177
5691B29812k10021J14631M8138K089L9469K4037O6003k12292J64985n9351K3257
5680B30757m9939J11588j76617K04369o5624J5400r4433k264n9307J29329J13573
5669C56832k93334j04024K61296Q6073k06668K74028p7024J59630k13611L7201
5659B80399m4383P5128L3928K1804j29297l1318J61293j86465j621O1977J57147
5648C98592j11011q8676L5689K08678J48379k39174j8718K5824o5618r0724P7375
5637B80616Q5362p5776J85638l56591p2896R5569L46300L5922l40749k70512J35152
$$ plain form
5626 48035 270836 190376 321590 139915 162123 357678 460585 368194 301349 254673 89443
5615 89443 111867 218702 344838 303303 367254 363906 328552 395949 305514 265382 309429 373619
5603 373619 581555 433863 450815 343711 187224 382782 344749 232857 402787 601646
5593 601646 535538 348527 193772 77254 309499 435304 358575 457354 375070 305115 206122
5582 206122 149893 99814 201397 237237 336186 387959 362173 575714 546313 406389 491062
5571 491062 650325 497781 456299 241801 320013 411244 309778 446904 467024 454934 417140
5560 417140 457128 326814 392062 479182 672398 424444 310310 375346 632846 632824 859070
5549 859070 809283 754019 746099 624924 445681 458578 555476 689795 914678 786625 787283
$$ packed form
5626D8035K22801q0460J31214j81675K2208J95555J02907r2391o6845m6676j65230
5615H9443K2424J06835J26136m1535O3951l348l5354O7397r0435m0132M4047O4190
5603C73619K07936j47692J6952j07104j56487J95558l8033j11892J69930J98859
5593F01646o6108j87011j54755j16518K32245J25805p6729R8779q2284o9955r8993
5582B06122n6229n0079J01583L5840R8949N1773k5786K13541k9401j39924Q4673
5571D91062J59263j52544m1482k14498P8212R1231j01466J37126K0120j2090l7794
5560D17140L9988j30314O5248Q7120J93216k47954j14134O5036K57500k2K26246
5549H59070m9787n5264p920j21175j79243J2897R6898J34319K24883j28053O58
$$ plain form
5538 787283 883894 818908 554422 536131 568280 513270 535353 675676 632716 529112 455657
5527 455657 415778 321002 436379 546992 537585 465444 490208 487181 551742 655053 459364
5516 459364 401588 539409 578365 798676 605630 637499 660180 656278 703813 401371 740669
5505 740669 675108 510205 536687 434742 369459 608036 531570 438547 553693 593744 609280
5494 609280 438115 466434 595079 592610 499020 365103 498039 411006 363710 511837 409919
5483 409919 477322 400710 368500 583427 717736 545146 590453 532477 535148 463073 553271
5472 553271 582352 533092 382843 555356 471410 349965 454852 359077 609449 408670
5462 408670 475351 661476 724318 775200 729838 480566 395229 366333 482244 639291 720264
$$ packed form
5538G87283R6611o4986k64486j8291L2149n5010K2083J40323m2960j03604p3455
5527D55657l9879r4776J15377J10613r407p2141K4764l027O4561J03311j95689
5516D59364n7776J37821L8956K20311j93046L1869K2681l902M7535l02442L39298
5505G40669o5561j64903K6482j01945o5283K38577p6466r3023J15146M0051J5536
5494F09280j71165K8319J28645k469r3590j33917J32936q7033m7296J48127j01918
5483D09919O7403p6612l2210K14927J34309j72590M5307n7976K671p2075R0198
5472E53271K9081m9260j50249J72513q3946j21445J04887r5775K50372k00779
5462D08670O6681J86125O2842N0882m5362k49272q5337k8896J15911J57047Q0973
$$ plain form
5451 720264 678943 494792 521491 769103 636211 271308 436748 630510 597165 635219
5441 635219 860942 775925 717981 600941 666654 714261 698834 683491 637160 905341 776883
5430 776883 764186 910997 783630 657561 790890 832050 542009 717680 663305 657174 626634
5419 626634 614069 605617 818207 747047 548664 700058 714007 575304 551725 560203 791411
5408 791411 960307 789182 734948 494017 487448 848225 956744 940937 919022 699959 798488
5397 798488 932106 821700 743042 788040 704095 712752 852940 716086 694260 531353 638122
5386 638122 1010012 843744 851709 844744 792769 703186 588684 507646 612457 558122 688910
5375 688910 791408 920019 778757 657883 904186 921902 922945 716256 684494 632393 539806
$$ packed form
5451G20264m1321j84151K6699K47612j32892l64903J65440J93762l3345L8054
5441F35219K25723q5017n7944j17040O5713M7607j5427j5343m6331K68181j28458
5430G76883j2697J46811j27367j26069J33329M1160k90041J75671n4375o131l0540
5419F26634j2565q452K12590p1160j98383J51394J3949j38703k3579Q478K31208
5408G91411J68896j71125n4234k40931o569L60777J08519j5807k1915k19063R8529
5397G98488J33618j10406p8658M4998q3945Q657J40188j36854k1826j62907J06769
5386F38122L71890j66268P965o965n1975q9583j14502q1038J04811n4335J30788
5375F88910J02498J28611j41262j20874K46303J7716J043k06689l1762n2101r2587
$$ plain form
5364 539806 505333 777463 691588 580710 633864 543734 642201 724683 681786 581781 476745
5353 476745 683020 542931 457055 380125 386308 529784 506703 592061 581539 685026 563069
5342 563069 343957 341501 469389 480169 568494 514267 529688 468701 511385 345731 510305
5331 510305 577056 512767 634844 660371 750408 414845 546911 565973 404569 718924 544670
5320 544670 429349 445034 378311 489923 542603 448078 321434 336676 323010 151737 232158
5309 232158 554991 482416 365647 406354 269743 499254 518462 502314 724955 567443
5299 567443 354694 501008 402719 492523 549523 533876 549665 462788 363372 459665 452580
5288 452580 422188 565084 398005 385684 623453 855561 843212 479046 199784 482266
$$ packed form
5364E39806l4473K72130q5875j10878N3154r0130R8467Q2482m2897j00005j05036
5353D76745K06275j40089q5876p6930O183J43476k3081Q5358j0522J03487j21957
5342E63069k19112k456J27888J0780Q8325n4227J5421o0987M2684j65654J64574
5331E10305O6751o4289J22077K5527R0037l35563J32066J9062j61404L14355j74254
5320E44670j15321J5685o6723J11612N2680r4525j26644J5242j3666j71273Q0421
5309B32158L22833p2575j16769M0707j36611K29511J9208j6148K22641j57512
5299E67443k12749J46314r8289Q9804N7000j5647J5789q6877r9416R6293p085
5288D52580l0392J42896j67079j2321K37769K32108j2349l64166k79262K82482
$$ plain form
5278 482266 492608 313492 537415 654300 537706 329558 504569 567048 417621 587505
5268 587505 464685 602706 509043 386677 553673 673715 573409 523491 611452 744554
5258 744554 548438 587455 551314 351790 155121 213049 428856 371282 495865 321660
5248 321660 377715 622432 445074 417136 606565 606356 546474 539659 443044 295460 366552
5237 366552 289343 378955 424252 570607 693731 866069 801873 783835 770716 587793 497349
5226 497349 613727 790823 724362 730511 716101 706938 604305 616987 500562 708543 739524
5215 739524 686151 579628 702471 814240 569433 369232 443550 639637 388522 745322
5205 745322 969936 808493 780308 902965 1028716 706029 723817 800323 711431 840623
$$ packed form
5278D82266J0342j79116K23923J16885j16594k08148J75011O2479j49427J69884
5268E87505j22820J38021r3663j22366J66996J20042j00306m9918Q7961J33102
5258G44554j96116L9017l6141j99524j96669N7928K15807n7574J24583j74205
5248C21660N6055K44717j77358k7938J89429k09n9882o815r6615j47584P1092
5237C66552p7209Q9612M5297J46355J23124J72338o4196j8038j3119j82923r0444
5226D97349J16378J77096o6461O149j4410r163j02633J2682j16425K07981L0981
5215G39524n3373j06523J22843J11769k44807k00201P4318J96087k51115L56800
5205G45322K24614j61443k8185J22657J25751l22687J7788P6506q8892J29192
$$ plain form
5195 840623 933643 905784 712409 635786 632862 471981 621464 952324 761399 653362 826215
5184 826215 576222 429917 431684 688858 621461 629128 759648 676820 626822 926185 1014297
5173 1014297 743859 561584 570906 672194 783033 745419 746827 638056 875782 845540 683461
5162 683461 659262 587624 660943 719034 775619 958213 952472 781250 685391 602806 754175
5151 754175 728380 823864 889283 990115 1058077 998665 725635 955884 730647 973557 1076589
5140 1076589 808878 607420 678424 808258 791208 1023967 977715 826911 775517 959509
5130 959509 1051912 1050184 906706 908525 998572 1010848 1142386 921128 985544 1242156 1149134
5119 1149134 1026373 863738 798364 843868 952024 900374 904819 815369 885030 1113900 1225282
$$ packed form
5195H40623R3020k7859j93375p6623k924j60881J49483L30860j90925j08037J72853
5184H26215k49993j46305J767K57174o7397P667J30520q2828m9998K99363Q8112
5173A014297k70438j82275R322J01288J10839l7614J408j08771K37726l0242j62079
5162F83461k4199p1638P3319N8091N6585J82594n741j71222r5859q2585J51369
5151G54175k5795R5484O5419J00832O7962n9412k73030K30249k25237K42910J03032
5140A076589k67711k01458P1004J29834j7050K32759m6252j50804n1394J83992
5130I59509R2403j728j43478J819R0047J2276J31538k21258O4416K56612r3022
5119A149134j22761j62635o5374M5504J08156n1650M445q9450O9661K28870J11382
$$ plain form
5108 1225282 1338931 1240726 972286 1128156 1465264 1224677 1009321 1107162 1327475 1342032
5098 1342032 1210504 1312797 1197422 1339131 1272698 1213142 1151902 916100 1040322 1130928
5088 1130928 1140682 1172042 1216696 1422861 1231773 1277296 1314064 1461719 1466100 1603042 1861444
5077 1861444 1835661 1797524 1505012 1628320 1506570 1568177 1634977 1735323 1865203 1755827
5067 1755827 1467395 1707025 1676306 1718797 1703653 1672020 1753540 1758385 1754879 1688498 1782250
5056 1782250 1817348 1700791 2013200 1915214 1872320 2158483 1957961 1966675 1950036 2018975 2271982
5045 2271982 2037825 1924903 1890061 2151887 2432982 2373645 2416063 2348653 2460787 2230909
5035 2230909 2137901 2216134 2551986 2618084 2544766 2616022 2740483 2429386 2400908 2444612 2436557
$$ packed form
5108A225282J13649r8205k68440J55870L37108k40587k15356R7841K20313J4557
5098A342032j31528J02293j15375J41709o6433n9556o1240k35802J24222R0606
5088A130928R754L1360M4654K06165j91088M5523L6768J47655M381J36942K58402
5077A861444k5783l8137k92512J23308j21750O1607O6800J00346J29880j09376
5067A755827k88432K39630l0719M2491j5144l1633Q1520M845l506o6381R3752
5056A782250L5098j16557L12409r7986m2894K86163k00522Q714j6639O8939K53007
5045B271982k34157j12922l4842K61826K81095n9337M2418o7410J12134k29878
5035B230909r3008P8233L35852O6098p3318P1256J24461l11097k8478M3704q055
$$ plain form
5024 2436557 2468366 2442071 2596875 2540441 2573463 2549073 2547004 2502628 2615832 2362723 2359672
5013 2359672 2637182 2545709 2501275 2524679 2816380 2845038 2657542 2717570 2845917 2885590 2821356
5002 2821356 2930017 2976600 3155769 3056658 3182820 3412413 3370912 3429794 3424055 3622276 3558736
4991 3558736 3651672 3615599 3771597 3617322 3879029 4039840 4023885 4072493 4022424 4130561
4981 4130561 4288520 4314308 4183554 4390928 4086433 4236132 4270098 4319905 4728656 4532181
4971 4532181 4711170 4807025 4843717 4829918 4926174 5034142 4909419 4779285 4706599 5056813
4961 5056813 5180406 5273642 5303454 5266315 5461570 5467965 5654195 5863907 5837786 5762601 5767641
4950 5767641 6154784 6217204 6299090 6308755 6449465 6419854 6435921 6669759 6715023 6837621 6750138
$$ packed form
5024B436557L1809k6295J54804n6434L3022k4390k069m4376J13204k53109l051
5013B359672K77510r1473m4434K3404K91701K8658j87496O0028J28347L9673o4234
5002B821356J08661M6583J79169r9111J26162K29593m1501N8882n739J98221o3540
4991C558736R2936l6073J55998j54275K61707J60811j5955M8608n0069J08137
4981D130561J57959K5788j30754K07374l04495J49699L3966M9807M08751j96475
4971D532181J78989R5855L6692j3799R6256J07968j24723j30134p2686L50214
4961E056813J23593R3236K9812l7139J95255O395J86230K09712k6121p5185N040
4950E767641L87143O2420Q1886R665J40710k9611J6067K33838M5264J22598q7483
$$ plain form
4939 6750138 6928372 6955970 7179546 7290991 7286025 7363707 7686656 7848955 7918092 8102571
4929 8102571 8572705 8682144 8713435 8759878 8875836 9095160 9399302 9566730 9583915 9784008
4919 9784008 9944762 10305896 10437064 10538274 10748041 11110683 11314974 11341456 11587964 11907275
4909 11907275 12023635 12457304 12816142 13002486 13394319 13947230 14067737 14467466 14828998
4900 14828998 15270187 15654880 16179474 16598766 16989100 17714335 18199169 18864143 19459185
4891 19459185 20053483 20790753 21579785 22017697 22641502 23178451 23595567 24104723 24619315
4882 24619315 25205562 25831627 26469500 26876549 27698987 28335425 28923905 29520565 30043334
4873 30043334 30411528 31406681 32266241 33082648 34056111 34835308 35908883 36909581 37769794
$$ packed form
4939F750138J78234K7598K23576J11445m966P7682L22949J62299O9137J84479
4929H102571M70134J09439L1291M6443J15958K19324L04142J67428J7185K00093
4919I784008J60754L61134J31168J01210K09767L62642K04291K6482K46508L19311
4909A1907275J16360M33669L58838J86344L91833N52911J20507L99729L61532
4900A4828998M41189L84693N24594M19292L90334P25235M84834O64974N95042
4891A9459185N94298P37270P89032M37912O23805N36949M17116N09156N14592
4882B4619315N86247O26065O37873M07049Q22438O36438N88480N96660N22769
4873C0043334L68194R95153Q59560Q16407R73463P79197J073575J000698Q60213
$$ plain form
4864 37769794 38724499 39817638 41093143 42225129 43571767 44777430 46272437 47921914
4856 47921914 49700763 51506794 53399192 55734149 57653687 59793258 62283380 64769523
4848 64769523 67503676 70851819 74257549 77795128 81591689 85929625 90372849 95076758
4840 95076758 100670575 106717055 113473806 120619885 128637808 137519409 147209430 158203600
4832 158203600 170287414 183911003 199182952 215893483 234272169 254726762 276921223
4825 276921223 300876062 326659591 353851993 382289673 410792553 437482931 460243728
4818 460243728 476664201 484354401 482030139 469492973 448074054 420788182 390311814
4811 390311814 359205753 329404627 301654304 276254441 253556762 233364954 215498986
$$ packed form
4864C7769794R54705J093139J275505J131986J346638J205663J495007J649477
4856D7921914J778849J806031J892398K334957J919538K139571K490122K486143
4848F4769523K734153L348143L405730L537579L796561M337936M443224M703909
4840I5076758N593817O046480O756751P146079Q017923Q881601R690021J0994170
4832A58203600J2083814J3623589J5271949J6710531J8378686K0454593K2194461
4825B76921223K3954839K5783529K7192402K8437680K8502880K6690378K2760797
4818D60243728J6420473P690200k324262j2537166k1418919k7285872l0476368
4811C90311814l1106061k9801126k7750323k5399863k2697679k0191808j7865968
$$ plain form
4804 215498986 199592571 185439630 172300263 160478951 150055065 140627712 132058738
4797 132058738 124328059 117236127 110899211 104792333 99273609 94252124 89985620 85695183
4789 85695183 81947348 78372728 75127463 71988405 68772285 65936773 63283009 61032488
4781 61032488 58773213 56608658 54429125 52501315 50730419 49246582 47564539 45652022
4773 45652022 44290288 42925610 41533765 40144599 38672221 37634226 36472247 35263902
4765 35263902 34032026 33105559 31989029 31218433 30408742 29670431 28864905 28087475 27122310
4756 27122310 26427665 25794039 24981093 24623873 24023111 23313552 22794217 22354314 21661534
4747 21661534 21011409 20678184 20263106 19770158 19206315 18878155 18854502 18291257 17920791 17366413
$$ packed form
4804B15498986j5906415j4152941j3139367j1821312j0423886r427353q568974
4797A32058738p730679p091932o336916o106878n518724n021485m266504m290437
4789H5695183l747835l574620l245265l139058l216120k835512k653764k250521
4781F1032488k259275k164555k179533j927810j770896j483837j682043j912517
4773D5652022j361734j364678j391845j389166j472378j037995j161979j208345
4765C5263902j231876r26467j116530p70596q09691p38311q05526p77430r65165
4756B7122310o94645o33626q12946l57220o00762p09559n19335m39903o92780
4747B1661534o50125l33225m15078m92948n63843l28160k3653n63245l70466n54378
$$ plain form
4737 17366413 16955407 16736670 16357832 15953443 15722235 15563010 15174921 14715275 14362734
4728 14362734 14085190 13620460 13353465 13114046 13027891 12718094 12326279 11972727 11707448 11287242
4718 11287242 10898214 11100884 10925063 10618652 10425346 10209348 9966955 9930953 9808071 9438170
4708 9438170 9309379 9258765 8934801 8802606 8790201 8484100 8271753 8245698 8175647 8203172
4698 8203172 8089415 7837572 7685668 7348763 7206478 7375291 7216934 6844886 6830354 6882549
4688 6882549 6633683 6501656 6569040 6429965 6125504 5940320 5919340 6032043 5774368 5695847
4678 5695847 5528339 5762656 5633272 5660205 5817041 5676658 5525688 5255586 5210322 4972813
4668 4972813 5050614 4835775 4676893 4628622 4757075 4667808 4506871 4320879 4512660 4553904
$$ packed form
4737A7366413m11006k18737l78838m04389k31208j59225l88089m59646l52541
4728A4362734k77544m64730k66995k39419q6155l09797l91815l53552k65279m20206
4718A1287242l89028K02670j75821l06411j93306k15998k42393l6002j22882l69901
4708I438170j28791n0614l23964j32195j2405l06101k12347k6055p0051K7525
4698H203172j13757k51843j51904l36905j42285J68813j58357l72048j4532N2195
4688F882549k48866j32027O7384j39075l04461j85184k0980J12703k57675p8521
4678E695847j67508K34317j29384K6933J56836j40383j50970k70102m5264k37509
4668D972813P7801k14839j58882m8271J28453q9267j60937j85992J91781M1244
$$ plain form
4658 4553904 4578540 4410411 4316262 4497377 4386133 4413747 4246615 4515518 4784647 4571277
4648 4571277 4727853 4613963 4770850 4913747 5124901 5393076 5757214 5792948 5787144 5745757
4638 5745757 5476096 5064424 4858862 4730379 4417864 3942276 3809027 3557098 3510064 3510182
4628 3510182 3460930 3457189 3480818 3343381 3071990 3063142 3081331 3228908 3153234 2982895 2826574
4617 2826574 2823194 2698571 2832556 2701767 2428112 2247241 2178919 2221792 2132826 2022038
4607 2022038 2263386 2528278 2462343 2324711 2396016 2127236 2130592 2340097 2407797 2090700
4597 2090700 1928160 1993857 2005251 2091644 2162493 2057871 2180976 1956559 1877155 2058682
4587 2058682 2193405 2017409 2044225 1902197 1804943 1740593 1882707 1844298 1576873 1505969
$$ packed form
4658D553904K4636j68129r4149J81115j11244K7614j67132K68903K69129k13370
4648D571277J56576j13890J56887J42897K11154K68175L64138L5734n804m1387
4638E745757k69661m11672k05562j28483l12515m75588j33249k51929m7034J18
4628C510182m9252l741K3629j37437k71391q848J8189J47577p5674j70339j56321
4617B826574l380j24623J33985j30789k73655j80871o8322M2873q8966j10788
4607B022038K41348K64892o5935j37632P1305k68780L356K09505O7700l17097
4597B090700j62540O5697J1394Q6393P0849j04622J23105k24417p9404J81527
4587B058682J34723j75996K6816j42028r7254o4350J42114l8409k67425p0904
$$ plain form
4577 1505969 1701776 1445545 1352814 1725547 1598849 1534034 1651620 1531796 1631612 1582785
4567 1582785 1458331 1742952 1662244 1531555 1627032 1473587 1304561 1237129 1371910 1498533
4557 1498533 1415121 1532285 1329921 1449294 1385080 1326427 1476123 1568952 1638305 1588545 1237080
4546 1237080 1272613 1252779 1258838 1079375 1367844 1470503 1271709 1324464 1338176 1530546 1342534
4535 1342534 1278474 1372043 1561707 1514089 1337852 1253710 1274568 1218597 1280482 1160221 1059065
4524 1059065 1311084 1180393 1088050 1185080 1193363 826945 850022 1140810 1065399 1018382 1054833
4513 1054833 1289311 1288570 1199303 1407972 1312062 991208 1016440 1155992 1059088 1073635 949400
4502 949400 974697 804725 1032312 1417538 1560498 1218563 964859 1002263 946377 1034005
$$ packed form
4577A505969J95807k56231r2731L72733j26698o4815J17586j19824R9816m8827
4567A582785j24454K84621q0708j30689R5477j53445j69026o7432J34781J26623
4557A498533q3412J17164k02364J19373o4214n8653J49696R2829O9353m9760l51465
4546A237080L5533j9834O059j79463K88469J02659j98794N2755J3712J92370j88012
4535A342534o4060R3569J89664m7618j76237q4142K0858n5971O1885j20261j01156
4524A059065K52019j30691r2343R7030Q283l66418K3077K90788p5411m7017L6451
4513A054833K34478p41q9267K08669r5910l20854K5232J39552r6904J4547j24235
4502I49400K5297j69972K27587L85226J42960l41935k53704L7404n5886Q7628
$$ plain form
4492 1034005 998399 857617 845872 1013844 1130618 1153930 1074977 1274840 1225634 1078882
4482 1078882 1244819 1051602 918930 1256309 1231688 931314 679085 795949 928042 966650
4472 966650 1142788 1182734 1290768 1318351 1146429 838390 691780 932894 807962 683543
4462 683543 723900 965393 808279 791700 789499 965507 923346 893930 1239136 1014490 980982
4451 980982 1107095 927555 862448 801597 883892 936947 729862 815007 664725 728269 955587
4440 955587 658697 726515 1063845 911417 1136600 1195903 1069495 1339888 1285964 977986
4430 977986 927230 758236 684393 769074 970700 979936 1108988 1031827 1073449 1305946 1419117
4419 1419117 1275063 1022096 1186227 1022930 1024546 1231260 1206750 1191881 1266646 1213741 1202769
$$ packed form
4492A034005l5606j40782j1745J67972J16774K3312p8953J99863m9206j46752
4482A078882J65937j93217j32672L37379k4621l00374k52229J16864J32093L8608
4472I66650J76138L9946J08034K7583j71922l08039j46610K41114j24932j24419
4462F83543M0357K41493j57114j6579k201J76008m2161k9416L45206k24646l3508
4451I80982J26113j79540o5107o0851Q2295N3055k07085Q5145j50282O3544K27318
4440I55587k96890O7818L37330j52428K25183N9303j26408K70393n3924l07978
4430I77986n0756j68994p3843Q4681K01626R236J29052p7161M1622K32497J13171
4419A419117j44054k52967J64131j63297J616K06714k4510j4869P4765n2905j0972
$$ plain form
4408 1202769 1127996 1223753 1450452 1140161 992040 1109504 1014223 1325741 1218604 1191177
4398 1191177 1186634 1095639 1531683 1413151 1290444 1322534 1510524 1666361 1607190 1735948
4388 1735948 1803498 1783195 1635514 1747939 1763744 1761454 1918616 1805727 1753703 1744026 1646406
4377 1646406 1701341 1892624 1885353 1832910 1905429 2036563 1768094 1799585 2016707 1920832 1920300
4366 1920300 1797149 1598615 1489439 1611926 1635496 1597336 1454792 1633229 1634326 1596893
4356 1596893 1681523 1571911 1615972 1755696 1537241 1421420 1362300 1432908 1342302 1427281 1385954
4345 1385954 1447927 1437225 1412096 1577620 1390882 1278182 1354551 1485224 1329775 1421195
4335 1421195 1760888 1697906 1311781 1401542 1467997 1437465 1199782 1265172 1308593 1315324 1530891
$$ packed form
4408A202769p4773R5757K26699l10291j48121J17464r5281L11518j07137k7427
4398A191177m543r0995M36044j18532j22707L2090J87990J55837n9171J28758
4388A735948O7550k0303j47681J12425J5805k290J57162j12889n2024r677r7620
4377A646406N4935J91283p271n2443P2519J31134k68469L1491K17122r5875n32
4366A920300j23151j98534j09176J22487K3570l8160j42544J78437J097l7433
4356A596893Q4630j09612M4061J39724k18455j15821n9120P0608r0606Q4979m1327
4345A385954O1973j0702k5129J65524j86738j12700P6369J30673j55449R1420
4335A421195L39693o2982l86125Q9761O6455l0532k37683O5390M3421O731K15567
$$ plain form
4324 1530891 1509643 1349523 1417528 1230300 1197236 1255258 1323043 1442102 1359971 1420871 1534730
4313 1534730 1221077 1448740 1341062 1277565 1307482 1216312 1271164 1543722 1678322 1783248
4303 1783248 1798252 1584820 1674441 1841202 2007725 1816483 1630005 1774850 1787347 1872004
4293 1872004 2003549 1898204 2063454 1812971 1737466 1853483 1931706 1651926 1799875 1667675
4283 1667675 1635395 1947582 2068412 1949462 1919646 2057711 1884892 1755052 1980433 1936608
4273 1936608 2088098 2096984 2019134 2115931 2248406 2081780 2040559 1952113 1983683 2077387 1750372
4262 1750372 2008641 1986811 2010425 1699256 1704061 1875093 1930122 1979303 1911004 2113108 2144668
4251 2144668 1983824 1926668 2004350 2118626 2105285 2098894 2027865 2088250 1886373 2015024 2038121
$$ packed form
4324A530891k1248j60120O8005j87228l3064N8022O7785J19059q2131O0900J13859
4313A534730l13653K27663j07678o3497K9917r1170N4852K72558J34600J04926
4303A783248J5004k13432Q9621J66761J66523j91242j86478J44845J2497Q4657
4293A872004J31545j05345J65250k50483p5505J16017P8223k79780J47949j32200
4283A667675l2280L12187J20830j18950k9816J38065j72819j29840K25381m3825
4273A936608J51490Q886p7850R6797J32475j66626m1221q8446L1570R3704l27015
4262A750372K58269k1830K3614l11169M805J71032N5029M9181o8299K02104L1560
4251B144668j60844n7156P7682J14276j3341o391p1029O0385k01877J28651K3097
$$ plain form
4240 2038121 1942216 1920266 1951339 2198337 1958103 1629867 1624197 1804578 1766925 1554688 1558861
4229 1558861 1657651 1609007 1777748 1991342 1645174 1496527 1565749 1659037 1867950 1947555
4219 1947555 1995437 2036602 2250771 2039495 1941095 1668631 1759327 2074669 2001084 1878169
4209 1878169 1732171 1758172 2115221 1977248 1869395 1882675 1798266 1939710 2066270 2369288
4199 2369288 2545392 2646572 2522905 2448978 2478079 2539885 2620099 2866702 3063306 3054101 2966623
4188 2966623 3030934 3055872 3020665 3355315 3467037 3311458 3343782 3414848 3406470 3441535 3525945
4177 3525945 3715736 3893646 4182099 4178770 4082583 4360676 4459412 4416198 4521132 4764632
4167 4764632 4792305 4839133 5126321 5315869 5723155 5909780 5851123 5797618 6112555 6470445
$$ packed form
4240B038121r5905k1950L1073K46998k40234l28236n670J80381l7653k12237M173
4229A558861R8790m8644J68741K13594l46168j48647O9222R3288K08913P9605
4219A947555M7882M1165K14169k11276r8400k72464R0696L15342p3585j22915
4209A878169j45998K6001L57049j37973j07853J3280q4409J41444J26560L03018
4199B369288J76104J01180j23667p3927K9101O1806Q0214K46603J96604r205q7478
4188B966623O4311K4938l5207L34650J11722j55579L2324P1066q378L5065Q4410
4177C525945J89791J77910K88453l329r6187K78093R8736m3214J04934K43500
4167D764632K7673M6828K87188J89548M07286J86625n8657n3505L14937L57890
$$ plain form
4157 6470445 6399056 6353052 6494647 6830333 6910068 7044352 7288574 7449615 7843037 8027178
4147 8027178 7839114 8229893 8404026 8503301 8989347 9150487 9579427 9877613 10151495 10557093
4137 10557093 10990810 11309912 11772372 12169782 12775947 13349834 13711516 14348086 15125419
4128 15125419 15968762 16992089 18214404 19493205 20909841 22455406 24327848 26310651
4120 26310651 28726193 31649364 35066420 38580130 42799762 47246224 52152955 56379376
4112 56379376 59884660 63516564 66936517 71246558 76683468 82069061 86963922 90231154
4104 90231154 91954603 92949735 94234165 96851866 100238330 103327133 104477464 103089926
4096 103089926 99665871 94965081 90987671 88469953 87288699 85583383 82627543 78160638
$$ packed form
4157F470445p1389m6004J41595L35686P9735J34284K44222J61041L93422J84141
4147H027178j88064L90779J74133R9275M86046J61140M28940K98186K73882M05598
4137A0557093M33717L19102M62460L97410O06165N73887L61682O36570P77333
4128A5125419Q43343J023327J222315J278801J416636J545565J872442J982803
4120B6310651K415542K923171L417056L513710M219632M446462M906731M226421
4112E6379376L505284L631904L419953M310041N436910N385593M894861L267232
4104I0231154J723449R95132J284430K617701L386464L088803J150331j387538
4096A03089926l424055m700790l977410k517718j181254j705316k955840m466905
$$ plain form
4088 78160638 72288418 66741743 61621140 57820341 54910416 51542975 48165928 44371269
4080 44371269 40000465 35925949 32385970 29818950 27315883 25298556 23552842 22189360
4072 22189360 20784739 19458718 18475022 17610565 16791458 15910167 15313235 14744045 14173765
4063 14173765 13763606 13200873 12920572 12199985 11705160 11731045 11457444 10820723 10518877 10355444
4053 10355444 10230102 9711271 9242005 9196618 9132335 8985617 8635083 8459091 8235306 8081413
4043 8081413 7790276 7760791 7677796 7704710 7647955 7469661 7369152 7361139 7245618 7402170 7497020
4032 7497020 7428737 7378917 7297536 7238065 7268904 7440379 7644316 7496011 7444500 7531150 7445844
4021 7445844 7418430 7349452 7217831 7070516 6826264 6595688 6434401 6105852 5972464 5645572
$$ packed form
4088G8160638n872220n546675n120603l800799k909925l367441l377047l794659
4080D4371269m370804m074516l539979k567020k503067k017327j745714j363482
4072B2189360j404621j326021r83696q64457q19107q81291n96932n69190n70280
4063A4173765m10159n62733k80301p20587m94825K5885k73601o36721l01846j63433
4053A0355444j25342n18831m69266m5387o4283j46718l50534j75992k23785j53893
4043H081413k91137k9485q2995K6914n6755j78294j00509q013j15521J56552R4850
4032G497020o8283m9820q1381n9471L0839J71475K03937j48305n1511Q6650q5306
4021G445844k7414o8978j31621j47315k44252k30576j61287l28549j33388l26892
$$ plain form
4011 5645572 5448284 5430718 5236867 5024579 4945601 4734879 4710999 4788916 4460007 4359966
4001 4359966 4230071 4047137 4120744 4163223 3910182 3702280 3673365 3504373 3063791 3302855
3991 3302855 3432096 3605360 3400464 2930122 2848675 2682440 2867390 2863661 2969448 2864515
3981 2864515 2821178 2736942 2627706 2637253 2761430 2735007 2612696 2323445 2322596 2383597 2275551
3970 2275551 2403836 2329242 2157315 2269437 2180449 1980098 2258957 2194935 2181700 2128845
3960 2128845 1990024 1989140 1896073 1949100 1962892 2186994 1885088 1720305 1910111 1846123 1843883
3949 1843883 1954710 1863802 1915724 1943065 1846041 1859606 1857986 1996783 2107732 1958545 2191520
3938 2191520 2550791 2663254 2585343 2681754 2555948 2477574 2391765 2143547 2085562 2065729 1910909
$$ packed form
4011E645572j97288j7566j93851k12288p8978k10722k3880P7917l28909j00041
4001D359966j29895j82934P3607M2479k53041k07902k8915j68992m40582K39064
3991C302855J29241J73264k04896m70342q1447j66235J84950l729J05787j04933
3981B864515m3337q4236j09236R547J24177k6423j22311k89251q49O1001j08046
3970B275551J28285p4594j71927J12122q8988k00351K78859o4022j3235n2855
3960B128845j38821q84r3067N3027J3792K24102l01906j64783J89806o3988k240
3949A843883J10827r0908N1922K7341r7024J3565j620J38797J10949j49187K32975
3938B191520L59271J12463p7911R6411j25806p8374q5809k48218n7985j9833j54820
$$ plain form
3927 1910909 1765281 1645297 1608055 1927342 1517203 1426503 1499581 1615577 1557113 1503605
3917 1503605 1650279 1586735 1573676 1610554 1384151 1605365 1668886 1667967 1726249 1687437 1652292
3906 1652292 1477500 1625677 1768746 1752759 1549620 1455399 1270332 1224643 1341138 1127197
3896 1127197 1140571 1208672 1471590 1594447 1732429 1456506 1242767 1307829 1567872 1561624
3886 1561624 1272338 1293051 1445127 1519192 1574711 1624288 1628542 1518663 1463094 1306983 1380516
3875 1380516 1424729 1371897 1476754 1347523 1590589 1631976 1472985 1416625 1546794 1416906
3865 1416906 1309801 1662324 1627433 1557013 1629383 1691592 1665393 1900014 1855604 1503232 1650198
3854 1650198 1369560 1529808 1547305 1490078 1649224 1607518 1442510 1450172 1411151 1598806 1611366
$$ packed form
3927A910909j45628j19984l7242L19287m10139r0700P3078J15996n8464n3508
3917A503605J46674o3544j3059L6878k26403K21214O3521r19N8282l8812l5145
3906A652292j74792J48177J43069j5987k03139r4221j85067m5689J16495k13941
3896A127197J3374O8101K62918J22857J37982k75923k13739O5062K60043o248
3886A561624k89286K0713J52076P4065N5519M9577M254j09879n5569j56111P3533
3875A380516M4213n2832J04857j29231K43066M1387j58991n6360J30169j29888
3865A416906j07105L52523l4891p0420P2370O2209k6199K34621m4410l52372J46966
3854A650198k80638J60248J7497n7227J59146m1706j65008P662l9021J87655J2560
$$ plain form
3843 1611366 1851695 1801768 1877143 1697399 1724227 1971242 2072564 1871766 1942641 2219080
3833 2219080 2160090 2257730 2241119 2261185 2024014 1937056 2158707 2364234 2437641 2345490 2355732
3822 2355732 2427996 2248149 2474495 2693722 2667643 2582664 2696583 2413884 2684150 2648249
3812 2648249 2596833 2962848 3014033 2727113 2929958 3032724 3113783 2918451 2755288 2954750
3802 2954750 3173257 2975033 2841762 2813703 2939688 3176055 2885389 2922496 2967423 3068439
3792 3068439 3026919 3068986 3215817 3364746 3360558 3545627 3620526 3715343 3647796 3735780 3553723
3781 3553723 3312849 3422525 3397537 3343111 3417679 3235816 3244603 3471319 3359702 3311473 3637943
3770 3637943 3385586 3216831 3461137 3345637 3425125 3605598 3755735 3817955 3879304 4049404
$$ packed form
3843A611366K40329m9927P5375j79744K6828K47015J01322k00798P0875K76439
3833B219080n8990R7640j6611K0066k37171q6958K21651K05527P3407r2151J0242
3822B355732P2264j79847K26346K19227k6079q4979J13919k82699K70266l5901
3812B648249n1416L66015N1185k86920K02845J02766Q1059j95332j63163J99462
3802B954750K18507j98224j33271k8059J25985K36367k90666L7107M4927J01016
3792C068439m1520M2067J46831J48929m188J85069P4899R4817o7547Q7984j82057
3781C553723k40874J09676k4988n4426P4568j81863Q787K26716j11617m8229L26470
3770C637943k52357j68755K44306j15500P9488J80473J50137O2220O1349J70100
$$ plain form
3760 4049404 4237989 4390693 4622966 4670213 4898437 4926896 4566950 4021044 3667387 3531339
3750 3531339 3388558 3371076 3285602 3270538 3425533 3411416 3462421 3423109 3259703 3278782 3329328
3739 3329328 3287727 3313166 3451228 3720165 3736194 3522810 3587957 3470508 3489808 3563300 3748158
3728 3748158 3882317 3923363 3960905 3902028 4006236 4134165 4300628 4746197 4825646 4683268
3718 4683268 5003237 5478734 5758779 5916608 6070653 6349182 6553031 7168461 7624567 7848822
3708 7848822 7940568 8446931 8585330 8955765 9387000 9680843 10140441 10484618 11108785 11696364
3698 11696364 12175965 12594134 13078128 13256703 13745359 14395775 14973738 15551190 16020623
3689 16020623 16310489 16744182 17189687 17658501 17840093 17973398 18012542 18290620 18522845 18859305
$$ packed form
3760D049404J88585J52704K32273M7247K28224K8459l59946n45906l53657j36048
3750C531339j42781j7482q5474j5064J54995j4117N1005l9312j63406J9079N0546
3739C329328m1601K5439J38062K68937J6029k13384O5147j17449J9300P3492J84858
3728C748158J34159M1046L7542n8877J04208J27929J66463M45569P9449j42378
3718D683268L19969M75497K80045J57829J54045K78529K03849O15430M56106K24255
3708G848822R1746N06363J38399L70435M31235K93843M59598L44177O24167N87579
3698A1696364M79601M18169M83994J78575M88656O50416N77963N77452M69433
3689A6020623K89866M33693M45505M68814J81592J33305L9144K78078K32225L36460
$$ plain form
3679 18859305 18684643 18451171 18662481 18515559 18409483 18235971 17956722 17908484 17959566 17787347
3669 17787347 17231040 16839137 16437711 16001787 15637948 15557487 15004190 14482694 13984194 13745183
3659 13745183 13196290 12651722 12183669 11651319 11104715 10435522 10325121 9985671 9751246
3650 9751246 9429270 8946575 8506433 8067956 7659995 7309728 6931031 6467053 6240240 6116919
3640 6116919 5845006 5511624 5230925 5306275 5009411 4838417 4661300 4651358 4635065 4234336
3630 4234336 4057552 3948713 4027275 4013678 4058772 3945674 3844423 3765269 3840587 3938024 3804493
3619 3804493 3576277 3902234 4080901 3983125 4108319 4091021 3977921 4074279 4154268 4247438
3609 4247438 4346349 4298640 4061414 4199483 4111016 3886574 4003938 4036971 4080324 3765176
$$ packed form
3679A8859305j74662k33472K11310j46922j06076j73512k79249m8238N1082j72219
3669A7787347n56307l91903m01426m35924l63839q0461n53297n21496m98500k39011
3659A3745183n48893n44568m68053n32350n46604o69193j10401l39450k34425
3650I751246l21976m82695m40142m38477m07961l50267l78697m63978k26813j23321
3640F116919k71913l33382k80699P5350k96864j70994j77117r942j6293m00729
3630D234336j76784j08839P8562j3597M5094j13098j01251p9154P5318R7437j33531
3619C804493k28216L25957J78667r7776J25194j7298j13100R6358P9989R3170
3609D247438R8911m7709k37226J38069q8467k24442J17364L3033M3353l15148
$$ plain form
3599 3765176 3764153 3635658 3742526 3641633 3486787 3474250 3357028 3287825 3297470 3376566 3445669
3588 3445669 3393071 3330888 3240651 3156615 3130725 2960499 2914586 3204128 3123140 3028780 3035893
3577 3035893 3068504 2962237 2897255 3096610 3029301 2913788 2938083 3033219 2923971 2809708
3567 2809708 2918716 3210388 3087522 2981615 3214041 2910620 2878639 2802865 2881209 2927871
3557 2927871 2821020 2820441 2983022 2574622 2703739 2589488 2608608 2759896 2847171 2888546 2832391
3546 2832391 2770864 2686487 2668403 2525169 2598568 2584061 2552131 2652313 2631353 2687296 2702978
3535 2702978 2552617 2521701 2578817 2504236 2735488 2748933 2560166 2500333 2228152 2366951
3525 2366951 2455570 2200031 1985522 2306225 2380599 2395270 2258484 2339321 2140303 1993052
$$ packed form
3599C765176j023j28495J06868j00893j54846j2537j17222o9203R645P9096O9103
3588C445669n2598o2183r0237q4036k5890j70226m5913K89542q0988r4360P113
3577C035893L2611j06267o4982J99355o7309j15513K4295R5136j09248j14263
3567B809708J09008K91672j22866j05907K32426l03421l1981p5774P8344M6662
3557B927871j06851n79J62581m08400J29117j14251J9120J51288Q7275M1375n6155
3546B832391o1527q4377j8084j43234P3399j4507l1930J00182k0960N5943J5682
3535B702978j50361l0916N7116p4581K31252J3445j88767n9833k72181J38799
3525B366951Q8619k55539k14509L20703P4374J4671j36786Q0837j99018j47251
$$ plain form
3515 1993052 1959588 2242724 2145893 2130304 2247193 2337403 2434118 2353045 2244411 2264439 2190344
3504 2190344 2314076 2274812 2156056 2045671 2098418 2306595 2144462 2077645 2117848 2222212
3494 2222212 2190474 2009209 2226536 2369733 2404921 2560866 2655455 2496794 2442567 2916026
3484 2916026 2726089 2912440 3274378 3356396 3424459 3600959 3874410 4008490 3985418 4147920
3474 4147920 4426442 4153637 4018522 3917064 3772868 3614565 3681002 3348596 3271913 3266826
3464 3266826 2849398 2831851 2954600 2792508 3049562 2990696 2961510 3075201 3145355 3016302
3454 3016302 2790981 3008140 3118405 3123914 3175642 3023597 3133184 2930809 2909240 3199342
3444 3199342 3144382 3135748 2989307 3009194 3157856 3420849 3302086 3254509 3308084 3044790 3171917
$$ packed form
3515A993052l3464K83136r6831j5589J16889R0210R6715q1073j08634K0028p4095
3504B190344J23732l9264j18756j10385N2747K08177j62133o6817M0203J04364
3494B222212l1738j81265K17327J43197L5188J55945R4589j58661n4227M73459
3484B916026j89937J86351L61938Q2018O8063J76500K73451J34080k3072J62502
3474D147920K78522k72805j35115j01458j44196j58303O6437l32406p6683n087
3464C266826m17428j7547J22749j62092K57054n8866k9186J13691P0154j29053
3454C016302k25321K17159J10265N509N1728j52045J09587k02375k1569K90102
3444C199342n4960q634j46441J9887J48662K62993j18763m7577N3575k63294J27127
$$ plain form
3433 3171917 3577486 3832321 3826681 3520918 3510018 3737895 3965411 3972618 4253561 4262035 4224928
3422 4224928 4164834 4004763 4269582 4440741 4456633 4646357 4843064 4865160 5155598 5302218
3412 5302218 5381963 5673397 5646970 5799088 6183219 6133382 6305292 6631230 6999298 7228481
3402 7228481 7145291 7524837 7923055 8038410 8111560 8120288 8477994 8735255 8819301 9075493
3392 9075493 9379801 9619892 9393715 9723248 9830985 9783428 9989972 10216840 10240577 10474865
3382 10474865 10470712 10668397 10723855 10860603 11000216 11196345 11625277 12099981 12063746 12289608
3372 12289608 12519764 12664168 13035144 13459911 13918333 14182500 14969480 15611048 16170424
3363 16170424 17042760 17554261 18278568 19226843 20211129 20913876 21761948 22757001 23603925
$$ packed form
3433C171917M05569K54835n640l05763j0900K27877K27516P207K80943Q474l7107
3422D224928o0094j60071K64819J71159J5892J89724J96707K2096K90438J46620
3412E302218P9745K91434k6427J52118L84131m9837J71910L25938L68068K29183
3402G228481q3190L79546L98218J15355P3150Q728L57706K57261Q4046K56192
3392I075493L04308K40091k26177L29533J07737m7557K06544K26868K3737K34288
3382A0474865m153J97685N5458J36748J39613J96129M28932M74704l6235K25862
3372A2289608K30156J44404L70976M24767M58422K64167P86980O41568N59376
3363A6170424Q72336N11501P24307R48275R84286P02747Q48072R95053Q46924
$$ plain form
3354 23603925 24582564 25740790 26845752 27815876 28600036 29307181 30484730 31381946 32584793
3345 32584793 33512675 34586193 35588264 36487588 37310093 38308862 39403300 40467396 41663943
3336 41663943 42757812 44012427 45196744 46391287 47848542 49703446 51553005 53476444
3328 53476444 55740861 57635578 59743130 61815364 63696033 65488717 66946462 67906888
3320 67906888 68892258 69271080 69208347 68897116 68140445 67363862 66697348 65698671 64873147 63877218
3310 63877218 62330990 60724698 58879568 56316030 53610728 50903951 47997876 45120879
3302 45120879 42159976 39332319 37018953 34744441 32456894 30263971 28702877 26995379
3294 26995379 25309447 24181781 23041811 21967817 21038093 20395741 19577573 19017057 18515288
$$ packed form
3354B3603925R78639J158226J104962R70124P84160P07145J177549Q97216J202847
3345C2584793R27882J073518J002071Q99324Q22505R98769J094438J064096J196547
3336D1663943J093869J254615J184317J194543J457255J854904J849559J923439
3328E3476444K264417J894717K107552K072234J880669J792684J457745R60426
3320F7906888R85370L78822o2733l11231p56671p76583o66514r98677q25524r95929
3310F3877218j546228j606292j845130k563538k705302k706777k906075k876997
3302D5120879k960903k827657k313366k274512k287547k192923j561094j707498
3294B6995379j685932j127666j139970j073994r29724o42352q18168n60516n01769
$$ plain form
3285 18515288 18107423 17602829 16905233 16382690 16056823 15646219 15135494 14804674 14542318
3276 14542318 14052413 13996515 13552801 13335229 12897732 12599622 12488687 12512165 12233497 11676507
3266 11676507 11412942 11252933 11011196 10739345 10446990 10115488 9804579 9395209 9043035
3257 9043035 8864398 8751742 8522038 8302144 7777999 7456099 7084080 7125421 7024976 6630061
3247 6630061 6491499 6362445 6000650 5921281 5896388 5758116 5667170 5360680 5215382 4939480
3237 4939480 4715328 4600379 4548353 4763252 4691742 4478435 4271818 4504196 4179735 3813015
3227 3813015 3827543 3728249 3595394 3646997 3983262 3908500 3579776 3484617 3320087 3280501 3125695
3216 3125695 2992410 2950984 2771698 2947544 3075100 2895310 2773857 2579669 2718727 2873911
$$ packed form
3285A8515288m07865n04594o97596n22543l25867m10604n10725l30820k62356
3276A4542318m89905n5898m43714k17572m37497k98110j10935K3478k78668n56990
3266A1676507k63565j60009k41737k71851k92355l31502l10909m09370l52174
3257I043035j78637j12656k29704k19894n24145l21900l72019M1341j00445l94915
3247F630061j38562j29054l61795p9369k4893j38272r0946l06490j45298k75902
3237D939480k24152j14949n2026K14899p1510k13307k06617K32378l24461l66720
3227C813015J4528r9294j32855N1603L36265p4762l28724r5159j64530l9586j54806
3216C125695j33285m1426j79286J75846J27556j79790j21453j94188J39058J55184
$$ plain form
3206 2873911 2873392 2791364 2443880 2306371 2321700 2696433 2848694 2614123 2437074 2530252 2602503
3195 2602503 2453834 2333000 2539836 2257992 2070754 2135302 1908714 1843665 1987536 1876585
3185 1876585 1899205 1869400 1794158 1685736 1598147 1863034 1853525 1627837 1557611 1642505 1631834
3174 1631834 1810113 1995968 2061481 1980567 1601817 1589119 1636115 1874582 1728970 1575818
3164 1575818 1564890 1436779 1571788 1570533 1534153 1528478 1640492 1729160 1624770 1571569 1627360
3153 1627360 1814914 1637591 1606449 1642919 1420712 1208844 1318115 1393781 1406773 1529178
3143 1529178 1477166 1453498 1345902 1362985 1321880 1307697 1230681 1505365 1333653 1327143 1357271
3132 1357271 1148134 1125711 1172620 1411529 1333280 1264896 1400227 1541746 1512398 1457835 1462440
$$ packed form
3206B873911n19q2028l47484j37509J5329L74733J52261k34571j77049R3178P2251
3195B602503j48669j20834K06836k81844j87238O4548k26588o5049J43871j10951
3185A876585K2620k9805p5242j08422q7589K64887r509k25688p0226Q4894j0671
3174A631834J78279J85855O5513q0914l78750j2698M6996K38467j45612j53152
3164A575818j0928j28111J35009j255l6380n675J12014Q8668j04390n3201N5791
3153A627360J87554j77323l1142L6470k22207k11868J09271P5666J2992J22405
3143A529178n2012k3668j07596J7083m1105j4183p7016K74684j71712o510L0128
3132A357271k09137k2423M6909K38909p8249o8384J35331J41519k9348n4563M605
$$ plain form
3121 1462440 1547317 1526618 1498671 1424732 1422978 1677651 1762451 1725739 1538467 1694437 1681389
3110 1681389 1513734 1308545 1332207 1228635 1371754 1345567 1434224 1560452 1364568 1456919
3100 1456919 1489506 1669867 1607097 1445908 1584463 1545888 1695084 1833305 1980951 1884840
3090 1884840 1833377 1925292 1974549 1830717 1634992 2015792 2113149 2214262 2042694 1970264
3080 1970264 2008306 2210894 2113998 2189069 2111780 2344425 2292370 2281632 2525008 2726228 2820432
3069 2820432 2904838 2866356 2942295 2864803 2811922 3037855 3268179 3610129 3640077 3799425 3966571
3058 3966571 4034998 3904907 3741499 3496226 3591711 3510865 3267941 2909167 2704106 2611221
3048 2611221 2431094 2416063 2355560 2406333 2240865 2220569 2132279 2132759 1788407 1519115 1538544
$$ packed form
3121A462440Q4877k0699k7947p3939j754K54673Q4800l6712j87272J55970j3048
3110A681389j67655k05189K3662j03572J43119k6187Q8657J26228j95884R2351
3100A456919L2587J80361o2770j61189J38555l8575J49196J38221J47646r6111
3090A884840n1463R1915M9257j43832j95725L80800R7357J01113j71568p2430
3080A970264L8042K02588r6896P5071p7289K32645n2055j0738K43376K01220R4204
3069B820432Q4406l8482P5939p7492n2881K25933K30324L41950K9948J59348J67146
3058C966571O8427j30091j63408k45273R5485q0846k42924l58774k05061r2885
3048B611221j80127j5031o0503N0773j65468k0296q8290M80l44352k69292J9429
$$ plain form
3037 1538544 1358317 1379053 1424032 1486381 1352527 1232155 1313001 1308666 1322580 1390346 1429054
3026 1429054 1283840 1160665 1180341 1238686 1459022 1251763 1206412 932432 955521 1039938
3016 1039938 1163589 1127778 962704 966012 901864 1154712 1157501 853822 980182 935358 815499
3005 815499 1176958 1114411 1041630 1309071 1111961 847072 946930 1129583 929630 1264781
2995 1264781 1423910 1044502 1091969 1193449 1260212 1273118 1543071 1598946 1427865 1296028
2985 1296028 1443232 1566012 1817641 1894096 1798903 1865826 1763906 1608289 1303797 1184325
2975 1184325 884811 971470 953868 752467 692297 615365 717577 704476 856954 853264 552514
2964 552514 760043 626672 667540 688169 684011 761871 621313 615571 724125 740839 877705
$$ packed form
3037A538544j80227K0736M4979O2349j33854j20372Q0846m335J3914O7766L8708
3026A429054j45214j23175J9676N8345K20336k07259m5351k73980K3089Q4417
3016A039938J23651l5811j65074L308o4148K52848K789l03679J26360m4824j19859
3005H15499L61459o2547p2781K67441j97110k64889R9858J82653j99953L35151
2995A264781J59129l79408M7467J01480O6763J2906K69953N5875j71081j31837
2985A296028J47204J22780K51629P6455r5193O6923j01920j55617l04492j19472
2975A184325k99514Q6659j7602k01401o0170p6932J02212j3101J52478l690l00750
2964E52514K07529j33371M0868K0629m158P7860j40558n742J08554J6714J36866
$$ plain form
2953 877705 819423 667796 781256 676691 747220 612907 522820 700502 808528 927907
2943 927907 901895 801924 696897 575021 638409 724263 606190 611037 498720 594931 744341
2932 744341 651209 700060 634302 627127 382760 674111 653064 618582 498420 523989 587570
2921 587570 413425 738978 750736 763591 790845 714448 733562 837474 722203 481398 702747
2910 702747 618318 536700 506589 530844 668241 434459 372526 461707 275688 307821 435714
2899 435714 368435 260650 401166 529327 489532 270257 178395 446793 772943 716625
2889 716625 676815 512986 444666 257228 221299 441436 470860 379440 366365 268216 146697
2878 146697 304452 512647 507342 195856 -73191 147277 268472 183071 147425 77137 -27428
$$ packed form
2953H77705n8282j51627J13460j04565P0529j34313r0087J77682J08026J19379
2943I27907k6012r9971j05027j21876O3388Q5854j18073M847j12317R6211J49410
2932G44341r3132M8851o5758p175k44367K91351k1047l4482j20162K5569O3581
2921E87570j74145L25553J1758J2855K7254p6397J9114J03912j15271k40805K21349
2910G02747q4429q1618l0111K4255J37397k33782o1933Q9181j86019L2133J27893
2899D35714o7279j07785J40516J28161l9795k19275r1862K68398L26150n6318
2889G16625l9810j63829o8320j87438l5929K20137K9424r1420j3075r8149j21519
2878A46697J57755K08195n305l11486k69047K20468J21195q5401l5646p0288j04565
$$ plain form
2867 -27428 89173 94481 260452 335905 334054 455301 323790 353291 342146 374549 319739
2856 319739 297930 360320 162715 213045 104719 235091 415605 210117 146403 94996 286362
2845 286362 286039 255232 233586 254724 141757 280018 112152 221264 323435 132834 1051
2834 1051 254632 401524 457680 535148 496094 364287 218622 411082 684600 527601 318311
2823 318311 364293 450766 349625 519160 419088 315993 348917 264168 236279 326234 444963
2812 444963 116992 87221 289618 217449 205611 249974 385343 429594 406149 382690 313760
2801 313760 237367 154613 149798 225446 403591 255112 206440 377448 418951 248355 492854
2790 492854 563952 533358 389971 337344 279410 238088 481614 359961 241609 501729 467795
$$ packed form
2867b7428J16601N308J65971P5453j851J21247j31511K9501j1145L2403n4810
2856C19739k1809O2390j97605N0330j08326J30372J80514k05488o3714n1407J91366
2845B86362l23l0807k1646K1138j12967J38261j67866J09112J02171j90601j31783
2834A051K53581J46892N6156P7468l9054j31807j45665J92460K73518j56999k09290
2823C18311M5982Q6473j01141J69535j00072j03095L2924q4749k7889Q9955J18729
2812D44963l27971k9771K02397p2169j1838M4363J35369M4251k3445k3459o8930
2801C13760p6393q2754m815P5648J78145j48479m8672J71008M1503j70596K44499
2790D92854P1098l0594j43387n2627n7934m1322K43526j21653j18352K60120l3934
$$ plain form
2779 467795 513339 663034 467045 543502 674030 617179 309302 535232 508670 337366
2769 337366 664130 909593 864410 838379 648105 447916 545740 550196 649110 695065 633150
2758 633150 545524 631150 484589 706013 730209 571855 646954 583072 694435 556087 713720
2747 713720 504860 505307 637074 768000 801074 759864 689292 683618 661348 636038 517895
2736 517895 418455 562893 323626 373731 678461 403626 568971 863982 769978 680136
2726 680136 525369 581986 616329 681157 648593 487061 439520 474978 414275 594966 504036
2715 504036 400000 350896 341846 411559 457788 608413 521808 553829 507808 309465 385770
2704 385770 362926 353544 272035 463747 654592 386133 381094 417731 315428 505648 384402
$$ packed form
2779D67795M5544J49695j95989P6457J30528n6851l07877K25930k6562j71304
2769C37366L26764K45463m5183k6031j90274k00189R7824M456R8914M5955o1915
2758F33150q7626Q5626j46561K21424K4196j58354P5099o3882J11363j38348J57633
2747G13720k08860M47J31767J30926L3074m1210p0572n674k2270k5310j18143
2736E17895r9440J44438k39267N0105L04730k74835J65345K95011r4004q9842
2726F80136j54767N6617L4343O4828l2564j61532m7541L5458o0703J80691r0930
2715E04036j04036m9104r050O9713M6229J50625q6605L2021m6021j98343P6305
2704C85770k2844r382q1509J91712J90845k68459n039L6637j02303J90220j21246
$$ plain form
2693 384402 395404 368643 287274 264958 187213 95374 382245 192277 118780 46599 -95141
2682 -95141 -21729 103323 148236 83427 222992 88544 84843 41750 112819 274264 274391 182568
2670 182568 167891 176458 186092 417867 232590 294911 89614 -11674 2336 -18235 130327
2659 130327 215519 163867 224963 309564 388216 520129 313321 107095 239030 218407 163919
2648 163919 274150 103554 105309 79471 203130 327561 331773 206210 202806 336367 41413
2637 41413 42760 -6026 -271584 -187848 -18119 -178939 -56537 -7395 85692 499014 331280
2626 331280 329417 194088 85237 16411 27372 30029 122575 12876 -131363 -91978 -25675
2615 -25675 63172 228925 86433 52799 -26305 149969 39078 -166686 20259 115389 191072
$$ packed form
2693C84402J1002k6761q1369k2316p7745r1839K86871j89968p3497p2181j41740
2682i5141P3412J25052M4913o4809J39565j34448l701m3093P1069J61445J27r1823
2670A82568j4677Q567R634K31775j85277O2321k05297j01288J4010k0571J48562
2659A30327Q5192n1652O1096Q4601P8652J31913k06808k06226J31935k0623n4488
2648A63919J10231j70596J755k5838J23659J24431M212j25563l404J33561k94954
2637D1413J347m8786k65558Q3736J69729j60820J22402M9142R3087M13322j67734
2626C31280j863j35329j08851o8826J0961K657R2546j09699j44239L9385O6303
2615b5675Q8847J65753j42492l3634p9104J76274j10891k05764J86945R5130P5683
$$ plain form
2604 191072 146810 -17178 -15122 73242 180728 54434 -44949 -91069 -77225 -171128 -98000
2593 -98000 -113742 -45599 118166 -98083 -245653 -269006 -107367 102662 969 24387 -28334
2582 -28334 -119009 8701 144047 9128 97222 -33350 -202939 -215362 -148220 -151256 -60023
2571 -60023 -219529 -146470 -318318 -161761 44553 -165325 63006 62888 81142 -200659 9001
2560 9001 108888 56907 -33425 59129 -59903 106672 131074 -124528 -107246 63997 133462
2549 133462 45598 62869 230052 -106816 -244879 -209196 -260689 93311 218966 270949 360566
2538 360566 64735 -22851 -178088 356651 224629 -57494 -181855 -85786 64963 192309
2528 192309 453198 151574 -23822 -196191 -365216 -102323 -244481 -290560 -210649 -68007
$$ packed form
2604A91072m4262j63988K056Q8364J07486j26294r9383m6120J3844r3903P3128
2593i8000j5742O8143J63765k16249j47570k3353J61639K10029j01693K3418n2721
2582b8334r0675J27710J35346j34919Q8094j30572j69589j2423O7142l036R1233
2571f0023j59506P3059j71848J56557K06314k09878K28331j18J8254k81801K09660
2560I001R9887n1981r0332R2554j19032J66575K4402k55602J7282J71243O9465
2549A33462q7864J7271J67183l36868j38063L5683n1493L54000J25655N1983Q9617
2538C60566k95831q7586j55237N34739j32022k82123j24361R6069J50749J27346
2528A92309K60889l01624j75396j72369j69025K62893j42158m6079P9911J42642
$$ plain form
2518 -68007 54516 36915 117789 40374 -51444 -174991 -60181 -165204 55324 123650 -126265
2507 -126265 3132 -58154 -168722 -59935 56509 135752 -2974 -16987 -152530 97586
2497 97586 239426 238031 32609 68335 -151124 -312201 -164998 75788 89281 -12468 -7593
2486 -7593 -123594 -189069 -165231 -117222 175358 6382 -187448 -269484 -205184 -215023 77024
2475 77024 94033 -93028 21328 -87854 -146647 -150094 -94101 63173 -23559 -306730 -231788
2464 -231788 -59377 -6978 109461 186630 89167 -78694 57276 -32228 -162521 41292
2454 41292 6660 95085 -158338 -108370 -174964 115857 417558 167960 -74323 -70720 -181957
2443 -181957 -191323 -165008 -58103 -203211 -101581 -78634 -138641 -38585 -86969 -232167 -62638
$$ packed form
2518f8007J22523j7601Q0874p7415r1818j23547J14810j05023K20528O8326k49915
2507a26265J29397o1286j10568J08787J16444P9243j38726j4013j35543K50116
2497I7586J41840j395k05422L5726k19459j61077J47203K40786J3493j01749M875
2486g593j16001o5475K3838M8009K92580j68976j93830q2036O4300r839K92047
2475G7024J7009j87061J14356j09182n8793l447N5993J57274q6732k83171P4942
2464b31788J72411N2399J16439P7169r7463j67861J35970q9504j30293K03813
2454D1292l4632Q8425k53423M9968o6594K90821L01701k49598k42283L603j11237
2443a81957r366K6315J06905j45108J01630K2947o0007J00056m8384j45198J69529
$$ plain form
2432 -62638 206329 93517 -175457 44734 116407 -69494 -76945 -154523 44448 163894 395547
2421 395547 277351 -30385 -121395 -52268 -40908 84781 9608 116744 130468 11551 22044
2410 22044 -47186 158730 92691 -13360 126613 35584 129310 98735 23039 -24896 -69147
2399 -69147 105073 87901 -130628 -119701 65844 -23269 34269 29573 119036 -59959 -379119
2388 -379119 -253217 15825 7671 49759 -115884 -52781 -147563 -147370 -96027 -203673 -93476
2377 -93476 -54420 -263286 -132831 -176338 -166896 -97164 -205056 -332924 -65378 192244 296638
2366 296638 130569 -29746 -179257 11116 -46579 20372 71779 -56003 -251143 -432626
2356 -432626 -4237 -142830 -45562 170024 389351 53411 -155511 -183006 -155375 -13562
$$ packed form
2432f2638K68967j12812k68974K20191P1673j85901p451p7578J98971J19446K31653
2421C95547j18196l07736r1010O9127J1360J25689p5173J07136J3724j18917J0493
2410B2044o9230K05916o6039j06051J39973r1029R3726l0575p5696m7935m4251
2399f9147J74220j7172k18529J0927J85545q9113N7538m696Q9463j78995l19160
2388c79119J25902K69042q154M2088j65643O3103r4782J93N1343j07646J10197
2377i3476L9056k08866J30455m3507R442O9732j07892j27868K67546K57622J04394
2366B96638j66069j60315j49511J90373n7695O6951N1407j27782j95140j81483
2356d32626M28389j38593R7268K15586K19327l35940k08922k7495K7631J41813
$$ plain form
2346 -13562 122000 -43407 246898 49766 69708 162394 136596 99478 86056 63142 123945
2335 123945 74084 87758 -29417 35011 -2147 11063 -38871 89853 93748 -26843 -191764
2324 -191764 -86114 -134353 -13457 -95198 -169415 -77928 -115295 221682 269435 -169673 -150232
2313 -150232 -25172 36614 318985 -254412 -388617 -327626 -218638 -81647 -129640 -63912
2303 -63912 -47039 -2739 10685 -272411 -120818 -167960 -197587 -30712 -180859 -82632 -138946
2292 -138946 -181908 -42452 -14747 290344 177721 -46540 -11180 1574 -93462 -155865 -42985
2281 -42985 -69928 -106728 -77071 73440 -136292 -294791 -31236 30212 10373 -63442 170140
2270 170140 131796 -147403 -245731 31393 32607 -407341 -393918 -126097 -189531 -69513 -20173
$$ packed form
2346a3562J35562j65407K90305j97132J9942R2686k5798l7118j3422k2914O0803
2335A23945m9861J3674j17175O4428l7158J3210m9934J28724L895j20591j64921
2324a91764J05650m8239J20896q1741p4217R1487l7367L36977M7753m39108J9441
2313a50232J25060O1786K82371n73397j34205O0991J08988J36991m7993O5728
2303f3912J6873M4300J3424k83096J51593m7142k9627J66875j50147R8227n6314
2292a38946m2962J39456K7705L05091j12623k24261L5360J2754r5036o2403J12880
2281d2985k6943l6800K9657J50511k09732j58499K63555O1448j9839p3815K33582
2270A70140l8344k79199r8328K77124J214m39948J3423K67821o3434J20018M9340
$$ plain form
2259 -20173 -65004 -194259 -329384 -257409 -350975 -102596 104090 -214088 -72892 -148547 -157452
2248 -157452 103163 223314 81280 36641 -30437 -15315 11227 -25152 -34733 59949 41569
2237 41569 137426 158217 294302 241715 275185 182211 62213 94830 277462 204686 19820
2226 19820 67045 161386 359845 155 -32658 40565 27226 31875 -67990 -72769 -260963 -189831
2214 -189831 -211465 -129177 -23447 151731 65283 224960 75486 101905 -12317 -65793 122864
2203 122864 -84515 68478 63735 148005 153449 147713 -181217 -313960 -154549 39892 167770
2192 167770 90674 134484 8189 54878 129327 -23165 50374 57669 118289 107069 40118
2181 40118 8439 -251408 -219014 214041 172418 181058 -8044 150694 253125 -49677 -69099
$$ packed form
2259b0173m4831j29255j35125P1975r3566K48379K06686l18178J41196p5655q905
2248a57452K60615J20151j42034m4639o7078J5122K6542l6379r581R4682j8380
2237D1569R5857K0791J36085n2587L3470r2974j19998L2617J82632p2776j84866
2226A9820M7225R4341J98459l59690l2813P3223j3339M649r9865m779j88194P1132
2214a89831k1634Q2288J05730J75178q6448J59677j49474K6419j14222n3476J88657
2203A22864k07379J52993m743Q4270N444n736l28930j32743J59411J94441J27878
2192A67770p7096M3810j26295M6689P4449j52492P3539P295O0620j1220o6951
2181D0118l1679k59847L2394M33055m1623Q640j89102J58738J02431l02802j9422
$$ plain form
2170 -69099 108274 -55615 130083 -53897 16663 -27070 -16666 -92097 -128370 -295157 -329208
2159 -329208 -434748 -276459 -18917 99958 121654 -196586 -343745 -204145 -230876 -96785
2149 -96785 76517 189597 -22887 -7879 68384 109757 188018 81873 -208109 -45408 51424
2138 51424 21755 166378 5025 76103 -78746 -292708 -108838 9008 -113134 -59459
2128 -59459 -3600 180640 75095 80175 33671 115290 -71272 282323 351386 124003 49279
2117 49279 23260 101836 110137 161241 105796 41836 -3414 -174196 -78493 213973 206170 -100013
2105 -100013 -106433 -214258 -179514 141494 124482 -98179 -147019 170012 174866 63815 133647
2094 133647 151319 166930 -5492 -40919 -86125 -158014 -339003 -156937 128733 40965 -322371
$$ packed form
2170f9099J77373j63889J85698j83980P0560m3733J0404p5431l6273j66787l4051
2159c29208j05540J58289K57542J18875K1696l18240j47159J39600k6731J34091
2149i6785J73302J13080k12484J5008P6263M1373P8261j06145k89982J62701R6832
2138E1424k9669J44623j61353P1078j54849k13962J83870J17846j22142N3675
2128e9459N5859J84240j05545N080m6504Q1619j86562L53595O9063k27383p4724
2117D9279k6019P8576Q301N1104n5445o3960m5250j70782R5703K92466p803l06183
2105a00013o420j07825L4744L21008j7012k22661m8840L17031M854j11051O9832
2094A33647J7672J5611j72422l5427m5206p1889j80989J82066K85670q7768l63336
$$ plain form
2083 -322371 -122088 -17183 -25076 236994 129285 126213 -56574 -57442 327695 297691 61569
2072 61569 -79423 -113043 -62578 121954 308788 351156 372184 50359 130707 78539 96523
2061 96523 180278 119588 281626 524321 749565 538236 601203 530803 477332 596161 767966
2050 767966 1160715 1487412 1596283 1380146 1058578 769824 654261 793148 721891 914293
2040 914293 454665 307604 289505 212232 399638 147748 414778 260999 -106232 -165187
2030 -165187 109459 102399 70741 86843 -22727 -244 98556 81477 46743 73888 19067
2019 19067 86484 43927 -3057 -96632 135551 69664 207649 293577 -243160 -56475 44898
2008 44898 133572 113700 74989 67773 29654 73259 -116077 -19726 -53883 94661 -51480
$$ packed form
2083c22371K00283J04905p893K62070j07709l072j82787q68L85137l0004k36122
2072F1569j40992l3620N0465J84532J86834M2368K1028l21825Q0348n2168J7984
2061I6523Q3755o0690J62038K42695K25244k11329O2967p0400n3471J18829J71805
2050G67966L92749L26697J08871k16137l21568k88754j15563J38887p1257J92402
2040I14293m59628j47061j8099p7273J87406k51890K67030j53779l67231n8955
2030a65187K74646p060l1658J6102j09570K2483R8800j7079l4734K7145n4821
2019A9067O7417m2557m6984r3575K32183o5887J37985Q5928n36737J86685J01373
2008D4898Q8674j9872l8711p216l8119M3605j89336R6351l4157J48544j46141
$$ plain form
1997 -51480 155705 328541 70635 -93854 13130 16581 137538 180791 182575 400608 -95554
1986 -95554 -210693 -154851 -93262 35787 152271 221821 93647 100263 31136 -78463 -83907
1975 -83907 -348092 -215378 -242769 -111790 -314888 -9210 69815 110978 332979 196151
1965 196151 -29058 -44861 37115 -67298 -120970 -93398 245328 218903 -55225 -86973 58771
1954 58771 36233 59334 47619 -177810 -155430 -106809 140313 105814 58612 69437 -46551
1943 -46551 -57340 2353 -78995 -8268 151131 177817 45010 -227765 -98693 -70643 -158393
1932 -158393 -90268 78970 23986 100682 74829 128979 229041 264447 240646 125013 -141122
1921 -141122 64988 166825 250721 145959 126677 123121 -9070 316159 143732 165249 311189
$$ packed form
1997e1480K07185J72836k57906j64489J06984L451J20957M3253J784K18033m96162
1986i5554j15139N5842O1589J29049J16484O9550j28174O616o9127j09599n444
1975h3907k64185J32714k7391J30979k03098L05678P9025M1163K22001j36828
1965A96151k25209j5803Q1976j04413n3672K7572L38726k6425k74128l1748J45744
1954E8771k2538K3101j1715k25429K2380M8621K47122l4499m7202J0825j15988
1943d6551j0789N9693q1348P0727J59399K6686j32807k72775J29072K8050q7750
1932a58393O8125J69238n4984P6696k5853N4150J00062L5406k3801j15633k66135
1921a41122K06110J01837Q3896j04762j9282l556j32191L25229j72427K1517J45940
$$ plain form
1910 311189 -16237 140867 -9380 -113569 -247338 -153712 -123260 -53453 139443 169249
1900 169249 299701 269613 71758 -33200 57643 27226 90675 -53815 -263462 -144656
1890 -144656 -156459 -139924 294827 196967 -133695 -155033 -51110 -334213 -174856 -103026 -71309
1879 -71309 56574 5574 -147401 -142915 101337 62978 -115404 -90970 51384 7198 -84692
1868 -84692 -93787 195599 142347 -29142 -80164 113514 71073 48008 -149463 -82402 16966
1857 16966 26375 -3087 301596 148464 -54806 81738 94585 -111858 -191709 75676 146735
1846 146735 131191 -95908 -151114 -440261 -228304 -91644 10379 10529 86147 152028 58884
1835 58884 -222940 -199211 94889 -202 -30167 29663 131905 80939 83745 182854 98091
$$ packed form
1910C11189l27426J57104j50247j04189j33769R3626L0452O9807J92896K9806
1900A69249J30452l0088j97855j04958R0843l0417O3449j44490k09647J18806
1890a44656j1803J6535M34751r7860l30662k1338J03923k83103J59357P1830L1717
1879g1309J27883n1000j52975M486K44252l8359j78382K4434J42354m4186r1890
1868h4692r095K89386n3252j71489n1022J93678m2441k3065j97471O7061R9368
1857A6966R409k9462L04683j53132k03270J36544J2847k06443p9851K67385P1059
1846A46735j5544k27099n5206k89147K11957J36660J02023J50P5618O5881r3144
1835E8884k81824K3729K94100r5091k9965N9830J02242n0966K806R9109q4763
$$ plain form
1824 98091 -105731 -150680 -121529 -90971 -43257 -77521 119238 67168 221794 259619 77539
1813 77539 162831 23995 208407 302535 -22169 -287127 -198423 33502 -4058 16092 -183950
1802 -183950 -289818 -257799 -86494 112935 244058 -51137 34263 -77299 -199522 -31341
1792 -31341 19598 -35750 59104 -113985 495 96398 3045 100757 -17780 30207 66010
1781 66010 75850 -46684 -27889 110716 -9674 113950 91725 7189 -131692 -73889 76704
1770 76704 12762 -50050 -105611 -181344 -96753 37463 -92139 117317 90893 -75214 72895
$$ packed form
1824I8091k03822m4949K9151L0558M7714l4264J96759n2070J54626L7825j82080
1813G7539Q5292j38836J84412R4128l24704k64958Q8704K31925l7560K0150k00042
1802a83950j05868L2019J71305J99429J31123k95195Q5400j11562j22223J68181
1792c1341N0939n5348R4854j73089J14480R5903r3353R7712j18537M7987L5803
1781F6010R840j22534J8795J38605j20390J23624k2225q4536j38881N7803J50593
1770G6704o3942o2812n5561p5733Q4591J34216j29602K09456k6424j66107J48109
$$ [...]
##END NTUPLES=NMR SPECTRUM
##END=
