##TITLE=1H_EC-3254(4-33)Y
 CDCl3, 8 sc, 
 6.07.2021
##JCAMPDX= 6.0         $$ Bruker NMR JCAMP-DX V2.0
##DATA TYPE= NMR SPECTRUM
##DATA CLASS= NTUPLES
##ORIGIN= UXNMR, Bruker Analytische Messtechnik GmbH
##OWNER= root
$$ XWIN-NMR		Version 3.5
$$ Tue Jul  6 08:38:12 2021 Russian Standard Time (UT+4h)  she@DPX200
##.OBSERVE FREQUENCY= 200.131506
##.OBSERVE NUCLEUS= ^1H
##.ACQUISITION MODE= SIMULTANEOUS
##.ACQUISITION SCHEME= undefined
##.AVERAGES= 8
##.DIGITISER RES= 18
##SPECTROMETER/DATA SYSTEM= spect
##.PULSE SEQUENCE= zg30
##.SOLVENT NAME= CDCl3
##.SHIFT REFERENCE= (INTERNAL, CDCl3, 0, 17.502)
##AUDIT TRAIL= $$ (NUMBER, WHEN, WHO, WHERE, WHAT)
$$ ##TITLE= Audit trail, XWIN-NMR		Version 3.5
$$ ##JCAMPDX= 5.01
$$ ##ORIGIN= Bruker BioSpin GmbH
$$ ##OWNER= she
$$ F:/spectra/data/she/nmr/H-F/1/pdata/1/auditp.txt
$$ ##AUDIT TRAIL=  $$ (NUMBER, WHEN, WHO, WHERE, WHAT)
(   1,<2021-07-06 08:36:29.03 +0400>,<she>,<DPX200>,
      <created by zg, POWCHK disabled, PULCHK disabled
       configuration hash MD5:
       00 E9 B6 7A A2 85 ED C7 34 08 36 98 17 FE 4E 26
       data hash MD5: 16K
       5F 65 AF D9 A7 FA A2 28 FF 3B F9 B3 16 30 2D 98>)
(   2,<2021-07-06 08:36:32.15 +0400>,<she>,<DPX200>,
      <Start of raw data processing
       efp BC_mod = 2 LB = 0.24 FT_mod = 6 PKNL = 1 PHC0 = -11919.42 PHC1 = 19.20099 SI = 16K 
       data hash MD5: 16K
       05 92 FA 59 1E 76 63 DF AF 83 C7 6C A1 3C 68 1C>)
(   3,<2021-07-06 08:36:57.46 +0400>,<she>,<DPX200>,
      <pk PHC0 = 7.326457 PHC1 = -8.8 
       data hash MD5: 16K
       2E C3 F9 04 33 08 13 69 17 58 1A 4D 2A D0 86 B1>)
(   4,<2021-07-06 08:37:01.29 +0400>,<she>,<DPX200>,
      <abs ABSG = 5 
       data hash MD5: 16K
       0C E2 40 65 EF AE D1 37 A4 09 E7 D4 80 8F 93 E8>)
$$ ##END=
$$ 
$$ hash MD5
$$ DD 1D 12 14 0F EB E1 A4 D4 4A C2 0E 2A 4F 16 98
##$RELAX= 
##$RELAX= 
##$RELAX= 
##$RELAX= 
##$RELAX= 
##$RELAX= 
$$ Bruker specific parameters
$$ --------------------------
##$DU= <F:/spectra>
##$EXPNO= 1
##$NAME= <H-F>
##$PROCNO= 1
##$TYPE= <nmr>
##$USER= <she>
##$AMP= (0..31)
100 100 100 100 100 100 100 100 100 100 100 100 100 100 100 100 100 100 
100 100 100 100 100 100 100 100 100 100 100 100 100 100 
##$AQSEQ= 0
##$AQ_mod= 1
##$AUNM= <au_zg>
##$AUTOPOS= <>
##$BF1= 200.13
##$BF2= 200.13
##$BF3= 200.13
##$BF4= 200.13
##$BF5= 200.13
##$BF6= 200.13
##$BF7= 200.13
##$BF8= 200.13
##$BYTORDA= 1
##$CFDGTYP= 0
##$CFRGTYP= 5
##$CHEMSTR= <none>
##$CNST= (0..31)
1 1 145 1 1 1 1 1 1 1 1 1 1 1 1 1 1 1 1 1 1 1 1 1 1 1 1 1 1 1 1 1 
##$CPDPRG= <>
##$CPDPRG1= <>
##$CPDPRG2= <>
##$CPDPRG3= <>
##$CPDPRG4= <mlev>
##$CPDPRG5= <mlev>
##$CPDPRG6= <mlev>
##$CPDPRG7= <mlev>
##$CPDPRG8= <mlev>
##$CPDPRGB= <>
##$CPDPRGT= <>
##$D= (0..31)
0 1.2 0 0 0 0 0 0 0 0.06 0 0.03 0 0 0 0 0.0002 0 0 0 0 0 0 0 0 0 0 0 0 
0 0 0 
##$DATE= 1625546188
##$DBL= (0..7)
120 120 120 120 120 120 120 120 
##$DBP= (0..7)
150 150 150 150 150 150 150 150 
##$DBP07= 0
##$DBPNAM0= <>
##$DBPNAM1= <>
##$DBPNAM2= <>
##$DBPNAM3= <>
##$DBPNAM4= <>
$$ [...]
##$SUBNAM3= <"">
##$SUBNAM4= <"">
##$SUBNAM5= <"">
##$SUBNAM6= <"">
##$SUBNAM7= <"">
##$SUBNAM8= <"">
##$SUBNAM9= <"">
##$SW= 20.0188882624521
##$SWIBOX= (0..15)
0 0 2 0 0 0 0 0 0 0 0 0 0 0 0 0 
##$SW_h= 4006.41025641026
##$TD= 16384
##$TD0= 1
##$TE= 0
##$TE2= 300
##$TE3= 300
##$TEG= 300
##$TL= (0..7)
0 120 120 120 120 120 120 120 
##$TP= (0..7)
150 150 150 150 150 150 150 150 
##$TP07= 0
##$TPNAME0= <>
##$TPNAME1= <>
##$TPNAME2= <>
##$TPNAME3= <>
##$TPNAME4= <>
##$TPNAME5= <>
##$TPNAME6= <>
##$TPNAME7= <>
##$TPOAL= (0..7)
0.5 0.5 0.5 0.5 0.5 0.5 0.5 0.5 
##$TPOFFS= (0..7)
0 0 0 0 0 0 0 0 
##$TUNHIN= 0
##$TUNHOUT= 0
##$TUNXOUT= 0
##$USERA1= <user>
##$USERA2= <user>
##$USERA3= <user>
##$USERA4= <user>
##$USERA5= <user>
##$V9= 5
##$VALIST= <valist>
##$VCLIST= <CCCCCCCCCCCCCCC>
##$VD= 0
##$VDLIST= <DDDDDDDDDDDDDDD>
##$VPLIST= <PPPPPPPPPPPPPPP>
##$VTLIST= <TTTTTTTTTTTTTTT>
##$WBST= 1024
##$WBSW= 4
##$XGAIN= (0..3)
0 0 0 0 
##$XL= 0
##$YL= 0
##$YMAX_a= 200121
##$YMIN_a= -164681
##$ZGOPTNS= <>
##$ZL1= 120
##$ZL2= 120
##$ZL3= 120
##$ZL4= 120
##$ABSF1= 17.50811
##$ABSF2= -2.510929
##$ABSG= 5
##$ABSL= 3
##$ALPHA= 0
##$AQORDER= 0
##$ASSFAC= 0
##$ASSFACI= 0
##$ASSFACX= 0
##$ASSWID= 0
##$AUNMP= <proc_1d>
##$AZFE= 0.1
##$AZFW= 0.1
##$BCFW= 0
##$BC_mod= 2
##$BYTORDP= 0
##$COROFFS= 0
##$CY= -3
##$DATMOD= 1
##$DC= 0
##$DFILT= <>
##$DTYPP= 0
##$F1P= 0
##$F2P= 0
##$FCOR= 1
##$FTSIZE= 16384
##$FT_mod= 6
##$GAMMA= 0
##$GB= 0
##$INTBC= 1
##$INTSCL= 1.334414e-10
##$ISEN= 128
##$LB= 0.24
##$LEV0= 0
##$LPBIN= 0
##$MAXI= 10000
##$MC2= 0
##$MEAN= 0
##$ME_mod= 0
##$MI= 1.114404
##$NCOEF= 0
##$NC_proc= -6
##$NLEV= 6
##$NOISF1= 3.799351
##$NOISF2= 2.8
##$NSP= 0
##$NTH_PI= 0
##$NZP= 0
##$OFFSET= 17.502
##$PC= 1
##$PHC0= -11912.09
##$PHC1= 10.40099
##$PH_mod= 1
##$PKNL= yes
##$PPARMOD= 0
##$PSCAL= 0
##$PSIGN= 0
##$REVERSE= no
##$SF= 200.130006531306
##$SI= 16384
##$SIGF1= 3
##$SIGF2= 2
##$SINO= 5.538805
##$SIOLD= 16384
##$SREGLST= <1H.CDCl3>
##$SSB= 0
##$STSI= 16384
##$STSR= 0
##$SW_p= 4006.41025641026
##$SYMM= 0
##$S_DEV= 0
##$TDeff= 16384
##$TDoff= 0
##$TI= <>
##$TILT= no
##$TM1= 0
##$TM2= 0
##$TOPLEV= 0
##$USERP1= <user>
##$USERP2= <user>
##$USERP3= <user>
##$USERP4= <user>
##$USERP5= <user>
##$WDW= 1
##$XDIM= 16384
##$YMAX_p= 433485681
##$YMIN_p= -291209
$$ End of Bruker specific parameters
$$ ---------------------------------
##NTUPLES= NMR SPECTRUM
##VAR_NAME=  FREQUENCY,     SPECTRUM/REAL,   SPECTRUM/IMAG
##SYMBOL=    X,             R,               I
##VAR_TYPE=  INDEPENDENT,   DEPENDENT,       DEPENDENT
##VAR_FORM=  AFFN,          ASDF,            ASDF
##VAR_DIM=   16384,         16384,           16384
##UNITS=     HZ,            ARBITRARY UNITS, ARBITRARY UNITS
##FACTOR=    0.24454680195387, 1,            1
##FIRST=     3502.67553615922, 0,            0
##LAST=      -503.73472025104, 0,            0
##MIN=       -503.73472025104, -291209,      0
##MAX=       3502.67553615922, 433485681,    0
$$ Real data points
##PAGE= N=1
##DATA TABLE= (X++(R..R)), XYDATA
$$ [...]
13751 37985 44448 45965 -20748 -17324 20219 -41283 -2991 44476 12427 3184 -104967 -43624
13739 -43624 52877 44471 95102 98951 -4708 -139994 -199293 -151412 -35258 5037 31555
13728 31555 -58601 -66163 -105083 17963 152582 197618 66898 -8976 42362 42558 56857 647
13716 647 -1991 96550 131556 100389 143028 113918 110061 84709 95818 117747 -29278 43230
13704 43230 127080 6415 -99092 -24755 -9439 -8580 -46028 -90553 -45861 -52780 23080 86669
13692 86669 1373 -98870 -23266 35660 9051 29451 48118 -32740 88297 48739 62281
13681 62281 13771 -37716 45126 22569 54008 27345 21128 -43473 -50238 -19969 -89453 -63524
13669 -63524 -18510 102735 17372 22814 7486 21564 188477 215873 203591 92664 25922
13658 25922 -1383 -76240 -68991 99792 101902 166130 80086 -47514 45347 -49910 -54592 -107681
13646 -107681 -150178 -13202 -3507 -72109 -56754 55717 96932 -67415 -145743 -73770 -8568
13635 -8568 12609 -89510 -40443 4367 -174290 -187353 -249020 -160794 -29937 -4573 25206
13624 25206 26196 37651 66553 18814 -6434 4811 16567 -24392 -28220 95959 84557 118494
13612 118494 16487 -36438 -41139 -111975 4125 -13064 -13479 96082 -20401 -7549 -53673
13601 -53673 -42279 111668 135405 52379 15708 -26680 14533 -33546 -31643 52050 67947 61681
13589 61681 -28190 -80352 -64633 4735 11760 163961 117786 -44454 -21814 26281 -29838
13578 -29838 -45437 -65225 -141556 -76145 -18091 48664 69075 -65250 -94895 -8506 24702
13567 24702 -10125 101915 -16531 -29716 157627 124869 6630 -1200 106773 57001 -10958
13556 -10958 -70596 -36561 46218 -90408 35622 109643 41496 66475 -10844 -7814 -63690
13545 -63690 -7525 -47139 117 -56620 -5779 127377 -12716 41231 70971 27277 126200
13534 126200 123145 61067 45747 -23554 -13537 -51298 -66482 -4148 -22259 -63309 -85176 -30154
13522 -30154 -28891 81839 120714 59117 134360 40670 -23515 -91721 -66278 -34654 -63033 30875
13510 30875 59526 -36321 -115247 -122692 25774 128770 -17754 -23009 38083 -14209 55167
13499 55167 44579 41540 -71295 -84551 -137743 -61057 100460 122083 142246 90172 84109 39606
13487 39606 -10132 67190 13982 -56609 -41380 43058 45512 13085 33747 -29795 -24492 -113083
13475 -113083 -37961 -123172 -100475 -26982 -16649 25193 111333 61572 135038 45408 83393
13464 83393 57477 -13192 -3436 -66957 -72986 27708 23356 46275 63591 61753 168482 56683
13452 56683 15184 -185071 -188615 -33141 -552 -53066 -28661 -20308 99870 -10125 -76701
13441 -76701 8604 74527 154144 174552 121765 -30258 19577 26430 -48316 27701 52596 74930
13429 74930 23426 46959 54783 -17803 34704 64125 134678 235844 90289 8926 -45802
13418 -45802 -71703 -98902 -45322 139037 -28637 -20091 -37807 38272 14152 57628 -5898
13407 -5898 45322 108574 -45746 -42331 -75359 11427 -7465 -67115 -80681 -56679 -65000 -114417
13395 -114417 -27760 48529 -9387 -72538 -117075 -105072 -44440 -27789 34071 69371 86967
13384 86967 116667 25452 9073 -35071 -133318 -56161 -15522 -71804 -59644 56037 99103
13373 99103 94580 -48448 -75883 61981 174856 110284 86944 154285 97574 54882 -44832
13362 -44832 33333 -49217 -12787 289 15765 -81551 -71024 -77433 -5989 75311 2055 -1311
13350 -1311 58701 46464 15798 22646 34745 -21942 -46139 -60901 -121413 -125027 -181556 -53314
13338 -53314 1666 51742 34135 53855 104856 38320 22833 136735 174304 71814 12535
13327 12535 1011 59642 40713 31169 -46538 -47043 -132369 -64862 19745 92879 -64915 2264
13315 2264 97878 -47199 50184 46576 -54630 30229 17575 -151949 -153218 -25363 71032
13304 71032 90689 61732 21922 -9667 57519 -16333 -66029 -30927 38709 87085 61131 94594
13292 94594 -70349 -128853 -159175 37815 50802 67527 51516 21631 -5324 36990 -7613
13281 -7613 -59637 -7643 59173 19894 -5679 -106815 -110778 -22232 28127 -80832 -15570 -39637
13269 -39637 92806 65796 95412 136784 68348 -12371 -51789 -50025 -64058 -28865 -33698 89412
13257 89412 74924 70404 -30555 1954 -46718 -65202 -28591 -31571 47598 49395 -76829 -30522
13245 -30522 37980 14523 2837 -1007 72957 140721 -7060 -52617 -65341 -106256 -13509 -42665
13233 -42665 47763 22229 -37591 74288 -49289 -66384 -1564 -25971 51596 -10605 -152897
13222 -152897 -96945 -16207 62672 -4534 -19025 61502 59059 15847 -62158 -90408 -28236 -48552
13210 -48552 -23821 -73222 -58698 -59371 -1648 -7597 17480 19560 67050 146956 100010 72320
13198 72320 28406 -21263 -26768 159959 78030 -8972 4332 -75371 -41014 -8695 20130 87350
13186 87350 48935 -49788 -153621 -155372 -122077 -20757 -8491 -59538 -5123 18258 25554 62267
13174 62267 -37045 -63456 -109087 -80895 -42268 -70270 -87965 -87437 100961 -85912 -97750 -70026
13162 -70026 -19993 71149 107885 47723 -62477 -35511 -18217 56951 43349 -37552 13184
13151 13184 99069 63363 61391 56846 -68177 -48577 5348 32263 4305 -36887 -39932 -114838
13139 -114838 -49822 -27852 20624 -32154 37976 80851 -3845 44296 51229 -8165 12564 -64516
13127 -64516 -166374 -63477 -9898 31531 -72 -61015 -23989 62999 -87175 -42547 10737
13116 10737 -89610 -69562 -33421 -63027 -105846 25430 -72666 7184 49346 25264 101571
13105 101571 74251 24175 21568 1490 -53538 62575 60712 53832 24539 -71807 -73281 -29005
13093 -29005 -4156 74772 23444 12173 104476 -10625 -104857 -72921 -52689 47773 46768
13082 46768 39819 41898 40450 -2949 130573 74118 66109 124942 94022 141791 160399 162854
13070 162854 166666 190601 144301 146110 149630 177228 171821 138630 70489 -49595 32436 66061
13058 66061 -6423 26762 -17598 -22186 -47220 -26782 -3033 -20149 -48186 -80931 -194295 -80747
13046 -80747 -33862 -84159 -80824 -28548 -14115 -8573 -73271 63476 -3160 -19466 20847 -7590
13034 -7590 -11171 33490 93038 -49511 -118365 -37933 36604 94202 22675 -41000 -51939 -40205
13022 -40205 -6518 84157 51592 -833 39974 58342 6096 -6747 13236 57030 66048 85811
13010 85811 -14324 -108863 -90304 -28235 20681 -12967 8746 -50410 30583 36460 3797 55499
12998 55499 117500 143068 94478 55708 37862 27923 -23951 -142235 -30817 -21114 -18355 -48900
12986 -48900 -21315 7554 -22560 35263 78608 127564 -3135 -122823 -51650 -41616 -51544
12975 -51544 61056 49847 -60578 -65505 -26922 -155613 -83142 -38817 -137593 -95629 -40396
12964 -40396 -95448 -162128 -104024 -34618 89633 -17868 -29797 -14425 -152066 -100753 -42694
12953 -42694 -10666 10971 -60012 72996 17874 -12271 1447 79075 118334 156234 169475
12942 169475 123985 109632 49540 -4190 -17075 6420 79303 18283 -23358 17538 -4744
12931 -4744 -84389 -31082 -77658 -79768 -52825 29651 158196 -7819 75923 89675 -48615
12920 -48615 -72387 -79792 -58738 -41527 -47548 -35821 36181 42400 -44680 -77999 -19721 55179
12908 55179 60222 7917 78871 51294 28373 72492 74206 79126 76755 41573 27821 -25140
12896 -25140 -74906 17389 135646 35898 -118864 -113032 -49990 45757 86724 15053 -35671
12885 -35671 12498 53672 -107688 -170494 -73957 -30919 -71830 -95914 -46344 -35825 47858
12874 47858 153123 42755 22919 56405 -78127 -66680 -46571 -31529 -86126 -32309 23471
12863 23471 -38300 -92011 -38501 -53656 74130 -17796 -117090 -95653 -63625 -8714 -23199
12852 -23199 -5823 67303 118005 32378 -9290 75081 -19579 63017 121249 131887 102355 71417
12840 71417 100576 141130 116736 74103 -6393 34723 -76525 -108129 -93916 -132805 22513
12829 22513 -30199 -26832 -79268 -38673 13729 -6839 4991 -26633 -40319 -27451 -36865 800
12817 800 -97818 -109720 -6502 22802 63571 32940 12384 36902 -30204 -99195 -22748 58350
12805 58350 39182 -40626 120136 35412 131020 162436 71747 -22006 -10883 23629 -4984
12794 -4984 56618 -41014 -62278 -114658 -158737 -167595 -57898 79889 32073 -51580 29010 58399
12782 58399 3714 -15264 -40472 -135169 -31608 -134660 -12007 19950 -17781 37184 15918
12771 15918 -28538 -41260 15562 17102 -90145 -9069 120721 55326 56867 91848 -42724
12760 -42724 -43908 -23033 28160 173248 55079 -168179 -41776 69198 27272 138302 114646
12749 114646 7672 2940 -78354 1351 70328 -10233 57111 -15482 -29083 -109086 -213553
12738 -213553 -76639 73708 30238 7035 56037 73035 -17882 -118747 -15822 -37663 -36779
12727 -36779 58896 58198 36197 -71320 -136315 -64324 -145230 -70868 -46474 -152518 -106822 -102311
12715 -102311 -26332 -23090 72457 62932 47011 27217 -83508 99635 92936 65414 -33445 -104704
12703 -104704 8124 9765 -5279 -71830 -34414 49671 57816 119595 100259 -7923 -81832
12692 -81832 -51207 1633 -72739 -91623 -116677 75762 142154 12584 53263 32242 63787
12681 63787 -32559 -15180 -31540 -22836 81740 76781 33222 -1130 48350 -9718 -24773 -65399
12669 -65399 -125815 -54043 -137433 -187240 -65912 -63688 -9608 -30072 -89702 25184 21022 -94025
12657 -94025 -129113 -28090 89611 45525 7346 7110 -24332 -5442 -19296 -177549 3984
12646 3984 66561 -18723 86693 69789 40398 -195507 -159516 -184177 -80296 25519 -56899
12635 -56899 -84985 5027 27105 -34463 99897 7191 -53982 -136853 -44173 -9012 -64937
12624 -64937 -90259 12077 50099 25339 5136 49206 14978 -41531 -74309 -68329 -45031 -67415
12612 -67415 -25736 -8098 -17017 -114265 -68410 -27382 -28979 -42560 -25460 -60257 -30152 122287
12600 122287 46220 16366 53086 48488 20869 161589 60880 -43339 -61057 -53656 8977
12589 8977 5846 124239 103287 -33345 -10466 -30524 69575 24090 -1052 3212 -14119 73720
12577 73720 67119 -19082 16793 24341 105298 76084 29629 84224 118465 29589 -29699 37479
12565 37479 86582 51320 49378 125264 100954 11482 16720 64737 89525 13107 -70991 -9356
12553 -9356 -66946 -15084 20245 3612 -52240 -96448 -100500 -60635 -110617 -10567 4824 -51872
12541 -51872 -8950 10130 -8168 -59718 -122256 -114742 -74921 25834 13423 26182 108095 -2400
12529 -2400 -8804 -53021 -64965 4381 -16298 16518 -34458 -14777 -83022 20508 37200 -42637
12517 -42637 -236149 -167694 -76482 -81526 -100539 -62982 -42768 -72530 -56156 -12014 39483 8347
12505 8347 23368 62581 14139 44050 17911 29677 -1547 -34591 -48950 -11328 47548 -24351
12493 -24351 -39058 26832 32224 62004 4450 7887 22219 -69349 -63721 -58462 -102392 -181733
12481 -181733 -155131 -112073 -115224 -20896 -28667 -33432 26734 -2450 -46292 -31297 28332 27406
12469 27406 68500 -33716 14350 102329 92930 -2927 -19902 21045 9324 20497 -106869
12458 -106869 -156736 -184021 -173456 -20466 46618 -16171 -23063 -79268 25230 10903 -14349
12447 -14349 68440 3530 53148 48609 10090 50123 30706 30209 167045 40084 88805 23961
12435 23961 -10922 -62421 -37673 -48837 25261 -54434 -49384 -66194 -36078 -44693 -76078 -2696
12423 -2696 -49035 -23024 -21903 89508 -30780 9403 106205 12716 -4562 138946 126726
12412 126726 -9867 -32939 -25621 17283 55646 148688 145416 78168 4178 48200 18245 28678
12400 28678 53424 27881 -53409 -65741 -226894 -183032 -125472 -14238 95602 25032 -39111
12389 -39111 -27604 -29780 -11300 80488 10225 25087 36274 -18736 33185 65556 50677 13695
12377 13695 51334 31303 15544 -36209 53598 104044 55184 202854 82607 -2924 -15195
12366 -15195 92504 64532 62215 -77597 -57236 -24844 -37227 -19789 5979 112140 31886
12355 31886 -62759 -96550 -38823 -67235 -77550 -24857 -62834 21109 63996 98722 -38541
12344 -38541 23582 -22877 39137 11029 -63731 99237 25793 -11465 -123047 -128858 -49530
12333 -49530 -37834 91018 65299 55402 3553 -53373 34768 4857 61048 54790 43634 139873
12321 139873 117567 31017 16818 -68925 10465 -60982 20167 112907 -57800 -56168 -83280
12310 -83280 -108821 -182990 -72750 56666 13749 -31779 61904 -88025 -151175 -86404 59560
12299 59560 47941 -91090 -63253 -4074 -44170 -122283 -133317 35532 150114 31886 -50614
12288 -50614 4683 32391 -47420 -85544 -70803 -123344 -70331 -111538 -108714 -19236 2621 63550
12276 63550 -11299 40046 -57425 -62916 85382 120173 -17881 -21657 -69595 36399 48238
12265 48238 -62321 -68140 -12733 27545 121 -111380 -186529 -63157 -76804 -184868 -101965
12254 -101965 -63963 -52618 25363 -62345 -27596 -5384 14176 51326 92930 87442 8852 -63223
12242 -63223 -81004 -45831 -36085 63910 137072 191782 117014 65690 127047 97647 102067 96921
12230 96921 117013 24 23104 51517 45391 -33393 29288 77488 6816 -13130 -77295 -118365
12218 -118365 65251 182468 83514 42057 1495 95496 96911 20256 -17794 -29296 13185
12207 13185 95293 121937 136649 36806 181496 116157 -38606 59463 102015 100517 25663
12196 25663 -170207 -19159 54168 78888 48315 70453 6813 -103235 -48220 -10462 46500
12185 46500 10543 60324 12180 48281 46421 71907 55676 -43251 -141774 -39839 -32859 29113
12173 29113 -61974 -55310 91354 -9660 -31244 -75641 44842 54556 88085 44274 4079
12162 4079 47259 -14634 12862 70757 -77439 -31816 -25097 -64991 -66701 27124 64705 49807
12150 49807 17717 943 22892 -100354 -135954 -185904 -91236 -10612 -76307 -82225 -35344 21717
12138 21717 58048 31815 78130 17720 -36274 60564 29634 34158 -14228 -9646 -46257 1487
12126 1487 -75496 -45912 -2381 -78565 -67134 -2212 93616 -2188 121646 78675 -45425
12115 -45425 -68646 -70631 -53486 -52709 -141383 -505 96473 46268 154347 69652 -32344 -12853
12103 -12853 -81547 -66355 -3261 108215 104054 100187 -25220 -34244 110488 110802 105442 41631
12091 41631 7124 -61447 -125981 -88181 -157439 -190752 -77195 -6101 -76651 -8543 18943
12080 18943 2509 14479 12939 101045 167258 186903 53738 -21014 -114452 -56938 -77378 108836
12068 108836 118598 95696 18024 -63739 -12156 -82254 -49512 -170351 -115853 -60729 13268
12057 13268 39612 59048 125412 149437 30656 16405 -80469 -83123 -96775 -140385 -71600 -105831
12045 -105831 -169249 -47096 -58954 14479 1854 28688 -23610 16970 -88475 11257 67292
12034 67292 -5908 -28817 978 110646 -4980 -19081 33756 22628 46801 41383 -31271
12023 -31271 33491 78716 132101 51135 -41637 150883 109472 705 51631 7595 34427
12012 34427 -1163 -61748 -147978 -136492 -153663 -158727 -57970 -66697 -57398 -68385 -162849 -194055
12000 -194055 -135367 -75993 -16005 -32793 -127068 -72083 -55970 -8569 -140084 -150298 -154520
11989 -154520 -72016 -157056 -69008 14728 -1492 -65522 15579 -55874 -25591 130220 63311
11978 63311 -44206 -26142 -81040 -59818 -34156 12625 -22984 -79724 -150773 -112476 -17297
11967 -17297 -12108 -21732 -20287 21486 -17070 40663 105755 34789 -24616 -48603 -11991 17007
11955 17007 -18758 -21531 105675 67152 -18031 -78317 -133095 6915 45797 -98362 -43917
11944 -43917 -25890 -19118 -76717 1258 558 -1953 32206 -43041 59934 117311 27884 -28561
11932 -28561 115182 158406 139051 153771 5813 -45500 -47671 -55116 47839 -66195 38592
11921 38592 -18995 32650 -52043 -33462 -74812 -123484 -74210 -114371 -135629 -191339 -144344 -51623
11909 -51623 -12683 49472 64268 39722 90565 35128 -85351 -32713 -50981 10035 -114782
11898 -114782 -125112 7207 44835 27225 11144 -44709 -20354 25656 -5067 -63608 -71554
11887 -71554 -57771 -48724 -14765 -60696 17059 151663 171396 103050 -13729 59941 -14769
11876 -14769 56546 -28936 -2595 25544 -73692 -110511 -44072 44328 21454 -53437 -59839 -68200
11864 -68200 -81236 -19194 -36027 -13900 -54640 1704 -10172 -81177 -112557 -59525 -113869 -109691
11852 -109691 -83682 -4459 -82458 -139738 -208770 -112444 -42872 71953 -89741 -117689 10603
11841 10603 12654 -41967 -80756 -112500 -147902 -38482 -68308 44326 40752 50892 -34032 -75218
11829 -75218 -40500 -33006 -136760 -75602 -63207 20530 93271 3090 3032 3508 69302 128330 87946
11816 87946 -77931 -107086 -8126 -31583 -6857 4148 83057 87957 83711 34679 -7934 83659
11804 83659 75773 -28747 -68059 -64523 -49997 59754 -88699 -100515 -130293 -52555 -19303
11793 -19303 55530 -13848 -28916 -20635 71272 -16093 -37675 -21721 44558 -5376 -86314 -122120
11781 -122120 -102036 -103744 -85859 -127067 -57060 -42304 -148239 47923 125812 70645 -25402
11770 -25402 -66474 36848 53570 -29233 -91508 28476 214629 134180 51208 -53734 -67767
11759 -67767 -9814 19557 -99025 -58534 -57828 -34332 91691 131222 104716 161985 147169 129965
11747 129965 62848 93009 50307 81385 41540 48810 98713 47915 57475 -140145 -206485 -77685
11735 -77685 -34349 65728 24701 -4798 36880 31772 11574 36620 38494 127823 101105 5124
11723 5124 99452 49461 66426 37271 -71958 19206 53136 5341 6420 -29947 -57884 -7381
11711 -7381 -2803 8233 35320 26570 -53643 -88790 -150182 -154064 -188244 -107845 -98801 -41289 93299
11698 93299 49616 -4456 -31040 28327 15200 -115067 -91323 -10108 -90186 -48671 -83790
11687 -83790 40605 22128 40360 -46104 11345 -20262 -27605 -144287 -33800 -6309 -41976
11676 -41976 -43689 -67252 -30054 26839 67108 52441 -95912 -163545 -76434 46380 63125
11665 63125 37450 2780 -35034 -62601 -109098 -129010 -95115 -65918 -122081 17483 -133609
11654 -133609 -139441 -108608 6751 38582 60661 96458 -43722 7911 150789 13129 51758
11643 51758 -49150 -51270 22971 -37982 -105433 -38363 -7767 3294 638 57672 -64463 20792
11631 20792 20155 -96436 -27838 -43559 -30370 128628 23005 31194 -8761 -34444 12088 -21584
11619 -21584 -10719 20159 77274 -6113 12588 35954 435 -81182 -149809 -19424 -35890
11608 -35890 -42473 -22293 42088 41100 -19401 81777 173339 114010 32819 16264 -40895 -68599
11596 -68599 -66544 66545 68 113876 101956 62363 107140 7404 -98867 -98233 -134429 -1540
11584 -1540 95591 -16110 -105153 909 -63351 -7955 3505 -8476 -51545 -89975 33132
11573 33132 -16916 -74580 14790 -32227 -32009 -51416 -47236 -93667 -107203 56654 -26776 -41654
11561 -41654 -16580 17175 34358 16502 -39659 -55174 -18587 -81155 31518 11004 41929
11550 41929 43483 -49043 -106804 -64105 -40951 -86061 -174846 -37661 -4762 53178 87990 -95283
11538 -95283 -79960 16674 59569 -24847 -35113 -65916 -47675 -12440 24710 -16408 25063 -166845
11526 -166845 -118579 -49121 -136587 -54843 -5357 -76132 -34331 -3267 30386 67336 -8054
11515 -8054 90677 76637 4477 26500 10759 -120848 -106143 9685 84530 -148835 -151219
11504 -151219 -64101 -135547 -114034 -105814 17869 19945 37742 106640 -60263 -91617 -23747
11493 -23747 -35502 -91262 -134300 -19477 100083 53067 28214 41699 -144538 -73745 5968
11482 5968 27559 36969 -16345 -52123 -126568 -52713 8844 -29395 -78897 -181927 -178136 22863
11470 22863 108259 19088 56499 76029 -26183 -35303 17384 6771 10270 62233 79808 64946
11458 64946 56689 27729 23536 -116341 -41687 -93731 -113482 15679 -6479 -7884 1359 -44998
11446 -44998 -53913 11662 38189 2404 -135838 -147009 -198063 -169917 -44916 -57080 -52185 -74648
11434 -74648 -98520 -22529 106858 10000 -33507 35577 -109922 -117675 -51235 -29761 -33604 -43301
11422 -43301 -70486 -161653 -33498 60187 -114307 -75481 -96491 -51301 -20444 -67332 -86115
11411 -86115 -88899 -160782 -73457 -56526 -105549 56892 -22021 -11475 -9909 -113192 16694
11400 16694 35269 -11746 93254 -15152 11865 8402 82109 21086 -21916 2033 -11341
11389 -11341 34412 -50821 -124523 -103795 -19338 -105215 -58955 -30782 56752 77889 -30223
11378 -30223 40386 16515 16606 -109130 -46878 -83939 -39751 -40373 -50861 -20935 32711 -39056
11366 -39056 -172859 -34751 9746 23399 -60343 6813 -43093 -31755 -84037 -80799 -48842
11355 -48842 -26602 -98013 -94427 -80205 -100812 -84601 25712 56812 -14517 10933 -27117 6816
11343 6816 25962 -26786 -107819 -80101 21427 17585 -45136 -130263 -112622 -20217 -133660 -36140
11331 -36140 32726 -1044 -48401 -116530 -105068 6336 10895 -44907 2029 -69262 -2389 21497
11319 21497 97242 30396 -4540 -16923 -115752 -33153 12562 -37158 -32843 7462 -102108 -120658
11307 -120658 -120927 -16419 -42997 -168562 -116423 -109777 -186878 -175116 -122318 -116574 -150100 -99677
11295 -99677 37424 -38105 -69662 -132659 12966 117062 -37870 -168636 -30195 -44118
11285 -44118 -57456 19951 -44000 -74695 -48887 -65386 -137544 -33571 -66757 -5936 33105
11274 33105 -64159 23540 23248 -20994 -118839 -88407 21646 -55638 -20419 -83100 -161482 -50162
11262 -50162 -30106 -91232 -146141 -42500 31981 2849 -44548 -53901 -151197 -34152 -4917
11251 -4917 44706 -18701 -183843 8502 85495 31179 -20511 3524 2620 24968 -56853 -118208
11239 -118208 -89050 -97174 -124775 -76314 -75134 2048 -136153 -26508 23571 -28119 6746
11228 6746 -14912 23663 40612 -613 -2481 -12849 -83663 16980 -67158 -96025 -112897 -120492
11216 -120492 22593 3534 -25071 -33372 87332 85617 -28764 -27673 -53640 4669 -23023
11205 -23023 -82468 -25204 8489 -69833 26670 35711 30413 75116 48757 68383 28812 27644
11193 27644 40279 -64249 -80960 25880 19949 -7647 -40023 -82213 -49544 -31323 24746
11182 24746 -57927 -103086 5461 -18434 -51756 -93983 -28890 -6870 67058 -87414 -187927
11171 -187927 -110302 -64211 -88524 -68541 -22471 19872 -34074 -92719 -71667 -28357 -55559
11160 -55559 16441 72750 33284 40833 5596 12389 22248 -6396 38477 13844 -74560 -30559
11148 -30559 12800 7889 5440 -56360 -65642 -112843 -83564 37712 36691 -4195 -109693 -189076
11136 -189076 -93679 -65039 -37314 -10909 -26536 -23775 -10708 79765 60114 -20926 -91550 -104352
11124 -104352 -132385 -82038 -101714 -113753 -153793 -116279 -93167 -116131 -160392 -42976 15480
11113 15480 30936 -45349 -24200 -57471 -73415 -26631 -82178 -143238 -11940 20384 -133848
11102 -133848 -2476 -37966 -121522 -11668 -81251 -121021 6500 80839 18996 46076 62339
11091 62339 -35612 -33377 -63923 -144568 -59620 39946 2554 87172 -82 -88728 10646 5742
11079 5742 30174 84055 69281 112392 57691 9128 78372 48041 -15485 -20355 -31594 -94429
11067 -94429 28499 19939 6498 36968 -115646 -149241 25425 -90810 -109707 6724 56372
11056 56372 21096 -8330 -64570 -127062 31509 -54653 -64076 -13568 8745 -43938 -105259 -9154
11044 -9154 -28408 33865 66049 -57508 9146 -28050 26275 42975 -77964 43360 16867
11033 16867 -26596 -72993 -152957 -90451 -129474 -180886 -155244 -88523 -52871 -80790 -127733 -8778
11021 -8778 39475 62387 -15419 -112433 -108061 -69292 -18716 -42059 33711 -13907 -17857 -29301
11009 -29301 -50410 28343 91401 -3374 8788 -56862 -74331 -33816 -70940 -75855 -38758 22820
10997 22820 60793 27667 -19446 26296 -131723 -167111 -109520 -20783 -26921 -15435 22577 68121
10985 68121 -35699 -87370 -72989 -177140 -257241 -26376 61542 -64127 -61763 -12176 -29153
10974 -29153 -35598 -22836 -52123 -34802 -68535 -168301 -118215 -130506 4528 -28950 -82815 -94070
10962 -94070 -101790 18266 -61733 -60062 -1362 -38486 10211 -43634 -60156 -142506 -126221 -141280
10950 -141280 -169366 -72157 -66903 -56945 104642 128325 63831 122500 6592 -16338 -143577
10939 -143577 -219625 -95784 -28343 -172654 -64973 106543 11331 -64166 -119443 -141357 41692
10928 41692 -89118 -95201 -39753 -153464 -109452 -35139 94220 61899 71438 -108894 -201886
10917 -201886 2450 66442 -81393 -49543 -9608 -123170 68186 8190 -103056 -102410 -89764
10906 -89764 -4988 22946 71902 -5009 -93665 -100132 -138190 -63599 -44746 -40997 -4165 27358
10894 27358 77382 30201 -102499 -8443 -32974 49628 -61052 -53125 3140 -56655 -12964
10883 -12964 -171677 -48202 -42158 -159584 -109055 -91412 -42507 -72763 -76360 -26918 94922
10872 94922 107685 45985 -32934 -58594 -115476 -118135 -111420 -13722 28172 -27248 -74563 -174237
10860 -174237 -170567 -96764 -96926 -73744 -88347 37336 69059 50418 28292 -62745 -148 -17567
10848 -17567 -61635 -24121 33864 23352 -9343 -1494 75416 21973 -21228 -53049 -86122 -21309
10836 -21309 -3756 -81882 -26476 29509 19526 -38173 136809 95547 -44161 -21443 -63550
10825 -63550 -91171 -4595 -16911 -9559 -28491 -16792 20609 -45457 -14164 9278 -11381 -114173
10813 -114173 -84991 -25223 16204 36528 4921 76314 8580 4041 -10167 -4850 -104209 -15619
10801 -15619 26720 -38884 -9011 27679 -43784 -15149 72580 17287 -133449 -104169 -61179
10790 -61179 19181 -31144 -73859 9684 -65781 -54840 93129 112569 -4974 5383 -9135
10779 -9135 -34395 95303 55847 -57124 -9818 16429 -27925 69225 122713 112187 29122
10768 29122 2913 11721 -80519 -78301 -113939 -28632 -37691 25752 67530 50532 18433 1835
10756 1835 -44278 -32308 -128034 -128315 -118000 -44018 21188 19132 -34839 -46781 -78999 -81216 -40612
10743 -40612 -100409 -44105 -23893 51997 -25315 -108039 -55509 -67482 105961 89606 -1084
10732 -1084 49450 43795 -75948 -105461 -38597 -201376 -115133 -69089 -47725 5481 -20452 -70934
10720 -70934 -102851 -118965 -96680 22396 -51766 5838 54675 -77215 -16575 39737 -5980
10709 -5980 38483 73782 107820 -148230 -45608 2743 -123919 -20166 17118 -92757 -132498
10698 -132498 -152456 -57943 -62660 -88411 -97894 -19757 18638 13829 -28682 -87717 -62715 -176070
10686 -176070 -68711 -40582 -41014 -108489 1388 34659 -62072 114060 129651 54297 102549
10675 102549 16687 -20646 -38733 31558 128683 121667 -22121 -56963 7668 -35384 -16746
10664 -16746 -53429 -30760 -12774 17046 1216 -22371 -26082 33528 61854 97735 67295 -90778
10652 -90778 1082 -79691 -44000 -71062 -8164 55307 62616 51816 82192 -54821 -120086 76204
10640 76204 63712 -48218 -75557 -20245 -58200 -117889 -43556 81060 29942 -109455 -29412
10629 -29412 -79631 6069 28 -8999 -110845 -165457 -47507 -123899 -167749 -152686 -62962 -103355
10617 -103355 -104632 -15249 -28932 -123627 32802 -64714 -125569 -39745 -104517 -100323 -121460 17805
10605 17805 -58356 -113166 93149 6738 -95190 -48753 -48040 -8755 27930 -75435 -114889
10594 -114889 -8195 -51353 -100740 81694 -32555 9752 -111929 -99676 -20114 21799 9960
10583 9960 -20567 -152663 -33248 -61174 -91585 -65482 -88527 -116876 -74835 28088 23696
10572 23696 1800 7385 77814 -80126 -84944 -53615 -120350 -212173 -130189 -133914 -141149 -106342
10560 -106342 -1084 -105223 -156921 -212846 -250670 -164248 -110778 -151924 -102762 -9018 -49487
10549 -49487 7742 -80484 -69941 -44409 -108814 -93534 -23797 -1846 -38844 -74042 -46919 -63243
10537 -63243 -206654 -202080 -71270 44763 -124347 -122971 -46771 14988 -30168 -63278 -175003
10526 -175003 -177960 -98128 -228063 -190655 -155635 -200648 -121422 -89000 -135026 -172566 -121919
10515 -121919 -118017 -201511 -74351 55651 -31748 -55348 -86259 -100100 62448 -9250 -166413
10504 -166413 -52091 145900 25857 -48753 -748 -68966 -27935 -74253 -100031 -122775 -96712
10493 -96712 -116751 -126159 -98415 -163732 -39096 54589 60768 16482 -136735 -74037 -70526 8881
10481 8881 -63933 -221221 -87934 -21423 40218 8428 33443 21754 4637 -34714 -70893
10470 -70893 -160460 -102777 -98541 -65866 -24298 -8933 125244 -28091 -93061 -21699 47300
10459 47300 -14196 -14101 -19858 18755 11400 -43844 -21652 -73494 -55341 -8552 -5909 -9702 -70293
10446 -70293 -8579 -65974 -81012 -56751 -21318 2989 -43297 -94877 73682 129966 -18948
10435 -18948 -4090 80499 85183 -20160 -41132 28063 151646 67115 15826 -22928 -33160
10424 -33160 -107081 -134331 -207832 -43762 57866 52838 13154 56189 -44696 40505 560
10413 560 -61496 50084 141695 104436 53308 -4902 45165 93373 74255 -103911 -62031 -66061
10401 -66061 -28974 62112 10203 11216 -20311 41951 -1600 -120461 -183798 -110498 -176464 -75641
10389 -75641 -51126 -29296 -63675 -22665 -59697 -37132 -19747 -12318 -78484 -132030 -135577 -109902
10377 -109902 -63407 -159766 -172695 33172 1802 -12375 -46889 -61874 -56091 -87602 -143554
10366 -143554 -44376 -24704 -135416 -91435 69246 12766 -11165 -68914 -17573 56735 -20467
10355 -20467 -71729 -105889 -38139 -6478 -111715 -110146 -61404 -37231 -53219 -96684 -1989 -38300
10343 -38300 -8787 -37499 16537 68192 8438 49492 -15345 -98763 -24397 13743 66293 579
10331 579 43788 88049 10174 -24685 40355 -134978 -100959 -56846 -98436 -11290 -19685 -94590
10319 -94590 -54073 31042 -7989 -42266 12883 -25854 -59565 -86683 -19202 -49933 -64337 -54192
10307 -54192 36524 105218 44563 -8962 43991 -31155 -34639 -21227 -118422 -79924 -164822 -28102
10295 -28102 47345 60712 1968 86176 68888 129830 180404 105473 -18017 -122486 -76919
10284 -76919 -75474 -88077 -41527 -7978 14045 35716 14085 56088 22265 -4409 25392 -12208
10272 -12208 17318 -35696 57723 44284 30012 84928 36408 -19695 -5067 -14878 37413 105823
10260 105823 42072 28613 -77046 -90075 -26360 55555 1142 59274 83353 83365 55879 41781
10248 41781 92696 76961 47435 1996 65322 -20949 -44443 -88883 -122719 -100098 -59996 -76910
10236 -76910 -2505 212946 123837 12912 -40007 -20610 -18302 -100505 -84115 -123238 61385
10225 61385 9495 2007 -15753 80318 106424 -72056 6389 164150 231622 114850 21302
10214 21302 -83474 -61961 -15692 -51719 -45822 50562 -170643 -200939 -63 -75254 -162555
10203 -162555 -55593 77455 65782 75577 7896 -31891 53269 63885 -2000 -169745 -77955
10192 -77955 -62741 -63305 -77574 -151987 -192971 -60556 68926 53397 59752 42554 -39690 -13898
10180 -13898 42458 43402 46943 9043 -15810 -3981 33993 -8539 -98334 -98583 -4188 -7736 -11829
10167 -11829 13080 -32339 32281 126287 112961 55605 94950 74350 14598 -47056 9780 37529
10155 37529 -11994 128928 153880 119342 143515 -11680 -16808 -60132 3018 21979 -44190
10144 -44190 -117619 -58862 -23973 27045 -12640 -26261 -47222 -148788 -32346 21461 -17040
10133 -17040 -1561 66723 -7923 57136 59889 -28438 -65826 -51842 -28236 184130 51873
10122 51873 -65572 3198 75538 38128 9646 70610 109967 134287 57731 72740 110632
10111 110632 75540 34341 26665 6768 70812 112046 49033 -4834 19955 65869 -511 -39210
10099 -39210 -29194 -15246 73483 103151 -12304 16612 30602 -5788 -18561 -58538 -83136
10088 -83136 -35522 55966 33042 -64950 -63207 -112387 -84971 -108549 21518 77815 36461 -21376
10076 -21376 -115996 -83774 -26094 -38646 -46289 18197 4021 -32702 148747 -874 -57345
10065 -57345 -104647 -48674 208213 143922 111075 80531 9166 -90351 -10477 -6769 -16590 63588
10053 63588 95594 82276 107524 79839 -16241 75911 -10841 -111238 6196 -21842 50970
10042 50970 -90322 -88323 -12716 27494 75120 90951 60021 -60663 -138350 -26661 16912
10031 16912 -82559 -41287 -15114 -30777 -41902 -12750 25696 115135 111372 32867 47099 154824
10019 154824 135081 99565 115893 138337 72026 -6353 17708 87880 91755 140935 171571 111524
10007 111524 132346 81791 93563 95078 2060 -24191 85068 161745 89116 27264 -22125
9996 -22125 21845 33000 16026 123083 40167 19953 64455 36858 -98847 -64752 21532
9985 21532 59524 12410 7658 -10251 22119 144090 148241 61180 -22636 -37872 -32396 32050
9973 32050 -13134 -128555 -91817 -52711 -52439 -119086 -223005 -159893 -73994 -69194 -96830 -76341
9961 -76341 122308 85486 58735 75841 42831 35701 15353 32195 34507 27194 -34514 127403
9949 127403 136009 -13276 -19549 19525 175389 70787 55662 104429 171312 244011 141927
9938 141927 78115 47941 6156 55716 156288 152943 83662 65477 66405 6671 4063 70555
9926 70555 107149 15448 81683 78279 -24681 3246 22789 66092 30204 21917 40156 38433
9914 38433 -3846 -53280 -40025 17128 -80022 -146735 -40016 -86693 -7179 -33878 -101107 -88477
9902 -88477 15959 -2648 50200 -31779 29888 35118 55863 130053 94071 101985 110293 73209
9890 73209 34794 45311 126544 23568 -67272 65322 132481 52466 -1632 78844 99355
9879 99355 123940 62607 -91396 -49719 -79590 -60119 -81064 -58247 -100991 -94311 -29723 31500
9867 31500 34053 -18411 24432 54425 40648 -12005 -54327 -85594 -54025 -63125 -82282 -111845
9855 -111845 -47138 41786 -29870 1069 86474 39702 94117 64549 18582 -18505 -99240 -86430
9843 -86430 -7123 86637 113068 -32398 93060 -18115 -25614 -32882 -52228 -45373 -25496 -17191
9831 -17191 -18928 35777 -1192 16503 75073 148878 117941 70414 56124 72803 66611 -35780
9819 -35780 -45136 -56117 -122492 -42968 141033 113707 -87642 -106368 26757 33015 62969 44186
9807 44186 -59734 -87422 93837 138898 -18966 -43525 43062 121061 18180 -88353 -47860
9796 -47860 -27538 -62664 2741 -15994 -152547 -152888 -123032 1535 25632 -14577 117345 82518
9784 82518 -17853 -63173 -20567 -19197 -126853 3292 40709 41008 79650 -8385 -25639 -39380
9772 -39380 -28313 -52746 -111659 -232647 -64851 -3917 -74922 -85126 -87617 54347 41533
9761 41533 -45879 -34285 -45726 -188579 -230393 -82077 61703 -76525 -58385 98980 129339
9750 129339 81340 -43725 -29516 71724 80835 4369 -175031 -138840 -60474 -83923 -80386
9739 -80386 -40996 -17718 44716 -33830 -138738 -193985 -99785 -38446 -66184 64428 145372
9728 145372 91173 39580 143576 173476 103231 21392 165256 101937 141641 107431 124509
9717 124509 108972 57056 6243 9991 -118795 -39043 -4473 -57797 12448 23757 24445 32318
9705 32318 -10454 -91490 -69692 -36080 -8551 37659 141383 166781 120373 -2679 16538
9694 16538 -55089 -62521 34630 36067 -66621 -88955 -67743 -44672 -97439 -5541 174453 115692
9682 115692 47002 36542 148998 101526 86004 47669 -85784 -11197 8263 9491 58715
9671 58715 50468 -24115 -42994 -55035 -27620 18043 46187 123568 73548 57901 51067 81320
9659 81320 55591 69738 51191 31399 35334 56672 121588 85902 73346 56025 145191 7466
9647 7466 -38692 -73078 -52545 -49347 -55202 23959 -26028 49774 143639 168773 174643 73377
9635 73377 18283 45671 5562 43963 135120 154018 27756 -173759 -54060 -64634 62905
9624 62905 98945 112093 117864 94548 98482 198788 133639 189110 85474 -8039 40041 -54534
9612 -54534 -67279 11122 43730 1545 47405 75337 118305 135711 106760 125214 115302 78060
9600 78060 20567 -65801 10921 7994 125371 -4393 -12115 16444 76080 130683 158730 101670
9588 101670 101735 26148 71535 129547 211508 37881 84262 -10769 10468 -77561 -52790 -22426
9576 -22426 -73452 -39564 -81544 124846 42684 142044 109584 -2716 66912 28956 -99559
9565 -99559 -19970 -146939 -107203 -71660 -29947 24840 29232 -59894 -24884 85526 44839 141704
9553 141704 108618 120155 210258 47323 -50035 52385 54060 11758 67606 46888 83192
9542 83192 136680 86854 73098 71091 102361 70746 83345 73495 126196 144279 114410 145621
9530 145621 127731 9567 2870 102259 174826 140764 30772 26959 15528 118018 100118
9519 100118 133850 60976 -43125 -29234 50403 143696 156150 70234 3520 52133 198975
9508 198975 137139 -17731 -13232 1651 -89535 51408 157739 196031 204878 133759 10933
9497 10933 -31162 20047 33821 22149 23024 -35831 13274 35991 3607 34270 85921 33866
9485 33866 -57563 11740 -34005 -10796 44161 33982 -45736 2947 122260 120936 35097 108488
9473 108488 101432 85014 129494 171971 130126 81976 -23855 -4606 74496 30314 15157 57945
9461 57945 141244 206663 175503 103996 198184 208549 186582 159505 55396 110089 43726 42590
9449 42590 6672 43697 68305 -7179 34734 8429 -15269 11933 84125 100718 134532 40084
9437 40084 40105 80793 106579 240769 80983 55083 18285 -12078 34805 963 -37947 86501
9425 86501 91457 87476 148439 80954 62194 38147 119724 193639 130427 49992 63713 169257
9413 169257 62817 -10411 59055 49292 27168 83987 -15937 -101879 103702 117389 8210
9402 8210 -7462 73170 89535 117135 11396 -14236 144265 184435 207754 102065 29053
9391 29053 33151 -30595 130872 102791 105952 86242 431 -62520 86609 138821 111742 68148
9379 68148 74011 115641 109651 193555 85687 101976 65969 -28983 -80307 -4590 141271 55441
9367 55441 -34326 -46079 -95679 -64184 -101340 25620 36114 158795 217768 120214 92466
9356 92466 18163 115149 90908 18488 63141 97728 36632 16369 -22447 63528 17080 6999
9344 6999 10507 -20940 70085 -25084 -38340 10948 112453 72238 80449 129844 70881 -15577
9332 -15577 -47009 49536 85949 1521 -8967 -10829 51091 7383 39780 102930 130093 208685
9320 208685 191869 -17558 -62556 83451 81335 76034 -64863 39477 122337 110324 52511
9309 52511 84261 -32400 -137689 -99921 20104 2154 -78517 755 35017 100026 127436
9298 127436 79088 -25471 -45393 -73146 -1 24175 29116 185424 187886 208489 203007 310387
9286 310387 46140 -30955 51397 -15427 -31266 31305 -28611 -30277 -10038 33144 -16789 86627
9274 86627 112218 38950 2961 -76483 -93666 -143710 -197651 9169 41220 7102 116644
9263 116644 53184 132189 80275 106920 135219 109487 54260 30302 16162 123829 79036
9252 79036 42199 292 88154 78924 67349 149576 127701 -36479 86383 -80682 9823
9241 9823 97691 124856 88683 130071 90365 8860 -36137 63782 91594 96479 23904 89156
9229 89156 86897 125358 102980 88779 171195 -298 -60685 -69483 -63411 -59778 45278 100718
9217 100718 64785 33159 92345 7006 93540 51389 -8327 -47266 -7495 -21412 9396 67839
9205 67839 -89363 -98474 58087 -9693 -48586 37675 101536 117247 109675 37611 97247 85323
9193 85323 55158 121909 148734 146908 195961 81951 63167 -38965 23024 62490 56437 51817
9181 51817 131080 172081 93805 -55450 108579 139396 131850 221988 215593 120483 122378 187136
9169 187136 125048 224864 178457 76935 87949 55861 3852 130194 38709 24942 -15463
9158 -15463 46416 130453 171510 63172 70685 151009 84274 95147 129715 66619 20906 65262
9146 65262 123757 124026 166949 37088 38658 184306 181646 76225 91998 112079 146312 117342
9134 117342 10837 88123 118714 180667 6390 80707 76219 16873 -3124 69235 105807
9123 105807 142649 119102 135581 153176 141530 94372 153474 161718 -30911 98690 106001 52687
9111 52687 114788 137484 120453 81444 187241 229859 184595 150641 129457 133933 143932 75776
9099 75776 87986 84354 181974 174589 187886 139173 39424 118811 126559 111286 77773 131085
9087 131085 128544 110789 133406 67724 100385 261295 56407 72108 46204 139836 68788
9076 68788 106319 213141 295960 262235 193284 199620 75441 96975 116278 36846 -28834 120613
9064 120613 166883 48424 21312 116158 130343 17898 119170 94328 57779 91805 103872
9053 103872 148725 207565 178011 81490 100929 188582 218520 199842 181667 255028 281570 152192
9041 152192 54284 76524 118720 107110 142231 129763 153285 210698 175183 167762 213128 228069
9029 228069 197522 248851 199416 97173 177119 214223 268563 159763 128058 256685 285341
9018 285341 123968 159103 99726 86841 92355 -9328 118216 153101 131568 233896 224794
9007 224794 275408 268331 311909 396221 322513 271067 233237 225263 226208 223210 178321 120877 122068
8994 122068 243382 350602 244777 88968 106725 145363 90617 222390 321667 278503 209595
8983 209595 280 -33472 62163 114984 239371 332426 317379 360210 308624 342957 286151
8972 286151 303008 348178 359196 235821 234690 283181 241162 294121 300208 236308 213353 233528
8960 233528 323785 335660 224720 249028 263046 200138 229397 298847 323447 205416 277288
8949 277288 339262 370467 297370 245312 448772 350281 280705 213724 352446 375845 308813
8938 308813 409361 428400 412269 312412 311405 378324 288029 396350 346814 390833 341033
8927 341033 376502 346333 312975 329504 344906 161338 188231 164684 188197 376366 394456
8916 394456 512072 397238 258963 281908 364565 245458 365686 357821 311850 361564 368795
8905 368795 407826 461281 334579 399140 429770 362933 498284 496032 443694 408787 436593
8894 436593 376208 421280 307948 230129 290229 275824 311254 399566 342805 305053 223575
8883 223575 237772 304493 229531 236274 305629 362301 393591 349793 346471 406232 296001 365160
8871 365160 507595 413136 422987 449376 406044 378945 394046 424270 388894 332680 226240
8860 226240 364481 376045 502290 470861 502890 469517 476175 503832 497331 446320 432511 459854
8848 459854 316965 352504 367216 376567 362149 460717 558203 470503 394440 349597 430985 468400
8836 468400 377942 366590 481094 577397 509026 502518 502561 494525 467713 392623 443412 501384
8824 501384 546807 464428 438732 415752 457865 519457 485921 449452 480450 420595 470250 494457
8812 494457 606285 639446 589191 590233 532433 461751 491865 487777 431783 420533 449516 505308
8800 505308 528926 553429 541930 582260 551716 501084 605935 554621 530055 609785 648825
8789 648825 567880 573971 603288 596243 633377 497433 620646 540723 493771 489764 709687 666246
8777 666246 578162 581342 656466 649234 600777 568518 595050 604948 594111 764349 783021 613742
8765 613742 605275 624545 686926 737376 717212 668627 718394 842604 835335 793123 678842 671589
8753 671589 691801 740316 707314 725219 707350 671964 706746 867028 876963 862429 880612 855928
8741 855928 759119 787459 874207 833039 800570 736514 890663 869665 854981 878325 805537
8730 805537 902713 1000909 968587 967366 954175 988417 1057320 996037 1051957 1050030 1036291 1042080
8718 1042080 1068550 1054169 939456 1063312 1041708 1056283 973435 916096 954587 989600 993732
8707 993732 981626 988496 1071778 1026834 1024262 1110427 994870 1032244 1059532 1051916 986161 1089155
8695 1089155 1090660 1235130 1233843 1152424 1120249 1096190 1140377 1197438 1170246 1055731 1191073
8684 1191073 1281769 1210782 1244422 1221549 1248341 1318320 1183523 1225641 1296837 1401623 1418556
8673 1418556 1373983 1384856 1387658 1312515 1475603 1435585 1299154 1363474 1377784 1366142 1621413
8662 1621413 1684768 1680880 1689088 1529847 1547825 1389242 1434821 1424244 1406480 1528832 1590648
8651 1590648 1567058 1669133 1738435 1590914 1639825 1610533 1571154 1624186 1579597 1647624 1634032
8640 1634032 1653085 1656840 1795749 1799260 1747840 1781832 1730263 1716178 1725107 1661809 1730558 1834826
8628 1834826 1904418 1920098 1809902 1826849 1853248 1900831 1876485 1970275 1970092 1977311 1982800 1872552
8616 1872552 1910998 1833182 1893025 1952665 2113186 2014633 1888125 1966520 1938116 1897561 1948481
8605 1948481 2124912 2125880 2096807 2001516 1997318 2116147 2078681 2036011 2061200 2166484 2204666
8594 2204666 2109724 2084665 2096197 2219532 2296046 2211404 2166444 2137086 2202532 2147144 2275424
8583 2275424 2406656 2375035 2197896 2241511 2237074 2266466 2451489 2385163 2332204 2422656 2397163
8572 2397163 2382999 2397006 2448447 2509757 2472208 2454661 2480260 2497401 2514601 2555739 2516452
8561 2516452 2598408 2676584 2737230 2714591 2715053 2761954 2807860 2655070 2762935 2873399 2873514 2837732
8549 2837732 2875740 2953894 3077881 2958046 2877377 2998239 3090838 2959313 2921618 3013864 3113841
8538 3113841 3335537 3288485 3221727 3285832 3192785 3251109 3395450 3424348 3315936 3365877 3424705
8527 3424705 3413661 3452613 3512725 3457872 3407681 3627266 3678467 3598938 3582326 3736785 3768020
8516 3768020 3849093 3819342 3781291 3917338 4062799 4142824 4071920 4007260 3970904 4061313 4221738
8505 4221738 4276468 4293519 4421410 4402235 4443478 4609382 4681911 4615263 4725244 4854241 4872860
8494 4872860 5009666 5121070 4971589 4998038 5109386 5114982 5200108 5301290 5403498 5393798 5416748
8483 5416748 5431076 5583466 5758674 5824437 5957239 5975177 6082768 6077622 6173054 6210511 6384949
8472 6384949 6447657 6347933 6372555 6477703 6783084 6974213 6984866 7016996 7206092 7281637 7404684
8461 7404684 7473694 7650195 7659502 7656512 7821320 7894014 8027253 8244388 8408973 8581916 8569319
8450 8569319 8814546 8844336 9004559 9232291 9349853 9386531 9602117 9798474 9881146 9998197
8440 9998197 10155385 10322543 10497909 10630818 10853255 11054099 11270164 11407488 11573007 11724251
8430 11724251 11881386 12134889 12379828 12681184 12838596 12981626 13209266 13574943 13732148
8421 13732148 13970502 14057636 14318724 14642163 14940050 15177642 15363445 15683433 15964778 16174478
8411 16174478 16575008 16975983 17211579 17441470 17680009 18101816 18464851 18778867 19125068
8402 19125068 19604690 20019235 20372653 20750352 21136707 21563407 22080220 22585715 22959343
8393 22959343 23298253 23811734 24308485 24756864 25285766 25813248 26299423 26797180 27364004
8384 27364004 27869921 28395168 28934406 29518225 30116586 30661305 31175143 31757614 32331414
8375 32331414 32978002 33543751 34157528 34713040 35369197 35937480 36476645 37061033 37551848
8366 37551848 38140818 38700037 39220285 39847345 40416725 40994968 41416447 41905809 42488640
8357 42488640 42982920 43555368 43943268 44256924 44739583 45173755 45579632 45996753 46346184
8348 46346184 46612895 46964945 47220883 47422260 47790162 48145214 48344235 48458745 48611955
8339 48611955 48726204 48825474 48905679 49080019 49208233 49264115 49399221 49484458 49412541 49468468
8329 49468468 49429149 49316773 49244630 49148583 49054745 48870713 48713048 48579200 48395394 48211840
8319 48211840 48059178 47912179 47626862 47295001 46959896 46740975 46470135 46203746 45933866
8310 45933866 45571989 45230670 44787086 44348529 43873865 43437095 43089381 42492334 41960324
8301 41960324 41626972 41093544 40615563 40099033 39604847 39045730 38492700 38042185 37520543
8292 37520543 36997201 36358740 35665604 35121844 34650005 34110201 33427363 32649049 32080471
8283 32080471 31461528 30867899 30278902 29746676 29163134 28512225 27934628 27278698 26784987
8274 26784987 26296833 25746698 25207678 24771133 24213513 23622179 23164743 22701584 22224339
8265 22224339 21769282 21235097 20845204 20501562 20067252 19716703 19447395 19129737 18642387
8256 18642387 18451680 18025377 17659546 17367561 17049566 16825322 16604141 16411644 16098496
8247 16098496 15918537 15788996 15517337 15342412 15110471 14952108 14767422 14528961 14414475
8238 14414475 14302512 14195620 14054919 13855197 13725944 13698993 13538536 13483267 13399209 13252096
8228 13252096 13179651 13146697 13093698 13057131 12994369 12967602 12826797 12818613 12784270 12760499 12788361
8217 12788361 12775488 12607251 12692874 12837136 12829250 12846808 12821708 12899673 13012515 13059435 13213398
8206 13213398 13149782 13155108 13253024 13285662 13469037 13667156 13793828 13917434 13819292 14033761
8196 14033761 14152170 14383554 14480250 15120673 15532197 14420296 14469981 14596659 14802680 15129978
8186 15129978 15189215 15268832 15519074 15689091 15830257 15793258 15849887 15986529 16032918 16032297 16138293
8175 16138293 16255594 16309371 16298886 16308482 16490305 16547987 16456326 16395820 16360538 16201528 16210731
8164 16210731 16148249 16131266 16039373 15893103 15844792 15912592 15815006 15807133 15694543 15601606 15530290
8153 15530290 15542057 15464726 15380017 15335648 15232122 15176298 15158541 15147170 15088734 15103664 15080434
8142 15080434 15156668 14974107 15009315 15085250 14964343 14988269 15093549 15123493 15084749 15126873 15224419
8131 15224419 15299282 15375612 15513235 15458665 15527587 15653739 15789780 15877413 15796778 15942329
8121 15942329 16016494 15965168 16110031 16343211 16412591 16532903 16691527 16879681 16929707 17119893
8111 17119893 17295495 17545986 17789369 17980927 18195656 18359085 18515860 18645903 18840977
8102 18840977 18947365 19044876 19120342 19318296 19419560 19465407 19664707 19827547 19851170 19977800
8092 19977800 20185633 20439622 20637924 20951610 21158526 21418706 21653775 21918369 22258251
8083 22258251 22478381 22778282 23011567 23309547 23516564 24026923 24468067 24774384 25118987
8074 25118987 25650242 26112927 26563251 27156171 27734066 28363450 29006724 29587476 30361899
8065 30361899 30998427 31606055 32486364 33353576 34233611 35259721 36422070 37545929 38758777
8056 38758777 40066516 41469973 43038818 44624966 46168844 47946083 49804942 51660062
8048 51660062 53532527 55617378 57558045 59675536 62060140 64772759 67738429 71242359
8040 71242359 75028853 79455457 84458682 89839982 96232205 103694941 111937674 121457203
8032 121457203 132285471 144956736 159651909 176858567 197112833 220896647 248418541
8025 248418541 279561078 314103613 351291271 388206959 418427844 433485681 429817424
8018 429817424 410145307 378594576 340842643 302476094 267623985 237867612 213086578
8011 213086578 192604035 175091117 159685743 145459474 132442582 121292186 111719982
8004 111719982 103530279 96404958 90389444 84852533 80136080 75822117 71779891 68136208
7996 68136208 64956941 61879970 59027962 56413936 53721007 51456914 49382727 47381896
7988 47381896 45466871 43789007 42206398 40740425 39398713 37933605 36716411 35664887
7980 35664887 34622004 33621059 32630732 31600296 30671000 29873730 29086979 28237317 27441715
7971 27441715 26722075 25961825 25154978 24349449 23667544 23009466 22350506 21954975 21431168
7962 21431168 20742051 20344208 19940943 19515303 19014673 18480138 18080887 17817044 17575268
7953 17575268 17243137 16969644 16483788 16140304 15980449 15715981 15240453 15064225 14806014
7944 14806014 14624459 14347810 14003248 13659257 13239303 12969381 12803773 12551673 12283465
7935 12283465 12119859 12042493 11801054 11547005 11383185 11216346 10955577 10787268 10651390 10564602
7925 10564602 10490454 10334859 10189456 9951060 9653230 9507218 9336683 9055227 8922063 8808555
7915 8808555 8716595 8420018 8255498 8094018 7808826 7672258 7677021 7541083 7466842 7322539
7905 7322539 7158279 7002903 6951944 6865345 6710858 6619848 6597875 6455215 6370633 6344393 6185588
7894 6185588 6027611 6046835 5985663 5908224 5772124 5634899 5624049 5635805 5479081 5335787
7884 5335787 5295712 5199748 5179999 5052383 4964706 4948416 4901462 4900044 4723838 4689807 4705430
7873 4705430 4688954 4559894 4535590 4478771 4431636 4499479 4474089 4400523 4426444 4495957 4433975
7862 4433975 4352148 4171099 4172325 4201435 4090809 4158837 3993091 3961568 3951395 3850608 3785846
7851 3785846 3787719 3783169 3724313 3712677 3709234 3495729 3534630 3637328 3497487 3453490 3394867
7840 3394867 3342006 3380581 3385006 3226783 3095224 3168118 3338229 3266836 3308169 3309629 3205625
7829 3205625 3157695 3201309 3307031 3246446 3241103 3264532 3172654 3188596 3292124 3429264 3299167
7818 3299167 3090762 3053567 3179265 3209405 3136343 3065276 3121460 3124034 3068621 3000165 2913073
7807 2913073 3007868 2999661 3016386 3015916 2986661 2915385 2839411 2870153 2925878 2857175 2846944 2901491
7795 2901491 2885762 2854274 2882360 2965510 2854868 2834955 2835352 2841186 2761193 2708777 2644642 2699987
7783 2699987 2640271 2535975 2613634 2669784 2611962 2718747 2729410 2706541 2652302 2706623 2549131
7772 2549131 2544285 2483297 2472082 2505353 2508731 2521494 2445579 2461322 2386462 2253411 2292732 2286924
7760 2286924 2300060 2327496 2316609 2279121 2193041 2285403 2234803 2293209 2272690 2216041 2220699 2355778
7748 2355778 2336703 2158341 2174371 2291755 2266106 2222248 2174625 2290360 2216833 2236136 2128486
7737 2128486 2177978 2170454 2120698 2009527 1963804 2122771 2146955 2139243 2093884 2139164 2104644
7726 2104644 1999236 2054142 2066369 1980919 1961859 2079296 2106487 2095778 2091648 1965269 1926718
7715 1926718 2089446 2119642 2002757 2087067 1975851 1876188 1989444 2059548 2006542 2039306 2017525
7704 2017525 2004848 2064490 2049863 1963582 2030272 1818865 1870011 1936613 1905051 1849547 1874940
7693 1874940 2044867 2017591 1939384 1986843 1994877 1947255 2024034 1970491 1949762 1995685 2012115
7682 2012115 1942358 1832612 1862185 1920163 1896612 1861307 1785550 1885783 1905398 1878236 1904062
7671 1904062 1885879 1834564 1854805 1926914 1992463 1911803 1927348 1935416 1810804 1813526 1868524 1854275
7659 1854275 1946760 1914799 1846104 1874765 1883341 1898532 2000919 1974995 1933125 1900111 1896912 1927654
7647 1927654 1924324 1981965 1940444 1863165 1871801 1928692 1900150 1943788 2006749 2041349 2044824 1939312
7635 1939312 1927308 1955871 1985998 1947668 1886957 1842946 1851895 1920259 2050639 1926327 1796118
7624 1796118 1926043 1992051 2004476 2056041 2080173 2068400 2092501 2054997 2009481 1987456 2052974
7613 2052974 2119965 2048641 2070224 2170907 2172508 2259479 2193909 2041379 2159908 2132406 2191281
7602 2191281 2125627 2047176 2057759 2073121 2350220 2315805 2267549 2193573 2149133 2273298 2265176
7591 2265176 2052607 2066479 2178451 2129489 2083090 2151056 2189738 2114791 2114861 2256548 2293418
7580 2293418 2182338 2104631 2260091 2296717 2350896 2319634 2121194 2151567 2190841 2156721 2121182
7569 2121182 2104856 2250787 2178616 2168881 2236081 2249747 2150624 2018507 2038378 2084596 2032243
7558 2032243 2030643 2062512 2038264 2041531 1958837 1932479 1977971 1955822 1882696 1950319 1874462 1833603
7546 1833603 1881911 1929698 1879964 1885391 1838565 1861910 1846485 1904767 1846764 1759261 1869781
7535 1869781 1889135 1812948 1853945 1863770 1799287 1750378 1763561 1705289 1700294 1770876 1653666 1754996
7523 1754996 1562924 1556349 1648953 1670127 1687121 1631607 1574991 1607485 1647710 1636014 1653014
7512 1653014 1614766 1645205 1619537 1530019 1497084 1506002 1429075 1398873 1384391 1350730 1362949 1472893
7500 1472893 1520454 1512863 1437936 1373573 1397541 1373878 1401918 1453844 1336791 1391570 1419226
7489 1419226 1408113 1443688 1532511 1337253 1320086 1378119 1439696 1498068 1403574 1345561 1283231
7478 1283231 1259743 1266446 1364641 1329593 1318248 1292788 1150533 1114844 1194331 1209082 1275904
7467 1275904 1165628 1176469 1279605 1255053 1279101 1314600 1217732 1282366 1236804 1345486 1279010
7456 1279010 1223653 1197943 1063720 1119321 1196900 1232918 1201172 1159929 1187853 1279173 1153435
7445 1153435 1134973 1203948 1255959 1233531 1267940 1169259 1083712 1147337 1032691 1047212 1115516
7434 1115516 1069068 1050433 1113055 1176249 1098796 1041184 1229022 1199427 1114866 1061858 1045910
7423 1045910 1041490 1054104 1086837 1110688 1107037 980355 948965 1011057 1060470 968155 987262 882208
7411 882208 820660 894769 1081570 1097155 1057262 972824 924691 895666 915349 900608 903202 876322
7399 876322 828375 947312 1006475 893146 877302 964356 874612 941227 995994 940965 937306
7388 937306 981337 878920 909612 894432 1017741 1033193 1065695 960490 898212 890181 764574
7377 764574 888681 906512 934966 943287 900863 871378 768985 760143 862588 880011 911577
7366 911577 811577 838183 745159 761162 861321 877741 910106 1004429 887690 891116 969789
7355 969789 783287 725165 849636 811914 844515 906633 827817 749039 696923 764876 755839
7344 755839 749351 805575 753225 772784 712333 661620 540326 661286 822960 645396 588232
7333 588232 622125 713618 684006 645618 680154 688108 606562 608836 627752 568801 522240 544786
7321 544786 574306 376704 358431 472655 487355 349100 297556 382090 464200 473405 373202
7310 373202 379189 307358 380848 417413 429841 451501 489850 448092 480872 483842 513942 496654
7298 496654 470772 403499 313972 326177 310542 289635 389293 357660 397659 452833 412467 338898
7286 338898 328117 385314 248659 147390 188068 196451 204370 361026 439043 286299 268968
7275 268968 320156 317662 396416 284187 245934 370915 360606 302256 144050 195211 157517
7264 157517 206908 307813 244505 283963 150600 219454 146828 181536 165154 -36188 54114
7253 54114 117182 118151 141895 218542 202320 206950 157363 227568 72378 14314 131339 99428
7241 99428 230122 279747 306307 266018 116212 145180 180921 168491 222401 179671 205879
7230 205879 119434 72633 100174 60992 43159 146387 178653 81149 214118 103279 110017
7219 110017 97154 116500 248168 187520 148749 218974 248090 142584 88569 55886 81431
7208 81431 87415 209889 173336 156050 194533 153777 32325 140326 198330 61369 67092
7197 67092 153452 95865 788 20101 18618 17964 168658 107421 36168 90304 84001 91379 131257
7184 131257 166540 97466 57043 133696 153571 160128 130997 119522 107838 112971 100646 50056
7172 50056 57419 85388 109951 147110 146915 138987 103859 96644 174373 119133 43445 109050 68694
7159 68694 64835 134490 155500 51814 35207 27265 115638 91866 208772 229012 118843 25713
7147 25713 -21807 42911 54911 -13300 2297 43292 58540 -98103 -58212 116480 61422
7136 61422 100879 -17406 -33960 20898 87437 125565 85430 11566 75826 134132 160973 34774
7124 34774 23127 24213 68475 125510 35277 38601 27988 177522 47981 -34771 31051 -71032
7112 -71032 9764 -1811 -36286 -41601 66647 106250 53683 -13152 14735 -60037 -106610 -88486
7100 -88486 22169 72507 36552 20454 -37177 -101991 -63480 -170428 -48048 -39752 -47173 -53923
7088 -53923 -100911 41921 72739 29694 1674 56397 132985 -25069 76250 -73644 -79881
7077 -79881 52484 1342 9317 -13447 -45152 -48710 13646 -15425 -114790 -108229 -32147 -52711
7065 -52711 -57937 -147317 -85742 -124014 -82690 -37566 -111118 -92415 31410 -85992 -72795 -10264
7053 -10264 -67795 -112513 -56912 4968 102828 25103 -21742 -38224 -6713 36715 -49497 -90695
7041 -90695 -85592 11138 -85117 -21368 27042 49527 149112 70154 -86069 48064 -69491
7030 -69491 -70415 43806 -97166 -75702 -90107 -120763 -52807 -565 16586 81648 136286 108201
7018 108201 55088 48239 16833 87813 12071 -14112 40790 61589 -8322 -37049 -111219 -39415
7006 -39415 -67563 -44739 -76529 -92362 -67370 -90672 -113998 -59479 23317 -83609 -68551 49066
6994 49066 87156 81292 11650 -25682 31237 4494 -139012 -8993 -11828 -61802 851 101145
6982 101145 196152 139085 46278 -85761 -71500 73714 70912 32785 46909 64526 124186
6971 124186 117406 125111 -3831 -13959 12700 55236 149260 113810 46564 -1960 80777 -28896
6959 -28896 -149253 -41499 -58114 -50806 40035 -4403 -34636 7834 23951 -40494 -8727 -20352
6947 -20352 -51972 9236 -22117 -59642 -132120 31436 92608 -47929 -98331 -27783 -8361
6936 -8361 -17789 82456 200189 152328 93318 18064 -52329 20487 -14702 56060 68669 -48432
6924 -48432 56347 99796 7628 -36268 711 28799 60015 70963 68647 -12696 -106316 -30880
6912 -30880 108330 40777 -121323 -85754 -56415 -2204 106859 47120 32720 23451 89015
6901 89015 46971 -117060 -65581 -46294 -101156 17150 42127 -36755 82488 99338 70268
6890 70268 62292 14233 49447 -30054 -10078 -31504 106468 41509 38791 -38652 -71394 -53223
6878 -53223 -142582 -38576 103379 -11932 -111135 -159424 -196455 -109598 -26203 6903 -53425
6867 -53425 -85558 -197733 -36380 78778 -50341 -107377 4357 22874 5724 51056 74681
6856 74681 31587 -52434 -53579 -50414 -86285 -81305 -127215 -46079 -50076 -45964 75274 35501 109026
6843 109026 16538 5310 17433 31732 50143 -64959 -43904 -26426 24452 -27459 -84929
6832 -84929 -129374 -4556 -2024 -23233 -88766 -39304 -44826 -100577 -80864 -154408 -104320 -60956
6820 -60956 -53092 39210 119395 62520 -18158 -43754 7366 138540 8273 -40992 -11434 11870
6808 11870 28810 34877 44141 -146585 -52580 87956 87137 64306 -61300 -51616 -82486 -100780
6796 -100780 -17451 18614 -101088 17995 86382 35345 -13824 61071 -9067 -111899 -60257
6785 -60257 -93003 -69268 -100652 -146936 -166824 -179805 -153387 -62473 -28230 82349 139448 69211
6773 69211 96971 47742 79429 57205 33164 11210 20913 -27558 -143329 -105076 -37284 12711
6761 12711 15118 73889 128150 53207 -108454 -112817 -140339 -167923 -61269 -100853 -160563 -25922
6749 -25922 -51032 -7439 38239 -34450 -15044 -21267 -43163 -94752 -33406 -133425 -238414 -43589
6737 -43589 -54870 -92917 -109262 5279 101142 85402 -17606 -79803 -42832 -52513 -142721 -25847
6725 -25847 -16347 -88477 -54214 13951 -73855 -32104 -46608 46649 -34972 -77940 -10402 37516
6713 37516 51489 39189 -15321 -27421 27 -37285 41095 12996 18833 -48299 93136 102267
6701 102267 58978 -38123 -3226 60492 -41851 -59035 -52945 -13524 -2005 46185 -60710
6690 -60710 64759 -23279 -28029 -105582 -101120 -88589 -212181 -186637 -156859 -134051 -104469 -52546
6678 -52546 -116692 -51949 32683 -45525 -126468 19640 62839 68791 -103839 -43889 57230
6667 57230 28504 10284 -52548 -181699 -93040 -2413 -31295 -12844 -84639 -10867 -65065 -158693
6655 -158693 -129586 -114908 -35777 -4428 52609 -50497 18243 58180 -86565 -240904 -116989
6644 -116989 -131121 -137886 -33914 42349 50036 -31709 -151319 -102655 -169993 -136398 -50909 -14722
6632 -14722 18295 -45653 -128037 -39122 -2197 42543 -17638 28274 -14662 -50586 -75680 -130979
6620 -130979 -42359 -54749 -90479 -79067 -18479 17846 -15803 -50058 14856 -80946 -150799 -46915
6608 -46915 -84162 -73326 129609 -56211 -69121 -113609 -6369 20853 -43213 -54184 -73622
6597 -73622 -91498 64852 -327 -148179 -109493 59471 -21708 -105452 -99761 -108428 -35995 -10733
6585 -10733 -13902 29421 -54900 22688 11912 39540 106952 77864 20903 -105535 -28738 -31820
6573 -31820 24511 -12665 10514 -6674 -60076 -107967 -165621 -208162 -44693 -92269 -32541 118240
6561 118240 105991 156639 88733 63961 -5832 79489 89952 -5110 58240 71581 56626 -130079
6549 -130079 -133801 100468 146479 100864 64503 -25136 -44335 -4906 -66392 -5379 -82995 -32056
6537 -32056 49272 71872 9389 -80295 -59031 -32275 -129603 -58217 63093 21487 82633 89198
6525 89198 36571 23694 38152 5121 36754 -52985 -113176 -29408 -111372 -31009 33345 56078
6513 56078 34222 16922 -2651 -60296 36886 58905 23467 -163811 -59437 -9084 -53940
6502 -53940 -75344 -86752 18129 120360 60114 -68637 -35444 -119759 -90214 -38876 -4998
6491 -4998 -52055 73902 -10191 -54603 42603 67088 16679 -85567 -156101 -183315 -240881 -272279
6479 -272279 -229807 -131354 -131559 -99531 -6988 60994 106778 82558 53338 39897 33322 -66555
6467 -66555 -147876 -220205 -157447 -97064 -46214 -5362 -8232 2016 70947 98949 100913 -35449
6455 -35449 781 18428 104605 29600 86221 80143 4787 -78625 40503 48417 -2161 -9080
6443 -9080 133031 86429 116407 -11455 -15102 -22256 -5396 -9724 52763 -5842 -62162 31522
6431 31522 45593 43036 59603 93367 -30900 77743 -6651 -54632 -58039 -2526 37857 44009
6419 44009 33125 25510 93093 135626 38927 16798 -11076 56879 56195 26105 -45068 -57057
6407 -57057 -16718 -74102 -55156 -78014 -88176 -37367 3973 15955 17508 -2360 -52877 24349
6395 24349 82495 39079 -43840 4954 -12280 22863 12206 -391 -69381 3146 -15596 11800
6383 11800 -4744 -92791 -56019 -74713 10827 25212 -122316 -72621 -147970 56519 154947
6372 154947 28407 -32767 -108428 -85608 -34139 -16955 88555 -43597 -42343 4684 -14599
6361 -14599 93924 -1706 -94701 -84993 -911 -60315 -25056 108730 -33790 -83227 -42919
6350 -42919 43234 -110788 -198646 -144157 -128293 -54344 -20338 -54382 -68165 -84338 -93595 -126699
6338 -126699 -83408 56589 15153 -36198 -19756 -60935 -2038 -85469 -722 44138 -130669
6327 -130669 -26332 40910 105245 117194 40505 -79111 -99916 -871 -43662 -149733 -38433
6316 -38433 -69361 -24661 -173390 -84351 -44265 -129142 -104835 7963 15866 49774 92329 82925
6304 82925 -1920 -104357 -61585 -76671 -47134 -99648 -30712 44580 85461 36785 -82729
6293 -82729 -1119 -35893 -66950 -164 -102100 -132545 -12235 -47110 7617 67339 -14356
6282 -14356 3411 -72298 23521 197760 65231 -25121 30473 133083 -127683 -120364 36724
6271 36724 67140 10717 -51226 -87803 -39038 -25558 72826 45935 7531 20444 14017 34945
6259 34945 -15880 -162935 -102804 -4879 -6873 9724 -8058 -6704 -21536 19690 -47712 30554
6247 30554 56798 72017 12668 -148489 -38543 39431 46600 31219 14229 52058 9422 46383
6235 46383 87983 26846 46959 -21686 -61350 -13503 -5326 31219 51492 141768 124714 94651
6223 94651 68362 7939 -26642 -67812 -63657 49643 18998 -10543 55755 -109453 -127384 -9730
6211 -9730 4742 112811 30962 -73152 -129559 -46009 -4329 37670 -34791 -66040 -98722 -63723
6199 -63723 21049 -11793 -87174 -62556 -77079 -114751 976 -37400 -17073 20368 35832 82966
6187 82966 -84657 -51316 -35228 -52683 25093 66096 68088 67424 105006 -53207 -44776 -71175
6175 -71175 -18644 138010 46477 62374 41812 34195 -2040 52051 92778 15330 -9031 23608
6163 23608 -21941 -43135 -95540 -79670 -35755 -8423 -51762 39863 123031 16609 -20848 -10967
6151 -10967 -58161 -134739 -17563 -59970 -127081 -992 -4620 102399 71746 14448 56946
6140 56946 152039 88129 -33045 -11467 -59916 -17201 -4531 64272 119126 62600 77532 49030
6128 49030 13694 38446 127176 92883 143192 65926 -48138 -17055 103004 42342 -45513
6117 -45513 42846 40359 77101 69790 -48299 -31627 -20493 32263 100569 78758 126113 85070
6105 85070 12403 -8588 114200 30796 15345 -99513 32465 88959 44219 42021 125118
6094 125118 29129 7365 -51867 -154821 -26330 6690 47737 61257 22475 61625 80092
6083 80092 155519 174784 75334 -54370 -90983 -32485 107925 121097 267475 155818 83080
6072 83080 85582 16737 71669 166772 126417 52012 6928 48700 108772 112002 51119 31551
6060 31551 -86216 23823 -12280 36720 132955 114505 111482 18283 104563 86963 97152 113279
6048 113279 23671 131124 85531 30172 134040 58623 118324 97064 35468 113371 129662
6037 129662 158795 88076 65692 68980 100414 64136 -10853 52813 11285 79899 70398 92308
6025 92308 94387 156448 182820 210208 117212 162815 174801 188187 93910 98803 108485 151787
6013 151787 100270 103066 111119 136031 142431 201600 95933 44007 76644 256733 269378 145332
6001 145332 -8367 124997 141498 125638 229432 124291 144868 138090 97229 121955 129885
5990 129885 310119 222648 236099 70612 13852 93872 176871 141289 175683 222582 198602
5979 198602 238081 181851 243757 303400 306721 294815 239031 123081 79288 46494 255758
5968 255758 242887 246895 214157 177561 190614 208777 224638 219625 105266 129619 192251 253387
5956 253387 299144 242679 143116 195677 212431 236742 266102 244497 186329 193086 260436 252502
5944 252502 194249 259495 234909 366318 285014 316809 267427 183529 265439 385686 197670
5933 197670 191975 254894 233700 219318 266580 324505 317583 322629 236713 343216 349617 260182
5921 260182 300696 140545 155174 278431 299739 336159 368396 309741 300418 311938 253296
5910 253296 256391 90581 17708 221909 209184 241882 262590 278606 252577 150078 230532
5899 230532 375586 304608 347490 267961 256834 391820 158736 74024 118998 208537 208943
5888 208943 197924 131674 261593 222615 339532 286010 256828 283969 239465 277801 493386
5877 493386 401586 230935 138756 100186 92834 190485 260772 222313 295078 280135 179268
5866 179268 124272 125200 185730 340094 382071 274637 196210 280925 260964 191340 300167
5855 300167 288251 201818 257784 188282 353652 309665 197858 205579 186512 252384 321595
5844 321595 289777 209363 223131 228700 220988 279295 263950 170579 329012 298390 463831 313524
5832 313524 266944 264785 279051 383784 289273 284751 303485 232453 264327 224875 193786 314915
5820 314915 258792 227419 235233 181539 175783 311391 238604 328098 251423 216837 214336 206728
5808 206728 379596 416858 335001 473859 421475 407519 473019 501064 285891 200827 296852
5797 296852 292264 287895 341361 249827 239833 328142 203653 209649 242612 229822 137810 218924
5785 218924 85035 153959 343675 493811 466283 300520 350788 377123 287298 335141 415222
5774 415222 409325 389844 380921 399544 378927 445165 327480 327093 368355 412767 352633 322790
5762 322790 314175 247195 290443 272383 287373 342739 352234 270986 359994 335427 297462 341762
5750 341762 385862 325998 384679 311125 226575 189882 278925 436974 312929 274477 201056
5739 201056 283212 348224 323136 325240 374269 351275 446591 490555 444487 428638 338184 351980
5727 351980 468244 508752 422293 343288 323405 335125 390045 459280 414815 368169 400749
5716 400749 415234 418436 403064 458491 476237 422548 454522 468138 401422 509479 532794 487023
5704 487023 371962 268136 379652 453447 523794 460415 361245 346183 386919 407739 398642
5693 398642 367787 351113 366890 429720 427549 428167 265998 203482 336813 293798 319586 402896
5681 402896 417334 451928 400775 338749 325514 419190 543876 428765 500871 586177 508511
5670 508511 518369 501003 481286 475710 489574 498333 479685 532083 390979 425378 508337 555758
5658 555758 434809 364680 394699 484829 512741 536304 534583 506216 541012 518897 417180
5647 417180 391605 420377 494693 462642 400734 442241 515619 546849 487793 543473 597143 477383
5635 477383 340666 464009 500865 632102 585270 602456 583952 577929 530616 576159 544681
5624 544681 542746 564666 517676 572454 665537 606118 574228 592111 621233 614613 673045 624464
5612 624464 662994 601050 472199 478852 528362 555705 495494 593619 593255 595466 680384 631325
5600 631325 495715 512151 584540 703168 678329 657797 623911 569847 632951 646133 717135
5589 717135 581160 582345 665612 557724 511946 479214 568011 728391 642109 617248 686983
5578 686983 673292 595444 545467 617681 544103 520160 555474 567932 457171 413494 589819
5567 589819 620526 529348 437434 463486 572741 571742 483261 521415 609683 514443 533391 609184
5555 609184 609501 591000 577079 425792 489545 442773 524931 555882 588686 649700 657808 608509
5543 608509 625548 648255 661788 535491 533882 519242 718283 647457 555373 559830 504374 577902
5531 577902 592034 618554 535961 570237 562947 523858 466843 615950 507924 492184 546479
5520 546479 706595 695147 630767 558056 564449 647852 671003 596699 457356 465581 533003 643848
5508 643848 587640 526903 560853 615988 536516 475274 507209 610427 607460 539328 597698 549954
5496 549954 540591 571671 524155 538441 485908 480815 534356 506867 486684 515465 531912 512522
5484 512522 581581 707623 578695 511420 519878 482757 556060 728308 703921 538797 592942
5473 592942 561548 646567 519214 532473 504255 559812 537458 448218 487802 447151 476891
5462 476891 490592 593619 509360 532160 587244 593649 648672 589845 655429 677924 606127 595334
5450 595334 634124 590708 717591 693437 577701 680951 635283 553965 521514 699710 761597
5439 761597 677483 684543 738800 755908 675124 668054 714103 718740 710672 770633 815795 702144
5427 702144 660282 706501 748375 901052 842908 815331 853552 729950 907616 948081 884802
5416 884802 740144 778208 929074 971108 874504 858781 914250 989270 1005763 977701 967808
5405 967808 788809 902851 959117 866925 962361 902225 836869 882519 881133 914029 920815 918374
5393 918374 957885 1101474 1058792 942973 898577 827380 965540 1015599 1037906 1059132 1116993
5382 1116993 1147006 1126908 1152800 1131235 1187595 1213894 1271829 1290756 1248348 1331800 1437877
5371 1437877 1407922 1467547 1390058 1430819 1560135 1648986 1633780 1698307 1650953 1677191 1870972
5360 1870972 1870382 1813566 1936181 1910836 2002168 2170404 2185513 2221521 2331498 2434014 2515586
5349 2515586 2492269 2601854 2782509 2939731 2978998 3125902 3338424 3497393 3789968 4176299
5339 4176299 4579841 5068633 5605515 6167074 6856832 7718611 8712971 9990195 11588357
5330 11588357 13356908 15492796 17571331 19611897 20837391 20564936 18961166 16546937
5322 16546937 13828313 11592615 9999185 8789029 7581275 6685134 6052582 5581711 5146572
5313 5146572 4800853 4479554 4237200 3943339 3669667 3473854 3101389 2952926 2959111 2716547
5303 2716547 2748588 2615242 2503335 2359921 2390174 2315043 2229824 2215791 2126301 2049057 1950618
5292 1950618 1902526 1831982 1752077 1749489 1883921 1899121 1777359 1663291 1678921 1646480 1565222
5281 1565222 1536797 1545330 1452168 1390935 1296406 1290047 1355268 1374977 1294676 1277114 1198814 1302255
5269 1302255 1292324 1233100 1188353 1096089 1148204 1182427 1103114 1091064 960822 908136 1031029
5258 1031029 1034209 1084578 1144284 1062896 1160725 1117565 1030734 972214 993390 899496 906777 980392
5246 980392 868912 866539 915336 835076 753103 873673 883817 800317 937501 883770 889935
5235 889935 950664 826449 890351 885283 769817 810751 746210 838482 875670 647175 725030
5224 725030 772050 740748 733195 730336 768317 850667 869376 821997 728950 743799 646666 630666
5212 630666 745133 765780 690339 558187 635979 672742 727295 678432 661729 608251 580968
5201 580968 615010 658526 707171 717283 670386 737849 762653 849425 724592 707035 754287
5190 754287 772923 927482 881272 855646 867293 915467 807699 866974 850256 851480 710943
5179 710943 606510 603699 594225 529257 560912 598203 645853 644328 632102 670426 701601 698888
5167 698888 719247 645780 492259 475532 548295 723782 752595 566176 614814 586327 611239
5156 611239 759144 809383 844022 791191 703812 569562 622254 615275 786844 747401 739023
5145 739023 769964 675782 621481 665999 736536 739088 648337 652248 691070 737379 706442 634004
5133 634004 723545 772146 775599 746607 685818 739142 810883 792152 867656 872397 885136 888329
5121 888329 966854 938089 953053 960670 954929 909009 878577 921366 801103 771881 788801 755527
5109 755527 848261 877441 852762 825529 747562 785232 885039 859679 962182 1009725 960663
5098 960663 876642 745033 875210 895303 745400 866051 853552 809554 833592 810772 776535
5087 776535 865288 934947 877247 903078 905831 1070031 985330 949040 953360 1049406 1092847 1040900
5075 1040900 1037315 1069285 1134744 984391 1069071 1005825 928244 1010230 1027432 988322 969895
5064 969895 1063650 1037210 975516 1146484 1119919 1134885 1055035 1081751 1167585 1232245 1239628 1305688
5052 1305688 1404077 1290131 1321760 1274831 1358538 1426124 1402851 1427961 1501520 1586530 1521762
5041 1521762 1508035 1515584 1447860 1556727 1660874 1642305 1734738 1886472 1857736 1851868 1916372
5030 1916372 1933060 2030058 2061157 2050797 2117356 2323985 2413717 2428480 2660936 2683718 2820373
5019 2820373 2884533 3031967 3061436 3106290 3342938 3427806 3507967 3644609 3838071 4089097
5009 4089097 4341232 4627124 4917831 5501985 6200230 6890875 7771191 8530520 9623691
5000 9623691 10900207 12355102 14101451 16113177 18224051 19942369 20528855 19411298
4992 19411298 17069622 14624399 12590477 10872945 9586391 8674603 7871393 7180036 6617485
4983 6617485 6090587 5659515 5347172 5000594 4767521 4551809 4292477 4073566 4002523 3881021
4973 3881021 3724291 3684572 3530939 3477812 3314947 3343025 3200717 3061347 3023849 2847200
4963 2847200 2753415 2825368 2838722 2756948 2669479 2615700 2541533 2462127 2461402 2268280 2256733 2297984
4951 2297984 2290862 2449799 2327806 2170232 2122660 2112459 2089666 2048646 2101884 2040234 1991461
4940 1991461 1940603 1833753 1894951 1803335 1839106 1916799 1907857 1726396 1750340 1713716 1693386
4929 1693386 1795025 1746210 1628780 1636797 1562177 1584572 1646054 1571203 1528135 1496900 1454904
4918 1454904 1390649 1297947 1206949 1328926 1369123 1381043 1262938 1387097 1302273 1203895 1238853
4907 1238853 1324790 1249554 1291334 1315190 1361643 1404535 1342018 1296263 1286070 1147061 1142488
4896 1142488 1125222 1164705 1205497 1222950 1111415 1200042 1214657 1149687 1277583 1188434 1063679
4885 1063679 1066626 1157820 1065459 1086815 1079340 1032588 899295 845354 1053183 1108867 993406
4874 993406 997381 950748 967313 972782 972879 1052046 1003100 1016533 1066518 1164980 1111088 998326
4862 998326 926145 909311 970066 971258 935821 993658 806329 844557 923087 939992 893787 780633
4850 780633 685946 719340 774983 808701 843147 948369 890756 842788 901089 884906 902466
4839 902466 857212 835902 820935 842061 789922 919697 814760 724173 805779 709571 716199
4828 716199 734832 837457 808143 747405 726707 716230 817247 686791 701574 722243 837139
4817 837139 801217 858357 873927 804661 773749 813821 802912 708714 787081 808912 685633
4806 685633 707737 706398 835351 813912 849743 833732 775242 796511 795778 784584 834448 740621
4794 740621 839511 917919 744778 977213 1005525 950620 786496 692651 668255 607659 697691
4783 697691 661307 714003 685927 729909 725766 803800 919540 886745 906348 980695 747106
4772 747106 736143 876060 814817 817225 784306 789424 777930 832809 844809 757394 912820 856405
4760 856405 767848 783047 839876 751497 754373 745098 675243 751694 870789 929822 902249 919338
4748 919338 861919 820617 849714 977721 999762 922287 907472 960556 862815 795855 834180
4737 834180 878921 898715 948281 921159 889376 971933 935768 865634 956200 1011007 1020026 926054
4725 926054 898753 921533 979866 934886 988659 1072813 1179252 998575 984734 1058497 1122912
4714 1122912 1114545 1165622 1251203 1106182 1105985 1191960 1110382 1036428 981532 1038018 1084330 1133835
4702 1133835 1144277 1082659 1122474 1261619 1236964 1173863 1153598 1249350 1177345 1143862 1288971
4691 1288971 1300457 1277617 1262118 1343442 1371400 1387498 1478442 1528277 1597089 1463365 1478597
4680 1478597 1527763 1398292 1266665 1288240 1410930 1313355 1296888 1306149 1278335 1309033 1346599
4669 1346599 1265125 1264264 1235814 1227969 1296485 1426023 1337109 1327494 1363271 1372199 1350086 1281530
4657 1281530 1482059 1406184 1330505 1421394 1376419 1318614 1311573 1318949 1409156 1436459 1368903 1381233
4645 1381233 1399715 1412592 1315342 1344492 1472764 1479688 1487333 1433133 1348842 1426302 1513955 1528295
4633 1528295 1450625 1423208 1438343 1346731 1356624 1366700 1400671 1358615 1422381 1467363 1325710
4622 1325710 1387523 1521377 1535893 1363420 1338390 1402186 1395719 1463715 1307097 1279369 1226913
4611 1226913 1252790 1264547 1345989 1350601 1358552 1429206 1351181 1323822 1303843 1388188 1413028 1516072
4599 1516072 1525227 1524065 1468025 1464184 1361463 1378578 1290310 1213741 1214168 1241339 1244728 1265240
4587 1265240 1145565 1169800 1115680 1220382 1228806 1250331 1220090 1223327 1259319 1159157 1085753
4576 1085753 1086467 1107579 1190367 1165664 1153667 1101490 1110687 1204577 1226067 1228311 1165771 1155847
4564 1155847 1143840 1068565 1112571 1145669 1158067 1186154 1148836 1236414 1149034 1131745 1112919
4553 1112919 1056939 1016873 1027226 1074327 986772 1089710 1148732 1036174 1114870 1205434 1199451
4542 1199451 1239516 1251968 1109474 1118855 1165857 1236639 1161042 1176615 1166601 1228500 1315383
4531 1315383 1396733 1365256 1199525 1189384 1243529 1200178 1201082 1207033 1274999 1289153 1253876 966739
4519 966739 1021761 1080350 1024105 1044367 1004625 1013064 999126 1066902 1108685 1054701 1096065 1066884
4507 1066884 1190444 1194585 1096170 1145172 1224886 1209133 1173344 1102875 1021417 1130408 1166880
4496 1166880 1139364 1110151 1214983 1208496 1242437 1167650 1146760 1153070 1188790 1196516 1127561 1267446
4484 1267446 1245059 1198681 1289485 1250785 1087906 1046204 1069425 961932 1029531 1113612 1039362
4473 1039362 1158874 1193899 1151652 1067542 1170691 1178867 1068211 1023174 1072961 1136660 1083280
4462 1083280 1133001 1179080 1134234 1071581 1011924 1021166 1106187 1113242 1058393 1067570 1033623 955476
4450 955476 915906 969812 1007751 946415 975655 1022434 900613 794237 950289 971645 908111
4439 908111 796314 883973 877912 877899 893892 934049 932756 831995 878448 811380 788590 845139
4427 845139 863489 931044 883594 867568 824736 898541 929511 896979 861542 881686 902080 861317
4415 861317 855933 783716 793110 828365 843165 798551 815533 838202 821701 754581 786373 802857
4403 802857 870398 820618 839411 927272 932166 848179 977522 914784 900505 812301 774844 925667
4391 925667 998332 916142 738258 776892 793016 830148 723804 745690 744042 730040 737406 771058
4379 771058 724620 745378 684528 752759 777042 767190 707370 713287 744393 776699 770036 718820
4367 718820 793338 805105 642341 718244 812930 906343 767927 690628 717598 618347 583033
4356 583033 658477 625389 699668 819555 802913 775159 787862 757083 743624 815267 807860 770606
4344 770606 808675 957692 953207 954126 953820 1083394 1063893 1057180 1127257 1160847 1320057 1348007
4332 1348007 1338482 1197398 1173205 1132255 973884 1008421 874592 853772 867005 724530 825343
4321 825343 811829 697780 810431 749738 811940 786170 821712 712497 750360 695557 728435
4310 728435 677241 728263 783377 683286 738174 752810 809332 843315 704455 786214 768645
4299 768645 756851 725151 635151 705251 668318 666648 635740 648176 703867 852611 784162 846478
4287 846478 819761 606276 608947 815224 669131 751129 859280 728820 720426 656981 735301
4276 735301 712730 749357 648581 627807 657193 688446 650986 664164 632703 606002 646389
4265 646389 578810 695794 653139 626269 654242 652245 679529 675032 670789 643631 620200 530309
4253 530309 585006 719628 569987 597662 606341 631826 628412 626006 682027 669453 608381 646708
4241 646708 690891 671051 659144 601802 674091 656782 662270 735374 847095 781388 730422 761792
4229 761792 810679 744176 780805 771410 649553 618454 624310 732511 774005 758821 770627 761647
4217 761647 751501 814749 704812 711141 798502 896993 867666 917655 908336 962945 966920 1020051
4205 1020051 1026391 931462 1051454 1090766 1060037 1085572 1001864 1050617 975465 899367 1062400
4194 1062400 981787 975189 979086 948782 838730 743792 714460 800623 814879 780555 809887 863196
4182 863196 838845 869314 912681 858992 820446 961247 932136 821261 880529 873968 906983
4171 906983 935268 950455 962226 977933 930129 911665 873599 877538 945007 851924 940478 972643
4159 972643 991979 917083 855865 879740 909003 1041787 982455 964733 916981 928412 894323
4148 894323 920233 925311 935331 898491 962321 1011701 947553 1011442 1065288 1097232 1129309 1140854
4136 1140854 1158002 979953 998346 1037608 1122104 1124636 1172742 1054539 1123156 1118782 1037147
4125 1037147 1183894 1205350 1256135 1164135 1201901 1223730 1209762 1135980 1195224 1256206 1190312
4114 1190312 1156259 1222112 1331124 1346916 1362424 1341974 1164787 1186207 1284631 1396535 1446953
4103 1446953 1408607 1385569 1370908 1344361 1337509 1400081 1432376 1335999 1400571 1574503 1578266 1564956
4091 1564956 1493596 1486128 1577402 1483136 1561337 1532982 1555966 1468785 1569804 1620673 1647392
4080 1647392 1719880 1630787 1805414 1818855 1723500 1862129 1865464 1799428 1762710 1868297 1905500
4069 1905500 1902262 2022149 1939314 1945251 2018580 2043488 2087774 2084062 1926612 2008658 2019239 2078582
4057 2078582 2058104 2078145 2079481 2012852 2181966 2286397 2259286 2183828 2276491 2340904 2407377
4046 2407377 2500806 2647950 2651419 2662091 2688596 2684640 2802823 2887530 2792874 2834814 2824235
4035 2824235 2742159 2929054 3068532 3073020 3146202 3241719 3347418 3336454 3337955 3450285 3494486
4024 3494486 3417218 3306357 3409865 3559929 3600553 3586810 3566306 3565388 3567579 3721526 3747384
4013 3747384 3747235 3805346 3946447 4200455 4169918 4180689 4231582 4218579 4324012 4435453 4490221
4002 4490221 4500343 4487577 4568210 4720591 4822568 5010317 5080374 5070626 5189272 5318055 5409290
3991 5409290 5465259 5696720 5695203 5816950 5995421 6172519 6370755 6564258 6663796 6819196
3981 6819196 6929775 7224926 7505774 7704459 7830799 8084178 8286544 8507145 8760943 9004710
3971 9004710 9417463 9776065 10151663 10490072 10638413 10931802 11445514 11815632 12276164 12935155
3961 12935155 13486256 14025792 14749756 15516938 16511164 17602718 19075957 20599997 22497509
3952 22497509 24809840 27293254 30362584 34135021 38392813 43670571 50049061 57352559
3944 57352559 65825925 75130649 82829866 85164298 80077528 70020730 59700329 51075657
3936 51075657 44195185 39193752 35372365 32090033 29467357 27230398 25339111 23701948
3928 23701948 22517244 21421988 20446581 19752110 19028954 18374163 17944788 17583676 17259676
3919 17259676 16957283 16682661 16425799 16283346 16240448 16174611 16141613 16091809 16098280 15891512
3909 15891512 15656311 15474501 15344264 15337646 15399904 15333401 15370197 15485097 15412670 15254298
3899 15254298 15244333 15331619 15207979 15180519 15264596 15181366 15131058 14992827 14883263 14849954 14851302
3888 14851302 14767319 14524668 14297349 14246341 14065634 13877566 13742158 13547517 13332427 12994110
3878 12994110 12810230 12658799 12468182 12162500 11981134 11723983 11402244 11196820 10999572
3869 10999572 10825375 10515433 10238889 9912237 9627283 9498211 9281107 9169914 8930875
3860 8930875 8699310 8527295 8280242 8125841 7949052 7993358 7867313 7717576 7730430 7647257
3850 7647257 7648352 7583427 7672791 7795192 7793853 7564266 7259623 6898475 6701153 6451803 6225358
3839 6225358 6179617 6050155 5797073 5643885 5565767 5396998 5277757 5101711 5010070 4944207
3829 4944207 4844452 4699131 4646307 4637265 4568396 4462952 4468063 4418077 4485593 4399872 4377537
3818 4377537 4427901 4359224 4187660 4189499 4223114 4045339 4108451 4030686 3941317 4041808 3996393
3807 3996393 3936169 3920494 3869217 3819790 3750749 3860643 3806197 3794130 3844195 3754048 3786001
3796 3786001 3817452 3684901 3625859 3715764 3678325 3840535 3887898 3924591 3952769 3856820 3748891
3785 3748891 3814022 3879582 3901281 3882632 3826053 3881466 3767507 3692273 3700384 3768477 3799929
3774 3799929 3842877 3805724 3801533 3696929 3731536 3769803 3703791 3714918 3686242 3673544 3779726
3763 3779726 3893329 3780822 3705328 3796617 3902610 3776162 3901520 4007671 3932938 3892706
3753 3892706 3923219 3961344 3927518 3932353 3947216 4016715 3996485 3919262 3974724 4013036 4037294 4041459
3741 4041459 4110530 4131361 4087756 4152567 4041403 4108281 4169861 4120637 4204115 4208928 4135890
3730 4135890 4154865 4202072 4273927 4336830 4397044 4319392 4495036 4420663 4422447 4497077 4592628
3719 4592628 4679765 4789467 4851657 4908805 4966433 4975315 4927132 4937433 5035931 5082509 5260959
3708 5260959 5389944 5459476 5423797 5393909 5548673 5652191 5671200 5812451 5843911 5972094
3698 5972094 5911383 5989795 6196180 6385141 6513813 6643931 6773484 6779386 6790570 7098015
3688 7098015 7230820 7304075 7472522 7687037 7831484 7797766 7930134 8043192 8161227 8095030
3678 8095030 8296289 8500292 8441440 8487570 8470257 8365547 8236265 8233235 8377387 8412908 8378988
3667 8378988 8320721 8333652 8294154 8326092 8351459 8344722 8299643 8367699 8301052 8206441 8216209 8255930
3655 8255930 8391859 8352715 8489183 8476495 8654779 8698301 8739773 8814548 8892379 8899383 8947522
3644 8947522 8979446 9201523 9381526 9364619 9574152 9698290 9873982 10145560 10352199 10503022
3634 10503022 10640556 10863165 11188738 11633173 12028675 12603183 13058973 13737291 14459405
3625 14459405 15197603 16078720 17049130 18199614 19277941 20501732 21590913 22734982 23905376
3616 23905376 24853459 25410203 25838462 26191818 26307075 26237570 26158531 26264629 26234921 26090816
3606 26090816 25896254 25541148 25205453 24674465 23985629 23215884 22211403 21098993 19987199
3597 19987199 18951826 17745190 16550645 15720787 14900502 14111180 13388181 12727784 12123093
3588 12123093 11650868 11183655 10885551 10427368 10019461 9851712 9655326 9449839 9359189 9192904
3578 9192904 8956213 8861859 8799664 8722359 8783868 8731753 8533008 8302666 8380186 8465751 8420650
3567 8420650 8324905 8278164 8335230 8363359 8368520 8497077 8417575 8379168 8532223 8738834 8708832
3556 8708832 8701753 8834760 8894349 8983545 9061594 9089163 9128548 9207571 9314763 9447874 9465650
3545 9465650 9556666 9468506 9554819 9554101 9499521 9569829 9638337 9600847 9538582 9442854 9453827 9319625
3533 9319625 9315050 9274956 9248338 9227170 9190037 9252706 9180647 9080612 9086516 9080858 9149420 9083024
3521 9083024 9033875 8961577 8982854 9053206 9149258 9258808 9263431 9276965 9374025 9516537 9682470
3510 9682470 9811140 10000155 10178417 10419484 10841618 11025612 11333565 11488123 11767091 12082940
3500 12082940 12295492 12424563 12713458 12922637 13133877 13263012 13477777 13623689 13816072
3491 13816072 13950578 14121368 14231477 14291101 14293342 14217469 14052754 13804171 13749568 13700319
3481 13700319 13406145 13258970 13151685 12934713 12745183 12543208 12403598 12161519 12008660
3472 12008660 11824319 11690847 11591068 11602483 11536569 11481499 11402732 11512345 11607025 11712510
3462 11712510 11846866 11927976 12145196 12264178 12372048 12656871 12829110 12971965 13173064 13389270
3452 13389270 13578086 13669931 13754313 13919242 14003880 14219684 14263686 14223785 14263008 14216761 14178183
3441 14178183 14026007 13920254 13690983 13384600 13138353 12996011 12751928 12300294 12078046
3432 12078046 11700774 11378281 11223198 11054524 10552591 10271721 10051302 9665520 9397613
3423 9397613 9004446 8752645 8595182 8163560 8023049 7843264 7739773 7559452 7535129 7466002
3413 7466002 7231860 7082822 7107025 7235463 7192608 7140584 7030971 6996711 6946998 7072980
3403 7072980 7056203 7120828 7062070 7114736 7027594 7024661 6960657 7022814 7079961 7032907 6974154 7018028
3391 7018028 6862132 6743678 6708776 6693187 6626064 6418048 6445205 6355736 6258439 6029207 5909661
3380 5909661 5799761 5768649 5713359 5509341 5345660 5185539 5019878 4855840 4730591 4683450
3370 4683450 4623914 4490871 4358536 4188460 4134773 4017642 3988957 3907787 3881058 3898253 3777127
3359 3777127 3696569 3638517 3491278 3402964 3365078 3346359 3376946 3460954 3359731 3155877 3113403
3348 3113403 3162263 3233845 3129651 2996862 2910788 2817124 2909544 2817010 2770071 2733305 2679676
3337 2679676 2600699 2683031 2747335 2671090 2536320 2459585 2517576 2530764 2546664 2534288 2519504
3326 2519504 2384130 2371020 2406646 2374729 2346497 2290071 2275162 2178194 2113808 2137266 2071863
3315 2071863 2104472 2026153 2099928 2104103 2155321 2123248 2144934 1876337 1835651 1932558 1900221
3304 1900221 1915987 1829271 1826965 1889807 1872755 1822602 1810461 1816143 1922992 1847000 1758386 1777935
3292 1777935 1747010 1817774 1721196 1750728 1618067 1598609 1640601 1769192 1660677 1564009 1640499
3281 1640499 1530085 1507292 1532635 1573058 1610106 1671517 1469144 1501078 1594179 1636297 1549713
3270 1549713 1530576 1507013 1540706 1506159 1453212 1479152 1613157 1568984 1646127 1654154 1570311
3259 1570311 1677209 1675390 1522165 1565464 1510825 1544569 1502558 1506244 1552449 1608786 1503855
3248 1503855 1533568 1530245 1442835 1470883 1612614 1705132 1520625 1506776 1517806 1475980 1392490
3237 1392490 1423898 1436535 1476078 1433869 1420080 1495316 1499246 1404008 1537368 1537785 1600042 1529975
3225 1529975 1394656 1464973 1522809 1513818 1707077 1692184 1614882 1565423 1548545 1540395 1642049
3214 1642049 1646253 1585111 1689005 1733081 1671253 1612595 1659917 1741491 1703909 1676480 1619103
3203 1619103 1687009 1763312 1701754 1731700 1769945 1684930 1638733 1796386 1898012 1855526 1813344
3192 1813344 1872049 1796492 1764558 1732715 1750127 1873732 1954966 2006701 2067542 2014155 2134758
3181 2134758 2096210 2069094 2145132 2164958 2110597 2238853 2168443 2128825 2192329 2259587 2466099
3170 2466099 2429808 2385611 2515541 2665798 2824983 2884265 2893000 2917671 3019552 3255018 3421154
3159 3421154 3745478 4040514 4185857 4282386 4346351 4315092 4205146 4105240 3672543 3529827
3149 3529827 3553049 3373885 3321251 3349987 3354391 3265816 3286968 3277323 3349543 3274304 3222416 3132883
3137 3132883 3209264 3277700 3295831 3286856 3253902 3357067 3356718 3391791 3368681 3466359 3472306 3494397
3125 3494397 3664358 3670925 3682353 3756069 3781164 3950312 4086016 4171758 4341857 4417766 4393521
3114 4393521 4516184 4721735 4743962 4785150 4995235 5245347 5394007 5504030 5703483 5997696
3104 5997696 6242878 6660322 7095112 7406317 7775017 8184278 8637948 9159446 9653723 10079531
3094 10079531 10378131 10757283 10891265 10737351 10366258 10008899 9417723 8661283 8117800
3085 8117800 7574686 7102058 6485869 6093467 5698681 5407313 5149963 4863131 4642367 4523085
3075 4523085 4131811 3965515 4014577 3905368 3775659 3669213 3536933 3417175 3317262 3176372
3065 3176372 3135141 3128173 3128152 3040594 2985978 2786626 2757250 2530075 2594803 2560781 2616891 2539603
3053 2539603 2367288 2255099 2167707 2179209 2151225 2213516 2202587 2012097 1911368 1858740 1731729
3042 1731729 1806924 1733208 1804595 1736076 1701972 1621808 1629146 1531263 1434112 1511178 1618981
3031 1618981 1602898 1529453 1453206 1358507 1285117 1274563 1241758 1247260 1238254 1313011 1318656 1257852
3019 1257852 1262175 1224396 1218308 1174192 1059933 1103936 1025851 1156299 1169223 1148655 1147701 1125469
3007 1125469 1147165 1109451 1143976 1002613 985933 915758 1050013 1004687 972658 1006725 996167
2996 996167 957021 866314 949563 910938 796210 745651 799560 926978 854619 777262 795205
2985 795205 758277 803189 675387 734588 756328 724729 764032 744689 893240 813554 876940
2974 876940 818940 666240 682958 782403 807457 809592 709302 652277 644863 698763 666785 644584
2962 644584 795418 872171 760474 590801 624936 769397 757687 706599 697485 730584 896047
2951 896047 799070 754865 703493 582963 760229 724457 632878 614436 679693 608824 601607
2940 601607 497251 533937 697617 707671 608162 524357 455843 521546 576760 650910 629306
2929 629306 549685 593383 435921 475023 406737 537132 579718 482265 519935 653401 623298
2918 623298 599705 571119 606167 554096 456755 479933 460809 470883 488410 630714 621495 500930
2906 500930 448474 524548 611757 616144 579071 506274 518770 464564 474155 466247 622239 566379
2894 566379 429748 444176 421886 617537 712050 560122 549548 551884 620049 641126 560375
2883 560375 629873 708893 589495 564997 560920 551421 664785 707931 726338 619291 675621
2872 675621 853334 811676 773571 656192 748544 807126 784934 788229 670654 673919 674288 760807
2860 760807 730803 765159 724530 745673 773277 784190 846141 813495 836451 860715 843069 842550
2848 842550 842091 890484 922269 987753 923082 858864 938977 987894 926977 953372 983531 920808
2836 920808 957435 900758 895213 1005521 1071078 973141 861086 981357 925824 964523 964164 945464
2824 945464 913674 804381 842773 840082 973802 1014174 986576 1102184 1270742 1172164 1093800
2813 1093800 1276254 1480928 1453296 1533578 1450286 1362239 1372738 1455126 1441058 1379070 1526727
2802 1526727 1516819 1528910 1572645 1613541 1651729 1680231 1662423 1635116 1563318 1672043 1629951
2791 1629951 1607224 1633105 1691835 1736281 1895912 1899384 1930922 2037661 1959231 2044067 2004310
2780 2004310 1888216 1801199 1775133 1728970 1717915 1696837 1686005 1572250 1540625 1488981 1513205
2769 1513205 1548591 1578182 1563144 1581587 1587949 1543651 1475188 1579077 1631277 1600617 1594600 1607289
2757 1607289 1598284 1582821 1602412 1588470 1561874 1423119 1398033 1365407 1256877 1213639 1225826
2746 1225826 1157906 1203026 1143603 1120123 1010406 1089837 1008795 876646 958143 1008371 938236
2735 938236 957464 959741 873148 895050 917455 942005 807215 718652 707891 761126 677741 574262
2723 574262 630727 514859 495611 416761 506760 522743 517044 500015 422892 496143 478262 391099
2711 391099 338553 358970 381606 361323 344153 487973 476174 507801 467063 502825 501357 424617
2699 424617 496986 373728 339712 393115 305716 295831 362452 284121 311413 399375 249086
2688 249086 270998 251193 287880 406766 461536 418214 319092 261648 194581 156323 304526
2677 304526 307471 150600 229575 231647 165892 208236 176861 212764 145905 179975 160770 179301
2665 179301 163593 116521 186244 252528 295073 226410 149782 183200 247149 223005 184279 187749
2653 187749 186594 135808 185520 138696 108629 129918 170465 95157 162899 80447 146206 157470
2641 157470 101698 12035 20064 105427 36641 61629 115269 126077 86302 217901 53557
2630 53557 99328 175625 183507 104654 74377 180931 241315 150504 191347 255857 109784 190448
2618 190448 146080 -78741 -22469 111977 82849 8436 95760 40815 84784 11628 27349
2607 27349 79378 15723 67980 116290 229419 119825 65969 64538 20364 61296 152694 115805
2595 115805 126149 119168 174645 141479 92045 -12132 22587 20144 19310 53335 118550 1220
2583 1220 16839 90988 91131 57413 49554 101783 34663 46429 41198 15862 -109254 -78178 37833
2570 37833 100841 51138 4633 112069 116155 125240 151059 38553 89422 8621 -14938 29494
2558 29494 55049 78756 52111 37708 112769 129889 79351 71172 140526 120625 50624 88784
2546 88784 53341 22315 92478 68243 56081 96046 116344 121586 64658 89584 171319 80483
2534 80483 -91238 -107515 -20139 106158 85644 133154 248470 279337 264856 243871 205947
2523 205947 256374 207616 201488 153857 206501 198597 115920 172142 137437 73725 33191 73162
2511 73162 90979 171608 96620 25402 76870 73463 105640 144399 172936 161100 254025 150902
2499 150902 2993 61270 140599 104363 135521 203611 150868 87525 164164 169517 280315
2488 280315 202441 212449 349837 272981 95791 39489 51178 -5945 48407 116477 102064
2477 102064 27484 92190 103846 93490 109260 119141 95636 48623 46563 172565 117687 68975
2465 68975 90078 124455 145262 205735 166353 158188 141062 73782 16131 54878 118652 206932
2453 206932 142922 -49514 -8686 56017 -67464 -24025 32212 83662 36065 25296 107538
2442 107538 87547 37878 51238 16888 15210 7361 -37660 -82587 -55829 159185 85365 -76074
2430 -76074 -57012 -36330 -43887 111179 154299 7225 -3542 143231 34801 28056 25186 -52604
2418 -52604 -113443 -78323 20766 66112 3739 7410 73572 -6655 -10149 -48383 37928 116164
2406 116164 122770 7781 84916 51833 -1733 -10847 -40531 17127 110492 -44572 4120 -5963
2394 -5963 -73082 12018 -49123 18992 14270 -32385 24365 8737 118682 127493 54930 106570
2382 106570 103672 167512 81551 49760 -12930 28319 65818 82815 -79184 80023 138614
2371 138614 109289 98584 -32153 -59895 -43651 -33200 -57374 98492 46757 86237 107219
2360 107219 54681 71947 3004 9054 2635 66769 17284 39794 -80169 -10509 853 -32185
$$ [...]
##END NTUPLES=NMR SPECTRUM
##END=
