##TITLE=1H_EC-3254(4-33)
 CDCl3, 8 sc, 
 5.07.2021
##JCAMPDX= 6.0         $$ Bruker NMR JCAMP-DX V2.0
##DATA TYPE= NMR SPECTRUM
##DATA CLASS= NTUPLES
##ORIGIN= UXNMR, Bruker Analytische Messtechnik GmbH
##OWNER= root
$$ XWIN-NMR		Version 3.5
$$ Mon Jul  5 11:32:56 2021 Russian Standard Time (UT+4h)  she@DPX200
##.OBSERVE FREQUENCY= 200.131506
##.OBSERVE NUCLEUS= ^1H
##.ACQUISITION MODE= SIMULTANEOUS
##.ACQUISITION SCHEME= undefined
##.AVERAGES= 8
##.DIGITISER RES= 18
##SPECTROMETER/DATA SYSTEM= spect
##.PULSE SEQUENCE= zg30
##.SOLVENT NAME= CDCl3
##.SHIFT REFERENCE= (INTERNAL, CDCl3, 0, 17.5032)
##AUDIT TRAIL= $$ (NUMBER, WHEN, WHO, WHERE, WHAT)
$$ ##TITLE= Audit trail, XWIN-NMR		Version 3.5
$$ ##JCAMPDX= 5.01
$$ ##ORIGIN= Bruker BioSpin GmbH
$$ ##OWNER= she
$$ F:/spectra/data/she/nmr/H-F/1/pdata/1/auditp.txt
$$ ##AUDIT TRAIL=  $$ (NUMBER, WHEN, WHO, WHERE, WHAT)
(   1,<2021-07-05 11:31:19.17 +0400>,<she>,<DPX200>,
      <created by zg, POWCHK disabled, PULCHK disabled
       configuration hash MD5:
       00 E9 B6 7A A2 85 ED C7 34 08 36 98 17 FE 4E 26
       data hash MD5: 16K
       5D F8 E1 A9 D4 1B 05 A3 75 E3 BB 2F F5 E5 EC 2E>)
(   2,<2021-07-05 11:31:21.57 +0400>,<she>,<DPX200>,
      <Start of raw data processing
       efp BC_mod = 2 LB = 0.24 FT_mod = 6 PKNL = 1 PHC0 = -12073.26 PHC1 = 12.80099 SI = 16K 
       data hash MD5: 16K
       8B 0F 31 D4 BC 53 83 8C E8 98 F5 47 9E E8 A8 BA>)
(   3,<2021-07-05 11:31:44.39 +0400>,<she>,<DPX200>,
      <pk PHC0 = -7.146614 PHC1 = 11 
       data hash MD5: 16K
       F1 B4 F7 9A 30 5A 1B 4D CF A6 B4 88 C2 03 60 D9>)
(   4,<2021-07-05 11:31:47.81 +0400>,<she>,<DPX200>,
      <abs ABSG = 5 
       data hash MD5: 16K
       C1 1B 7A A8 45 71 04 88 A5 7B A7 F3 E1 37 E0 F0>)
(   5,<2021-07-05 11:32:28.87 +0400>,<she>,<DPX200>,
      <abs ABSG = 5 
       data hash MD5: 16K
       77 C2 69 2A 01 F1 7D A9 C9 60 1B D7 D1 6C 32 F8>)
$$ ##END=
$$ 
$$ hash MD5
$$ EA 09 A0 3D 85 92 52 56 9B DD 37 46 45 BE 85 02
##$RELAX= 
##$RELAX= 
##$RELAX= 
##$RELAX= 
##$RELAX= 
##$RELAX= 
$$ Bruker specific parameters
$$ --------------------------
##$DU= <F:/spectra>
##$EXPNO= 1
##$NAME= <H-F>
##$PROCNO= 1
##$TYPE= <nmr>
##$USER= <she>
##$AMP= (0..31)
100 100 100 100 100 100 100 100 100 100 100 100 100 100 100 100 100 100 
100 100 100 100 100 100 100 100 100 100 100 100 100 100 
##$AQSEQ= 0
##$AQ_mod= 1
##$AUNM= <au_zg>
##$AUTOPOS= <>
##$BF1= 200.13
##$BF2= 200.13
##$BF3= 200.13
##$BF4= 200.13
##$BF5= 200.13
##$BF6= 200.13
##$BF7= 200.13
##$BF8= 200.13
##$BYTORDA= 1
##$CFDGTYP= 0
##$CFRGTYP= 5
##$CHEMSTR= <none>
##$CNST= (0..31)
1 1 145 1 1 1 1 1 1 1 1 1 1 1 1 1 1 1 1 1 1 1 1 1 1 1 1 1 1 1 1 1 
##$CPDPRG= <>
##$CPDPRG1= <>
##$CPDPRG2= <>
##$CPDPRG3= <>
##$CPDPRG4= <mlev>
##$CPDPRG5= <mlev>
##$CPDPRG6= <mlev>
##$CPDPRG7= <mlev>
##$CPDPRG8= <mlev>
##$CPDPRGB= <>
##$CPDPRGT= <>
##$D= (0..31)
0 1.2 0 0 0 0 0 0 0 0.06 0 0.03 0 0 0 0 0.0002 0 0 0 0 0 0 0 0 0 0 0 0 
0 0 0 
##$DATE= 1625470278
##$DBL= (0..7)
$$ [...]
##$SUBNAM3= <"">
##$SUBNAM4= <"">
##$SUBNAM5= <"">
##$SUBNAM6= <"">
##$SUBNAM7= <"">
##$SUBNAM8= <"">
##$SUBNAM9= <"">
##$SW= 20.0188882624521
##$SWIBOX= (0..15)
0 0 2 0 0 0 0 0 0 0 0 0 0 0 0 0 
##$SW_h= 4006.41025641026
##$TD= 16384
##$TD0= 1
##$TE= 0
##$TE2= 300
##$TE3= 300
##$TEG= 300
##$TL= (0..7)
0 120 120 120 120 120 120 120 
##$TP= (0..7)
150 150 150 150 150 150 150 150 
##$TP07= 0
##$TPNAME0= <>
##$TPNAME1= <>
##$TPNAME2= <>
##$TPNAME3= <>
##$TPNAME4= <>
##$TPNAME5= <>
##$TPNAME6= <>
##$TPNAME7= <>
##$TPOAL= (0..7)
0.5 0.5 0.5 0.5 0.5 0.5 0.5 0.5 
##$TPOFFS= (0..7)
0 0 0 0 0 0 0 0 
##$TUNHIN= 0
##$TUNHOUT= 0
##$TUNXOUT= 0
##$USERA1= <user>
##$USERA2= <user>
##$USERA3= <user>
##$USERA4= <user>
##$USERA5= <user>
##$V9= 5
##$VALIST= <valist>
##$VCLIST= <CCCCCCCCCCCCCCC>
##$VD= 0
##$VDLIST= <DDDDDDDDDDDDDDD>
##$VPLIST= <PPPPPPPPPPPPPPP>
##$VTLIST= <TTTTTTTTTTTTTTT>
##$WBST= 1024
##$WBSW= 4
##$XGAIN= (0..3)
0 0 0 0 
##$XL= 0
##$YL= 0
##$YMAX_a= 43957
##$YMIN_a= -26181
##$ZGOPTNS= <>
##$ZL1= 120
##$ZL2= 120
##$ZL3= 120
##$ZL4= 120
##$ABSF1= 17.50322
##$ABSF2= -2.51582
##$ABSG= 5
##$ABSL= 3
##$ALPHA= 0
##$AQORDER= 0
##$ASSFAC= 0
##$ASSFACI= 0
##$ASSFACX= 0
##$ASSWID= 0
##$AUNMP= <proc_1d>
##$AZFE= 0.1
##$AZFW= 0.1
##$BCFW= 0
##$BC_mod= 2
##$BYTORDP= 0
##$COROFFS= 0
##$CY= -3
##$DATMOD= 1
##$DC= 0
##$DFILT= <>
##$DTYPP= 0
##$F1P= 0
##$F2P= 0
##$FCOR= 1
##$FTSIZE= 16384
##$FT_mod= 6
##$GAMMA= 0
##$GB= 0
##$INTBC= 1
##$INTSCL= 1.334414e-10
##$ISEN= 128
##$LB= 0.24
##$LEV0= 0
##$LPBIN= 0
##$MAXI= 10000
##$MC2= 0
##$MEAN= 0
##$ME_mod= 0
##$MI= 1.114404
##$NCOEF= 0
##$NC_proc= -9
##$NLEV= 6
##$NOISF1= 3.799351
##$NOISF2= 2.8
##$NSP= 0
##$NTH_PI= 0
##$NZP= 0
##$OFFSET= 17.50322
##$PC= 1
##$PHC0= -12080.41
##$PHC1= 23.80099
##$PH_mod= 1
##$PKNL= yes
##$PPARMOD= 0
##$PSCAL= 0
##$PSIGN= 0
##$REVERSE= no
##$SF= 200.130006285242
##$SI= 16384
##$SIGF1= 3
##$SIGF2= 2
##$SINO= 5.538805
##$SIOLD= 16384
##$SREGLST= <1H.CDCl3>
##$SSB= 0
##$STSI= 16384
##$STSR= 0
##$SW_p= 4006.41025641026
##$SYMM= 0
##$S_DEV= 0
##$TDeff= 16384
##$TDoff= 0
##$TI= <>
##$TILT= no
##$TM1= 0
##$TM2= 0
##$TOPLEV= 0
##$USERP1= <user>
##$USERP2= <user>
##$USERP3= <user>
##$USERP4= <user>
##$USERP5= <user>
##$WDW= 1
##$XDIM= 16384
##$YMAX_p= 289719874
##$YMIN_p= -925959
$$ End of Bruker specific parameters
$$ ---------------------------------
##NTUPLES= NMR SPECTRUM
##VAR_NAME=  FREQUENCY,     SPECTRUM/REAL,   SPECTRUM/IMAG
##SYMBOL=    X,             R,               I
##VAR_TYPE=  INDEPENDENT,   DEPENDENT,       DEPENDENT
##VAR_FORM=  AFFN,          ASDF,            ASDF
##VAR_DIM=   16384,         16384,           16384
##UNITS=     HZ,            ARBITRARY UNITS, ARBITRARY UNITS
##FACTOR=    0.24454680195387, 1,            1
##FIRST=     3502.91944945899, 0,            0
##LAST=      -503.490806951268, 0,           0
##MIN=       -503.490806951268, -925959,     0
##MAX=       3502.91944945899, 289719874,    0
$$ Real data points
##PAGE= N=1
##DATA TABLE= (X++(R..R)), XYDATA
$$ [...]
6781a79810o598L27042l18532Q9101M5836j42997J13936R3063p9336o3581k90661
$$ -179810 -186408 140634 -177898 -88797 -42961 -185958 -72022 21041 -58295 -121876 -412537
6770d12537k9593J22977m7316J22378l1030J46184Q4305k345P4068j64348Q8335
$$ -412537 -442130 -319153 -366469 -244091 -275121 -128937 -44632 -46977 27091 -137257 -48922
6759d8922m0867J94429p4466l9117j59760L0609j67463J59356R4026j68235J2564
$$ -48922 -89789 104640 30174 -8943 -168703 -138094 -305557 -146201 -52175 -220410 -207846
6748b07846K80852L0241J82990J72154l82792l29886p7310L83761j38919R8742
$$ -207846 73006 103247 286237 458391 75599 -254287 -331597 52164 -86755 11987
6738A1987O8174K63415P3912k86757P1787k49007j01770j06285M0189J17848J65500
$$ 11987 80161 343576 417488 130731 202518 -46489 -148259 -254544 -214355 -96507 68993
6727F8993P906L6681J43382j63976N6243p3738j28889K20108J56424j91723R1082
$$ 68993 76899 113580 256962 92986 149229 75491 -53398 166710 323134 131411 222493
6716B22493j88733J16300p2090j82124L9161J74330k53016J19628J61067J5027
$$ 222493 33760 150060 77970 -104154 -64993 109337 -143679 -24051 137016 152043
6706A52043k06190O9049l37672j23284L33415J52585Q6988r4317M20758K42030
$$ 152043 -54147 14902 -322770 -446054 -112639 39946 126934 32617 453375 695405
6696F95405m30857J68674m18858k8069L19450j92785J9942k35287M093J83128
$$ 695405 264548 433222 14364 -13705 305745 112960 132902 -102385 -98292 84836
6686H4836k85065j7318L4076l0780J82170r9577L39773j46026K1229K3623j12466
$$ 84836 -200229 -217547 -183471 -214251 -32081 -131658 208115 62089 83318 106941 -5525
6675e525J28201K3506J15476l25034J55236K86136j75031O432j19491K59276m9450
$$ -5525 122676 146182 261658 -63376 91860 377996 202965 209397 89906 349182 299732
6664B99732r2521J21048k39612j05967L1572m301j58677K99006R9536k33014o0123
$$ 299732 207211 328259 88647 -17320 14252 9951 -148726 150280 249816 16802 -43321
6653d3321J20001K60566j60221P086o9103j54193K76217p6860k45852K70963j48005
$$ -43321 76680 337246 177025 184111 115008 -39185 237032 160172 -85680 185283 37278
6642C7278m5094m0804L8959j06176K25383J38289j42853L03007p426j75329J43184
$$ 37278 -7816 -48620 -9661 -115837 109546 247835 104982 407989 400563 225234 368418
6631C68418K41146L2842k17060r9376l0200j05008O447n9939O154k8083m76296
$$ 368418 609564 642406 425346 325970 295770 190762 197209 137270 143424 115341 -360955
6620c60955O3167K52543J89416K21466Q6869m89981L38129k17517m32944M54021
$$ -360955 -297788 -45245 144171 365637 452506 -37475 300654 83137 -349807 104214
6610A04214R2971q5680k58300O4133K01451P8456k69385R5976J23711k13058J97867
$$ 104214 197185 111505 -146795 -82662 118789 197245 -72140 23836 147547 -65511 132356
6599A32356o446k31835J08741J48461l22283K2797P561j03086J11760k6437J68164
$$ 132356 125910 -105925 2816 151277 -171006 -148209 -140648 -243734 -131974 -158411 9753
6588I753k30301j08323N7714J04874M8309j9767r960m968j9315j39716J64053
$$ 9753 -220548 -328871 -271157 -166283 -117974 -137741 -147701 -152669 -171984 -311700 -147647
6577a47647L32052J98144K2518j91391q3735J22976k04224l03060K43603Q6118
$$ -147647 184405 382549 405067 213676 129941 252917 48693 -254367 -10764 75354
6567G5354J18678J03860j20341k54516J14259J83864j15900k1679n2856l0387
$$ 75354 194032 297892 177551 -76965 37294 221158 105258 83579 30723 336
6557C36J60633k92172K2876J35595q9629j59857J01266k38013L7153L91469R192
$$ 336 160969 -131203 -108327 27268 -62361 -222218 -120952 -358965 -321812 69657 78849
6546G8849K657J7963j88314J37637J57358j35126j53003N02789m9435j58089N8775
$$ 78849 81506 99469 -88845 48792 206150 71024 -81979 420810 371375 213286 272061
6535B72061j12590O0972R6490j20037J16615p3642j56791k0123l1188k52017J79763
$$ 272061 159471 220443 316933 196896 313511 239869 83078 62955 31767 -220250 -40487
6524d0487n163k12864L51335M46442o1550k60861j83163k77166K95261L9109J51548
$$ -40487 -45650 -258514 92821 539263 477713 216852 33689 -243477 51784 90893 242441
6513B42441j53800J51918K5287k41406Q634J39058m97522K82294K91525j51628
$$ 242441 88641 240559 265846 24440 33074 172132 -325390 -43096 248429 96801
6503I6801N1565J00425O5813L8082J66727l04455j12176R1424m1082j16657l27466
$$ 96801 148366 248791 314604 352686 519413 214958 102782 194206 153124 36467 -290999
6492b90999M76980l6473n0612K87606j63663j00810R5652m6918K2701K35256j55643
$$ -290999 185981 149508 98896 386502 222839 122029 217681 170763 193464 428720 273077
6481B73077K88894k18179l0928j4494j22616L629k50774N01655j98567P2547M1587
$$ 273077 561971 343792 312864 298370 175754 179383 -71391 430264 231697 304244 345831
6470C45831k84875k6549j90211L13842R1210m40700q551J06147j8088K29550k8376
$$ 345831 60956 34407 -155804 158038 249248 -191452 -200003 -93856 -111944 117606 89230
6459H9230k13870J31204J18182j68610M47758L4301j93657O496K2713J35150j89439
$$ 89230 -124640 6564 124746 -43864 403894 438195 244538 251034 273747 408897 219458
6448B19458J77413k62763j02625K70377J02537O7736J39962m15077O5997L36098
$$ 219458 396871 134108 31483 301860 404397 472133 612095 197018 263015 599113
6438E99113j05470k92396J48773J51678j82089j96912L44934L1275r5851j5300
$$ 599113 493643 201247 350020 501698 319609 122697 467631 498906 403055 387755
6428C87755N4816j55772j57081K08238K45662r2908j61261l2196j36472j9656
$$ 387755 442571 286799 129718 337956 583618 490710 329449 297253 160781 141125
6418A41125j53455K6278j82505Q9258N5909J4029q0384j40767K86501J78960Q7747
$$ 141125 -12330 13948 -168557 -79299 -23390 -9361 -89745 -230512 55989 234949 322696
6407C22696m1765k60770J05762P9434J72490m5212k18963J61589j84513k8788
$$ 322696 280931 20161 125923 205357 377847 332635 113672 275261 90748 61960
6397F1960j8445r0830M41734q5270q7438m5513j52408j30418L80835l5624k0343
$$ 61960 43515 -47315 394419 309149 221711 176198 23790 -106628 274207 238583 218240
6386B18240k76754K34570J11632j04980l5976j11051J75671N1613J31175N2095
$$ 218240 -58514 176056 287688 182708 146732 35681 211352 262965 394140 446235
6376D46235m58336p1411n1809K73205L19382j08000L47523j55255l35910m6393
$$ 446235 -12101 -83512 -135321 137884 457266 349266 696789 541534 205624 159231
6366A59231J3136J36685n1148j61347k02362K10577k6537O3461N6918J64138j28842
$$ 159231 172367 309052 257904 96557 -105805 104772 78235 141696 198614 362752 233910
6355B33910j60516R4108J18058j52216J16503K9465l33754j2768L58075J91707
$$ 233910 73394 167502 285560 133344 249847 279312 -54442 -67210 290865 482572
6345D82572m26093J01548J49172O2687j00014q4920R9807j58669j75536M39587
$$ 482572 56479 158027 307199 369886 269872 184952 284759 126090 -49446 390141
6335C90141j8918M3950J7526k39443j57105O9566J40400Q6308J04424l41170o8882
$$ 390141 371223 415173 432699 193256 36151 105717 246117 332425 436849 95679 26797
6324B6797J74565L2264K59168Q6251k62127j25166P2226j28721L09796j11196
$$ 26797 201362 233626 492794 579045 316918 191752 263978 135257 445053 333857
6314C33857Q477K74780M560j65455l52282P2832K4117k57582L48297J21857q5788
$$ 333857 342334 617114 621674 456219 103937 176769 200886 -56696 291601 413458 327670
6303C27670J32916k11676k62985M3636O4024J30818p5105k14097N3327K58563
$$ 327670 460586 248910 -14075 29561 93585 224403 149298 -64799 -11472 247091
6293B47091P0670j19072j59570J81716j39546j12328J71206K8554o3772K38117
$$ 247091 317761 198689 39119 220835 81289 -31039 140167 168721 104949 343066
6283C43066L4462k00269J07401L7110q4268j64761K88743L33731q5106r2160q0607
$$ 343066 377528 177259 284660 321770 237502 72741 361484 695215 610109 517949 437342
6272D37342j32415k5982r8411l9371K78323k5815l66281K62533K5584O4210j90076
$$ 437342 304927 278945 180534 141163 419486 393671 27390 289923 315507 379717 189641
6261A89641L84245j9650j45878N952k84425M76851L9174j95644k04951P722Q4070
$$ 189641 573886 554236 408358 414310 129885 606736 645910 450266 245315 253037 337107
6250C37107k53955j8160K65562O2400j64977L24397J61702l83430j2058M06172
$$ 337107 83152 64992 330554 392954 227977 552374 714076 330646 318588 724760
6240G24760j33149k75129L24764j11764P7192L4340k81757J57095M10572k60486
$$ 724760 591611 316482 641246 529482 606674 641014 359257 516352 926924 666438
6230F66438j96562j23260N9959J78996j24883l7061L79890L3665j75834J84489
$$ 666438 469876 346616 406575 585571 460688 423627 803517 837182 661348 845837
6220H45837R6317k78565L7812r4395J6941K2521P9779O09N5700J8323j31681J60523
$$ 845837 942154 663589 701401 607006 623947 646468 726247 726856 782556 800879 669198 829721
6208H29721P9192m2340k97059j2973K27477j67613L9235K18015L4147k0895J5826
$$ 829721 908913 866573 569514 556541 784018 616405 655640 873655 907802 886907 902733
6197I02733L72621k26112k4751l9290j51917j10336j01694K25761K29956P0756
$$ 902733 1275354 1049242 1024491 985201 833284 722948 621254 847015 1076971 1147727
6187A147727J60873m97116j29410L85624m3976j24920Q4049N7505O3090r5599
$$ 1147727 1308600 811484 682074 1067698 1023722 898802 982851 1040356 1103446 1007847
6177A007847r4924R3026K1308J56332J61750k51433k20932Q8335o576r9207N9874
$$ 1007847 912923 1005949 1027257 1183589 1345339 1093906 872974 961309 954733 855526 915400
6166I15400Q6791J81205L41678k09604l0707k55110j27927L7445R1354K16702
$$ 915400 1002191 1183396 1525074 1315470 1284763 1029653 901726 939171 1030525 1247227
6156A247227n1392o7664m467L06278k0179l06186l1324M29330k99824K2011M5022
$$ 1247227 1195835 1128171 1123704 1429982 1409803 1103617 1072293 1501623 1201799 1223810 1268832
6145A268832j8918L9917K03484N55561k41216l50828j5547l90892M27839N7743
$$ 1268832 1249914 1289831 1493315 2048876 1807660 1456832 1441285 1050393 1478232 1535975
6135A535975J22309O5957l84260M762J82406p1553R2448J96769j05312K88447
$$ 1535975 1658284 1724241 1339981 1344743 1527149 1455596 1548044 1744813 1639501 1927948
6125A927948n4350q9536K35112j09329J03451J34906k81581K03237K44329j9682
$$ 1927948 1873598 1784062 2019174 1909845 2013296 2148202 1866621 2069858 2314187 2294505
6115B294505K14464R0476m13736nk47423J12650J34725J94107J98736L095j31505
$$ 2294505 2508969 2599445 2185709 2185704 1938281 2050931 2185656 2379763 2578499 2581594 2450089
6104B450089j21343k36061N07853J10330j75393K9329j19935L92253J50922k45674
$$ 2450089 2328746 2092685 2600538 2710868 2535475 2564804 2444869 2837122 2988044 2742370
6094B742370n30944K19855K30598J59166j59344o7813n5819j49403q0186N62751
$$ 2742370 2211426 2431281 2661879 2821045 2661701 2593888 2538069 2388666 2308480 2871231
6084B871231M12774j11238j37201j34206j44291J17779J17493l65134P1605J48574
$$ 2871231 3284005 3172767 3035566 2901360 2757069 2874848 2992341 2627207 2698812 2847386
6074B847386K76737K32223l2907k11694J952m305N1130K65690k0186L0203l510
$$ 2847386 3124123 3356346 3323439 3111745 3113697 3109392 3160522 3426212 3406026 3436229 3432719
6063C432719J86348L0594k41019K74566q4274k9085J5760K43588K9570j31423
$$ 3432719 3619067 3649661 3408642 3683208 3598934 3569849 3585609 3829197 3858767 3727344
6053C727344J71376J08849J08123l7044L63420m9774p8660n7480k1375K93622
$$ 3727344 3898720 4007569 4115692 4078648 4442068 4392294 4313634 4256154 4234779 4528401
6043D528401J52587L14258p8504J40510J16957K06505j61970J47348J11708L34623
$$ 4528401 4680988 4995246 4916742 5057252 5174209 5380714 5218744 5366092 5477800 5812423
6033E812423J53925O5308k73416K40643J32775J3106r3374J50206M30035K39465
$$ 5812423 5966348 6031656 5758240 5998883 6131658 6144764 6051390 6201596 6631631 6871096
6023F871096J57017k28806L51135K81773K52190m1110n4960K45126J34503J61748
$$ 6871096 7028113 6799307 7150442 7432215 7684405 7643295 7588335 7833461 7967964 8129712
6013H129712J6300K4507L32184J18104L19859n4463N34472Q0362m2726L39791
$$ 8129712 8146012 8170519 8502703 8620807 8940666 8886203 9420675 9501037 9458311 9798102
6003I798102L85902J48204M6505j2432N8585K95107K69727M51904M66654K27861
$$ 9798102 10184004 10332208 10378713 10366281 10424866 10719973 10989700 11441604 11908258 12136119
5993A2136119L20808N2835K44175K72567M9778L37870M35986M04166L99262J4093
$$ 12136119 12456927 12509762 12753937 13026504 13076282 13414152 13850138 14254304 14653566 14667659
5983A4667659M42300M57359j42732N42400R48712L91124j496N92570Q06444O03001
$$ 14667659 15109959 15567318 15424586 15966986 16915698 17306822 17305326 17897896 18704340 19307341
5973A9307341P65122N09933M53251Q00088Q41797R54576P24273O76198Q17290
$$ 19307341 20072463 20582396 21035647 21835735 22677532 23632108 24356381 25032579 25849869
5964B5849869O26594P17371J160547J156019J015260R61651Q55850J064549J037779
$$ 25849869 26476463 27193834 28354381 29510400 30525660 31487311 32343161 33407710 34445489
5955C4445489J075165J542423J581322J139903J050263J241889J545341J741883
$$ 34445489 35520654 37063077 38644399 39784302 40834565 42076454 43621795 45363678
5947D5363678J365899J480462J252615J541046J553214J934313J900550J388598
$$ 45363678 46729577 48210039 49462654 51003700 52556914 54491227 56391777 57780375
5939E7780375J914084J929017J707733J492855J518163J791632J562889J449520
$$ 57780375 59694459 61623476 63331209 64824064 66342227 68133859 69696748 71146268
5931G1146268J467364J165881J281007J012580Q81755N01281M73917J65115j12464
$$ 71146268 72613632 73779513 75060520 76073100 76954855 77456136 77930053 78095168 77982704
5922G7982704j72767l22513m81367p76637q70994j217106j494822j500494j906496
$$ 77982704 77809937 77487424 77006057 76229420 75358426 74141320 72646498 71146004 69239508
5913F9239508j550179j674155j882270j977814j985951j910586j914259k022698
$$ 69239508 67689329 66015174 64132904 62155090 60169139 58258553 56344294 54321596
5905E4321596j907115j749546j521947j686818j539303j413553j775075j053988
$$ 54321596 52414481 50664935 49142988 47456170 45916867 44503314 42728239 41674251
5897D1674251j265111j584342j596515o80953j039323j238335j021693q76432
$$ 41674251 40409140 38824798 37228283 36547330 35508007 34269672 33247979 32371547
5889C2371547j288497p68495j050233q59616q15041j060297o67887j010830q97916
$$ 32371547 31083050 30314555 29264322 28404706 27589665 26529368 25861481 24850651 23952735
5880B3952735j194090p54629j005713o52494k88996p40831q09420q02694n20540
$$ 23952735 22758645 22004016 20998303 20345809 20056813 19315982 18506562 17703868 17183328
5871A7183328l98644p89405m21522l52358o00783m36372k97074l91724n95752
$$ 17183328 16784684 15995279 15573757 15221399 14620616 14184244 13887170 13495446 12899694
5862A2899694q09384n08141q3097j93491k49985k73108m74461m07629j25141j13308
$$ 12899694 12090310 11582169 11499072 11305581 11055596 10782488 10308027 9900398 9775257 9661949
5852I661949m47141k55120m74474k09820j07523k93761p619k74669O3335j95024
$$ 9661949 9214808 8959688 8485214 8275394 8167871 7874110 7866491 7591822 7655157 7460133
5842G460133m19118O4504k92788q9701n4358j69171r1592p7061k07363L7992j69573
$$ 7460133 7041015 7105519 6812731 6723030 6668672 6499501 6407909 6330848 6123485 6161477 5991904
5831E991904j88134l34944K22952J40070l96544k57809P799M786P6883k64603
$$ 5991904 5803770 5468826 5691778 5831848 5435304 5177495 5185294 5190080 5266963 5002360
5821E002360J01264J26311k40260l28768j51532k4550q9558J67421j87774p7790
$$ 5002360 5103624 5229935 4989675 4660907 4509375 4484825 4395267 4562688 4374914 4297124
5811D297124k97154L45986k13792j51935Q9270J21939n10279J74760J33276k66996
$$ 4297124 3999970 4345956 4132164 3980229 4069499 4191438 3681159 3855919 3989195 3722199
5801C722199j94751K1348L08402l522k64074K35316l53759l20151K99735J16636
$$ 3722199 3527448 3548796 3857198 3853676 3589602 3824918 3471159 3151008 3450743 3567379
5791C567379j8976k13508j83481m5265J38499l31250N405K04922k07344K67303
$$ 3567379 3548403 3334895 3151414 3106149 3244648 2913398 2918803 3123725 2916381 3183684
5781C183684q5856j46333j2392m596j5463j63806N0329o721J09640J69759n16468
$$ 3183684 3097828 2951495 2939103 2934507 2919044 2755238 2805567 2798846 2908486 3078245 2561777
5770B561777l68519M35185l02767p6730L038J09495l63863Q7700K49776m02023
$$ 2561777 2193258 2628443 2325676 2248946 2251984 2361479 1997616 2085316 2335092 1933069
5760A933069L11279j15352j25304K03599J63173J28170k02654j5888j20360k2702
$$ 1933069 2244348 2128996 2003692 2207291 2370464 2498634 2295980 2280092 2159732 2137030
5750B137030K77989j5802q1834j27154j44189r6422n3960K37219J18153Q4156
$$ 2137030 2415019 2399217 2317383 2190229 2046040 1949618 1895658 2132877 2251030 2335186
5740B335186j77698l41116k18877K92891J14006o4716o2927J06203m51477j67857
$$ 2335186 2157488 1816372 1597495 1890386 2004392 1939676 1876749 1982952 1531475 1363618
5730A363618K86259o6402N786j48493L64663O6748M1242L8553l57511k5968K33321
$$ 1363618 1649877 1583475 1589261 1440768 1805431 1872179 1913421 1951974 1594463 1568495 1801816
5719A801816k8830R9069k5297k60841o9740o7326L6662M4414R3655k32928r2041
$$ 1801816 1772986 1872055 1846758 1585917 1516177 1448851 1485513 1529927 1623582 1390654 1298613
5708A298613L1876K08063j1118N7476Q8814J26854k14894j04441K56582j98299
$$ 1298613 1330489 1538552 1527434 1584910 1673724 1800578 1585684 1481243 1737825 1539526
5698A539526J45931l06797j11925k18910k1942J62797N11M85932O3455k94507
$$ 1539526 1685457 1378660 1266735 1047825 1025883 1188680 1189191 1675123 1738578 1444071
5688A444071n7652j41607K04167j13703J52056Q022m7367R1334j27200K7340k0319
$$ 1444071 1386419 1244812 1448979 1335276 1487332 1495354 1447987 1539321 1412121 1439461 1419142
5677A419142j90025O2943K00968p8242l8796L49518j12562l19294M27099j57123
$$ 1419142 1229117 1292060 1493028 1414786 1375990 1725508 1612946 1293652 1720751 1563628
5667A563628Q5368j36052K7101k19647j30061K45618J26276j46097P2581o0606
$$ 1563628 1648996 1512944 1540045 1320398 1190337 1435955 1562231 1416134 1488715 1428109
5657A428109L3312K5174O5375Q5981j42929K78756K7474R8155m43299l5664k4597
$$ 1428109 1461421 1486595 1551970 1637951 1495022 1773778 1801252 1899407 1456108 1420444 1395847
5646A395847k53393J58778p5708K07971n972K13614M7637k55361k96204J92863
$$ 1395847 1142454 1301232 1225524 1433495 1427523 1641137 1688774 1433413 1137209 1330072
5636A330072J67447k29367L5511N0116l42246J7915K90240O4287k4966j21881
$$ 1330072 1497519 1268152 1303663 1353779 1011533 1029448 1319688 1383975 1359009 1237128
5626A237128J67572L69813k3579l17492K50946J50117N9601o2503j79147R3972
$$ 1237128 1404700 1774513 1750934 1433442 1684388 1834505 1894106 1831603 1652456 1746428
5616A746428J6771J32735k08212L18387J31011k68049k95818K76066J42539k73014
$$ 1746428 1763199 1895934 1687722 2006109 2137120 1869071 1573253 1849319 1991858 1718844
5606A718844k2856R0019K82455J01839J21380k00356K48756o7814k62189l4455
$$ 1718844 1695988 1786007 2068462 2170301 2291681 2091325 2340081 2272267 2010078 1975623
5596A975623j06984j05154L19565k43480k786M47674J50267m90318k6812K60324
$$ 1975623 1868639 1763485 2083050 1839570 1836784 2284458 2434725 1944407 1917595 2177919
5586B177919j43952q4500j07068J60205j99960l10533R0629J17630P4795N6012
$$ 2177919 2033967 1949467 1842399 2002604 1802644 1492111 1582740 1700370 1775165 1831177
5576A831177K62483o3651j74631K75274k22052j00691J50617k38454J35657n9747
$$ 1831177 2093660 2030009 1855378 2130652 1908600 1807909 1958526 1720072 1855729 1795982
5566A795982q7595m487K84696K1440j85317K57430j05543k51742k26199Q3941
$$ 1795982 1708387 1703900 1988596 2010036 1824719 2082149 1976606 1724864 1498665 1582606
5556A582606J37375j71737K36792k57327L20254j60891k3396k42928Q4882L38430
$$ 1582606 1719981 1548244 1785036 1527709 1847963 1687072 1663676 1420748 1505630 1844060
5546A844060J06773M0325k05303K54610q2565K3353j53105o3802j2059j34928
$$ 1844060 1950833 1991158 1785855 2040465 1957900 1981253 1828148 1764346 1752287 1617359
5536A617359L06534K02180P59k90619N9699l10491O3094m798M2665J83340R2730
$$ 1617359 1923893 2126073 2126832 1836213 1895912 1585421 1648515 1643717 1686382 1869722 1962452
5525A962452l7549j84576j46655j22648K80980J83992J99327k40872N1674j80985
$$ 1962452 1924903 1740327 1593672 1471024 1752004 1935996 2135323 1894451 1946125 1765140
5515A765140M4723p5314j36512n5836K10192j18240K05830j64667j4008J43526
$$ 1765140 1809863 1734549 1598037 1542201 1752393 1634153 1839983 1675316 1661308 1804834
5505A804834m10270j82751M30442p1761J2026j11022j69042j6593o589j59213
$$ 1804834 1394564 1211813 1642255 1570494 1582520 1471498 1302456 1285863 1279274 1120061
5495A120061J26915J96208M2540k78096N0049L12282J38473o9517l85253L01003
$$ 1120061 1246976 1443184 1485724 1207628 1257677 1569959 1708432 1638915 1253662 1554665
5485A554665j24126l30474K40239L2168k03387k79520L73868n1991K6572l79896
$$ 1554665 1430539 1100065 1340304 1372472 1169085 889565 1263433 1211442 1238014 858118
5475H58118K62316k4294J1587P004Q6535j32440k26216K14986j21885l1022L7977
$$ 858118 1120434 1096140 1107727 1114731 1201266 1068826 842610 1057596 935711 904689 942666
5464I42666N8795j10287K17074k8720j76442l8758K11275p8371J21474J0003J3354
$$ 942666 1001461 891174 1108248 1079528 903086 864328 1075603 997232 1118706 1128709 1142063
5453A142063k85128M122M4327K36484q538m8179q5904J28605O6362j89776J39256
$$ 1142063 856935 861057 905384 1141868 1133330 1085151 999247 1127852 1194214 1004438 1143694
5442A143694k08904L71853l4182k92450K49982J7507q2677j14956J71749k65108
$$ 1143694 934790 1306643 1272461 980011 1229993 1247500 1164823 1049867 1221616 956508
5432I56508j87550j02058K63188P4662k384m3489K8450k17461j80958j37276o5582
$$ 956508 768958 666900 930088 1004750 1002366 958877 987327 769866 588908 451632 386050
5421C86050K38378J45784j71434O9161n663K17023L28720J83866p1048l01813
$$ 386050 624428 770212 598778 667939 662276 879299 1208019 1391885 1320837 1019024
5411A019024L7796j85053k98097K74104r9363P6000O8557O4758O5741l50142k9113
$$ 1019024 1056820 871767 573670 847774 748411 824411 892968 957726 1023467 673325 644212
5400F44212N3429P965j08991K83520o3225j13239j35412P6689R4518k82026K51188
$$ 644212 697641 705606 596615 880135 816910 703671 568259 644948 739466 457440 708628
5389G08628L36605m55313O0453Q5689q3326K18585o9843K61429l96775j98220
$$ 708628 1045233 589920 650373 736062 652736 871321 801478 1062907 666132 467912
5379D67912K83816K7970M9843K60023k09007j78924K17432k24518K48980j90564
$$ 467912 751728 779698 829541 1089564 880557 701633 919065 694547 943527 752963
5369G52963p1316n2613J1474K51839k55526l2053L81463j18672J55984j36804
$$ 752963 681647 629034 640508 892347 636821 604768 986231 867559 1023543 886739
5359H86739j18983J45993O1457o6793o9283P8018j50837M5895l4716m3143k00203
$$ 886739 767756 913749 975206 908413 839130 917148 766311 812206 777490 734347 534144
5348E34144n8199l3551J23801J23142n7749J27497l5529m6750J07164r9878k53598
$$ 534144 475945 442394 566195 689337 631588 759085 723556 676806 783970 684092 430494
5337D30494P2118J51325J95447q9551J8931Q7073j52440J71155L5802l63342Q2519
$$ 430494 502612 653937 849384 759833 778764 865837 713397 884552 920354 557012 639531
5326F39531K02784J81785j82075j55994J34794N9409J86905j60834K12527k02246
$$ 639531 842315 1024100 842025 686031 820825 880234 1067139 906305 1118832 916586
5316I16586m3344O9108N4294j30189m9033j72625j48742Q0308J69928j38668J36040
$$ 916586 873242 942350 996644 866455 817422 644797 496055 576363 746291 607623 743663
5305G43663j17406J71367L77179m76240P8994M04800l55126j83484J62390J03703
$$ 743663 626257 797624 1174803 698563 777557 1182357 827231 643747 806137 909840
5295I09840J67651j25150J19416j83038j53455M6753J97881m6978J14412R8947
$$ 909840 1077491 952341 1071757 888719 735264 782017 979898 932920 1047332 1146279
5285A146279k09992L5340J1601j77377J03639j58321o6317K51818k00335j70943
$$ 1146279 936287 971627 983228 805851 909490 751169 684852 936670 736335 565392
5275E65392K49033J83639K1822p1785o8689n2992n1631M8239L306j06722K8405
$$ 565392 814425 998064 1019886 948101 879412 826420 774789 823028 826334 719612 748017
5264G48017k2266J71434r0515K23223l24650J85504L01020j41037l9159M2597
$$ 748017 725751 897185 806670 1029893 705243 890747 1191767 1050730 1011571 1054168
5254A054168l65554j22681q0849O8959J06191M02153j77465l34917J81051j98381
$$ 1054168 688614 565933 485084 554043 660234 1062387 884922 550005 731056 532675
5244E32675K3513K28158K51370j9757K57221k69244l32525L20489r9434k31765
$$ 532675 556188 784346 1035716 1015959 1273180 1003936 671411 991900 892466 660701
5234F60701J98745O3067L18394j19461o8893K42644J0946l06298P6930N6256K04545
$$ 660701 859446 922513 1240907 1121446 1052553 1295197 1306143 999845 1076775 1133031 1337576
5223A337576l11569j18756j12456M40771K00717l26076n3788K46492n2791J8040
$$ 1337576 1026007 907251 794795 1235566 1436283 1110207 1056419 1302911 1250120 1268160
5213A268160M438j61462m19047L01498J85182K15533J82045l4855k54880K09530
$$ 1268160 1272598 1111136 692089 993587 1178769 1394302 1576347 1541492 1286612 1496142
5203A496142L6880j73414O6009K6214K74064M7494L0950m11888M59242Q9676j34847
$$ 1496142 1533022 1359608 1425617 1451831 1725895 1773389 1804339 1392451 1851693 1941369 1806522
5192A806522n1009M457J02034j36523n8133j4956P6998n2455l72606J82963l461
$$ 1806522 1755513 1759970 1862004 1725481 1667348 1652392 1729390 1676935 1304329 1487292 1483831
5181A483831p3667p3202J14381J62009j47855k08567N7736K66395L45012l19617
$$ 1483831 1410164 1336962 1451343 1613352 1465497 1256930 1314666 1581061 1926073 1606456
5171A606456m2866j65718K51758j68177J2388k19089j0498J85887l84755j13553
$$ 1606456 1563590 1397872 1649630 1481453 1493841 1274752 1264254 1450141 1065386 951833
5161I51833m3110M51849j96952J47070K94507j06761k74091q1546L5167L81394
$$ 951833 908723 1360572 1163620 1310690 1605197 1498436 1224345 1142799 1177966 1559360
5151A559360j71712m05558K46532j06136J46677j12982K7013J17344k08121J66456
$$ 1559360 1387648 982090 1228622 1122486 1269163 1156181 1183194 1300538 1092417 1258873
5141A258873J75491L1303j12546j9582l6167k26089J9618J16113J51745N9136
$$ 1258873 1434364 1465667 1353121 1333539 1297372 1071283 1090901 1207014 1358759 1417895
5131A417895L791J34449j20213J64701K1680k61873L8017k4583M25864R5729k94388
$$ 1417895 1421686 1556135 1435922 1600623 1622303 1360430 1398447 1373864 1799728 1895457 1601069
5120A601069K39343q171m038J21706J86787q0429m64047R443j27415M4182K65087
$$ 1601069 1840412 1832241 1828203 1949909 2136696 2056267 1592220 1601663 1474248 1518430 1783517
5109A783517N7078j1567O7671j79588M9171m8626m2071J11372J23538l1905M8702
$$ 1783517 1840595 1829028 1896699 1717111 1766282 1717656 1675585 1786957 1910495 1878590 1927292
5098A927292J69509r9989k28581l18170k3651J63064K33145J65429P9818j53256
$$ 1927292 2096801 1996812 1768231 1450061 1426410 1589474 1822619 1988048 2067866 1914610
5088A914610p1045J7488j51402p1793M61083k98081P7261N3450Q3263n000J60842
$$ 1914610 1843565 1861053 1709651 1637858 2098941 1800860 1878121 1931571 2014834 2009834 2170676
5077B170676m19414J34134L2048o5312Q8191J11349j41368L15819j22733j30601
$$ 2170676 1751262 1885396 1917444 1852132 1940323 2051672 1910304 2226123 2103390 1972789
5067A972789J66083K52541L7649k96064J90517m7839J50561J18727k488N4848
$$ 1972789 2138872 2391413 2429062 2132998 2323515 2275676 2426237 2544964 2542476 2597324
5057B597324K54592j34613M9697K5907j42707p5771K9127L34356M78415K46430
$$ 2597324 2851916 2717303 2767000 2792907 2650200 2574429 2603556 2937912 3416327 3662757
5047C662757k39947k872M1783k36748P0798K44390K48170l4826J86468M994K61155
$$ 3662757 3422810 3419938 3461721 3224973 3295771 3540161 3788331 3753505 3939973 3944967 4206122
5036D206122L03002j66792K72213K73587j82624J01522q4947L9975K44007N5991
$$ 4206122 4509124 4342332 4614545 4888132 4705508 4807030 4722083 4762058 5006065 5062056
5026E062056l9521J53210J98722J90941J70508j15016j27399J21191k14277J19430
$$ 5062056 5022535 5175745 5374467 5565408 5735916 5620900 5493501 5614692 5400415 5519845
5016E519845n9729k61804m34408R2159J91234K1069j02592k22897Q0739n0035
$$ 5519845 5460116 5198312 4763904 4856063 5047297 5068366 4965774 4742877 4823616 4773581
5006D773581j62263k08533o7987M7349l86691L59342K79530k83990K91760Q0930
$$ 4773581 4611318 4402785 4334798 4382147 3995456 4354798 4634328 4350338 4642098 4723028
4996D723028k36653L2303r1464L06172L3834j59302N1861J25831m5380K47349
$$ 4723028 4486375 4518678 4427214 4733386 4767220 4607918 4659779 4785610 4740230 4987579
4986D987579k6264Q8480J08762J77689J98498r934K04816p6959o5708k9065j44683
$$ 4987579 4961315 5049795 5158557 5336246 5534744 5524810 5729626 5652667 5586959 5557894 5413211
4975E413211K42208j84665K0709K78331J35998K63466l877r652j27426K84924
$$ 5413211 5655419 5470754 5491463 5769794 5905792 6169258 6165381 6155729 6028303 6313227
4965F313227K59514M81j27368j7416K28646j29294j22586N63390J61537N8656
$$ 6313227 6572741 6573222 6445854 6428438 6657084 6527790 6405204 6968594 7130131 7188787
4955G188787L52013J23091M80580j0731L28520L00508R2348K77324K18187K26180
$$ 7188787 7540800 7663891 8144471 8133740 8462260 8762768 8855116 9132440 9350627 9576807
4945I576807M5602O4530M46358L27989K99379N58126J79489L95690J65644M78384
$$ 9576807 9622409 9686939 10133297 10461286 10760665 11318791 11498280 11893970 12059614 12537998
4935A2537998L15500M41249N42201L96033P42214R94840Q03315J016806J291886
$$ 12537998 12853498 13294747 13836948 14232981 14975195 15970035 16773350 17790156 19082042
4926A9082042J673496J435563J479570J545166J951968K682304L162356L882819
$$ 19082042 20755538 22191101 23670671 25215837 27167805 29850109 33012465 36895284
4918C6895284M417990M481698O013133O683764P562486Q781590J1218361J3080031
$$ 36895284 41313274 45794972 51808105 58491869 66054355 74835945 86054306 99134337
4910I9134337J6295347J8939466K1187857K4764613K2417689m609484k4012563
$$ 99134337 115429684 134369150 155557007 180321620 202739309 198129825 174117262
4903A74117262k9325338l1551498k2333688j6145784j1028931q146570o050501
$$ 174117262 144791924 113240426 90906738 74760954 63732023 55585453 49534952
4896D9534952m944512l992237l629801l036556k538629k195040j893583j998651
$$ 49534952 44590440 40598203 36968402 33931846 31393217 29198177 27304594 25305943
4888B5305943j678191j432239j189426p01850j295157j044766n63724o13234p07032
$$ 25305943 23627752 22195513 21006087 20304237 19009080 17964314 17400590 16787356 16080324
4879A6080324q06988r71046m88497m30881k57811n82679l21099l84406k91599
$$ 16080324 15273336 14302290 13813793 13382912 13125101 12542422 12221323 11836917 11545318
4870A1545318l28781l49411j62979p6675l60870k42626l79656n71788j90931j26436
$$ 11545318 11216537 10867126 10704147 10627472 10266602 10023976 9644320 9072532 8881601 8755165
4860H755165k39853j10411k34082m50923O9058k15160m57348j98335j59503J73564
$$ 8755165 8515312 8404901 8170819 7719896 7788954 7573794 7116446 6918111 6758608 6932172
4850F932172q0941J42598k20020m88732m04854k45988n3619q3113k81853J53993
$$ 6932172 6851231 6993829 6773809 6285077 5880223 5634235 5580616 5497503 5215650 5369643
4840E369643j07624l50030K9453L3008J90271j05425j27727k43682K3432N9613
$$ 5369643 5262019 4911989 4941442 4974450 5164721 5059296 4931569 4687887 4711319 4770932
4830D770932k27050l78279J62449k6684J92608j96851k83206K44122J4049l51905
$$ 4770932 4543882 4165603 4328052 4301368 4493976 4297125 4013919 4258041 4272090 3920185
4820C920185K2120K55988k00202l3024J25744J02035n806k58113j67410j42878
$$ 3920185 3942305 4198293 3998091 3965067 4090811 4192846 4187040 3928927 3761517 3618639
4810C618639J38917K13201P218P1336N9908l04819j43015o7939l2965L7978j40246
$$ 3618639 3757556 3970757 3977975 4049311 4109219 3804400 3661385 3593446 3560481 3598459 3458213
4799C458213K69630M7795M5272J65230J66038j71464j04304K05889J02976k94675
$$ 3458213 3727843 3775638 3820910 3986140 4152178 3980714 3876410 4082299 4185275 3890600
4789C890600J72130K24568k40765K81057J30429J62912J52853k82342j54031k52599
$$ 3890600 4062730 4287298 4046533 4327590 4458019 4620931 4773784 4491442 4337411 4084812
4779D084812L18517l8440J11676k64100N198j6505O7343l2998j47524k99466m55400
$$ 4084812 4403329 4364889 4476565 4212465 4217663 4201158 4268501 4235503 4087979 3788513 3333113
4768C333113l3195l7481J44514k27457p6836N3526K4637l15315Q7153k21614q5460
$$ 3333113 3299918 3262437 3406951 3179494 3102658 3156184 3180821 2865506 2952659 2731045 2645585
4757B645585J03640k04907K80939K63459m0870l81279m35919P6133P1694m6876
$$ 2645585 2749225 2544318 2825257 3088716 3047846 2666567 2230648 2306781 2378475 2331599
4747B331599k15196j63344q8030J69941j94974j19169M7414K89457j57200R1446
$$ 2331599 2116403 1953059 1865029 2034970 1839996 1720827 1768241 2057698 1900498 1991944
4737A991944j6511P6933j87641k36731k86056K52794k36467J8430K58568K4728
$$ 1991944 1975433 2052366 1864725 1627994 1341938 1594732 1358265 1376695 1635263 1659991
4727A659991p8753j06089J90357J25129l33393K32883P7604k91320j6556k19423
$$ 1659991 1581238 1475149 1665506 1790635 1457242 1690125 1767729 1476409 1459853 1240430
4717A240430J40004J0686R8154j8087K02143l10117j11644o2210L67311J47949
$$ 1240430 1380434 1391120 1489274 1471187 1673330 1363213 1251569 1189359 1556670 1704619
4707A704619r1082p5967l4109J39084l61577j23397L06917k41611m9192J17487
$$ 1704619 1613537 1537570 1503461 1642545 1280968 1157571 1464488 1222877 1173685 1291172
4697A291172K52797j41763k9654k03072n8493J611J03322J57934j08547j69243
$$ 1291172 1543969 1402206 1372552 1169480 1110987 1112598 1215920 1373854 1265307 1096064
4687A096064K01403q7831m70631J11077J86380R6748j28156J84586J62448j49960
$$ 1096064 1297467 1209636 739005 850082 1036462 1133210 1005054 1189640 1352088 1202128
4677A202128N1131p2341k2579M6233n9204j43852K83907L21587q4992k31852o1922
$$ 1202128 1253259 1180918 1158339 1204572 1145368 1001516 1285423 1607010 1522018 1290166 1228244
4666A228244K03818j54180k17524K17660N5673k59234j854J03463j50621J85779
$$ 1228244 1432062 1277882 1060358 1278018 1333691 1074457 1072603 1176066 1025445 1211224
4656A211224R4570O2332O9196j6272k61264J99945O6212j98608J9223M03651j40154
$$ 1211224 1305794 1368126 1437322 1421050 1159786 1359731 1425943 1227335 1246558 1650209 1510055
4645A510055J90459K02372k48152J05581j47431M8830j62980j69592k17440K19964
$$ 1510055 1700514 1902886 1654734 1760315 1612884 1661714 1498734 1329142 1111702 1331666
4635A331666o2395J99715p2277M8497k9660Q0991k87971l05486J09755J70940
$$ 1331666 1269271 1468986 1396709 1445206 1415546 1496537 1208566 903080 1012835 1183775
4625A183775O1510K71381K46786J63703r5147q4217J23410j6665J82219N8903
$$ 1183775 1245285 1516666 1763452 1927155 1832008 1747791 1871201 1854536 2036755 2095658
4615B095658O355n1365j23668j40022k80203l02451K28500n4975k47762J32721
$$ 2095658 2102013 2050648 1926980 1786958 1506755 1204304 1432804 1377829 1130067 1262788
4605A262788M6427p8920J17486M7677j22788J84463J621k6810k07788j72215j41382
$$ 1262788 1309215 1230295 1347781 1395458 1272670 1457133 1458754 1431944 1224156 1051941 910559
4594I10559N3335Q7315M3310j172j19294j15064Q1786R421r002M41174j08777
$$ 910559 963894 1051209 1094519 1093347 974053 858989 940775 950196 941194 1382368 1273591
4583A273591j17929P4325K32626K08781k26536l08217J27414K20554K53178J30012
$$ 1273591 1155662 1229987 1462613 1671394 1444858 1136641 1264055 1484609 1737787 1867799
4573A867799j96393m241R6597j33644K06723j17514j97974J26139J12646j8045
$$ 1867799 1671406 1667165 1763762 1630118 1836841 1719327 1521353 1647492 1760138 1742093
4563A742093j01619J33209r3359L434j26045J29155j42683l20254P9494J45560
$$ 1742093 1640474 1773683 1680324 1683758 1557713 1686868 1544185 1223931 1303425 1448985
4553A448985j9771k20395K35979K4994l16451j33765K57619l13873M1001N618
$$ 1448985 1429214 1208819 1444798 1469792 1153341 1019576 1277195 963322 1004323 1009941
4543A009941O20636K53817m50162J47303J8077j74331k2988k12736J33828j53512
$$ 1009941 1630577 1884394 1434232 1581535 1599612 1425281 1402293 1189557 1323385 1169873
4533A169873J95087Q8504k48040K3034o8719J11529j00840L25382j27837K7677
$$ 1169873 1364960 1453464 1205424 1228458 1159739 1271268 1170428 1495810 1367973 1395650
4523A395650J97816L69836k82657k92409R6033N5847o6720O6163O8428Q5284j22642
$$ 1395650 1593466 1963302 1680645 1388236 1484269 1540116 1473396 1539559 1607987 1693271 1570629
4512A570629R3167O5896K54310k09759R9210M8350L5127J20115j78479j14098
$$ 1570629 1663796 1729692 1984002 1774243 1873453 1921803 1956930 2077045 1898566 1784468
4502A784468J33154l9739n0060K85441k44528M34861p8233M745j15692k0382L41497
$$ 1784468 1917622 1877883 1827823 2113264 1868736 2303597 2225364 2230109 2114417 2094035 2435532
4491B435532j45925O4193M4095j11746J3969R1135M19612n662M2697N9952m9135
$$ 2435532 2289607 2353800 2397895 2286149 2300118 2391253 2810865 2805203 2847900 2907852 2858717
4480B858717k86458K3864N1476k24898M2175K23705j34694J93035K4988Q2596
$$ 2858717 2572259 2596123 2647599 2422701 2464876 2688581 2553887 2746922 2771910 2854506
4470B854506J36525m8704o6990M44473j92379l09775M22848J85528n21557k49216
$$ 2854506 2991031 2942327 2875337 3319810 3127431 2817656 3240504 3426032 2904475 2655259
4460B655259q3968J37872K00831o3924k61037R9730K29156L19611m0376J34762
$$ 2655259 2571291 2709163 2909994 2846070 2585033 2684763 2913919 3233530 3193154 3327916
4450C327916k26590k16820L82220Q5436j24500j62579M63971r0447J53690j9958
$$ 3327916 3101326 2884506 3266726 3352162 3227662 3065083 3529054 3438607 3592297 3572339
4440C572339L87735k55492Q2444O9444J45476n5646K6904J47192J60614J25820
$$ 3572339 3960074 3704582 3787026 3856470 4001946 3946300 3973204 4120396 4281010 4406830
4430D406830K63262j08853O8982J59376k1001M9019J7641P7931j18031L25598
$$ 4406830 4670092 4561239 4630221 4789597 4768596 4817615 4835256 4913187 4795156 5120754
4420E120754L03715j6238J10100l38573J29802M53865j6784k21958J15397J61219
$$ 5120754 5424469 5408231 5518331 5179758 5309560 5763425 5746641 5524683 5640080 5801299
4410E801299q5587k15664K02373Q6542M9260N7207K900j07565j50394N4909j42151
$$ 5801299 5715712 5500048 5702421 5788963 5838223 5895430 5898330 5790765 5640371 5695280 5553129
4399E553129K05959m2924j47836k00303n5281J70353J17851K5726J07818j47213
$$ 5553129 5759088 5716164 5568328 5368025 5312744 5483097 5600948 5626674 5734492 5587279
4389E587279q6937k91270l65725K389J04099m0271j4172J1857k04661J33255j41976
$$ 5587279 5500342 5209072 4843347 4845736 4949835 4909564 4895392 4907249 4702588 4835843 4693867
4378D693867k74761K43642P2841l01590j31528K21768l07205k5602m22620J26166
$$ 4693867 4419106 4662748 4735589 4433999 4302471 4524239 4217034 4191432 3768812 3894978
4368C894978J20598q5379j5281k22298K20386Q5024l81817l06419L65108k9323
$$ 3894978 4015576 3930197 3914916 3692618 3913004 3998028 3616211 3309792 3674900 3645577
4358C645577m8058R0583j92278K6736j67943J15152J82278P6931k47892O0674
$$ 3645577 3597519 3688102 3495824 3522560 3354617 3469769 3652047 3728978 3481086 3541760
4348C541760k7692O0498K7260N5818P793k50561k63374R4932K37910l11176j70435
$$ 3541760 3514068 3574566 3601826 3657644 3665437 3414876 3151502 3246434 3484344 3173168 3002733
4337C002733K91861K38049m26537K65988J9596J58094m6483j40919q0264j09780
$$ 3002733 3294594 3532643 3106106 3372094 3391690 3549784 3503301 3362382 3282118 3172338
4327C172338r7922k9486K591J80881J39320J81834J43136k35884k75703k43248
$$ 3172338 3074416 3044930 3047521 3228402 3367722 3549556 3692692 3456808 3181105 2937857
4317B937857R6130K03328K04937l51126J82055N5397j39691K3885M7520R5978
$$ 2937857 3033987 3237315 3442252 3091126 3273181 3328578 3188887 3212772 3260292 3356270
4307C356270J52998J69028O6131l26165N6786r133p0508j9640l196Q0603j30791
$$ 3356270 3509268 3678296 3744427 3418262 3475048 3465915 3395407 3375767 3372571 3453174 3322383
4296C322383J17243J78958l3091k38959L56845J09631l59368L8057J86300M8973
$$ 3322383 3439626 3618584 3585493 3346534 3703379 3813010 3453642 3491699 3677999 3726972
4286C726972r719j04772J94479L9185J8197P2701K13092k80292J01683m742J67958
$$ 3726972 3717253 3612481 3806960 3846145 3864342 3937043 4150135 3869843 3971526 3966784 4134742
4275D134742M1335Q8116O3339l51207J80939n1647J92710N09678k55558k48546
$$ 4134742 4176077 4264193 4327532 3976325 4157264 4105617 4298327 4808005 4552447 4303901
4265D303901k73085K44416J64222j5081K61096M6819k2790j23298J4123J65879
$$ 4303901 4030816 4275232 4439454 4424373 4685469 4732288 4709498 4586200 4600323 4766202
4255D766202m5053J45203J54584q2768K43377j10216M26874Q2305j72240j2229
$$ 4766202 4721149 4866352 5020936 4938168 5181545 5071329 5498203 5580508 5408268 5396039
4245E396039K13914m2047L24187m6368k034J19671N7283m5351j82216j13793J4366
$$ 5396039 5609953 5567906 5892093 5845725 5843691 5963362 6020645 5975294 5793078 5679285 5693651
4234E693651J01531J33461j0449J95698K95928l3220K95074K46758j59015N01784
$$ 5693651 5795182 5928643 5918194 6113892 6409820 6376600 6671674 6918432 6759417 7261201
4224G261201L37732Q0120L92496M60817K9200K80414N26154m24483k88945m8943
$$ 7261201 7598933 7679053 8071549 8532366 8561566 8841980 9368134 8943651 8654706 8605763
4214H605763j43405j33905O6102j69825l55806K88821J29484K857l9046k31032
$$ 8605763 8462358 8328453 8394555 8224730 7868924 8157745 8287229 8290086 8251040 8020008
4204H020008r9067k16400L43916L7853J78379O2071l13990K23088Q6841K41018
$$ 8020008 7920941 7704541 8048457 8086310 8264689 8326760 8012770 8235858 8322699 8563717
4194H563717k5139j09273M35721R0402J89526L25669j6377k23185J8123J84715
$$ 8563717 8538578 8429305 8865026 8955428 9144954 9470623 9454246 9231061 9249184 9433899
4184I433899K69568J64456J2213k12787l8024J25778J72160M85564L53914p7191
$$ 9433899 9703467 9867923 9880136 9667349 9629325 9755103 9927263 10412827 10766741 10689550
4174A0689550R3138K49292L26669Q0763m4132L55387L47003J97270L19322N15756
$$ 10689550 10782688 11031980 11358649 11439412 11395280 11750667 12097670 12294940 12614262 13130018
4164A3130018K50399J98719P45286L82380M75752M62488O93897P13687O58461
$$ 13130018 13380417 13579136 14324422 14706802 15182554 15645042 16338939 17052626 17711087
4155A7711087O38208P24767P89745Q21438L58977k02018o9738j92080m12027q7007
$$ 17711087 18349295 19074062 19863807 20685245 21044222 20842204 20772466 20580386 20168359 20081352
4145B0081352m08461k84527l0393k72151L6540J04153l78541m4931J34049L60568
$$ 20081352 19672891 19388364 19357971 19085820 19122360 19226513 18847972 18803041 18937090 19297658
4135A9297658P0258P9312K51519J82870J25358P509J29282M70556L50734K80314
$$ 19297658 19367916 19447228 19698747 19881617 20006975 20014484 20143766 20614322 20965056 21245370
4125B1245370M92745K73140M10081J73677K74572K58684P30890J14784N49836
$$ 21245370 21738115 22011255 22421336 22595013 22869585 23128269 23859159 23973943 24523779
4116B4523779N06265Q2123N99950K12686M65946O47846M51081L31645O19635J124779
$$ 24523779 25030044 25112167 25712117 25924803 26390749 27038595 27489676 27821321 28440956 29565735
4106B9565735P51046O08413O26204O83407O59866Q03498Q08923O01296N49766
$$ 29565735 30316781 30925194 31551398 32234805 32894671 33698169 34507092 35108388 35658154
4097C5658154O00352P59164O97618K91569N22816P31872J074681O58867M59952
$$ 35658154 36258506 37017670 37715288 38006857 38529673 39261545 40336226 40995093 41455045
4088D1455045J279939N41910O02631J040068Q82105J027056R39146P92173J014226
$$ 41455045 42734984 43276894 43879525 44919593 45801698 46828754 47767900 48560073 49574299
4079D9574299J219002J146920Q47821R05060Q59213Q56328P96266J242268J181800
$$ 49574299 50793301 51940221 52788042 53693102 54552315 55408643 56204909 57447177 58628977
4070E8628977M89146Q60793N25544P11075N74725N61994Q64660L82013j11709
$$ 58628977 59118123 59978916 60504460 61215535 61790260 62352254 63216914 63598927 63487218
4061F3487218L07850N46584O6475o3745N80979p7827r6990j02097l64900m17395
$$ 63487218 63795068 64341652 64408127 64344382 64925361 64847534 64750544 64648447 64283547 63866152
4051F3866152p03383k25092j79449m09357n33662p34861r92866p39585q80856
$$ 63866152 63162769 62937677 62758228 62348871 61815209 61080348 60087482 59347897 58467041
4042E8467041m83869o53574j067425n47372j513103p78747o26773j000778j008811
$$ 58467041 57983172 57329598 56262173 55714801 54201698 53422951 52796178 51795400 50786589
4033E0786589j013069q78052r53566p72501j258658p59651p70524j006549p58218
$$ 50786589 49773520 48895468 47941902 47169401 45910743 45151092 44380568 43374019 42615801
4024D2615801p75228r60481q59750n38087q39736n35498q95857p06671k04293
$$ 42615801 41840573 40880092 40020342 39482255 38642519 38107021 37211164 36504493 36300200
4015C6300200o56745n68358q19498r27117k96172m64307p88220p07293p77244
$$ 36300200 35643455 35075097 34255599 33328482 33032310 32568003 31779783 31072490 30295246
4006C0295246m38401m73578n19697m89130m64954n46438l72159m21992m00417
$$ 30295246 29856845 29383267 28863570 28374440 27909486 27363048 26990889 26568897 26168480
3997B6168480n27365k95131j36167k76692j63195l12087Q1527o26138l75174n15506
$$ 26168480 25641115 25345984 25209817 24933125 24769930 24457843 24539370 23913232 23538058 23022552
3987B3022552l17283k51048q6566J5282n11887m63971l0175k75031j10613j55779
$$ 23022552 22705269 22454221 22367655 22382937 21871050 21407079 21376904 21101873 20991260 20835481
3977B0835481m50717j42002J34620J08683l43586l46032m52729K30964q5998k82357
$$ 20835481 20384764 20242762 20377382 20486065 20142479 19796447 19343718 19574682 19488684 19206327
3967A9206327l86096O957l72420j58093L4564k12340j86275n44094p04003O5641
$$ 19206327 18820231 18827188 18454768 18296675 18331239 18118899 17932624 17388530 16684527 16750168
3957A6750168k24443k46634l79597K05978k4216k76754j65225k99931j77932l7902
$$ 16750168 16525725 16279091 15899494 16105472 16081256 15804502 15639277 15339346 15161414 15123512
3947A5123512j78028P8437p7196k21938O3127K7082R8122O4217k42530n1698k05376
$$ 15123512 14945484 15023921 14946725 14724787 14787914 14814996 14913118 14977335 14734805 14683107 14477731
3936A4477731K81474j82194J22106K4003j08217L10451O0231L50344J09072R9518
$$ 14477731 14759205 14577011 14699117 14723120 14614903 14925354 14985585 15335929 15445001 15544519
3926A5544519K08249k06522L38226K94950N70065M6281K04262K20032J97429J81511
$$ 15544519 15752768 15546246 15884472 16179422 16749487 16795768 17000030 17220062 17417491 17599002
3916A7599002M45541J94993L9439J45820j67649m90401j08836l07433j03525J55718
$$ 17599002 18044543 18239536 18278975 18424795 18257146 17766745 17657909 17350476 17246951 17402669
3906A7402669j77646m2011J03371M43654N159m5094M5438J25129p38970j55943
$$ 17402669 17225023 17183012 17286383 17730037 17735196 17690102 17735540 17860669 17121699 16965756
3896A6965756j95760P3684l11260J53195N22897J64788k4927L01729N9950K94839
$$ 16965756 16769996 16843680 16532420 16685615 17208512 17373300 17348373 17650102 17710052 18004891
3886A8004891l21455L24522N60523M88290P5807M82348M55395L52518N95281L14397
$$ 18004891 17683436 18007958 18568481 19056771 19132578 19614926 20070321 20422839 21018120 21332517
3876B1332517K22307Q8242N82618N48822J19615M31847O10579N39167N79563Q09569
$$ 21332517 21554824 21643066 22225684 22774506 22894121 23325968 23936547 24475714 25055277 25864846
3866B5864846O44959J148079J037289J590550J642236K239006J654467K146147
$$ 25864846 26509805 27657884 28695173 30285723 31927959 34166965 35821432 37967579
3858C7967579K440359K979703L276275M577299N238321O104765O708727P455395
$$ 37967579 40407938 43387641 46663916 51241215 56479536 62584301 69293028 76748423
3850G6748423Q239089J0249556J1944658J5011624J6945044K1612260K5169566
$$ 76748423 84987512 95237068 107181726 122193350 139138394 160750654 185920220
3843A85920220K8580956L4377920L7566765L274013l2401070l9742944m5943451
$$ 185920220 214501176 248879096 286445861 289719874 257318804 217575860 171632409
3836A71632409l3757738k4122154j5759350j1226559q402292o734115n645549
$$ 171632409 137874671 113752517 97993167 86766608 78364316 71630201 65984652
3829F5984652n148435l947080l418569k935844k903335k599826k444672j845493
$$ 65984652 60836217 56889137 53470568 50534724 47631389 45031563 42586891 40741398
3821D0741398j732693j235989j444966j247387q43632r14600r14007j236598p64573
$$ 40741398 39008705 37772716 36327750 35080363 34236731 33322131 32408124 31171526 30406953
3812C0406953p31312o12486o88332k26708j47093j29058J19990k16722J45558
$$ 30406953 29675641 29063155 28374823 28148115 28001022 27871964 27991954 27775232 27920790
3803B7920790k27949k30088m6186K91249j38442l27705J60768P3265K29070J22879
$$ 27920790 27692841 27462753 27416567 27707816 27569374 27241669 27402437 27475702 27704772 27827651
3793B7827651L71049N01299Q13887K19590J73233P12237Q54220O59810Q71631
$$ 27827651 28198700 28699999 29513886 29733476 29906709 30618946 31473166 32132976 33004607
3784C3004607Q03077O90856J097596P25602K78807O95992P63318P17838R51471
$$ 33004607 33807684 34498540 35596136 36321738 36600545 37296537 38059855 38777693 39729164
3775C9729164R97813N10268Q09712N65096M41596L63531P90515L33815K82783
$$ 39729164 40726977 41237245 42046957 42612053 43053649 43417180 44207695 44541510 44824293
3766D4824293L72596J13260L59189P1489M3303J28854n65832o7651m23668q3683
$$ 44824293 45196889 45310149 45669338 45740827 45784130 45912984 45347152 45279501 44855833 44772150
3756D4772150n02160p76294l33756n52931o27627q32166q86217p22540p93332
$$ 44772150 44269990 43493696 43159940 42607009 41979382 41147216 40260999 39538459 38745127
3747C8745127q90078j052188j007651o79814q61176r96267j064722q65589r63781
$$ 38745127 37855049 36802861 35795210 35115396 34254220 33257953 32193231 31327642 30363861
3738C0363861q51375n08370r55117j324126p54235m06620q38656r36526n71073
$$ 30363861 29512486 29004116 28048999 26724873 25970638 25564018 24725362 23788836 23217763
3729B3217763l91045o84914p31482n14751m38485l22855o55473m98463m01196
$$ 23217763 22826718 22141804 21410322 20895571 20457086 20134231 19478758 18980295 18579099
3720A8579099m32192m40962m17590k72217l17882l97388m28007k67666o6301l78711
$$ 18579099 18146907 17705945 17288355 17016138 16698256 16300868 15872861 15605195 15538894 15160183
3710A5160183j31502m52131o2695l26287N9548P2893l71793l47188j13333O1707
$$ 15160183 15028681 14576550 14513855 14187568 14247116 14320009 13948216 13601028 13487695 13549402
3700A3549402Q2172m50870l34943K14944j7760o0123N6099J69575l47335k19303
$$ 13549402 13631574 13180704 12845761 13060705 13042945 12982822 13038921 13208496 12861161 12641858
3690A2641858J00639J96802j20330k21275K1926k18814j2954J61946j91222r5482
$$ 12641858 12742497 12939299 12818969 12597694 12619620 12400806 12387852 12549798 12358576 12263094
3680A2263094M32225K76986r4619j12908q1208J4835L61285M46149K08178j13793
$$ 12263094 12695319 12972305 12877686 12764778 12683570 12698405 13059690 13505839 13714017 13600224
3670A3600224j50480j15052m65528o2909j68392q35141m01011m364k01738N0248
$$ 13600224 13449744 13334692 12869164 12806255 12637863 11802722 11401711 11397347 11195609 11245857
3660A1245857J20575j14201K45531p5545j94046J37890k44494Q7465J56517m2297
$$ 11245857 11366432 11252231 11497762 11422217 11228171 11366061 11121567 11209032 11365549 11323252
3650A1323252l97119r4066r0719j54288l68992j32553p0084J77106q2651k37113
$$ 11323252 10926133 10832067 10741348 10587060 10218068 10085515 10015431 10192537 10109886 9872773
3640I872773m81818k40495J90159p1514j65980m54457q9499j30462k53313l8600
$$ 9872773 9390955 9150460 9340619 9269105 9103125 8648668 8559169 8428707 8175394 8136794
3630H136794l8027J06428J9548p1265l12606j02827k2354k2251o0738k16451J27143
$$ 8136794 8098767 8205195 8224743 8153478 7840872 7738045 7715691 7693440 7632702 7416251 7543394
3619G543394J55349j71482K1332J84515O9555p6412Q6589K71052K29315k44520
$$ 7543394 7698743 7527261 7548593 7733108 7802663 7726251 7812840 8083892 8313207 8068687
3609H068687L03895K3237j37348J27991r0366K51673j7132J26774K39563J12601
$$ 8068687 8372582 8395819 8258471 8386462 8296096 8547769 8530637 8657411 8896974 9009575
3599I009575p6342j98057L7039J62808L62242K71890k84264K9407O7025J92712
$$ 9009575 8933233 8735176 8772215 8935023 9297265 9569155 9284891 9314298 9381323 9574035
3589I574035K12902k27985N9553K56059j40263O9949Q8494K46557J31807N2705
$$ 9574035 9786937 9558952 9618505 9874564 9734301 9804250 9892744 10139301 10271108 10323813
3579A0323813L4683l20733j93737j23409m8973k13053p6773k38376Q7121K69644
$$ 10323813 10358496 10037763 9844026 9720617 9671644 9458591 9381818 9143442 9230563 9500207
3569I500207k52114l9397M52187j41307j43537o931J25234l3521K4091J49088
$$ 9500207 9248093 9208696 9660883 9519576 9376039 9369108 9494342 9460821 9484912 9634000
3559I634000q6214L5533J62641L82752J8301j77636J50721K69525N1635j49510
$$ 9634000 9547786 9583319 9745960 10128712 10147013 9969377 10120098 10389623 10441258 10291748
3549A0291748k81761O3868K42903L29849j7467R9690k6422K13441L63389J61221
$$ 10291748 10009987 10073855 10316758 10646607 10629140 10728830 10702408 10915849 11279238 11440459
3539A1440459q4473K41619J52877N34934K6876J96349K40565K2786J28000K88184
$$ 11440459 11355986 11597605 11750482 12285416 12312292 12508641 12749206 12771992 12899992 13188176
3529A3188176k10205J63402M68492J43943J59955J60788J06645M9068K94612J04459
$$ 13188176 12977971 13141373 13609865 13753808 13913763 14074551 14181196 14230264 14524876 14629335
3519A4629335N2103J8462M92389K55469K23270L17985j07202J86830M45171L06357
$$ 14629335 14681438 14699900 15192289 15447758 15671028 15989013 15881811 16068641 16513812 16820169
3509A6820169J71254K99814K73664L34861O8173N04260N79495O90500N08652L93580
$$ 16820169 16991423 17291237 17564901 17899762 17967935 18472195 19051690 19742190 20250842 20644422
3499B0644422O70477P18932L84125Q97887J212988Q57877J091792J128010K001636
$$ 20644422 21314899 22033831 22417956 23315843 24528831 25386708 26478500 27606510 29608146
3490B9608146J075115J586681K282339J953113K686418K582507K895924L942726
$$ 29608146 30683261 32269942 34552281 36505394 39191812 41774319 44670243 48612969
3482D8612969L688009M022161M474524N073655N480054N685567O312946N989536
$$ 48612969 52300978 56323139 60797663 65871318 71351372 77036939 83349885 89339421
3474H9339421M779809M457303L675510K341003J899119P85706R4653j47936M58247
$$ 89339421 94119230 98576533 102252043 104593046 106492165 107277871 107372524 107224588 107682835
3465A07682835P6471l51020K14794k54212r09395j739229k310099l580849l805068
$$ 107682835 107759306 107408286 107623080 107368868 106459473 104720244 102410145 98829296 95024228
3456I5024228m666582n144152m869369n121250m522306l571375l399695l270867
$$ 95024228 90357646 85213494 80344125 75222875 70700569 67129194 63729499 60458632
3448F0458632k952317k159745j714020j812043j415057j095996j247042j010291
$$ 60458632 57506315 55346570 53632550 51820507 50405450 49309454 48062412 47052121
3440D7052121q17548m35687l58696m03795n3981J84938J91257M16115N07982O01454
$$ 47052121 46234573 45798886 45440190 45036395 44982414 45167352 45358609 45774724 46282706 46884160
3430D6884160N97380R25048J100968J287954J147594J553346J730695J798107
$$ 46884160 47481540 48406588 49507556 50795510 51943104 53496450 55227145 57025252
3422E7025252K146746J954902K114142J927796K312127K290838K171461K121957
$$ 57025252 59171998 61126900 63241042 65168838 67480965 69771803 71943264 74065221
3414G4065221K246222J994245K178074K117424J901050J884761J741052J387481
$$ 74065221 76311443 78305688 80483762 82601186 84502236 86386997 88128049 89515530
3406H9515530R48667J129293N49408K0527J06029q9029m09652m94608m20800n33842
$$ 89515530 90464197 91593490 92142898 92163425 92269454 92180425 91770773 91276165 90855365 90321523
3396I0321523p92540j053742j612038j916075j695033k226125k592414k324432
$$ 90321523 89528983 88475241 86863203 84947128 83252095 81025970 78433556 76109124
3388G6109124k909402k790941k243491k674609k399510k119923k109213k258158
$$ 76109124 73199722 70408781 68165290 65490681 63091171 60971248 58862035 56603877
3380E6603877k420526j748184j961441k344337k227999k133459k287026j552278
$$ 56603877 54183351 52435167 50473726 48129389 45901390 43767931 41480905 39928627
3372C9928627j781420j581142j238618j355807j062577j273560o42323j129038
$$ 39928627 38147207 36566065 35327447 33971640 32909063 31635503 30993180 29864142
3364B9864142p44738m89904q03712o32471l76696m38515p18193n43023m32894
$$ 29864142 29119404 28629500 27825788 27193317 26816621 26378106 25659913 25116890 24683996
3355B4683996m10303m13022j67237n34507n46332k29658j01555l51363k76695
$$ 24683996 24273693 23860671 23693434 23158927 22612595 22382937 22281382 21930019 21653324
3346B1653324j45049l78452n6846l47130j57912j59426n90649n55720m1757m73928
$$ 21653324 21508275 21129823 21072977 20725847 20567935 20408509 19817860 19262140 19220383 18746455
3336A8746455k47885k10842k71561m45512j32175o0041k98292j20557j06979r4650
$$ 18746455 18498570 18287728 18016167 17570655 17438480 17378439 17080147 16959590 16852611 16757961
3326A6757961k78390l50016m60109n38187m62528k1933k27841k39800m77747M8809
$$ 16757961 16479571 16129555 15669446 15131259 14668731 14646798 14418957 14179157 13701410 13750219
3316A3750219n00437l36011j94189l95947k10035l12079k91736k76459l30701
$$ 13750219 13249782 12913771 12719582 12323635 12113600 11801521 11509785 11233326 10902625
3307A0902625k50639l49374m27619J56055k75473J056l82004m14648l27947K03216
$$ 10902625 10651986 10302612 9874993 10031048 9755575 9756631 9374627 8959979 8632032 8835248
3297H835248q2746k98318j23149j08826j32988l54096j22833Q0161o3917l5747
$$ 8835248 8752502 8454184 8331035 8222209 8089221 7735125 7612292 7692453 7628536 7592789
3287G592789l60961k01640J23296K07547P9255j70256l38383j18254j18860J7428
$$ 7592789 7231828 7030188 7153484 7361031 7440286 7270030 6931647 6813393 6694533 6711961
3277F711961k13706J9123Q5419r0020J28307k05684j19389M9055q2789m51868
$$ 6711961 6498255 6517378 6602797 6512777 6641084 6435400 6316011 6365066 6282277 5830409
3267E830409j69501J16067J94057j23528J18470l67490P5124L7639J77262l69843
$$ 5830409 5660908 5776975 5971032 5847504 5965974 5598484 5673608 5711247 5888509 5518666
3257E518666L03470m1886j43894r627l74082j03595j99887j61897K88081O8766
$$ 5518666 5822136 5780250 5636356 5626729 5252647 5149052 4949165 4787268 5075349 5144115
3247E144115L8347K62050k19503k5313j48743N5086L43297j96964l68577K45420
$$ 5144115 5182462 5444512 5225009 5199696 5050953 5106039 5449336 5252372 4883795 5129215
3237E129215j44255j49331K05363K41461j84714r8525k55962M5265J22642k23205
$$ 5129215 4984960 4835629 5040992 5282453 5097739 4999214 4743252 4788517 4911159 4687954
3227D687954j36721J32296l334K55055j4571O3048L80943r7027l45581l02936
$$ 4687954 4551233 4683529 4680195 4935250 4920679 4983727 5364670 5267643 4922062 4619126
3217D619126M82794k19038j23856K30490j25107j46182n8018J19880j28819m1425
$$ 4619126 5101920 4882882 4759026 4989516 4864409 4718227 4660209 4780089 4651270 4609845
3207D609845j232K74965J74044J01841J98975J73869j50320j75741j26141l4394
$$ 4609845 4608613 4883578 5057622 5159463 5358438 5532307 5381987 5206246 5080105 5045711
3197E045711n3748k0019p2575J40352M9160O9547j2221n7466j72623P8918k3399
$$ 5045711 4991963 4971944 4899369 5039721 5088881 5158428 5146207 5088741 4916118 4995036 4971637
3186D971637n4337j50392L52219J25374l79873N9088m83179J67942K01651N44197
$$ 4971637 4917300 4766908 5119127 5244501 4864628 4923716 4440537 4608479 4810130 5354327
3176E354327M31840k37964k23137J44120k78419k492K97680M46950l75045j41870
$$ 5354327 5786167 5548203 5325066 5469186 5190767 5188275 5485955 5932905 5557860 5415990
3166E415990K01099o1056J05914J63961J68638j09231O587K86627J89861K24401
$$ 5415990 5617089 5556033 5661947 5825908 5994546 5885315 5891902 6178529 6368390 6592791
3156F592791j29924q9395j83392o1980M08243K11868k18354N9847K09598J1768
$$ 6592791 6462867 6373472 6190080 6128100 6536343 6748211 6529857 6589704 6799302 6811070
3146F811070J31747j33141k5449K66854k7628K10873J45610O9012N5851J8473
$$ 6811070 6942817 6809676 6784227 7051081 7023453 7234326 7379936 7448948 7504799 7523272
3136G523272r6264R5969L75342j861J29520j18663P07964J28447j68167o6448
$$ 7523272 7427008 7522977 7898319 7896458 8025978 7907315 8615279 8743726 8575559 8509111
3126H509111J85130k61999R0631L98155l1836K23247N5292K99001K53231J70501
$$ 8509111 8694241 8432242 8522873 8921028 8889192 9112439 9167731 9466732 9719963 9890464
3116I890464J64562J39597L18826L23392p8522K65112L50502J93560M86722L93088
$$ 9890464 10055026 10194623 10513449 10836841 10758319 11023431 11373933 11567493 12054215 12447303
3106A2447303L57432L07676P02569O04133L89297P67552Q14458J114582R97629
$$ 12447303 12804735 13112411 13814980 14419113 14808410 15575962 16390420 17505002 18502631
3097A8502631J159900J247009J009710J721036J498521J528240J892333K094272
$$ 18502631 19662531 20909540 21919250 23640286 25138807 26667047 28559380 30653652
3089C0653652K279394J770511J129877k33043j072310j563109j867334j866595
$$ 30653652 32933046 34703557 35833434 35600391 34528081 32964972 31097638 29231043
3081B9231043j993143j936373k014163j693004j343992j021100j242460j025649
$$ 29231043 27237900 25301527 23287364 21594360 20250368 19229268 17986808 16961159
3073A6961159r70258q22043o01911q05325o88907n12224n29270m09224l77305
$$ 16961159 15990901 15168858 14566947 13761622 13072715 12560491 12031221 11621997 11244692
3064A1244692m02060l18617m22088l73391k76370j98020l56624Q041o40551j16763
$$ 11244692 10842632 10524015 10101927 9728536 9452166 9254146 8897522 8905563 8265012 8148249
3054H148249o6973p7926Q5345o15070J32296k18107k78426o2765m65631l31611
$$ 8148249 8081276 8003350 8088695 7473625 7605921 7387814 7109388 7046623 6580992 6249381
3044F249381j06195j41976J34244L4080j89688l66661L9854l7278k99624J57944
$$ 6249381 6143186 6001210 6135454 6169534 5979846 5613185 5653039 5615761 5316137 5474081
3034E474081N2226m7585m28969l30979K92276m09111l02702K90370j5932k13994
$$ 5474081 5526307 5478722 5049753 4718774 5011050 4601939 4299237 4589607 4573675 4359681
3024D359681L5539k51441K45104K42510l37743j12845j41413k27805M1874J39212
$$ 4359681 4395220 4143779 4388883 4631393 4293650 4180805 4039392 3811587 3853461 3992673
3014C992673k22671j44720L24419k43050m1380O1621k13484o3759J02942J17742
$$ 3992673 3770002 3625282 3949701 3706651 3665271 3726892 3513408 3449649 3552591 3670333
3004C670333j87253j76299j93469K44228J98105l27805j98083K43812J66j1834
$$ 3670333 3483080 3306781 3113312 3357540 3555645 3227840 3029757 3273569 3273735 3261901
2994C261901k45596j1771k79848J4016P2646P0557j67979j41113Q4257O2763K01846
$$ 3261901 3016305 3004534 2724686 2738702 2811348 2881905 2713926 2572813 2657070 2719833 2921679
2983B921679P7932k71473l79168J79802J30133j65439r8801J00483K18984J16821
$$ 2921679 2999611 2728138 2348970 2528772 2658905 2493466 2394665 2495148 2714132 2830953
2973B830953j5892J39644j14108m02236J2237J37936l4135J88760j69324k10703
$$ 2830953 2815061 2954705 2840597 2438361 2450598 2588534 2554399 2743159 2573835 2363132
2963B363132L74089j83574j78360K08296n5163k55877j0026n7436j23496P9571
$$ 2363132 2737221 2553647 2375287 2583583 2528420 2272543 2262517 2205081 2081585 2161156
2953B161156J91583j63550k52406M33508M2739l16964k50092n5141N1046k31671
$$ 2161156 2352739 2189189 1936783 2370291 2413030 2096066 1845974 1790833 1841879 1610208
2943A610208K47123J2412k61010J35748K34986P1785K11661o2738k73790o2390
$$ 1610208 1857331 1869743 1608733 1744481 1979467 2051252 2262913 2200175 1926385 1863995
2933A863995l37251L26647n090j10797J38517l4731n6420j0339J32451l49974
$$ 1863995 1526744 1853391 1848301 1737504 1876021 1841290 1784870 1774531 1906982 1557008
2923A557008l0033J54491L52517n7662l69829R3105L27534k88300j17642k44490
$$ 1557008 1526975 1681466 2033983 1976321 1606492 1699597 2027131 1738831 1621189 1376699
2913A376699J82613J11666K9211J30761L04r5674l847J6309k87606K14742K7480
$$ 1376699 1559312 1670978 1700189 1830950 1831254 1735580 1731733 1748042 1460436 1675178 1702658
2902A702658J61382O353p7275k04415J0949L0381l88293q718L15653L0763N193
$$ 1702658 1864040 1870393 1793118 1588703 1599652 1630033 1241740 1233022 1548675 1579438 1584631
2891A584631R0259j37520j86565K03993J47027O4283j28402j70449J00862l55661
$$ 1584631 1674890 1537370 1350805 1554798 1701825 1766108 1637706 1467257 1568119 1212458
2881A212458k1926L50775P3025M72713j10270m67763K60319J54743k71746p2967
$$ 1212458 1190532 1541307 1614332 2087045 1976775 1509012 1769331 1924074 1652328 1579361
2871A579361J71981L81826l0077m19405J15496j82524p1282L04290n7480m16875
$$ 1579361 1751342 2133168 2103091 1683686 1799182 1616658 1545376 1849666 1792186 1375311
2861A375311j26886K61297J30883L23814j45380N8351k65708K72354Q066l06878
$$ 1375311 1248425 1509722 1640605 1964419 1819039 1877390 1611682 1884036 1892102 1585224
2851A585224J36987L1235k030K88417R8318m0721K44161K29329j25206J13877
$$ 1585224 1722211 1753446 1751416 2039833 2138151 2097430 2341591 2570920 2445714 2559591
2841B559591l69492o1375K23541j50095Q1235p7780K56801J37846k79363o118
$$ 2559591 2190099 2128724 2352265 2202170 2283405 2205625 2462426 2600272 2320909 2314791
2831B314791J37049p8832J79965N5847l70233R3616k4386J440j56k02362K34956
$$ 2314791 2451840 2373008 2552973 2608820 2238587 2332203 2307817 2309257 2309101 2106739 2341695
2820B341695j6270R6060L71556K87879K8000j14789J64847k15403L7054K27379
$$ 2341695 2325425 2421485 2793041 3080920 3108920 2994131 3158978 2943575 2980629 3208008
2810C208008M6358K66126K57499k18516j19548K13106O8259j7358K26154J16060
$$ 3208008 3254366 3520492 3777991 3559475 3439927 3653033 3721292 3703934 3930088 4046148
2800D046148j32872m7033j0560m9115L03736L89476k00776j39336K04920m6861
$$ 4046148 3913276 3866243 3855683 3806568 4110304 4499780 4299004 4159668 4364588 4317727
2790D317727k6989K87367L36334J38255o9435Q25P254J17686r7512L57703j1385
$$ 4317727 4290738 4578105 4914439 5052694 4983259 4984084 4991338 5109024 5011512 5369215 5357830
2779E357830j4927N1273Q4020m62496k00536n4108l40587J0033j91392k61598
$$ 5357830 5342903 5394176 5478196 5015700 4815164 4761056 4420469 4430502 4239110 3977512
2769C977512J48502k11503j52610J03190M86682J854j15516J6911l3704O7104
$$ 3977512 4126014 3914511 3761901 3865091 4351773 4353627 4238111 4255022 4221318 4288422
2759D288422K56628M9620J4966l25593j54314K42784P2789l4430J43865l192m12067
$$ 4288422 4545050 4594670 4609636 4284043 4129729 4372513 4445302 4410872 4554737 4551545 4139478
2748D139478j96563j13788l31459N9875J24876p9846o2329j30821l54482k83437
$$ 4139478 3942915 3829127 3497668 3557543 3682419 3602573 3540244 3409423 3054941 2771504
2738B771504k3215P9733o939j30894L897L50401O706k7753k91472k83541J01231
$$ 2771504 2748289 2828022 2821083 2690189 2694086 3044487 3051193 3023440 2731968 2448427 2549658
2727B549658k27638n685Q3917k64910k12628L0461j16114q1811M0294k2568j78368
$$ 2549658 2322020 2316335 2400252 2135342 1922714 1953175 1837061 1755250 1795544 1772976 1594608
2716A594608p5733j9123J45280m35503M77195J1041l15796J43161k62770L30428
$$ 1594608 1518875 1499752 1645032 1209529 1686724 1697765 1381969 1525130 1262360 1592788
2706A592788n9069m48017J9116J0512m4167O152q8144k17544L6805L83226l639
$$ 1592788 1533719 1085702 1104818 1115330 1071163 1077315 989171 771627 808432 1191658 1188019
2695A188019m12744J59955J08702K86587J81095k26797l67035J20645p6075j49652
$$ 1188019 775275 935230 1043932 1330519 1511614 1284817 917782 1038427 962352 812700
2685H12700J4215Q0208k2765J74719j90924j37216L8763j70267k23021L06059
$$ 812700 826915 907123 884358 1059077 868153 730937 769700 599433 376412 682471
2675F82471J84093N98252j02871k65687l78807j81005L83727K2726J50961o0057
$$ 682471 866564 1464816 1361945 1096258 717451 536446 920173 942899 1093860 1033803
2665A033803m08387P1852M27950m27860j7655J08068p9482n8700j4669P2089q96
$$ 1033803 625416 697268 1125218 697358 679703 787771 708289 649589 634920 707009 706113
2654G06113N4359j43410k7073J31177j63147J77596l7027k4668J03222k1533j37521
$$ 706113 760472 617062 589989 721166 558019 735615 698588 673920 777142 755609 618088
2643F18088j91167L4328J87139J70125j75203k25352K09355o9052j8586k56050
$$ 618088 426921 461249 648388 818513 643310 417958 627313 558261 539675 283625
2633B83625k42347M8261L51419r5247J34384R8336p2041l81262K82260n6132r7515
$$ 283625 41278 89539 440958 345711 480095 578431 506390 125128 407388 351256 253741
2622B53741J27182J30806n592O4204J17396j121k98350k85367K14690r7250P358
$$ 253741 380923 511729 506137 570341 687737 686616 388266 102899 317589 220339 227697
2611B27697M4645J95313N6867P7882m2165k82833j6760j08452K65955l6212l2579
$$ 227697 272342 467655 524522 602404 560239 277406 260646 152194 418149 381937 349358
2600C49358J63564N8298K05465k16340k13012j68655J48611m05127M8733K95975
$$ 349358 512922 571220 776685 560345 347333 178678 327289 -77838 -29105 266870
2590B66870j31901J13004P1630k87770o5046K61220m0820K07091K36453l09619
$$ 266870 134969 247973 319603 31833 -33213 228007 187187 394278 630731 321112
2580C21112J81521J05688l70700J20894j48709J20202J90498J1252j3821j79194
$$ 321112 502633 608321 237621 358515 209806 330008 520506 531758 517937 338743
2570C38743L05473k25952j57739N5344K56439k3500j58160o3431j37817j72220
$$ 338743 644216 418264 260525 315869 572308 548808 390648 327217 189400 17180
2560A7180L89144n6092j57897r8691M6572Q44k8421j39459J48606J76873N952
$$ 17180 406324 350232 192335 93644 140216 141060 112639 -26820 121786 298659 304611
2549C04611l9526j04142P4324J08532P6922j58078N9162R8645k05682Q8175J709
$$ 304611 265085 160943 235267 343799 420721 262643 321805 420450 214768 302943 304652
2538C04652j27810Q0669K7314j09083q6947J19118M1027p385n8504n9829K56145
$$ 304652 176842 257511 284825 175742 88795 207913 248940 241555 183051 123222 379367
2527C79367K273l86941K91004K60522M8577l39793L24314J4984l01466M935k21714
$$ 379367 381640 -5301 285703 546225 594802 255009 579323 594307 292841 297776 76062
2516G6062O430j2146k66132L56823K62257j84992p1689J27782o9837o6030J54789
$$ 76062 82492 70346 -195786 161037 423294 238302 166613 294395 224558 158528 313317
2505C13317j1372j35959k11295J97361J32641k44841J94992L4655r9709j06216
$$ 313317 301945 165986 -45309 152052 284693 39852 234844 269499 169790 63574
2495F3574j63763J04201J10448r2748J24289J95019j33404p359L4158K2017j66606
$$ 63574 -100189 4012 114460 21712 146001 341020 207616 200257 234415 256432 89826
2484H9826L32802J79104j34053q2377J18373j84267k28858M9626J22874J7000
$$ 89826 422628 601732 467679 385302 503675 319408 90550 140176 263050 280050
2474B80050l0755j47721j8892J64271k74402J54981j5687J52417p4385j28342
$$ 280050 249295 101574 82682 246953 -27449 127532 111845 264262 189877 61535
2464F1535q7664J8838N0481K73768n8316l570N00o5373Q3490j21497j32672P5203
$$ 61535 -26129 -7291 43190 316958 258642 255072 255572 190199 273689 152192 19520 94723
2452I4723j8116K88203m9387n7411n4991n1588j36438K7209J37322K6891P8861
$$ 94723 76607 364810 315423 258012 203021 151433 14995 42204 179526 206417 285278
2441B85278k38905N4535N3192k48044o6088O3911p7252J96325K92349j16234l04315
$$ 285278 46373 100908 154100 -93944 -160032 -96121 -173373 22952 315301 199067 -105248
2430a05248l4300j5761O5015L37593k08795j75097M27116J91679J38679j95225
$$ -105248 -139548 -155309 -90294 247299 38504 -136593 290523 482202 620881 425656
2420D25656j28493Q7959k95181k05528Q8947n72300L42590K15235l26114M6493
$$ 425656 297163 385122 89941 -115587 -26640 -598940 -256350 -41115 -367229 -320736
2410c20736L86638j41723j37271j38325q885J96587O6407j11950J77483k32253
$$ -320736 65902 -75821 -213092 -351417 -360302 -163715 -97308 -209258 -31775 -264028
2400b64028J34256M8322k21041R1851J80486k47961L7537L06059j49128J603j13613
$$ -264028 -129772 -81450 -302491 -210640 -30154 -278115 -240578 65481 -83647 -82044 -195657
2389a95657J77661k3930k35850K00900K26940R448q6349k27745O242M6551p1487
$$ -195657 -17996 -41926 -277776 -76876 150064 159512 73163 -154582 -148340 -101789 -173276
2378a73276K641K21192J74976o2308k51044P7085J74172L82189l24617k26729
$$ -173276 -170635 50557 225533 163225 -87819 -10734 163438 545627 221010 -5719
2368e719J68649l6366j47253J91784l2507K14347M5178j21379Q4479k46780j63087
$$ -5719 162930 126564 -20689 171095 138588 352935 398113 276734 361213 114433 -48654
2357d8654n626j40239l76775J21715L5037l6585K30281J83213J90197L06854l14231
$$ -48654 -54280 -194519 -571294 -449579 -414542 -451127 -220846 -37633 152564 459418 145187
2346A45187k98718M33283N1013J12563O0598m98536j66591j11628L01738R3824
$$ 145187 -153531 279752 330765 443328 503926 5390 -161201 -272829 28909 122733
2336A22733J77367j50778j10685j53952l75280J87170K11281Q1708M5883l23168
$$ 122733 300100 149322 38637 -115315 -490595 -303425 -92144 -10436 35447 -287721
2326b87721l1063P9558J53702J69861m5486j69481R5587J53965J01366o1067J04205
$$ -287721 -318784 -239226 -85524 84337 38851 -130630 -35043 118922 220288 159221 263426
2315B63426r6471o8842j49809N3144R9813Q5118N4174J76915K11410j21776j61059
$$ 263426 166955 98113 -51696 1448 101261 186379 240553 417468 628878 507102 346043
2304C46043n8746j36560j20496K50654J28753N9517j90575k2938l7507p2576L49876
$$ 346043 287297 150737 30241 280895 409648 469165 278590 255652 218145 145569 495445
2293D95445Q7629l77446J80144l95435J16090j40857K95299j08061j61634j54162
$$ 495445 583074 205628 385772 -9663 106427 -34430 260869 152808 -8826 -162988
2283a62988J40126L47932j08672m5172M4776k7593j63270j28853L14963j49381
$$ -162988 -22862 325070 216398 171226 216002 188409 25139 -103714 211249 61868
2273F1868K1865O5849k23685l62943j3171J88092p8332m6529M27487J57565k21053
$$ 61868 83733 149582 -74103 -437046 -450217 -262125 -340457 -386986 40501 198066 -22987
2262b2987P9172J14492l23498J4261K96749j33024r5391L8646j22947J38140L74160
$$ -22987 56185 170677 -152821 -138560 158189 25165 -70226 -31580 -154527 -16387 357773
2251C57773k66268o0184P4621J21812J9780M7031j3513j04355l49647q7333J36876
$$ 357773 91505 31321 105942 227754 247534 294565 281052 176697 -172950 -260283 -123407
2240a23407L8327r2501J18168J07592J72603l3200K3156K33928r961k33152k4912
$$ -123407 -85080 -177581 -59413 48179 220782 187582 210738 444666 434705 201553 176641
2229A76641K7632k39918k25757L11882r9906P00J53542O038K26765N135m6344
$$ 176641 204273 -35645 -261402 50480 -49426 -48726 104816 110854 337619 342754 296410
2218B96410L35826o1022l47006o5104N9836l93799K73246K23180m28920j14603
$$ 296410 632236 571214 224208 159104 218940 -174859 98387 321567 -107353 -221956
2208b21956k6870J99968k53367L97586o6172r908L9625j46582J97586L472K0445
$$ -221956 -248826 -48858 -302225 95361 29189 19281 58906 -87676 109910 113382 133827
2197A33827J8551K89236j63943j02207J69293k21864R5072p7489P2784Q9180L1743
$$ 133827 152378 441614 277671 175464 344757 122893 217965 140476 213260 302440 334183
2186C34183L04883j19153m3467L6985R3344j54248J60212K14498L1823o27987
$$ 334183 639066 519913 476446 513431 606775 452527 612739 827237 859060 231073
2176B31073p0607L08658j7637o0316j67997J18448L1867K02175q8961J98341J81343
$$ 231073 160466 469124 451487 391171 223174 341622 373489 575664 486703 685044 866387
2165H66387l09197J58868k03297m0131J39060Q4652l365j8891j17134P8509K19259
$$ 866387 557190 716058 512761 472630 611690 696342 692977 674086 556952 635461 854720
2154H54720m0872k38325J81443j04938J70218j52628J12325K11761J35626l5942
$$ 854720 813848 575523 756966 652028 822246 669618 781943 993704 1129330 1093388
2144A093388p7400K44862J47259j12185M5533K22096l01290J22156L70450l2691
$$ 1093388 1015988 1260850 1408109 1295924 1341457 1563553 1262263 1384419 1754869 1722178
2134A722178l98189j64459J22585Q3885j50880K43314j7298K7571l2375L12818
$$ 1722178 1323989 1159530 1282115 1366000 1215120 1458434 1441136 1468707 1436332 1749150
2124A749150k76271k29137L85725j48206j72579J49600o7112N6738L07168q4943
$$ 1749150 1472879 1243742 1629467 1481261 1308682 1458282 1391170 1447908 1755076 1670133
2114A670133K80923J78368j73067j96063Q3017j05476J49086j12015p5214K41695
$$ 1670133 1951056 2129424 1956357 1760294 1843311 1737835 1886921 1774906 1699692 1941387
2104A941387Q4303Q5717K56683Q1431Q7689l6487l35276K79516J09715q9950m9800
$$ 1941387 2025690 2111407 2368090 2449521 2537210 2500723 2165447 2444963 2554678 2464728 2414928
2093B414928Q47321K25876j75824P4335K37487J81180J83031L05216L09774J88846
$$ 2414928 3262249 3488125 3312301 3386636 3624123 3805303 3988334 4293550 4603324 4792170
2083D792170L03567M28479O22110N61662Q44456M51085L79893M40713Q85498J023957
$$ 4792170 5095737 5524216 6146326 6707988 7552444 8003529 8383422 8824135 9709633 10733590
2073A0733590J397916J910517J562727J371069J861361J467559K434651L312363
$$ 10733590 12131506 14042023 15604750 16975819 18837180 20304739 22739390 26051753
2065B6051753L949468M601627O119085O938724P567933R515342J1375856L813467
$$ 26051753 30001221 34602848 40721933 47660657 55228590 64743932 76119788 79933255
2057G9933255p229273j0179815j2399331j0296318p238280n004178l454956k426184
$$ 79933255 72703982 62524167 50124836 39828518 32590238 27586060 24131104 21704920
2049B1704920j799080j534068j160068r31617q25324j312780j324722q35532j183541
$$ 21704920 19905840 18371772 17211704 16280087 15454763 14141983 12817261 11981729 10798188
2040A0798188p68942p99087p62995k03455j94826n36705o58341l70387m2388o1038
$$ 10798188 10029246 9230159 8467164 8263709 8068883 7532178 6873837 6503450 6461062 6400024
2030F400024l42336l78214m84758n7029n221k65567k02567k62883m42159M4724
$$ 6400024 6057688 5679474 5194716 5137687 5132466 4866899 4664332 4401449 3959290 4004014
2020D004014K02101Q73j72909m56652K8304k138k43904j72193l26532j01502k9109
$$ 4004014 4206115 4206988 4034079 3577427 3605731 3603593 3359689 3187496 2860964 2759462 2730353
2009B730353J99164J17030P2994l22784j56921J82794j53199N1138j7181j44086
$$ 2730353 2929517 3046547 3119541 2796757 2639836 2822630 2669431 2720569 2703388 2559302
1999B559302j55779m7873j18060J08446R53k72533J28651L0157k90369K30437
$$ 2559302 2403523 2355650 2237590 2346036 2346989 2074456 2203107 2233264 1942895 2173332
1989B173332r0317l21726k41859M4297K47237j88329k91137R9325n3201j33355
$$ 2173332 2083015 1761289 1519430 1563727 1810964 1622635 1331498 1430823 1377622 1244267
1979A244267J10427K29J66063R9277m52988J4106K2811l79834J96136R7205p0663
$$ 1244267 1354694 1354923 1520986 1620263 1167275 1181381 1204192 824358 1020494 1117699 1047036
1968A047036k9133J33766N3661J12710J34861m28706J9299o5409j58590k40751
$$ 1047036 1017903 1151669 1205330 1318040 1452901 1024195 1043494 978085 819495 578744
1958E78744j10765N5626K63816m9938j77723j00599l8639K76577j79279K11361
$$ 578744 467979 523605 787421 737483 559760 459161 420522 697099 517820 729181
1948G29181o1921O5128k21497j05668K73470J74485n1245k11282R0559k75596
$$ 729181 667260 732388 510891 405223 678693 853178 801933 590651 681210 405614
1938D05614M76595M5754k98210L22728L3915j67222L25181k54948k37919l0996
$$ 405614 882209 927963 629753 952481 986396 819174 1144355 889407 651488 620492
1928F20492j60618k404K19035j65372k8338K25365P4255q9637j80837Q9349O2615
$$ 620492 459874 457470 676505 511133 482795 708160 782415 692778 511941 601290 663905
1917F63905m1235k22064n6968q0233j8916K66854K33045k66320j51624J33652
$$ 663905 622670 400606 343638 263405 244489 511343 744388 478068 326444 460096
1907D60096R4380j97951L9675L4445J52509J45076J39836o96062M9120R5629p8302
$$ 460096 554476 356525 396200 430645 583154 728230 868066 172004 221124 316753 238451
1896B38451K4709J83953O8698R0160o7744n30187K79958K56981j38995j04221
$$ 238451 263160 447113 515811 605971 538227 8040 287998 544979 405984 301763
1886C01763K52509j87202n2375M3386j14691J01324K9771J21750o0350l35822
$$ 301763 554272 367070 314695 358081 243390 344714 374485 496235 435885 100063
1876A00063K76337J90966l28576l22958J86909K82474p3827o194p5046m01035
$$ 100063 376400 567366 238790 -84168 102741 385215 311388 305194 230148 -170887
1866a70887N0412M36147l25322J35801K27101j1639m11885k49892M94962J59631
$$ -170887 -120475 315672 -9650 126151 353252 341613 -70272 -320164 174798 334429
1856C34429K2523L7024k40645J39288J27841j14694J05661l06721J48684L68404
$$ 334429 356952 393976 153331 292619 420460 305766 411427 104706 253390 621794
1846F21794j13481k04565j1086j59147l15097N6506J97400j44626J00480q1476
$$ 621794 508313 303748 292662 133515 -181582 -125076 72324 -72302 28178 -53298
1836e3298k54686K40471p650R6084L59149r5863o4217m44269j68575N15942J12355
$$ -53298 -307984 -67513 -75163 20921 380070 284207 219990 -224279 -392854 123088 235443
1825B35443O5221J89209l32307M56882l05906J1048K06657k39060Q3880o5680
$$ 235443 300664 489873 157566 614448 308542 319590 526247 287187 371067 305387
1815C05387K27584j14251j12104j91915R2893n1870K95215P2047j02914m57424
$$ 305387 532971 418720 306616 114701 207594 155724 450939 522986 420072 -37352
1805c7352j27823L5156J91906O9864J91101l2168j48189J36884j53023Q662k20041
$$ -37352 -165175 -130019 61887 131751 322852 290684 142495 279379 126356 135018 -85023
1794h5023J33613K70875P6048j36241K3678j85632J18675j6351k19365R9799J99439
$$ -85023 48590 319465 395513 259272 282950 97318 215993 199642 -19723 80076 279515
1783B79515M2578j45685m25113J54784K13438j90386M6312k10359L15170L2017
$$ 279515 322093 176408 -248705 -93921 119517 -70869 -24557 -234916 80254 112271
1773A12271K95919k32240K3393j32549m21667K42210K07685j95346j7533J84374
$$ 112271 408190 175950 199343 66794 -354873 -112663 95022 -100324 -117857 66517
1763F6517n6084j62102o7828K47966j14505n8705O802M58196j82733k03048R471
$$ 66517 10433 -151669 -219497 28469 -86036 -144741 -137939 320257 137524 -65524 -56053
1752e6053l1869J34612J10680k9492j02000n3400J82498Q3634l1875k0282j71042
$$ -56053 -87922 46690 157370 127878 25878 -27522 154976 238610 206735 186453 15411
1741A5411Q0116j23056J56216L5956k10069R0957R2729O4877k0355j10251Q2936
$$ 15411 95527 -27529 128687 164643 -45426 45531 138260 203137 182782 72531 155467
1730A55467K20448j13381j48391j1474K84154r623k13798p3875J65244j525l04733
$$ 155467 375915 262534 114143 102669 386823 377200 163402 89527 254771 253246 -51487
1719e1487l05478L26879k2898J5858L6922j8098o5816J57663O5806j05245M6395
$$ -51487 -356965 -30086 -52984 -37126 -204 -18302 -84118 73545 139351 34106 80501
1708H0501j23521K7831J44114q4345n2704k542m03442J49533K11828K75190j21507
$$ 80501 -43020 -15189 128925 44580 -8124 -10666 -414108 -264575 -52747 222443 100936
1697A00936l05639J92850O8099l13520k03224K32973K03818k88336K68702j7702
$$ 100936 -204703 -11853 56246 -257274 -460498 -227525 -23707 -312043 -43341 -61043
1687f1043K39090K5209p4393k15438k92016q0881J45186N01340l29149j37867
$$ -61043 178047 203256 128863 -86575 -378591 -459472 -314286 187054 -142095 -279962
1677b79962P8301M6817N7331M22345n1207L12533l62057K1212j48127j86210O3659
$$ -279962 -201661 -154844 -97513 324832 273625 586158 224101 245313 97186 -89024 -25365
1666b5365k14150K75033p2713K15685p7255j63761L53634L75694l61667m68540
$$ -25365 -239515 35518 -37195 178490 101235 -62526 291108 666802 305135 -163405
1656a63405k4631K44145O0473K25777N55k64785j3450J16612L92101n4552k62313
$$ -163405 -188036 56109 116582 342359 342914 78129 64679 181291 573392 518840 256527
1645B56527r0095J33586K19035l48002j50390K79813K06114o9540j05440q3049
$$ 256527 166432 300018 519053 171051 20661 300474 506588 437048 331608 248559
1635B48559j76951j59586L43975J01772q6486l43469j68540r0277K20683J26610
$$ 248559 71608 -87978 255997 357769 271283 -72186 -240726 -331003 -110320 16290
1625A6290J44206K9399p2379O2613k9149J21178n0737P3536j13112j37962O0544
$$ 16290 160496 189895 117516 180129 150980 272158 221421 294957 181845 43883 104427
1614A04427K8057O3212j01974k2013Q1860k17851r4751J79326q5036M0172L61065
$$ 104427 132484 195696 93722 71709 153569 -64282 -159033 20293 -64743 -24571 336494
1603C36494K97935o8830n42929M0289J45106j53194K3539l08463J72426K27538
$$ 336494 634429 565599 22670 62959 208065 54871 78410 -230053 -57627 169911
1593A69911l3422j13750k2349o6048J19537l78218J24487J01235q5204J23266
$$ 169911 136489 22739 390 -65658 53879 -324339 -199852 -98617 -183821 -60555
1583f0555o6375J23691k05577J73324M6602K855j85678J33494J04413K5950q097
$$ -60555 -126930 -3239 -208816 -35492 11110 13965 -171713 -38219 66194 92144 84047
1572H4047j51653P934m00616J19312K48104L5846J15653l8079Q6476O1446P0157
$$ 84047 -67606 -59672 -460288 -340976 -92872 -57026 58627 20548 107024 168470 238627
1561B38627j98203j64336k40639J08127L11715k7009j12408J56621p4774j68331
$$ 238627 40424 -123912 -364551 -256424 55291 28282 -84126 72495 -2279 -170610
1551a70610k4343J57023O7002J05473j84264k18875k65012m9230N67865K63701
$$ -170610 -194953 -37930 29072 134545 -49719 -268594 -533606 -582836 -14971 248730
1541B48730k53282q7740L35731j58262j71697k90488N1513K02104K8894K46418
$$ 248730 -4552 -92292 243439 85177 -86520 -377008 -325495 -123391 -94497 151921
1531A51921L2858l4149m62561J40671j57841K75463n259l34881K40159m7891k26051
$$ 151921 184779 150630 -311931 -171260 -329101 -53638 -58897 -393778 -153619 -201510 -427561
1520d27561K03309p1105K54267m53058n1222N27582M7456J4008l1301j33207k16484
$$ -427561 -224252 -295357 -41090 -494148 -545370 -17788 29668 43676 12375 -120832 -337316
1509c37316N79340j8726o7699o5177N9153j15946N3138m52020J93373j85770J86996
$$ -337316 242024 223298 155599 90422 149575 33629 86767 -365253 -171880 -357650 -170654
1498a70654K63636K46537l3194k80780m9676O7552J86566o2379k33795j82957
$$ -170654 92982 339519 306325 25545 -24131 43421 229987 167608 -66187 -249144
1488b49144k2614J97192K09478j79162J69584k76924J49409j74407J69204j40779
$$ -249144 -271758 -74566 134912 -44250 125334 -151590 -2181 -176588 -7384 -148163
1478a48163j98579k7252J86852L35000K04723k54543l41562K77478J40424j69128
$$ -148163 -346742 -373994 -187142 147858 352581 98038 -243524 33954 174378 5250
1468E250k18132K51322m0505k75288R9313K63660j77652n4448L6432R7837N581
$$ 5250 -212882 38440 -2065 -277353 -178040 85620 -92032 -146480 -110048 -12211 -6630
1457f630o3840J34011k64195L1772j10750L64804J26918m15561L4408Q7658O2105
$$ -6630 -70470 63541 -200654 -168882 -279632 85172 212090 -203471 -169063 -81405 -19300
1446a9300P4513j1560J45803j3054j26706J54162k72041p6997J18735j51833j20014
$$ -19300 55213 43653 189456 176402 49696 203858 -68183 -145180 -26445 -178278 -298292
1435b98292K70493L52832R3451j51709q8705q2632J46139n1994n9718j4013j81720
$$ -298292 -27799 325033 418484 266775 178070 95438 241577 189583 129865 115852 -65868
1424f5868O9971p6113q1329Q2170K34369m6650k84440K34309J87551k62390l1028
$$ -65868 4103 -72010 -153339 -71169 163200 116550 -167890 66419 253970 -8420 -39448
1413c9448o3547j06941M2942k93670N6491P6641L02984k16613M4534L11158m2017
$$ -39448 -102995 -209936 -166994 -460664 -404173 -327532 -24548 -241161 -196627 114531 72514
1402G2514N3693j72395q3934n7774j10397J01196O556K4452j26319J0094P7990
$$ 72514 126207 -46188 -130122 -187896 -298293 -197097 -190541 -166089 -292408 -282314 -204324
1391b04324m3174r228r1921N973M23075L9717J02987J3703j14369J13637m57885
$$ -204324 -247498 -256726 -348647 -342674 80401 120118 223105 236808 122439 236076 -221809
1380b21809J81285m8732n6753q2217r9972K68037J16026j48300k8941k06941K6279
$$ -221809 -40524 -89256 -146009 -228226 -328198 -60161 55865 -92435 -121376 -328317 -302038
1369c02038L13337j93771j44114K28965N0609K22416K5677k65704j12124k87713
$$ -302038 11299 -182472 -326586 -97621 -47012 175404 201081 -64623 -176747 -464460
1359d64460J09371K46607K51383j23341J13219j37841k2505M9761M8225K13811
$$ -464460 -355089 -108482 142901 19560 132779 -5062 -27567 22194 70419 284230
1349B84230j49304M3851N0682k87878m37105K21664L3982J18988J18288k37988
$$ 284230 134926 178777 229459 -58419 -495524 -273860 -239878 -120890 -2602 -240590
1339b40590L76780j12412M3392n66J1881j10614k35211q0794L5161M42808M3615
$$ -240590 136190 23778 67170 66604 78485 -32129 -267340 -348134 -312973 129835 173450
1328A73450j88919j90679L9242J10492k3671O1991j22002N0986L4705j7921j5883
$$ 173450 -15469 -206148 -166906 -56414 -80085 -18094 -140096 -89110 -54405 -72326 -88209
1317h8209j12082K94687q587J57576K9309J47977k25895r0846j47123J77259j70512
$$ -88209 -200291 94396 85809 243385 272694 420671 194776 103930 -43193 134066 -36446
1306c6446M8008O7832j34148k05760L82431J39489k42708O7261K0327n9887l1714
$$ -36446 11562 79394 -54754 -260514 121917 261406 18698 85959 106286 46399 14685
1295A4685J05751M7951J48122q6863j37609Q9628l9851l45104K12034K70584J72734
$$ 14685 120436 168387 316509 229646 92037 181665 141814 -203290 8744 279328 452062
1284D52062O6080k77449j08398N7325l45749J70407J09443q8516M4612j40465
$$ 452062 518142 240693 132295 189620 -156129 14278 123721 35205 79817 -60648
1274f0648k22863K99786L5986K04096K72238k62128l46253M269m6350j41673L14151
$$ -60648 -283511 16275 52261 256357 528595 266467 -79786 -75517 -121867 -263540 50611
1263E0611J79775k09053m0889K91434l75684j13373Q1731K38615n9257J66675
$$ 50611 230386 21333 -19556 271878 -103806 -217179 -135448 103167 43910 210585
1253B10585k04651q0699N3244j28241J20150k56101J44591R5339J31943k11411
$$ 210585 5934 -74765 -21521 -149762 -29612 -285713 -141122 -45783 86160 -125251
1243a25251P2881K13K95418P9004m1401k23272L30118k30850j1450J45926j45800
$$ -125251 -52370 -52157 243261 322265 280864 57592 387710 156860 145410 291336 145536
1232A45536p8743n79630K92976M3576N101p9722P7256L21928J26100M4595j60041
$$ 145536 66793 -512837 -219861 -176285 -171184 -250906 -173650 148278 274378 318973 158932
1221A58932j98739M9346q6460Q6061o4089n6037J68914q5120N8631M3279n02031
$$ 158932 -39807 9539 -76921 9140 -54949 -110986 57928 -27192 31439 74718 -427313
1210d27313Q3454K89063n3925j04766m6365K04432J43993k4987k957l1041l2597
$$ -427313 -343859 -54796 -108721 -213487 -259852 -55420 88573 63586 60629 29588 -3009
1199c009N3804k67400j0303P7118j3410j77062K86329J89783m102l26867j64019
$$ -3009 50795 -216605 -226908 -149790 -163200 -340262 -53933 135850 131748 -195119 -359138
1188c59138O4475J60767k72659k18972K42129K33998j8904k19547L21766n1953
$$ -359138 -294663 -133896 -406555 -625527 -383398 -149400 -168304 -387851 -66085 -118038
1178a18038k9288R8096Q8170k8765m0467j8963j10689N2009K7007J60606P6412
$$ -118038 -147326 -49230 38940 10175 -30292 -49255 -159944 -107935 -80928 79678 156090
1167A56090r0968l53043K83323r9295Q6416k64990m8086M63078j8854j72907j50478
$$ 156090 65122 -287921 -4598 -103893 -17477 -282467 -330553 132525 113671 -59236 -209714
1156b09714O7940K8789l67970K03393Q7482J23398K90809j45966R7522k75943
$$ -209714 -141774 -112985 -480955 -277562 -190080 -66682 224127 78161 175683 -100260
1146a00260k29093o6652L36201j04739J31136J10602n6313k83906M80007j95575
$$ -100260 -329353 -396005 -59804 -164543 -33407 77195 20882 -263024 216983 21408
1136B1408l32931j88620R4539K03717K45646P7956j84529q753m4105j27540m703
$$ 21408 -311523 -500143 -405604 -201887 43759 121715 -62814 -71567 -115672 -243212 -247915
1125b47915J49344q3444J40447O5355j4873k25433j88242M4064J92416j22703
$$ -247915 -98571 -182015 -41568 23787 8914 -216519 -404761 -360697 -168281 -290984
1115b90984k45299N35217r463L6765o3076J74713k55693k17398O6934J17148J15398
$$ -290984 -536283 -1066 -10529 26236 -36840 137873 -117820 -335218 -268284 -151136 -35738
1104c5738L99652k73112m67210K41200J659N9671J9473L18121M2584l28422M2507
$$ -35738 363914 90802 -376408 -135208 -133549 -73878 -54405 263716 306300 -22122 20385
1093B0385J52702J38076q7331r0263J34230j52352L05667k72846K63007j37580
$$ 20385 173087 311163 223832 133569 267799 115447 421114 148268 411275 273695
1083B73695J50784o5499k89400j90781J79979k25200l65746L14618K75295J98198
$$ 273695 424479 358980 69580 -121201 58778 -166422 -532168 -217550 57745 255943
1073B55943o7786k00831n121K08035L9134k07584k28673P2096J74447k24363J03578
$$ 255943 188157 -12674 -17795 190240 229374 21790 -206883 -134787 39660 -184703 -81125
1062h1125n9295q8395K29325l70063j30329O6530K78787M08068j67442k53882
$$ -81125 -140420 -228815 510 -369553 -499882 -433352 -154565 253503 86061 -167821
1052a67821K33035m8125J41086j80523j92606J49471P0117k73976l11444L51835
$$ -167821 65214 17089 158175 -22348 -214954 -65483 4634 -269342 -580786 -228951
1042b28951J30327K09165J63954k55644k10296J02152K99487m33297N182j3527
$$ -228951 -98624 110541 274495 18851 -191445 -89293 210194 -223103 -217921 -231448
1032b31448j07792J56491j47619K67252K18191J2545j7443J06636L66M4679k71215
$$ -231448 -339240 -182749 -330368 -63116 155075 167620 150177 256813 257179 301858 30643
1021C0643M5278L2673l94221j75759K1364L10553K96041J42160k25879l17041
$$ 30643 75921 108594 -285627 -461386 -440022 -129469 166572 308732 82853 -234188
1011b34188j6080L44789l4437j11010N414J68948j48863O1552J45789j11866L0007
$$ -234188 -250268 94521 60084 -50926 -45512 123436 -25427 36125 181914 70048 100055
1000A00055j50317q6917r2133K17587j616k00847k83318J80220m0919R5737m9996
$$ 100055 -50262 -137179 -229312 -11725 -13341 -214188 -497506 -317286 -358205 -262468 -312464
989c12464k8913J43051q5613J2348N1381J96741J45925J08054K04080k44100k35173
$$ -312464 -341377 -198326 -283939 -271591 -220210 -23469 122456 230510 434590 190490 -44683
978d4683k18484Q2535L38561j09262O8991J83007j97527p1400N6782Q5651j52828
$$ -44683 -263167 -180632 157929 48667 117658 300665 103138 31738 88520 174171 21343
967B1343K03620L32830j48568p2488j42576J49670R1077k67649m3801J74859l15634
$$ 21343 224963 557793 409225 336737 194161 343831 434908 167259 123458 298317 -17317
956a7317N2489J91409k15494n4334K71350l29601k51258K29448R4316M7422J9782
$$ -17317 35172 226581 11087 -43247 228103 -101498 -352756 -123308 -28992 18430 38212
945C8212K89502P3221j24943j20012j94985j04602n1354L70742j52663q5716P0536
$$ 38212 327714 400935 275992 155980 -39005 -143607 -194961 175781 23118 -62598 7938
934G938L87400j64685l00533j0991k3078l37623O6974O29700J22077j28160j15608
$$ 7938 395338 230653 -69880 -80871 -103949 -441572 -374598 255102 377179 249019 133411
923A33411l69449j79138j886L97240k04387M11317j13144k44124L1728J9212L46067
$$ 133411 -236038 -415176 -417062 -19822 -224209 187108 73964 -170160 -138432 -119220 226847
912B26847k87663j43766J872K25187L9055q9278j93341J41206l41040M64661n1161
$$ 226847 -60816 -204582 -202710 22477 61532 -27746 -221087 -79881 -420921 43740 -7421
901g421o7475j68622r0841L30928K31677l5221k19994J66997J34475l8697N2192
$$ -7421 -74896 -243518 -334359 -3431 228246 193025 -26969 140028 274503 235806 287998
890B87998o1518j56081M0373m1390k22452r5594J68822O1986m1286k20432l07419
$$ 287998 226480 70399 110772 69382 -153070 -248664 -79842 -17856 -59142 -279574 -586993
879e86993J76878K79047K3619m3646J35003N0797k1148q9274N5877N7862P903
$$ -586993 -410115 -131068 -107449 -151095 -16092 34705 13557 -75717 -19840 38022 45925
$$ [...]
##END NTUPLES=NMR SPECTRUM
##END=
