##TITLE=1H_EC-3254(4-32)
 CDCl3, 8 sc, 
 5.07.2021
##JCAMPDX= 6.0         $$ Bruker NMR JCAMP-DX V2.0
##DATA TYPE= NMR SPECTRUM
##DATA CLASS= NTUPLES
##ORIGIN= UXNMR, Bruker Analytische Messtechnik GmbH
##OWNER= root
$$ XWIN-NMR		Version 3.5
$$ Mon Jul  5 11:45:31 2021 Russian Standard Time (UT+4h)  she@DPX200
##.OBSERVE FREQUENCY= 200.131506
##.OBSERVE NUCLEUS= ^1H
##.ACQUISITION MODE= SIMULTANEOUS
##.ACQUISITION SCHEME= undefined
##.AVERAGES= 8
##.DIGITISER RES= 18
##SPECTROMETER/DATA SYSTEM= spect
##.PULSE SEQUENCE= zg30
##.SOLVENT NAME= CDCl3
##.SHIFT REFERENCE= (INTERNAL, CDCl3, 0, 17.4971)
##AUDIT TRAIL= $$ (NUMBER, WHEN, WHO, WHERE, WHAT)
$$ ##TITLE= Audit trail, XWIN-NMR		Version 3.5
$$ ##JCAMPDX= 5.01
$$ ##ORIGIN= Bruker BioSpin GmbH
$$ ##OWNER= she
$$ F:/spectra/data/she/nmr/H-F/1/pdata/1/auditp.txt
$$ ##AUDIT TRAIL=  $$ (NUMBER, WHEN, WHO, WHERE, WHAT)
(   1,<2021-07-05 11:43:51.82 +0400>,<she>,<DPX200>,
      <created by zg, POWCHK disabled, PULCHK disabled
       configuration hash MD5:
       00 E9 B6 7A A2 85 ED C7 34 08 36 98 17 FE 4E 26
       data hash MD5: 16K
       E2 E5 89 B0 9E 43 36 FA D9 02 A0 D4 68 0F 4D 4F>)
(   2,<2021-07-05 11:44:27.28 +0400>,<she>,<DPX200>,
      <Start of raw data processing
       efp BC_mod = 2 LB = 0.24 FT_mod = 6 PKNL = 1 PHC0 = -12075.96 PHC1 = 15.80099 SI = 16K 
       data hash MD5: 16K
       4D A9 67 C5 ED 69 0B 27 75 4B 32 8B 4B 32 2A BD>)
(   3,<2021-07-05 11:44:41.14 +0400>,<she>,<DPX200>,
      <pk PHC0 = -2.310679 PHC1 = 4.599999 
       data hash MD5: 16K
       BE 04 59 F0 EB 83 72 59 71 75 E1 69 02 5D 40 98>)
(   4,<2021-07-05 11:44:44.57 +0400>,<she>,<DPX200>,
      <abs ABSG = 5 
       data hash MD5: 16K
       22 31 0A 24 55 E7 65 0F 8B D6 20 0A BC 2F 08 62>)
$$ ##END=
$$ 
$$ hash MD5
$$ 2C FB B7 84 4C EE 7E 05 B6 C7 16 7A E7 09 F2 0D
##$RELAX= 
##$RELAX= 
##$RELAX= 
##$RELAX= 
##$RELAX= 
##$RELAX= 
$$ Bruker specific parameters
$$ --------------------------
##$DU= <F:/spectra>
##$EXPNO= 1
##$NAME= <H-F>
##$PROCNO= 1
##$TYPE= <nmr>
##$USER= <she>
##$AMP= (0..31)
100 100 100 100 100 100 100 100 100 100 100 100 100 100 100 100 100 100 
100 100 100 100 100 100 100 100 100 100 100 100 100 100 
##$AQSEQ= 0
##$AQ_mod= 1
##$AUNM= <au_zg>
##$AUTOPOS= <>
##$BF1= 200.13
##$BF2= 200.13
##$BF3= 200.13
##$BF4= 200.13
##$BF5= 200.13
##$BF6= 200.13
##$BF7= 200.13
##$BF8= 200.13
##$BYTORDA= 1
##$CFDGTYP= 0
##$CFRGTYP= 5
##$CHEMSTR= <none>
##$CNST= (0..31)
1 1 145 1 1 1 1 1 1 1 1 1 1 1 1 1 1 1 1 1 1 1 1 1 1 1 1 1 1 1 1 1 
##$CPDPRG= <>
##$CPDPRG1= <>
##$CPDPRG2= <>
##$CPDPRG3= <>
##$CPDPRG4= <mlev>
##$CPDPRG5= <mlev>
##$CPDPRG6= <mlev>
##$CPDPRG7= <mlev>
##$CPDPRG8= <mlev>
##$CPDPRGB= <>
##$CPDPRGT= <>
##$D= (0..31)
0 1.2 0 0 0 0 0 0 0 0.06 0 0.03 0 0 0 0 0.0002 0 0 0 0 0 0 0 0 0 0 0 0 
0 0 0 
##$DATE= 1625471031
##$DBL= (0..7)
120 120 120 120 120 120 120 120 
##$DBP= (0..7)
150 150 150 150 150 150 150 150 
##$DBP07= 0
##$DBPNAM0= <>
##$DBPNAM1= <>
##$DBPNAM2= <>
##$DBPNAM3= <>
##$DBPNAM4= <>
$$ [...]
##$SUBNAM3= <"">
##$SUBNAM4= <"">
##$SUBNAM5= <"">
##$SUBNAM6= <"">
##$SUBNAM7= <"">
##$SUBNAM8= <"">
##$SUBNAM9= <"">
##$SW= 20.0188882624521
##$SWIBOX= (0..15)
0 0 2 0 0 0 0 0 0 0 0 0 0 0 0 0 
##$SW_h= 4006.41025641026
##$TD= 16384
##$TD0= 1
##$TE= 0
##$TE2= 300
##$TE3= 300
##$TEG= 300
##$TL= (0..7)
0 120 120 120 120 120 120 120 
##$TP= (0..7)
150 150 150 150 150 150 150 150 
##$TP07= 0
##$TPNAME0= <>
##$TPNAME1= <>
##$TPNAME2= <>
##$TPNAME3= <>
##$TPNAME4= <>
##$TPNAME5= <>
##$TPNAME6= <>
##$TPNAME7= <>
##$TPOAL= (0..7)
0.5 0.5 0.5 0.5 0.5 0.5 0.5 0.5 
##$TPOFFS= (0..7)
0 0 0 0 0 0 0 0 
##$TUNHIN= 0
##$TUNHOUT= 0
##$TUNXOUT= 0
##$USERA1= <user>
##$USERA2= <user>
##$USERA3= <user>
##$USERA4= <user>
##$USERA5= <user>
##$V9= 5
##$VALIST= <valist>
##$VCLIST= <CCCCCCCCCCCCCCC>
##$VD= 0
##$VDLIST= <DDDDDDDDDDDDDDD>
##$VPLIST= <PPPPPPPPPPPPPPP>
##$VTLIST= <TTTTTTTTTTTTTTT>
##$WBST= 1024
##$WBSW= 4
##$XGAIN= (0..3)
0 0 0 0 
##$XL= 0
##$YL= 0
##$YMAX_a= 13041
##$YMIN_a= -9944
##$ZGOPTNS= <>
##$ZL1= 120
##$ZL2= 120
##$ZL3= 120
##$ZL4= 120
##$ABSF1= 17.49711
##$ABSF2= -2.521927
##$ABSG= 5
##$ABSL= 3
##$ALPHA= 0
##$AQORDER= 0
##$ASSFAC= 0
##$ASSFACI= 0
##$ASSFACX= 0
##$ASSWID= 0
##$AUNMP= <proc_1d>
##$AZFE= 0.1
##$AZFW= 0.1
##$BCFW= 0
##$BC_mod= 2
##$BYTORDP= 0
##$COROFFS= 0
##$CY= -3
##$DATMOD= 1
##$DC= 0
##$DFILT= <>
##$DTYPP= 0
##$F1P= 0
##$F2P= 0
##$FCOR= 1
##$FTSIZE= 16384
##$FT_mod= 6
##$GAMMA= 0
##$GB= 0
##$INTBC= 1
##$INTSCL= 1.334414e-10
##$ISEN= 128
##$LB= 0.24
##$LEV0= 0
##$LPBIN= 0
##$MAXI= 10000
##$MC2= 0
##$MEAN= 0
##$ME_mod= 0
##$MI= 1.114404
##$NCOEF= 0
##$NC_proc= -11
##$NLEV= 6
##$NOISF1= 3.799351
##$NOISF2= 2.8
##$NSP= 0
##$NTH_PI= 0
##$NZP= 0
##$OFFSET= 17.49711
##$PC= 1
##$PHC0= -12078.27
##$PHC1= 20.40099
##$PH_mod= 1
##$PKNL= yes
##$PPARMOD= 0
##$PSCAL= 0
##$PSIGN= 0
##$REVERSE= no
##$SF= 200.130007508592
##$SI= 16384
##$SIGF1= 3
##$SIGF2= 2
##$SINO= 5.538805
##$SIOLD= 16384
##$SREGLST= <1H.CDCl3>
##$SSB= 0
##$STSI= 16384
##$STSR= 0
##$SW_p= 4006.41025641026
##$SYMM= 0
##$S_DEV= 0
##$TDeff= 16384
##$TDoff= 0
##$TI= <>
##$TILT= no
##$TM1= 0
##$TM2= 0
##$TOPLEV= 0
##$USERP1= <user>
##$USERP2= <user>
##$USERP3= <user>
##$USERP4= <user>
##$USERP5= <user>
##$WDW= 1
##$XDIM= 16384
##$YMAX_p= 428941518
##$YMIN_p= -5170221
$$ End of Bruker specific parameters
$$ ---------------------------------
##NTUPLES= NMR SPECTRUM
##VAR_NAME=  FREQUENCY,     SPECTRUM/REAL,   SPECTRUM/IMAG
##SYMBOL=    X,             R,               I
##VAR_TYPE=  INDEPENDENT,   DEPENDENT,       DEPENDENT
##VAR_FORM=  AFFN,          ASDF,            ASDF
##VAR_DIM=   16384,         16384,           16384
##UNITS=     HZ,            ARBITRARY UNITS, ARBITRARY UNITS
##FACTOR=    0.24454680195387, 1,            1
##FIRST=     3501.69682909061, 0,            0
##LAST=      -504.713427319653, 0,           0
##MIN=       -504.713427319653, -5170221,    0
##MAX=       3501.69682909061, 428941518,    0
$$ Real data points
##PAGE= N=1
##DATA TABLE= (X++(R..R)), XYDATA
$$ [...]
4834A303382n95281L50629j806383L74995p89415K026027K78547j595646p23408
4825a176553J377516j86864K72331M07542m49943j04196j96275O3667J40501J93113
4815C40839K17521J15615R64837j043452N71565r93929R48868J167283j745556
4806E43591j67691k31981l92952p7565k52171J149247q70014j46541R85812l47777
4796A91958l56147P10027m54226M78438o23260N78924J474083j837025p5195K1598
4786A09175R86414K32896P8824j01602j034173L62230J198673p48110l97235k81374
4776D05718j26393P3200P43588l48959l60875J12323k46346M06746K37727l38441
4766E58288m09385m10050M31217j61910K8467N19985n6764m16518o28989N66119
$$ plain form
4834 1303382 708101 1058730 -747653 -372658 -1162073 863954 1142501 -453145 -1176553
4825 -1176553 200963 14099 286430 693972 244029 139833 -56442 7225 147726 340839
4815 340839 558360 673975 1638812 595360 1166925 172996 1121864 2289147 543591
4806 543591 375900 143919 -249033 -326598 -578769 570478 -299536 -446077 539735 191958
4796 191958 -164189 545838 91612 570050 -53210 525714 1999797 162772 87577 109175
4786 109175 1095589 1328485 1407309 1305707 271534 633764 1832437 1084327 687092 405718
4776 405718 279325 352525 1096113 747154 386279 498602 252256 659002 896729 558288
4766 558288 148903 -261147 170070 8160 36627 556612 499848 83330 -545659 20460
4756B0460j275698n68970J654920O71915L74610p89664K69240L47234j82802M89917
4746A011162K15452j090509j83007Q47211P0074p48824q3207K54517j98735R57203
4736A051337n7097o69272J72396l06658L00531L19299J75370k63412M24810p60946
4726C86358M52171l51640M35489p80065p18461Q45958J32078j9770O51963j099136
4716f5055L92621L12693K53925J082502j155202N4886Q34647j265867j420655
4707i75505k03380J219728M57513k56875P32174p4683L3918j097708J613996p89747
4697F59431m07146N58143k93314K87476q3178l07050n22047p84443J405211J96451
4687G09534j54551Q2039L90561n87766q86188R92628K73758P57470j01326K42385
$$ plain form
4756 20460 -1255238 -1824208 -169288 502627 877237 87573 356813 704047 521245 1011162
4746 1011162 1226614 136105 -46902 800309 870383 121559 38352 292869 94134 1051337
4736 1051337 994240 324968 497364 190706 491237 810536 985906 722494 1147304 386358
4726 386358 838529 486889 922378 142313 -576148 269810 401888 382118 1034081 -65055
4716 -65055 327566 640259 894184 1976686 821484 876370 1711017 445150 -975505
4707 -975505 -1178885 40843 498356 241481 973655 898972 932890 -164818 1449178 659431
4697 659431 252285 810428 517114 804590 721412 414362 -107685 -892128 513083 709534
4687 709534 554983 637022 1027583 439817 -446371 546257 820015 1577485 1476159 1718544
4677A718544m57697n64810k65059R63259K30320j40516l66262N62136l5770n92727
4667A051418n74346P06074q06572k73000O22042n45730L70655n30165R99916l82765
4657F37527j008862P85890j22139R38567m21142J298449Q43963m94354K52271
4648B710170q16971k23010l19762L82557j18280J27739n82486P57484J60875o3751
4638B014565j642836L77590j37796j601920K07780L48493J02229J298836J069186
4629B036127n16888r33248K47606O99637o38541p55863j46337j82083N58299P51811
4619A120520q27797p31929O64510Q75397P33540J46964q21440P1342k59824j74885
4609G96398L68098l70026L85512o70563n41585j57160P43985O96738o94453l01564
$$ plain form
4677 1718544 1260847 696037 430978 1394237 1624557 1484041 1117779 1679915 1644145 1051418
4667 1051418 477072 1183146 376574 103574 725616 179886 550541 20376 1020292 637527
4657 637527 -371335 414555 292416 1230983 809841 2108290 2952253 2457899 2710170
4648 2710170 1893199 1670189 1350427 1732984 1614704 1742443 1159957 1917441 2078316 2014565
4638 2014565 371729 749319 611523 -990397 -782617 -434124 -331895 966941 2036127
4629 2036127 1519239 585991 833597 1533234 894693 138830 -7507 -189590 368709 1120520
4619 1120520 292723 -439206 225304 1100701 1834241 1981205 1159765 1231107 971283 796398
4609 796398 1164496 794470 1179982 509419 -32166 -189326 554659 1251397 556944 255380
4599B55380J384935j24208r23585M67467M74132l12824K06308J74245P11135M47202
4589B760187j13612J98619J03300m43565j325675q6487J225151l60093q20471
4580A137354P81068m48175J110310J165175Q73370P24995k46324o40297k718023
4571A739453n7760p3283M24205L74216k73231J96003j014629Q08404O18099Q27031
4561C568508j140632K97283N05696m79417K28173O5035j2626m91231j191272k45354
4551A104163l74358K3681Q08061j414669J199685R23639J88298j189607j778743
4542e09850M77148O64545K86624N43760O85636k34385m11397L89244k37445k7663
4532A626217K976J279863L98051q11264m81920J00059J213405j65406n6593O69276
$$ plain form
4599 255380 1640315 1516107 592522 1059989 1534121 1221297 1427605 1601850 2312985 2760187
4589 2760187 2646575 2845194 2948494 2504929 1179254 1092767 2317918 1957825 1137354
4580 1137354 1918422 1470247 2580557 3745732 4619102 5344097 5097773 4457476 1739453
4571 1739453 1681693 1608410 2032615 2406831 2133600 2329603 1314974 2123378 2741477 3568508
4561 3568508 2427876 2725159 3230855 2751438 2979611 3044646 3032020 2540789 1349517 1104163
4551 1104163 729805 753486 1561547 146878 1346563 2270202 2458500 1268893 -509850
4542 -509850 -32702 631843 918467 1462227 2147863 1913478 1502081 1891325 1653880 1626217
4532 1626217 1629193 2909056 3307107 2495843 2013923 2113982 3327387 3161981 3105388 3774664
4522C774664L21038j968289M62575Q2108O68657j136646L10179p0702Q35069K82634
4512C561287o12669n28144j278399Q66510n44408J548930M8432j216705J233463
4503C078297j07966j65945p28193O34324j094709O33598p11584j324721N9484
4494B72585Q34044J393359N43972p30204Q7309P54234M88286n56423n06626N96834
4484C177370k81793j024435m13606M97065k58732J054595j236871L60791O96651
4475B571035N50874n3182l57504j256623J37790j051466L00294K50329M5217N63635
4465A700399L52994m02734n20979K8089J114615O15858j201621n3463N12068m96499
4455A648727M97084M2509n24611P71818K38777j025347O45819q54358L0733o03262
$$ plain form
4522 3774664 4095702 2127413 2589988 2672096 3340753 2204107 2514286 2443584 3278653 3561287
4512 3561287 2948618 2420474 1142075 2008585 1464177 3013107 3061539 1844834 3078297
4503 3078297 2970331 2804386 2076193 2710517 1615808 2249406 1537822 213101 272585
4494 272585 1106629 2499988 3043960 2313756 2401065 3155299 3643585 3087162 2580536 3177370
4484 3177370 2895577 1871142 1457536 1954601 1695869 2750464 1513593 1874384 2571035
4475 2571035 3121909 3068727 2711223 1454600 1592390 540924 841218 1091547 1136764 1700399
4465 1700399 2053393 1650659 1129680 1157769 2272384 2888242 1686621 1633158 2145226 1648727
4455 1648727 2145811 2188320 1663709 2435527 2674304 1648957 2294776 1440418 1471151 867889
4445H67889Q49040P19174j778835J295750O59691k13752K16820M76547o33742
4436B458582l59686l09253J19414K07169o86070p14002M81723k52366Q83754r20496
4426I08769p75023Q02651K51101N26682p57402j63936K10187J91497J68875J77650
4416A541051r49906n87346m2946J893458l183k92221K1351J62755Q7134m90682
4406A339465p07715r05462Q87306P22344O27237l98983O19817m96821p22307n46428
4396D18453N53579O85381q95703l62036N01016R15417K201959j451965j340217
4387A225884N2649J517604k36175j358543n26294J039294M3743j202798p02016
4378a46652M64448J91857l11923P51129O49580L29351j114047J559773K20637
$$ plain form
4445 867889 1716929 2436103 657268 1953018 2612709 2398957 2615777 3092324 2458582
4436 2458582 2098896 1789643 1909057 2116226 1430156 716154 1197877 945511 1829265 908769
4426 908769 133746 936397 1187498 1714180 956778 792842 1003029 1194526 1363401 1541051
4416 1541051 591145 3799 -39147 1854311 1851128 1558907 1580258 1743013 1830147 1339465
4406 1339465 631750 -273712 613594 1335938 1963175 1564192 2184009 1687188 964881 418453
4396 418453 972032 1657413 761710 399674 900690 1816107 4018066 2566101 1225884
4387 1225884 1278533 2796137 2559962 1201419 675125 1714419 1758162 555364 -146652
4378 -146652 317796 509653 197730 948859 1598439 1927790 813743 2373516 2594153
4369B594153K8696J00778j269967m52651k19099M28580n87860j35761J222473
4360A709342n30955o30126J002482m87466Q7437L25958j198553Q21437j000482
4351I9074Q475P05398M01873m20599K5584K39375p0449j132181J55805R82003
4341I94358L05993p25514K44303m59692P29327K77500k35569K23856R5389k61949
4331A188002Q2737j78547p83187k04228N115N38168n88329K92017K5625R27490
4321A304863r53960m11323L98122Q5774M09165K359731r52811k51466j29432L6225
4311A894888n82197n94878n81340n75857K32600J629750r83731n53269J184892
4302A070858P30830n61105k314540J35665O61022p2690P01769Q91802L48879P70896
$$ plain form
4369 2594153 2622849 2723627 1453660 1001009 781910 1210490 622630 486869 1709342
4360 1709342 1178387 548261 1550743 1063277 1150714 1476672 278119 1099556 99074
4351 99074 107549 812947 1214820 794221 819805 1059180 988731 -143450 12355 994358
4341 994358 1300351 574837 819140 359448 1088775 1366275 1130706 1354562 1449951 1188002
4331 1188002 1270739 1092192 309005 104777 109892 648060 59731 351748 377373 1304863
4321 1304863 350903 -60420 337702 423476 832641 3192372 2239561 1988095 1858663 1894888
4311 1894888 1312691 717813 136473 -439384 -206784 1422966 439235 -114034 1070858
4302 1070858 1801688 1240583 -1073957 -938292 -277270 -349960 351809 1243611 1592490 2363386
4292B363386k17011O48379j466205o72246J86095k22633m1374O41382L12185m41716
4282A090242K87367Q87389l76406r45434l12034J256533K88300o06618k472371
4273i03032J330633k22090K45751Q75434L89218K514j035733j08059J026320o47666
4263I53290j232810Q81316R14668N92918l32320J20739j160499L31929o09293
4254D59938L20516Q3642K58473j11697L13312o93981J241348j171238M70801L36287
4244A507401L32884k4106m41489n72401Q43907J17371m24639J071697r27381K97382
4234A780626j729729P51145J000860K83796N11389R05971J39453J817668j122772
4225D338407J19101J304857N37656O0961n94813j327006p73690j98652Q50026
$$ plain form
4292 2363386 2146375 2794754 1328549 656303 842398 619765 578391 1219773 1531958 1090242
4282 1090242 1377609 2264998 1888592 943158 631124 1887657 2175957 1569339 -903032
4273 -903032 427601 205511 451262 1326696 1715914 1718428 682695 574636 1600956 953290
4263 953290 -279520 601796 1516464 2109382 1777062 1897801 737302 1069231 459938
4254 459938 780454 864096 1122569 1010872 1324184 630203 1871551 700313 1171114 1507401
4244 1507401 1840285 1816179 1374690 802289 1646196 1763567 1338928 2410625 1483244 1780626
4234 1780626 50897 802042 1802902 2086698 2598087 3504058 3643511 5461179 4338407
4225 4338407 4457508 5762365 6300021 6360982 5766169 4439163 3665473 3466821 4316847
4216D316847l14849m74008J86393L46368o72112j206227J112356M4281J97875
4207C536924o78447j290547n88150J516855J70881o30324J402492m77729p31033
4198B230922m83097j312022j032006M72665J337723o73779M97433j76848o80401
4189A80590N28526J18207k90170q25611m97828J725658o50477M72319K6602Q17480
4179A605296l31423P68774n93996k32972P82792m70311j288681J760993N09122
4170B509594k440291q4948M9321J43605l19505K114381j96523L97891p56606l96411
4160A020508k32004k9093m76790R12026P05497l62761J99467K09395J90139o0604
4150B075780l52064p30539l73221J13744j214408J133916k04346O88971J52769
$$ plain form
4216 4316847 4001998 3527990 3714383 4060751 3388639 2182412 3294768 3339049 3536924
4207 3536924 2858477 1567930 979780 2496635 2667516 2037192 3439684 2961955 2230922
4198 2230922 1747825 435803 -596203 -123538 1214185 540406 1037839 860991 180590
4189 180590 709116 827323 537153 -288458 -786286 939372 288895 761214 787816 1605296
4179 1605296 1273873 2042647 1448651 1215679 1998471 1528160 239479 2000472 2509594
4170 2509594 69303 -15645 33676 177281 -142224 1972157 1775634 2173525 1416919 1020508
4160 1020508 788504 759411 282621 1194647 1900144 1537383 1736850 1946245 2136384 2075780
4150 2075780 1723716 993177 619956 733700 -480708 653208 448862 1137833 1290602
4141A290602K69844k17778N64684l01593j178928J531759j604839k78689j79956
4132a04894K27609j58961J185515O97256n65431k4186J330487j140308l50534
4123A096553M82274M3832m06399k28159o1141L67850J55267J027129l46338j114628
4113A016240m49787k86013N71903J250555N17926j171799J98095l60879l93922
4104H92319Q83428K40065L56202K73030o88509L93710m01066P56858r78828r06868
4094H20341j09101K3252j03114J819943j383070L69240m55524k90740J024633
4085A715860l8779j008887l38582J177737M84959M84643L87401K78637k19084
4076B923905j051625m27908J128301n4685J07147q8376p90830j88910O18987j070231
$$ plain form
4141 1290602 1560446 1342668 1907352 1605759 426831 1958590 353751 75062 -104894
4132 -104894 122715 -36246 1149269 1846525 1281094 1256908 2587395 1447087 1096553
4123 1096553 1578827 1622659 1216260 988101 926960 1294810 1450077 2477206 2130868 1016240
4113 1016240 566453 280440 852343 2102898 2620824 1449025 1647120 1286241 892319
4104 892319 1775747 2015812 2372014 2645044 1956535 2350245 1949179 2706037 1727209 820341
4094 820341 711240 734492 631378 2451321 1068251 1437491 981967 691227 1715860
4085 1715860 1677081 668194 329612 1507349 1992308 2476951 2864352 3142989 2923905
4076 2923905 1872280 1444372 2572673 2517988 2625135 2536759 1745929 1557019 2176006 1105775
4066A105775O85537O57273j434060P47854J001569j619680k86204p54381P24552
4057H28235P53246N57815j303458L25666K69744M5548J646618q67999j017500
4048A237915K48320L87371q91081L06048j87766p78063P67695O50502J333932
4039C074873L75625l46988p98434L1939m47254K16367R65711q72505r40140P77212
4029B036406Q75691m89934P05989P05481o46493m91986Q22120L50428k032395
4020A835307o11683K49820L36561M02333L40606L01731J252616p97900n90584
4011B718807O01371L73059J55471q2146j20004Q70644l97877j54421m27870L92933
4001C929967P04742o32413L52015n92110L854O22335O93262o7077J088919j39815
$$ plain form
4066 1105775 1791312 2448585 1014525 1762379 2763948 1144268 858064 103683 828235
4057 828235 1581481 2139296 835838 1161504 1431248 1476796 3123414 2255415 1237915
4048 1237915 1486235 1873606 982525 1288573 1100807 322744 1090439 1740941 3074873
4039 3074873 3450498 3103510 2305076 2337015 1889761 2106128 3071839 2199334 1259194 2036406
4029 2036406 2912097 2422163 3128152 3833633 3187140 2695154 3517274 3867702 1835307
4020 1835307 1223624 1473444 1810005 2212338 2552944 2854675 4107291 3309391 2718807
4011 2718807 3320178 3693237 3848708 3766562 3646558 4517202 4119325 3964904 3537034 3929967
4001 3929967 4634709 4002296 4354311 3762201 3766055 4388390 5081652 5014575 6103494 5963679
3991E963679k44966k16957l69278O36759M50066O25213K49960j763229M00569
3982E731816j247720n70691n04402J069148J253384j508172L40853K88742K90170
3973E143128Q32381N99893q98928J4909L86500k84353M9356Q32965O05422J23194
3963G404467r24900K70379Q25103j119625j402292M22606J180270m0753K46565
3954F861820r08496P82343l45684j086924N61419M7886O62775j16501K84522J68195
3944F911355j572589J092230M56693J104726N91037J017553j233752j45005N86725
3935H808973K49462j13559j135134N97615L00539m90192Q89531m4945l04725J642767
3925A0400332J98282J03842k79467J347824O38782K40309q8705j84175j177351
$$ plain form
3991 5963679 5718713 5501756 5132478 5769237 6219303 6844516 7094476 5331247 5731816
3982 5731816 4484096 3913405 3409003 4478151 5731535 4223363 4564216 4852958 5143128
3973 5143128 5975509 6575402 5676474 5691383 6077883 5793530 5842886 6675851 7281273 7404467
3963 7404467 6479567 6749946 7575049 6455424 5053132 5475738 6656008 6615255 6861820
3954 6861820 5953324 6735667 6389983 5303059 5864478 5912364 6575139 6458638 6743160 6911355
3944 6911355 5338766 6430996 6887689 7992415 8583452 9601005 8367253 8222248 8808973
3935 8808973 9058435 8944876 7809742 8407357 8707896 8217704 9107235 9062290 8757565 10400332
3925 10400332 10598614 10702456 10422989 11770813 12409595 12649904 12561199 12377024 11199673
3916A1199673P40327J10666l91839J676124n125q64436J093008K42385j690249
3907A2110534J056748M27735j04587j38469k44942O70760P97772l95513k92496
3898A3887542L67726P05148R08506M75675m58091J01669J0792l88849R08505J385464
3888A7904087Q33383J81758J20554L51507k65017r75844J720735L2135Q15515
3879B0718813J88655l80875P10497J139034k60211J197148R39622J205434P88660
3870B6246777N56048L311J504407J205581J529462J362866L87196K319297J526112
3861C6641057J439805K868119J957675J877350L019393L394354L246784L140242
3853E7584779M562937L987755M670612P437226P521577R561427J0396308J2422805
$$ plain form
3916 11199673 11940000 12050666 11658827 13334951 13329826 12465390 13558398 13800783 12110534
3907 12110534 13167282 13595017 13490430 13351961 13107019 13777779 14575551 14180038 13887542
3898 13887542 14255268 14960416 15868922 16344597 15886506 15988175 15998967 15610118 16518623 17904087
3888 17904087 18737470 18919228 19039782 19391289 19126272 18150428 19871163 19903298 20718813
3879 20718813 20907468 20526593 21237090 22376124 22115913 23313061 24252683 25458117 26246777
3870 26246777 26802825 26806136 28310543 29516124 31045586 32408452 32795648 35114945 36641057
3861 36641057 38080862 40948981 42906656 44784006 47803399 51197753 54444537 57584779
3853 57584779 62147716 66135471 70806083 78243309 85764886 95326313 105722621 118145426
3845A18145426K002580j1277047p178001q597907o307649l603742j874204q07133
3837H0502323j921387k34803J139106R40545j98876n64141J43091k3078J34674
3828G9917454N02498P60255m3965p11121r94035q58706j136821J30723o73472
3819G6892810n50343j28271j660328j14672j442082j211261j310268k356747j220308
3810F6898530k138189j412216j386435r47172k057712k026644j707204k242030
3802E2980928k29573j547043l762215j283073p48550r04904j851664n71193j387895
3793D0694818j242499P88627j628781j034691o65259j16609k36912n53304l97505
3784C5607885o25004J029236K86884l74724j609200l47471r8053P24455l11239
$$ plain form
3845 118145426 120148006 108870959 101692958 93095051 86787402 83183660 81309456 80502323
3837 80502323 78580936 78346133 79485239 80425784 80226908 79662767 79805858 79782780 79917454
3828 79917454 80419952 81180207 81136242 80425121 79431086 78572380 77435559 77566282 76892810
3819 76892810 76342467 76214196 74553868 74439196 72997114 71785853 70475585 68118838 66898530
3810 66898530 64760341 63348125 61961690 61014518 58956806 56930162 55222958 52980928
3802 52980928 52751355 51204312 47442097 46159024 45410474 44505570 42653906 42082713 40694818
3793 40694818 39452319 40240946 38612165 37577474 36912215 36795606 36558694 36005390 35607885
3784 35607885 34982881 36012117 36299001 35924277 34315077 33967606 33869553 34594008 34282769
3775C4282769n67777Q21756J15798Q70054J591875P20198M08461O37590L65848
3766C9246572J86194q0021J311165J003448J068967J502285J479055O31685O58297
3757D7007647K902362J353059J526748K710604K287477K742482K520886L310703
3749F6361968L952538M089924M074087M238486L797089O511097O581773P536038
3741A07143000P616177Q541551P794051Q130839R715496R086961Q943707P613516
3733A74585298M244673L277644J718467j194095k256702j290687j363298j192479
3725A76528821k316671j976159k758686m997053m556991o901564o419983o366778
3717A40234936q871962q288874p636569p864616r148975p326593o654199m781899
$$ plain form
3775 34282769 33714992 34536748 34652546 35522600 37114475 37834673 38243134 38880724 39246572
3766 39246572 39432766 39352745 40663910 41667358 42736325 44238610 45717665 46349350 47007647
3757 47007647 49910009 51263068 52789816 55500420 57787897 60530379 63051265 66361968
3749 66361968 70314506 74404430 78478517 82717003 86514092 93025189 99606962 107143000
3741 107143000 114759177 123300728 131094779 139225618 148941114 158028075 166971782 174585298
3733 174585298 178829971 182107615 183826082 182631987 180375285 179084598 177721300 176528821
3725 176528821 174212150 172235991 169477305 164480252 159923261 153021697 146601714 140234936
3717 140234936 131362974 123074100 115437531 107572915 98423940 91097347 84443148 79661249
3709G9661249m941197m562687l777177l564893l283419l546565k740188l531426
3701D9713697j125358k019151j554805r52234j042451l099274j950359q84442
3693C7085623n34180j389346j485851K71727j350293j179625q31534q13777k76940
3684B9495804j87825l37913j251092m97824n33928j876936p47541q71158j012697
3675B2178890J44116J2745P38056n75809j427997j94805n80045P63701j214071
3666A9844781p67414J3053N03741o92191k2396p0013p33130P07919K91316q16611
3656A8259055m14338J48255j683993Q45226n58250n28546R73092k74275k88999
3647A6477227K93629N2848k44199j363460P94181o99226p44122J13960M73951
$$ plain form
3709 79661249 74720052 70157365 66380188 62815295 59531876 55985311 53245123 49713697
3701 49713697 48588339 46569188 45014383 44062149 43019698 39920424 37970065 37085623
3693 37085623 36551443 35162097 33676246 33947973 32597680 31418055 30586521 29772744 29495804
3684 29495804 29307979 28970066 27718974 27221150 26687222 24810286 24062745 23191587 22178890
3675 22178890 22323006 22335751 23073807 22497998 21070001 20875196 20295151 21058852 19844781
3666 19844781 19077367 19090420 19594161 18901970 18879574 18809561 18076431 18784350 19075666 18259055
3656 18259055 17844717 17992972 16308979 17154205 16595955 16067409 17040501 16766226 16477227
3647 16477227 16770856 16823704 16579505 15216045 16010226 15311000 14566878 14680838 15154789
3638A5154789p84505N99738L01254n03710o57762K8548l36447j87261Q99261K66694
3628A4780599j803156j02984J389894q3156M33538j245752N59358K88532J091464
3619A5308337q35423O39642k55052J27267K22695j827616Q05316K89942k28729
3610A4246379R60542K3748L94457N06321J9801j88648M78341P94516l39814q88056
3600A6007587J98011j173938o47053O52077J26351K36002l40506k90551j50519
3591A4617461N83352l10438J04151M94064p4997j226090O19209P37882M7796N44786
3581A6137176p69368R91204K33397j146209L6927j12865o2887Q54574J56968J660329
3571A7979246J058735j710054k55830o84582M22728l37905K53837N88176K85251
$$ plain form
3638 15154789 14370284 14970022 15271276 14767566 14109804 14138352 13801905 13614644 14513905 14780599
3628 14780599 12977443 12874459 14264353 14181197 14614735 13368983 13928341 14216873 15308337
3619 15308337 14472914 15112556 14857504 14984771 15207466 13379850 14185166 14475108 14246379
3610 14246379 15206921 15230669 15625126 16131447 16151248 15962600 16440941 17235457 16895643 16007587
3600 16007587 16205598 15031660 14384607 15036684 15163035 15399037 15058531 14767980 14617461
3591 14617461 15200813 14890375 14994526 15488590 15413593 14187503 14806712 15544594 15592390 16137176
3581 16137176 15367808 16359012 16592409 15446200 15483127 15370262 15307375 16161949 16318917 17979246
3571 17979246 19037981 17327927 17072097 16387515 16810243 16472338 16726175 17314351 17599602
3562A7599602N07455O2477R71440K46976J588149m20056j20368o63865n48467
3553A9223343Q14361m33112K173754j10904J8152Q88820n24873J337256k35179
3544B3151618L67660M29299q17821J931296M0835k19072j32160J216845l25708
3535B5642792O12162M28363J270080P41417Q22422J186982m07002L13894R39364
3526C1550474R22205K16578J351059m89951L40963M79097J472432o08047K449793
3517C7684603N81798K18263J616056K038926o42000J119107J19836J405534N76658
3508D4718781R13367J837386J039576J760040N81412Q91500M85083R83309P26595
3499E3937049J601456K004538J234713L84060K537045M89187J259328K097979
$$ plain form
3562 17599602 18107057 18169534 19140974 19387950 20976099 20556043 20435675 19771810 19223343
3553 19223343 20037704 19604592 21778346 21667442 21685594 22574414 22049541 23386797 23151618
3544 23151618 23519278 23948577 23130756 25062052 25102887 24883815 24751655 25968500 25642792
3535 25642792 26254954 26683317 27953397 28694814 29517236 30704218 30297216 30611110 31550474
3526 31550474 32472679 32689257 34040316 33550365 33891328 34370425 35842857 35234810 37684603
3517 37684603 38266401 38484664 40100720 42139646 41497646 42616753 42736589 44142123 44718781
3508 44718781 45632148 47469534 48509110 50269150 50850562 51742062 52227145 53210454 53937049
3499 53937049 55538505 57543043 58777756 59161816 61698861 62188048 63447376 65545355
3491F5545355L144420K733319J62835k71954J369169K221039J997756L330970
3483H0232909L096087J164299K075570K625861K269589K785875K042948J644335
3475I7937473M452432K607868K208197L762476L957390K881529N332027M796827
3467A27936219M348578M004687M859710N756084N763714N632152O122933O839803
3459A71263880M567018O193131O692849M614259L909522L572019K641318K835589
3451B06289585M052843L011520K177395L836286J491938J811356j3040j085833
3443B21572050l267346m304529m883089p551282m702262o894203o449424n429109
3435A78090806n471301o715912o855722n503268n625418o095338p360777p112547
$$ plain form
3491 65545355 68689775 71423094 71585929 71313975 72683144 74904183 76901939 80232909
3483 80232909 83328996 84493295 86568865 89194726 91464315 94250190 96293138 97937473
3475 97937473 102389905 104997773 107205970 110968446 114925836 117807365 123139392 127936219
3467 127936219 132284797 136289484 141149194 146905278 152668992 158301144 164424077 171263880
3459 171263880 175830898 182024029 188716878 193331137 197240659 200812678 203453996 206289585
3451 206289585 210342428 213353948 215531343 219367629 220859567 222670923 222657883 221572050
3443 221572050 218304704 214000175 209117086 201565804 196863542 189969339 183519915 178090806
3435 178090806 172619505 165903593 159047871 153544603 147919185 141823847 134463070 127350523
3427A27350523o421664o334368n084982n322094p333760l785126m438215n063777
3419H3566537k494180m368575m241884o62933k314136j912289j684819k593481
3411F3294240k136640j752450p08495k755269q16798j368677j156233j754792
3403E0844886q10049k170652j293580j149398n35124m31775q97324k72144j492854
3394D1791986p07138l23483p44575j018759R953j199336j446161n86457k70697
3385C5505333k109967l05556j733534J69473j303068k97824Q04797M30738j367949
3376B9792443j793782r4151P1075J382811j595220r2425p39973n06249o3359j961928
3366B4399242k36508r6514m89222O41246p31991q18547p43302r6389L15242p88227
$$ plain form
3427 127350523 120928859 114594491 109509509 104187415 96853655 93068529 88630314 83566537
3419 83566537 81072357 76703782 72461898 71798965 69484829 67572540 65887721 63294240
3411 63294240 61157600 59405150 58696655 55941386 55124588 53755911 52599678 50844886
3403 50844886 50034837 47864185 46570605 45421207 44886083 44454308 43556984 43284840 41791986
3394 41791986 41084848 40761365 40016790 38998031 39007984 37808648 36362487 35776030 35505333
3385 35505333 33395366 33089810 31356276 31525749 30222681 29924857 30729654 31160392 29792443
3376 29792443 27998661 27904510 27975585 29358396 27763176 27670751 26930778 26424529 26361170 24399242
3366 24399242 24162734 24066220 23576998 24218244 23486253 22667706 21924404 21828015 22143257 21355030
3356B1355030m66221j059309J443305P6161r25258Q39788J51317j414919j98075
3347A9801819n87093p91008M90187p93483Q8906o93923j202372J531718R6054
3338A7940805L2154j781867o48459m16593q60926M75572o55189k12598p68833
3329A3104066R63770Q43985j8868m24294n91935J086302l03882j82523l92215
3320A4084406j138522J462658M25461k026204k08092L952k77199o15362j087764
3311A0623334N97993j98967l81595Q83473J524615j538373J13657l70704J286930
3302A2540363j060001j156949M30034J44207O90321n05518m69835J68897l7054
3293A0744465k42100o05797J83177O28306l361k31334j145185k02023q94484P80449
$$ plain form
3356 21355030 20888809 19829500 21272805 21348966 20423708 21263496 21414813 19999894 19801819
3347 19801819 19214726 18423718 18913905 18120422 18209328 17515405 16313033 17844751 17940805
3338 17940805 17972959 16191092 15542633 15126040 14265114 14740686 14085497 13872899 13104066
3329 13104066 14067836 14911821 14892953 14468659 13876724 14963026 14659144 14476621 14084406
3320 14084406 12945884 14408542 14834003 12807799 12599707 12603659 12326460 11711098 10623334
3311 10623334 11221327 11022360 10640765 11524238 13048853 11510480 11624137 11253433 12540363
3302 12540363 11480362 10323413 10753447 10897654 11587975 11082457 10612622 10781519 10744465
3293 10744465 10502365 9896568 10079745 10708051 10704690 10473356 9328171 9126148 8231664 9012113
3283I012113l65319n35190K531677l96353n62511Q72568K55043j118712p81404
3274H911912Q61208M34822j105572L54816l89742q3266l61388j51053J551610
3265A0023347j55177J040980K1354J6481j791411M82185n87649j21109K74614
3256I203615n2085j80405o41665K24234J791635P35196j133599L64319K9780j389971
3246H951054L42262L18647J83924m7309l0007Q44603l90940Q15032q88986n11431
3236I586849o46295N98494P48303j880L25570N25634l74230j352692m7791K31047
3226I593009L67795Q46370l21439m99063J266348P66274m64241j552653j211130
3217H791270J064876k73555r04988J604927l93880j021248l42277J615423Q08749
$$ plain form
3283 9012113 8646794 8111604 10643281 10246928 9684417 10556985 10812028 9693316 8911912
3274 8911912 9773120 10207942 9102370 9457186 9067444 8984178 8622790 8471737 10023347
3265 10023347 9868170 10909150 10930504 10946985 9155574 9637759 9050110 8929001 9203615
3256 9203615 9151530 8971125 8329460 8553694 10345329 11080525 9946926 10311245 10341025 8951054
3246 8951054 9293316 9611963 9795887 9748578 9718571 10563174 10172234 10987266 10098280 9586849
3236 9586849 8940554 9539048 10287351 10285471 10611041 11136675 10762445 9409753 9361962 9593009
3226 9593009 9960804 10807174 10485735 9986672 11253020 12019294 11555053 10002400 8791270
3217 8791270 9856146 9582591 8677603 10282530 9888650 8867402 8525125 10140548 10949297
3208A0949297o14126J032301p6515m38750J165738K86706k58400J49596R32131
3199A3127978J68891l17857J397085o44559q72780p12101N25180N08972R4024
3190A3274833Q89708J9298j136047N27456M96460q51557j90625L70912O27789
3181A4028227P73277l54996P32475j23690l71448J319416l94031q92939R90068
3172A5706359O53677O08787n0481N78450J06876R28063K02424o13603N23388q6205
3162A8557735L94206J212440K88483n70181J309382j98300O84905o8801Q0408
3153B1690277P97285R13200L4609Q59444q16597N36567P23887P94233J10686j212478
3143B4431113K82263J028669O79547p75686J062414J372873L39777K05828K95976
$$ plain form
3208 10949297 10335171 11367472 11290957 10852207 12017945 12304651 12046251 12195847 13127978
3199 13127978 13296869 12979012 14376097 13731538 12858758 12146657 12671837 13180809 13274833
3190 13274833 14164541 14183839 13047792 13575248 14071708 13220151 13029526 13400438 14028227
3181 14028227 14801504 14446508 15178983 15055293 14683845 16003261 15609230 14716291 15706359
3172 15706359 16360036 16968823 16918342 17496792 17603668 18531731 18734155 18120552 18643940 18557735
3162 18557735 18951941 20164381 20452864 19882683 21192065 20993765 21678670 21609869 21690277
3153 21690277 22487562 23400762 23435371 24294815 23478218 24014785 24738672 25532905 25643591 24431113
3143 24431113 24713376 25742045 26421592 25645906 26708320 28081193 28420970 28626798 28922774
3134B8922774K04532J043904Q20183l71563k88402O17429J589229J452868k72284
3125C3718670O64713J455752J181417J448183J924312J192236R89009N34495J696342
3116D4805129J318902J585344j04777K097706J654606J930602J647681L251562
3108E8186755K603194L247573K874310K575043L160755L815752M744953L599083
3100H4807418O399498M481613N488645O694865P523953O611355O581638L265018
3092A31854003J856111j380309m018582n208657r565375r983015q865067q074046
3084H6615063p367828n985891m630216m788478m020202k585444k984196l852250
3076E0400558l177491k513356j269460m76206j335393l723342r65402k384513
$$ plain form
3134 28922774 29127306 30171210 30991393 30619830 30331428 30948857 32538086 33990954 33718670
3125 33718670 34383383 35839135 37020552 38468735 40393047 41585283 42574292 43108787 44805129
3116 44805129 46124031 47709375 47604598 49702304 51356910 53287512 54935193 58186755
3108 58186755 60789949 64037522 66911832 69486875 72647630 76463382 81208335 84807418
3100 84807418 91206916 95688529 101177174 107872039 115395992 122007347 128588985 131854003
3092 131854003 133710114 132329805 128311223 123102566 113537191 103554176 94689109 86615063
3084 86615063 79247235 73261344 68631128 63842650 59822448 57237004 54252808 50400558
3076 50400558 47223067 44709711 43440251 42964045 41628652 37905310 36939908 34555395
3068C4555395o16832j091655n56631P86744r60114j408489m24478j208281q79784
3059B8195875m39719m46143j223548P91770l14395j466146j186339o53995q20126
3050B2437234r83868q10279r50698J2847j550363o96744Q44722k72085j504783
3041A6525983j03057q57286J88802N10586k95850n84937O76855j291755m58966
3032A4310375o54232j050373J29501k5587l25071P98006K44138N88327p10551
3023A3304533p91416p82877R8050L37980P2434j809790J205833J011451N23612
3014A3169810o64696q58810n36107q30300l53928M95404J055865o17413q34520
3005A0025305o4003j50521J115658j387j789796q13343j9935L53206Q74557j083630
$$ plain form
3068 34555395 33938563 32846908 32290277 33077021 32116907 30708418 30283940 29075659 28195875
3059 28195875 27756156 27310013 26086465 26878235 26563840 25097694 23911355 23257360 22437234
3050 22437234 21453366 20643087 19692389 19705236 18154873 17458129 18302851 18030766 16525983
3041 16525983 16422926 15565640 15754442 16265028 15969178 15384241 16061096 14769341 14310375
3032 14310375 13656143 12605770 12735271 12709684 12384613 13182619 13426757 14015084 13304533
3023 13304533 12513117 11730240 11828290 12166270 12238704 10428914 11634747 12646198 13169810
3014 13169810 12505114 11646304 11110197 10279897 9925969 10421373 11477238 10859825 10025305
3005 10025305 9961302 9810781 10926439 10925052 9135256 8321913 8301978 8655184 9529741 8446111
2995H446111p32952o1924j318801P70518O08182O00045j11903m03780o65911l93380
2985F736205R65613M5876M1579M62200l10216r38392N8984J81355j043110P94067
2975F994161N40469l55622q57603N42823n55526M27381j019147R7210M54633J125280
2965G394059o24390N76779r93564K34194O19923K92703R3487j778280l9705l87534
2955E387672K170233m34283j315459O37789M05750q20290L44044J13793j92568
2946F296681l92241Q87986m23993R2648r00016m28005O96011q1052J43270N78990
2936F470279J3550q65714l77940O00375O21398j156691k63229L08365R11905q62588
2926E399710o45271l32160J020784o56326k84145L83750q88594M32146O23644
$$ plain form
2995 8446111 7713159 7651235 6332434 7102952 7711134 8311179 8199276 7795496 7129585 6736205
2985 6736205 7701818 7747694 7789273 8251473 7941257 7002865 7061849 7243204 6200094 6994161
2975 6994161 7534630 7179008 6321405 6864228 6308702 6736083 5716936 5814146 6268779 7394059
2965 7394059 6769669 7346448 6352884 6587078 7207001 7499704 7593191 5814911 5775206 5387672
2955 5387672 7557905 7123622 5808163 6445952 6851702 6031412 6375456 6489249 6296681
2946 6296681 5904440 6792426 6368433 6461081 5561065 5133060 5829071 5748019 5891289 6470279
2936 6470279 6483829 5618115 5240175 5840550 6461948 5305257 5042028 5350393 6262298 5399710
2926 5399710 4754439 4422279 5443063 4786737 4502592 4886342 3997748 4429894 5053538
2917E053538q4370n1115o04897n40913q7743L33889k5085L60484P96268j298515
2907C851541J69748Q69335M05235j050731k26816k69059M69947k13457k88432
2898C717311N2828n01437J222165K45662m22905L06081L05745Q15829j055467
2889D685812L68767J69334K62468j09919k39243K03845l03990k77037n3056p18725
2879C988256m1748O61480k94357O81326q70451o96585l34603J168739M71549J708928
2869F442534J12645k053835r11301N74183J76462P7415M22460Q19829N05035K00000
2859F365427j474695k85640P93598K86332P06744k11557K76551k30792M33620
2850F659588j65045K13475L17257J508039j005706r27332O61215J16273j7815
$$ plain form
2917 5053538 4969168 4918053 4313156 3772243 3684500 4018389 3993304 4353788 5150056 3851541
2907 3851541 4021289 4890624 5295859 4245128 4018312 3749253 4219200 4005743 3717311
2898 3717311 3770139 3268702 4490867 4736529 4313624 4619705 4925450 5741279 4685812
2889 4685812 5054579 5223913 5486381 5376462 5137219 5341064 5037074 4760037 4706981 3988256
2879 3988256 3946508 4607988 4313631 4994957 4124506 3427921 3093318 4262057 4733606 6442534
2869 6442534 6555179 4501344 3590043 4164226 4340688 4418103 4840563 5660392 6165427 6365427
2859 6365427 4890732 4605092 5398690 5685022 6391766 6180209 6456760 6225968 6659588
2850 6659588 6494543 6708018 7025275 8533314 7527608 6600276 7261491 7377764 7359949
2841G359949k18132O1439p54957K67307L62215J004693K5757K35085O55194p82928
2831H215622m76668R07269P64818J443216q07638o96152N78800N8189J73752P24170
2821A0885378N91837R94104k09766r663Q73028K76618J88677N23146l551M45727
2811A4555535M34248K94074l43702N9815J635947o81515j525892N86890J114563
2802A6129963K07588l13309J548565Q70188j657321M42673m0721O64756L23782
2793A8176164m48770j129217K545129K839141N71070J40645M75864J363933J464773
2784B5998732m58098j091930p06960r98081k65265j977106j004693O53615j132510
2775A9017704p11409o47045m88234J13890M64878M75251J08308l75481j73453
$$ plain form
2841 7359949 7141817 7203256 6448299 6715606 7077821 8082514 8108271 8343356 8998550 8215622
2831 8215622 7738954 8646223 9411041 10854257 10046619 9350467 9929267 9987456 10161208 10885378
2821 10885378 11477215 12471319 12261553 12251890 13124918 13401536 13590213 14113359 14109808 14555535
2811 14555535 14989783 15283857 14940155 14999970 16635917 15954402 14428510 15015400 16129963
2802 16129963 16337551 16024242 17572807 18442995 16785674 17228347 17187626 17852382 18176164
2793 18176164 17727394 16598177 19143306 21982447 22553517 22694162 23170026 24533959 25998732
2784 25998732 25540634 24448704 23741744 22743663 22478398 20501292 19496599 20150214 19017704
2775 19017704 18306295 17659250 17171016 17284906 17749784 18225035 18333343 17957862 17784409
2766A7784409J120028Q85165j291226M72356K5862l89139K61092O38552n91803
2757A8915296L33533M15691j019424j225849n97331r63609r09612m83385P8097
2748A4543407j04000r5826j632124N25631J321888j6816K60744l54631j487402
2739A2960871m86669J272876j235907j545752r9184L75348j035139R1041j120725
2730I176760J289330j635664k94984o80890j103765r23262J684602P69700k507098
2721E774729N8832l00306K59437N97543k00715L10767M2931p41435n74484n39138
2711D688161L98869J28239L10439K2072j016521m53047R8239L02109L47731j665707
2701C160584r70821O87966O25717n98491K6442j76080L58707P20819p00343M96576
$$ plain form
2766 17784409 18904437 19789602 18498376 18970732 18996594 18607455 18868547 19507099 18915296
2757 18915296 19248829 19664520 18645096 17419247 16821916 15858307 14948695 14465310 14543407
2748 14543407 14439407 14343581 12711457 13237088 14558976 14542160 14802904 14448273 12960871
2739 12960871 12474202 13747078 12511171 10965419 10866235 11241583 10206444 10297485 9176760
2730 9176760 10466090 8830426 8535442 7854552 6750787 5827525 7512127 8281827 5774729
2721 5774729 5833561 5533255 5792692 6390235 6189520 6500287 6543218 5801783 5227299 4688161
2711 4688161 5087030 5215269 5525708 5547780 4531259 4078212 4176451 4478560 4826291 3160584
2701 3160584 2189763 2877729 3503446 2904955 2931397 2755317 3114024 3834843 3134500 3631076
2691C631076M88500k45310j123729j295927L81092M88238q26944P54235m55253
2682A795978l08520Q89920Q4996o35004l68408J776100K92636o65705p75600r83914
2672A102479M91540P25151l72614M36030j109833l85002L07007q15542Q02020
2663A181236K16419j04484p74385n12167J375301Q72339K1667j497981M26215
2654A204160O86760j505766J085681Q2899J117713L35412j4481j53795j593386
2645A245197m6739J00890L37306l52491l93735q89126o27278J377005o74771k75962
2635a99704j89575J160541K71678J0044N31921q05949j337945J150089N95847
2626A186947j68501j164313M2706J661847j152699P90490J58166j476794J222771
$$ plain form
2691 3631076 4119576 3874266 2750537 1454610 1835702 2323940 1496996 2251231 1795978
2682 1795978 1487458 2377378 2462374 1827370 1458962 3235062 3527698 2861993 2086393 1102479
2672 1102479 1594019 2319170 1946556 2382586 1272753 887751 1194758 379216 1181236
2663 1181236 1397655 1293171 518786 6619 1381920 2254259 2275926 777945 1204160
2654 1204160 1890920 385154 1470835 1553734 2671447 3006859 2992378 2838583 1245197
2645 1245197 1198458 1299348 1636654 1284163 890428 1302 -625976 751029 76258 -199704
2635 -199704 -389279 771262 1042940 1052984 1584905 778956 -558989 591100 1186947
2626 1186947 1018446 -145867 -103161 1558686 405987 1196477 1354643 -122151 1100620
2617A100620M7691J52540l78847m56913N86500l26800o2973p39156m80219L35157
2607b22400Q43657p75931o4946k09179J299934r48593L02604O97470j012195M81340
2597C91761J56329K05273j383850L4327Q27949j220205Q90008j20125l42161j29200
2587f89894J751559m23565q43908Q15207K17771J13910m12171j181039P69558
2578A17428Q70383q61413o75489Q58764k81044J411502J49890q80140j308983
2569e99102Q91420L10241p04251N58733O3971m79251p55777Q2441j298913K87710
2559a642778O80013q6760L18646N35239N13460m94422j70957k12811k59920N26874
2549b93416l51420M67961J93996j069913j62908O84815P12325r41692M99210Q78645
$$ plain form
2617 1100620 1148311 1300851 922004 465091 1051591 724791 661818 -77338 -557557 -222400
2607 -222400 621257 -154674 -219620 -428799 871135 -77458 225146 922616 -89579 391761
2597 391761 548090 753363 -630487 -596160 231789 -988416 -98408 -218533 -560694 -689894
2587 -689894 1061665 638100 -205808 609399 827170 941080 528909 -652130 117428
2578 117428 987811 126398 -549091 309673 28629 1440131 1590021 709881 -599102
2569 -599102 292318 602559 -101692 457041 521012 41761 -714016 -631575 -1930488 -1642778
2559 -1642778 -962765 -1049525 -730879 -195640 317820 -176602 -347559 -560370 -820290 -293416
2549 -293416 -644836 -176875 17121 -1052792 -1215700 -530885 181440 -760252 -261042 617603
2539F17603p70731J53482o36734j658697J631980Q27609j546967m56770Q68160
2530i71065L39189Q37176M96803q01955l9249L51689M94828p19400k61405j007397
2520a280786M54072N53328p1238p51718J074054M43303p16106j295597J108807
2511d81881n07597J298362L86620L480o08759n27636K82140P52855L58808j738937
2501g82545o09447m20088j51925O21280M62659m19177N88032K77073R8003m51859
2491g87994q32615J796452L12721j003555m96005J17944l24884K48959K003815
2482A034838r64688l26770K46240l01327l95313M384J276734p11639j452361K83384
2472a306518N63341l32546J998557q63211m32191Q9116o87605j34153Q70059l30016
$$ plain form
2539 617603 -153128 354 -636380 -2295077 -663097 164512 -1382455 -1839225 -971065
2530 -971065 -631876 205300 702103 -99852 -139101 212588 707416 -11984 -273389 -1280786
2520 -1280786 -826714 -273386 -344624 -1096342 -22288 421015 -295091 -1590688 -481881
2511 -481881 -989478 308884 695504 698984 90225 -437411 -155271 597584 956392 -782545
2501 -782545 -1391992 -1812080 -1964005 -1342725 -880066 -1299243 -711211 -434138 -336135 -787994
2491 -787994 -1620609 175843 488564 -514991 -1010996 -893052 -1217936 -968977 1034838
2482 1034838 70150 -256620 -10380 -311707 -707020 -702636 574098 -137541 -1589902 -1306518
2472 -1306518 -743177 -1075723 922834 59623 -372568 -283452 -971057 -1105210 -235151 -565167
2462e65167O91042M96718m18468J61961p57729j006194m42860O68727K59316m07361
2452a320015j45811L32277J245711J034767q96774q98713l35617N78763j175867
2443a581279r53394K14514J123742L79369J01297M38456O7971p2390Q7880K47028
2433E3194J16293l27530k32844p45422J85968k06232m66250j16674L60771J92756
2423a185970j783167K86015J059876M77036L16601o36577P15401q79028N89694
2414a040119J38643l78308j464833N86773K25015j1641N23938N89031m30924K73638
2404i88787Q1258j137050Q2919J445462n65556M34787L76966o97512p59114O59264
2394a067363j82403m25306J307649j238763J311696L95557l97659p08402L56989
$$ plain form
2462 -565167 125875 622593 204125 366086 -391643 -1397837 -1840697 -1171970 -912654 -1320015
2452 -1320015 -1465826 -1133549 112162 1146929 250155 -648558 -984175 -405412 -1581279
2443 -1581279 -2534673 -2320159 -1196417 -817048 -715751 -277295 -209324 -281714 -193834 53194
2433 53194 169487 -158043 -390887 -1136309 -950341 -1156573 -1622823 -1739497 -1378726 -1185970
2423 -1185970 -2969137 -2683122 -1623246 -1146210 -829609 -1466186 -750785 -1629813 -1040119
2414 -1040119 -901476 -1279784 -2744617 -2157844 -1932829 -1944470 -1420532 -831501 -1262425 -988787
2404 -988787 -907529 -2044579 -1961660 -516198 -1081754 -646967 -270001 -967513 -1726627 -1067363
2394 -1067363 -1249766 -1675072 -367423 -1606186 -294490 101067 -296592 -1004994 -648005
2385f48005K39514m94535J72829N26229M92827p03942q47681L43845M31573q14194
2375a301540K77242N5088r88011m1005J269063j439130O6216M55729j25786j073542
2365b845676Q42957M36512N42775O05045p86609j753491J269836O87569L30511
2356f70571n90552K34325P35121p06899Q3456o31089N83195M90995q88553j359095
2346b719667N94373l59704R18663j099723M84546J77035K18958J28701M08287
2337a248531p5069O48816r11P54825j051073n09810J278418q05132j83194p09944
2327a901605M39001P10983n94319J20975r0741R90521P86048N21565q73924r42104
2317h33600K60212K16547k40841Q98414j28893p85145P58714k79800m73942M54694
$$ plain form
2385 -648005 -408491 -903026 -730197 -203968 288859 -415083 -1262764 -918919 -487346 -1301540
2375 -1301540 -1024298 -969210 -1957221 -1998226 -729163 -2168293 -2102077 -1646348 -1772134 -2845676
2365 -2845676 -2002719 -1566207 -1023432 -418387 -1204996 -2958487 -1688651 -1001082 -670571
2356 -670571 -1261123 -1026798 -291677 -998576 -915120 -1546209 -963014 -472019 -1360572 -2719667
2346 -2719667 -2125294 -2484998 -1566335 -2666058 -2181512 -2004477 -1785519 -1656818 -1248531
2337 -1248531 -1323600 -674784 -675695 79130 -971943 -1481753 -203335 -1008467 -1191661 -1901605
2327 -1901605 -1462604 -751621 -1345940 -1224965 -1315706 -325185 460863 982428 108504 -833600
2317 -833600 -573388 -356841 -597682 300732 171839 -613306 145408 -134392 -608334 -153640
2307a53640Q24084Q56564j890572M86604M53008q31251O8987J569901k13834j420692
2297b50841l72476L32063Q46773n63910M69901L31358L29922q08837j658310J715524
2287C71167j009746r02610R59425k27136R6228K46715p8229P97777M68177m76511
2277B45257J252911n33920n55768o06284n36820N69401J042204n54068N54836
2268H77749n65073n55775j349743N22212M57603n03801K122831N1573o98391l28314
2258C0871n23058P6449K4107J026548J527784j011447m75794J72886N68828n55786
2248H61388q13662N20253o08096L80563m4759q46903N53422l96614p45192m37788
2238a577388N72284J154634J66904n02228l19845o18031Q80078k49329P39708
$$ plain form
2307 -153640 670444 1527008 -363564 123040 576048 -255203 -186216 1383685 1169851 -250841
2297 -250841 -623317 -291254 555519 -8391 461510 792868 1122790 313953 -1344357 371167
2287 371167 -638579 -1541189 -581764 -808900 -712672 -465957 -544186 253591 721768 245257
2277 245257 1498168 964248 408480 -197804 -734624 -165223 876981 322913 877749
2268 877749 312676 -243099 -1592842 -1070630 -613027 -1116828 1006003 1057576 359185 30871
2258 30871 -492187 -415738 -391631 634917 2162701 1151254 675460 848346 1417174 861388
2248 861388 47726 567979 -40117 340446 295687 -551216 2206 -394408 -1139600 -1577388
2238 -1577388 -1005104 149530 316434 -185794 -505639 -1123670 -243592 -492921 246787
2229B46787L8852p9835m41815o01052O28503Q07092K74916r64571O07976j309223
2219g92370l10551P31388M50460K71364N12607j49978N74414q4748p58510M88926
2209I33002n53796L78695P10016j149490M00163N92260r63046r1920N19233L7720
2199H12837L08316O40847K68223L1481K28614j42674P16956N14168M13502j646475
2189B145795q92058K027684K98834j679745j482309j30360K66964P9604O86978
2180A321387J107248o05020k79452L98708p97110P12372M0238K3404j054062P75300
2170A643013Q63246Q85560j542882K2356M00711Q74181n34070m54162K31282Q48211
2160C237446R62953k37516o14482o76574M38688O29449r55647N46628O30408P13644
$$ plain form
2229 246787 285639 205804 -236011 -837063 -208560 598532 873448 -91123 516853 -792370
2219 -792370 -1102921 -371533 78927 350291 862898 712920 1287334 1202586 444076 933002
2209 933002 379206 757901 1467917 318427 718590 1310850 347804 255884 775117 812837
2199 812837 1121153 1762000 2030223 2061704 2290318 2147644 2864600 3378768 3792270 2145795
2189 2145795 1253737 3281421 3580255 1900510 418201 287841 554805 634409 1321387
2180 1321387 2428635 1823615 1544163 1942871 1145761 1858133 1898371 1921775 867713 1643013
2170 1643013 2506259 3391819 1848937 1871293 2272004 3146185 2612115 2157953 2389235 3237446
2160 3237446 4200399 3962883 3348401 2671827 3110515 3739964 2784317 3330945 3961353 4674997
2150D674997r46627k99722M4483q45185P47865o6066N07010M51471Q11168M71745
2140E551139J15085n85646j808j83561J269685N35851O72270m14030p45989q5833
2130F127163L91150l08658K149727P60789j396672M90256K26771R62281J367338
2121A0770145j387999J011317L72858m21938m59878k50877J55681P94862O81019
2112A1265190L04054p38746K74857J85934m91625k5706R09457N96505j024786
2103A1255134J884839O03359m57910L90779J160302J044955j84737K304274K540066
2094B0541061Q57969R62240J761255R01162K349311K941642J290144J457543L423096
2085C6485423K560155K226549K724614L035220K900254M875758N754912P701428
$$ plain form
2150 4674997 3728370 3428648 3473131 2627946 3375811 3309745 3816755 4268226 5079394 5551139
2140 5551139 5666224 5080578 5078770 4895209 6164894 6700745 7373015 6958985 6212996 6127163
2130 6127163 6518313 6209655 8359382 9120171 7723499 8213755 8440526 9402807 10770145
2121 10770145 9382146 10393463 10766321 10344383 9884505 9633628 9789309 10584171 11265190
2112 11265190 11569244 10830498 11105355 11291289 10799664 10773958 11683415 12279920 11255134
2103 11255134 13139973 13743332 13285422 13676201 14836503 15881458 15696721 18000995 20541061
2094 20541061 21399030 22361270 24122525 25023687 27372998 30314640 31604784 33062327 36485423
2085 36485423 39045578 41272127 43996741 47031961 49932215 54807973 60562885 68264313
2077F8264313P715141O590579P151697P325353Q950186J2988723J6269371K0066382
2069A55321745K4167084L3615323M3100985N6212196O9678087M6846098l9370172
2062C89571346o6055604n3782637n7152868l9995122k8478941k0519167j6846510
2055A06740497j1494788q730907p917772o920738l316548n817838m294321o072037
2047E2175548l959163l578907m919375m085874k878172l33893j533865j610206
2039B9276093n95632p25062l55319j774856j170127j741443q94954m93976l39436
2030B1185288j316114o65616o60432l11735j244490q03261j48608j699356k10861
2021A4124815n65916j083362J18059r25448l21653n79043n4653J0098N0425Q11588
$$ plain form
2077 68264313 75979454 82570033 89721730 97047083 105997269 118985992 135255363 155321745
2069 155321745 179488829 213104152 256205137 312417333 382095420 428941518 389571346
2062 389571346 323515742 269733105 212580237 172585115 144106174 123587007 106740497
2055 106740497 95245709 86514802 78597030 71676292 68359744 62541906 58247585 52175548
2047 52175548 48216385 44637478 39718103 35632229 32754057 32420164 30886299 29276093
2039 29276093 28680461 27955399 27600080 25825224 24655097 22913654 22018700 21524724 21185288
2030 21185288 19869174 19203558 18543126 18231391 16986901 16183640 16035032 14335676 14124815
2021 14124815 13558899 12475537 12593596 11668148 11346495 10767452 10712799 10722897 10773322 11584910
2011A1584910j279424j320353O24741o25931k43331N47747J50294j819331k05767
2002G413555J284044m92552o72662K50692j043986L98455l0276r51072K47182
1993F403380r61128o21228j383474J069093M11802P04678O4307j73945J630787
1984G144272j495069o47686N21318m68219P5523l87754k67416j244458M42813
1975C673324J153063j31332N07392k73622k022048K42845O21936k31000M00685
1966C941243n54709L0880Q55535j058572j178316l66422J93108O53359j127591
1957A388515o24008R77058J288370o57336Q92757k6403k23146m59218L92639l47580
1947B601648Q6144l24127m98583n31948N28714J05055n4089Q87722K05518o87885
$$ plain form
2011 11584910 10305486 8985133 9609874 8983943 8740612 9288359 9438653 7619322 7413555
2002 7413555 8697599 8205047 7532385 7783077 6739091 7137546 7107270 6156198 6403380
1993 6403380 5442252 4821024 3437550 4506643 4918445 5623123 5687430 5513485 7144272
1984 7144272 5649203 5001517 5522835 5054616 5130139 4742385 4474969 3230511 3673324
1975 3673324 4826387 4695055 5202447 4928825 2906777 3149622 3771558 3540558 3941243
1966 3941243 3386534 3417414 4272949 3214377 2036061 1669639 1862747 2516106 1388515
1957 1388515 764507 1741565 3029935 2372599 3265356 3238953 3015807 2556589 2949228 2601648
1947 2601648 2687792 2363665 1865082 1333134 1861848 1966903 1912814 2800536 3006054 2318169
1937B318169q99779L64776J196271N8269j427672p23477M11378O50372n08423
1928A439884O09883j152024p24896M54823j387104o4849N8040j328975L52266
1919a742952Q39332J158482R51974M90291o95582l49798R9852N4264k69973K66936
1909H02826J47680Q54202L50892p29048k70850l1798q82019J175055n34489m99015
1899C83436k30407J24846J141180r93048q91470K03939K29767O06048M94406j54507
1889I14190q22416M70709l96217k49401k90871L77505L40130L06212j179973J129712
1879E99580l64840k24865p65652j05148O66116N58335r15843m87257R03735j591609
1869a727448Q02535L43703q00261K37430j13591j269492N66418J922672K0282
$$ plain form
1937 2318169 1418390 1783166 2979437 3037706 1610034 886557 1297935 1948307 1439884
1928 1439884 2049767 897743 172847 627670 -759434 -824283 -766243 -2095218 -1742952
1919 -1742952 -903620 254862 1206836 1697127 1001545 651747 751599 805863 535890 802826
1909 802826 950506 1804708 2155600 1426552 1155702 1123904 241885 1416940 882451 383436
1899 383436 153029 277875 1419055 426007 -465463 -261524 -31757 574291 1068697 914190
1889 914190 91774 562483 166266 -83135 -374006 3499 343629 649841 -530132 599580
1879 599580 234740 9875 -755777 -860925 -194809 363526 -552317 -1039574 -135839 -1727448
1869 -1727448 -924913 -581210 -1381471 -1144041 -1257632 -2527124 -1960706 -38034 -17752
1860a7752j56540q83324L96882K61347p52804K27323J018068J359665n78381j705671
1850h31187j91914Q24587k70542Q73307R93786n84046j025920K46496j18135l60266
1840d43834o7133J196238L19329q48684r08267J748031L52731J39811l64745R44622
1830B068099Q5427j618746J02124J73899M95233k71446M7619M70954m67576O92070
1820A777657P87578r07961k07406k79721L7645j595507k38465J514831o10877
1811B77774L26736j377002L53864k93178P37462l72759M88171j86064q21381O00503
1801b65874q08921R7180m55808J601544o14965o13885Q80166J32507o04873O87382
1791C4453O29515q05718m59899r71411K476286J51755q6445j326204J46593o11642
$$ plain form
1860 -17752 -174292 -1057616 -660734 -399387 -1152191 -924868 93200 1452865 874484 -831187
1850 -831187 -1023101 -198514 -469056 404251 1398037 813991 -211929 34567 -83568 -443834
1840 -443834 -510967 685271 1004600 155916 -752351 995680 1348411 1488222 1123477 2068099
1830 2068099 2153526 534780 636904 810803 1306036 1034590 1082209 1553163 1085587 1777657
1820 1777657 2565235 1657274 1449868 1170147 1207792 -387715 -626180 888651 277774
1811 277774 604510 -772492 -418628 -711806 25656 -347103 141068 -44996 -866377 -265874
1801 -265874 -1074795 -977615 -1433423 168121 -446844 -1060729 -180563 -48056 -652929 34453
1791 34453 663968 -141750 -601649 -1573060 903226 1054981 968536 -357668 -211075 -822717
1781h22717k47524J057793r13601L6406M82605q46692j117786K154994P62522
1772E46000l004J73493k79280Q61107o85231o41567J39750K50524j82200m10608
1762b31016K91956j13504l63188q8603O61575R08430j260998J92516K25942k36363
1752a3253J71028l23661j482508O28171N97055n58103M36701p41480J109626N99435
1742D23011p8501j16773J045469j479072k1496k29954J21237m74262q59413j47693
1732a817447J427898J436771N69112q32476o52229j446293j396515J158104N75242
1723i77833j476325J235012N19733K97719J62444m07835p07078J035800P54186
1714D35823k21547j564013p07099J06899L011L50795L95623Q27834K06436k44530
$$ plain form
1781 -822717 -1070241 -12448 -926049 -889643 -407038 -1253730 -2371516 -216522 546000
1772 546000 542996 716489 437209 1298316 613085 -28482 111268 361792 179592 -231016
1762 -231016 60940 -52564 -415752 -504355 157220 1065650 -195348 -2832 223110 -13253
1752 -13253 157775 -165886 -1648394 -1020223 -423168 -981271 -544570 -1286050 -176424 423011
1742 423011 344510 227737 1273206 -205866 -227362 -457316 -336079 -810341 -1669754 -1817447
1732 -1817447 -389549 1047222 1616334 783858 131629 -1314664 -2711179 -1553075 -977833
1723 -977833 -2454158 -1219146 -699413 -401694 -239250 -647085 -1354163 -318363 435823
1714 435823 214276 -1349737 -2056836 -1949937 -1946926 -1596131 -1200508 -372674 -166238 -410768
1704d10768m83417J400386l92850L47190l96157k03834K94408n7109j009956K2777
1694h89330o05380M20867M78533N54733o48169p6201J005457J96377m50128J84612
1684A71371j049672O06773J81770K72817O51744r73033m68549p41141J421119
1675G3199m36520L93977m77288q63588j45307j25419j07737J85389J352971L51924
1665B01601m33247N30468L65050l70589j258610l59131k98384N86029L69391j69565
1655h36987j20010K60257R09463j268106J27934O34101k59725N07830N06239M08823
1645H69819l90257j525896L86147Q76894K30343j66153R85890j287009n17126
1636e37348n05809P41487n59704O85524N97623m68794J83930l96068N05198K51206
$$ plain form
1704 -410768 -894185 506201 113351 460541 64384 -139450 154958 97849 -912107 -889330
1694 -889330 -1494710 -1073843 -595310 -40577 -688746 -764947 240510 436887 -13241 171371
1684 171371 -878301 -271528 -89758 183059 834803 -138230 -606779 -1347920 73199
1675 73199 -363321 30656 -446632 -1310220 -1455527 -1580946 -1688683 -1503294 -150323 201601
1665 201601 -231646 298822 663872 293283 -965327 -1324458 -1622842 -1036813 -667422 -836987
1655 -836987 -956997 -696740 212723 -1055383 -927449 -293348 -553073 -45243 460996 869819
1645 869819 479562 -1046334 -660187 216707 447050 280897 1266787 -20222 -537348
1636 -537348 -1043157 -301670 -861374 -175850 421773 -47021 136909 -259159 246039 497245
1626D97245o49019j133906J742158K40910J13803j265251K88910Q28858k64764
1617C98944k124050P23038P66750K9689k27139j255418N3875Q08501K37602j485226
1607b073434J207976K98602J14198Q48494M75167k19289p87996M9346j438078
1598a525014J05288R64647N31645O20583n35082j340846O58923L18358r13108
1589a114606R09035M90383j233981N11279l35603J78356o17620M31670N09314
1580b71773m78171m67090R5360r16486K95962Q44594m67764J873789j47219o38866
1570b77664k3128p35443J161667j97262j396078O201P59693P64780j144684m70445
1560a552363L61929L25716J151213P60890r18263n89121Q58590o06535j17333
$$ plain form
1626 497245 -151774 -1285680 456478 697388 811191 -454060 -165150 663708 398944
1617 398944 -1725106 -1002068 -235318 -205629 -432768 -1688186 -1634311 -825810 -588208 -2073434
1607 -2073434 -865458 -566856 -452658 395836 871003 651714 -136282 -86936 -1525014
1598 -1525014 -1419726 -455079 76566 697149 162067 -1178779 -519856 -201498 -1114606
1589 -1114606 -205571 284812 -949169 -437890 -773493 -595137 -1212757 -781087 -271773
1580 -271773 -749944 -1217034 -1121674 -2038160 -1742198 -897604 -1365368 508421 361202 -277664
1570 -277664 -300792 -1036235 125432 -71830 -1467908 -1461707 -702014 62766 -1081918 -1552363
1560 -1552363 -1190434 -864718 286495 1047385 129122 -459999 398591 -207944 -325277
1551c25277L6278l73858Q52467p37326P01327R41830j309201m65877L2552M45814
1541b01271N14250j345405L66889L41904p78980M62510k25881j299093P92174
1532a372903o70960N86705J000450J621386j002901j400336o92399Q30332Q51716
1523b48910O16812M39390Q15792p49841n94094q24849N40749m22864m6843J674553
1513A199895j335987o17022R62173o15437J105915p72361j244250K88622J458760
1504D30308Q20420j068701n20867j332034N97308N60658Q52575o96483k40708
1495e97524J217299P5939o49995m24631J79355P28377J59438j289206j558956
1486b159904J666056N63135q65873p64140M62921J056956q8667l99160o06511
$$ plain form
1551 -325277 -288999 -662857 189610 -547716 153611 1095441 -213760 -679637 -647085 -201271
1541 -201271 312979 -1032426 -665537 -323633 -1102613 -640103 -865984 -2165077 -1372903
1532 -1372903 -2043863 -1457158 -456708 1164678 161777 -1238559 -1930958 -1100626 -248910
1523 -248910 367902 807292 1623084 873243 279149 -545700 -4951 -427815 -474658 1199895
1513 1199895 -136092 -753114 209059 -406378 699537 -72824 -1317074 -1028452 430308
1504 430308 1250728 182027 -338840 -1670874 -1073566 -512908 339667 -356816 -597524
1495 -597524 619775 695714 45719 -378912 -199557 528820 688258 -600948 -2159904
1486 -2159904 -493848 69287 -796586 -1560726 -1097805 -40849 -129516 -528676 -1135187
1477a135187L12563N7114L46815J226621k19551m52094j193410l63173l75764
1468a796066J363834M34899n66790K18952q3215m1794o88504J52989P01020j329460
1458a634135k24690O79067J056036j74430j211361q56623P91106R09310j03740
1449g69460J465450N63856j574763R1897K70836j394882L53163R19171Q50143
1440G75411r80292L04557k90199P05226J106115j541645L15700l62236K30465
1431B63102r6017n66775o76824J18820P16825K0991o36931J466332M79058k81126
1421H07455k93775L5042J030896j046854j200019N86402l9057l09279l62265Q43600
1411E2146r74037K67618J585440j510209p81040o95744K27371P52053R24202m07901
$$ plain form
1477 -1135187 -822624 -765510 -418695 807926 588375 136281 -1057129 -1420302 -1796066
1468 -1796066 -432232 2667 -564123 -345171 -428386 -470180 -1158684 -1005695 -304675 -1634135
1458 -1634135 -1858825 -1179758 -123722 -298152 -1509513 -2366136 -1575030 -665720 -769460
1449 -769460 695990 1259846 -314917 -223020 47816 -1347066 -993903 -74732 775411
1440 775411 -204881 99676 -190523 514703 1620818 79173 394873 32637 263102
1431 263102 167085 -399690 -1076514 -957694 -240869 -219878 -856809 609523 1088581 807455
1421 807455 513680 548722 1579618 532764 -667255 -80853 -119910 -429189 -791454 52146
1411 52146 -921891 -654273 931167 -579042 -1360082 -2055826 -1828455 -1076402 -152200 -560101
1401e60101p64241K57223K79490L39203j068856L33129J164108k44076n10544
1392g74665O64677k26048J426680J86484n43412o34633l77750K55401n43746J089617
1382E22605k71332q50360J21830k24505j37263j59200K18309r70691p3485J271041
1372e53051r3867M76489R90724j239410L15394k02969k1831j73049l28385J001721
1362A71766m93248N81542L66224j563563r72166N5232J188508N76848j32860K89513
1352F7796j13494K01616j713776J165007M26475N38475p86245p61073M5205N09990
1342d20024k0577o29807k67279R02768J67835L35126N17266q43528r1061N20965
1332A71684j900858N51433J50708J06433m22668M14603J094326j576262J19886
$$ plain form
1401 -560101 -1324342 -1067119 -787629 -448426 -1517282 -1184153 -20045 -264121 -774665
1392 -774665 -109988 -336036 1090644 1277128 733716 99083 -278667 -23266 -567012 522605
1382 522605 251273 -599087 -477257 -701762 -839025 -998225 -779916 -1750607 -1824092 -553051
1372 -553051 -646918 -170429 820295 -419115 -103721 -306690 -328521 -501570 -829955 171766
1362 171766 -321482 260060 626284 -937279 -1909445 -1854213 -665705 -88857 -221717 67796
1352 67796 -45698 155918 -1557858 -392851 33624 572099 -214146 -975219 -930014 -420024
1342 -420024 -440601 -1070408 -1337687 -434919 -267084 68042 585308 -258220 -349281 171684
1332 171684 -1729174 -1177741 -1027033 -920600 -1343268 -928665 165661 -1410601 -1290715
1323a290715J342258n09136J013363J66122Q596l18894k74772j976025O05183
1314a234020K50974j065691J152173o8125j50579M86950l58983n08497J640546
1305A44748J57777j52147j87286R48495p80622j355575Q46656j46734n21730j98180
1295a244598Q45843N33240j05782j308614j155559J276346O78092l9615J820484
1286A299837o3371j416129J92931l32321N05401j47588r62457N53044k22295m20343
1276a013291J06805q7010O41057K31463M64536m08083K34986K00351k5093p80516
1266d34795k63527l09072J282203J88485k33335q22728M84879o68016N04514m57779
1256g29171R80525L4926q36380R82067O22934q33973L72570Q19900j195816m08297
$$ plain form
1323 -1290715 51543 -457593 555770 721892 730488 411594 136822 -1839203 -1234020
1314 -1234020 -983046 -2048737 -896564 -964689 -1115268 -628318 -987301 -1495798 144748
1305 144748 302525 150378 -36908 911587 130965 -1224610 -377954 -524688 -1046418 -1244598
1295 -1244598 -398755 134485 28703 -1279911 -2435470 -1159124 -481032 -520647 1299837
1286 1299837 1236466 -179663 13268 -319053 186348 38760 -923697 -370653 -592948 -1013291
1276 -1013291 -906486 -993496 -352439 -120976 343560 -64523 170463 370814 345721 -434795
1266 -434795 -698322 -1007394 274809 463294 229959 -592769 -107890 -775906 -271392 -729171
1256 -729171 251354 286280 -550100 431967 1054901 220928 593498 1413398 217582 -190715
1246a90715O2892K08418k80506O29987j47195q16528o11181Q47802n53717P42828
1236a07915n79420j21472J77876m79589k40304J690947K70643q86341O0026O99399
1226D83850n83531r27346N68262l99848J26105n12017Q21843J056855o00924m93179
1216d59930j51081p27805P15605N263J135374J45433j025272k81940L77978N04929
1206B38554r1352j58410J80839k12380K35203Q91179n79519j521464O75650L20864
1196b0836O4105m16664l18740j082631J599839P71595n96860l80851Q76213k43846
1186B51324L66381n97865p08148L09828j332049l24400J385670K68719l67089
1177g47629L93825P78131m87891m79871J340512l71659j051648q1916p1203k90616
$$ plain form
1246 -190715 -127823 80595 -199911 430076 282881 -533647 -1144828 -297026 -850743 -107915
1236 -107915 -687335 -808807 -630931 -1110520 -1350824 340123 610766 -275575 -215549 483850
1226 483850 -99681 -1027027 -458765 -858613 -732508 -1244525 -422682 634173 33249 -459930
1216 -459930 -611011 -1338816 -623211 -617948 517426 662859 -362413 -644353 -266375 238554
1206 238554 147202 -11208 169631 -42749 192454 1083633 504114 -1017350 -341700 -20836
1196 -20836 43269 -373395 -692135 -1774766 -174927 596668 -192 -381043 495170 251324
1186 251324 617705 19840 -688308 -378480 -1710529 -2034929 -649259 -380540 -747629
1177 -747629 -353804 424327 -63564 -543435 797077 425418 -626230 -708146 -779349 -1069965
1167a069965J404438o19137O12754J24609j387166n68873O10360P03241N8402
1158a31337k53809J166900j368145j439757M78848P34733R44013o6836j749153
1149a684543K34420m60090J690676m01345M58469K41739Q57579L47092J79362
1140A463359m08084j601564Q51731J53458K70920J88685K15977j306194p80189
1131i51901J224485k34304O9764l43311k33439J35837R30204k36243j138243J99460
1121e77691p3813r69374L29444P43793n56584R99768K60416L76593M42202j169268
1111a94514l55229M55308j27156R2432j331509j28110J10511M66773J780681N40859
1101A310046m59555m9790m08774m46596P8241o54789l6092N18116L18530L07056
$$ plain form
1167 -1069965 334473 -284664 328090 452699 -934467 -1503340 -892980 -189739 -131337
1158 -131337 -385146 781754 -586391 -2026148 -1547300 -812567 131446 64610 -1684543
1149 -1684543 -1450123 -1910213 -219537 -620882 -162413 79326 936905 1283997 1463359
1140 1463359 1055275 -546289 305442 458900 729820 918505 1134482 -171712 -951901
1131 -951901 272584 38280 108044 -235267 -468706 -332869 597335 361092 -777151 -577691
1121 -577691 -651504 -1620878 -1291434 -547641 -1104225 -104457 155959 532552 974754 -194514
1111 -194514 -549743 -94435 -221591 -129159 -1460668 -1588778 -1478267 -1011494 769187 1310046
1101 1310046 850491 800701 391927 -54669 23572 -631217 -667309 -149193 169337 476393
1091D76393j40615N52952P95095j338299k54730J46177j86980L83454n66128q5532
1081b18213P3848P79820k24902k43151R03125o79958j01207m58470J7838K00481
1071D9211k49403m43090j23683J076337J00275l12455j306840J332591R83071
1062A106014J06481o17795L08953P85222K03569k34388J3583j133306m85159K24550
1052B77724J109517k45398m66886j283927p464K15295J195853j874381l74854
1043a454521J745734j48911j86068m54625K54952j391004q2870L59465N94775
1034g63073O55371M49358q1948P2858k87065K60018j228495N74917L95434Q62922
1024I10297j413273L27086Q93899L62714j109506j006123o50080L66723N44936
$$ plain form
1091 476393 335778 888730 1683825 345526 90796 236973 49993 433447 -132681 -218213
1081 -218213 -144365 635455 410553 167402 1070527 390569 289362 -169108 -151270 49211
1071 49211 -200192 -643282 -766965 309372 409647 97192 -1209648 122943 1106014
1062 1106014 1212495 594700 903653 1688875 1892444 1658056 1671639 538333 53174 277724
1052 277724 1387241 1141843 674957 -608970 -616434 -401139 794714 -1079667 -1454521
1043 -1454521 291213 142302 -43766 -498391 -243439 -1634443 -1717313 -1357848 -763073
1034 -763073 -107702 341656 259708 332566 45501 305519 -922976 -348059 47375 910297
1024 910297 -502976 -175890 718009 1080723 -28783 -1034906 -1684986 -1318263 -773327
1015g73327K67003K57825M28288Q18940q76701p50545N76140k74112n28333R97541
1005A42719l71115J17288J157995o57033q37091j00833r10032O05205Q48757L80441
995C76301j19595k22501j174508J121421L51439o46699M00345K04443N08614l89129
985D10131o53494j45029l75243O84970m5798J042660p35140l52043J07057r61935
975a023864R32613m52032N44680O75672j244839O58759L92465q00885N30315L2622
965B45506m62819p90866O99698N3514K80154Q94167Q16535R5335j344874m35133
955E1217K20584k08635M66324j57437m13362L59295n25665P67686l83233k64319
945h7545j419183m8346P37015R38412O14829j415183q82809J180857Q57569L08807
$$ plain form
1015 -773327 -506324 -248499 179789 998729 122028 -628517 -52377 -326489 -854822 142719
1005 142719 -228396 -111108 1046887 389854 -447237 -548070 -1458102 -852897 -4140 376301
995 376301 256706 34205 -1140303 -18882 332557 -314142 86203 290646 799260 410131
985 410131 -243363 -388392 -763635 -78665 -124463 918197 183057 -168986 -61929 -1023864
975 -1023864 -91251 -543283 1397 677069 -567770 90989 483454 -317431 212884 245506
965 245506 -217313 -1008179 -308481 -254967 25187 919354 1735889 1831224 486350 51217
955 51217 271801 63166 529490 372053 -41309 317986 -207679 560007 176774 -87545
945 -87545 -1506728 -1555074 -818059 120353 735182 -680001 -1562810 -381953 475616 784423
935G84423j032182p7324k96948R94680M10762M8867R68298n14131N16116N7507
925A860068j359618k71541n64868l41601K03534j07569N47336n73810N77319k38969
915b69719O93108L37303n93749K31776k37947j002829J089657n06818j226949
906a486167R92803J535837k51320j516320R17214O43387J219537J30600j028508
897A157063p89142k15240O65877p58847K80764K62659L10558j294913q29624O09830
887f01015O76583R75314j324307n10426M01968j64369K84018j98193K49950p06036
877i16513J244139o11189P6167R11153L16617P3903j23983n49487o92382L15068
867D3493l34407Q89078j180089J52296R57995j037141J043575J76073q46949m90150
$$ plain form
935 784423 -247759 -325083 -622031 372649 783411 832278 1800576 1286445 1802561 1860068
925 1860068 500450 228909 -335959 -677560 -474026 -581595 -34259 -608069 -30750 -269719
915 -269719 423389 760692 166943 398719 160772 -842057 247600 -259218 -1486167
906 -1486167 -493364 1042473 791153 -725167 192047 835434 2054971 2185571 1157063
897 1157063 367921 152681 818558 59711 340475 603134 913692 -381221 -1210845 -601015
887 -601015 75568 1050882 -273425 -783851 -381883 -546252 -262234 -460427 -210477 -916513
877 -916513 327626 -283563 -207396 703757 1020374 1094277 970294 420807 -271575 43493
867 43493 -290914 598164 -581925 -429629 528366 -508775 534800 710873 -136076 -626226
857f26226j729116N91767P66400k36002j80244O07844P12969k20496Q71846Q0052
847F38794K01685o78029o82587P8051J201745n46715K88152L97164o06763J04297
837C95794N26223k33687J99175j130290L77928j08801j99655J003690P40702n06837
827A064242j410003j59121p60698J42391J317283J8301q68951R63796J66784l96411
817G7613m22418j05067j69117N64583R70786J16566l50621j32857j67281P97434
807A179621o7246O82847o36835r4679r47312J31888p04864J49495M38455N26613
797F57983O97346j446745j494379L80934J15469r83868J843584J085430j120848
788b65094M9033O63717j036804K37734o92505Q77425L03061k94689o8771J056431
$$ plain form
857 -626226 -2355342 -1763575 -997175 -1233177 -1413421 -805577 -92608 -313104 558742 638794
847 638794 840479 162450 -520137 -442086 759659 212944 501096 898260 291497 395794
837 395794 922017 688330 887505 -242785 135143 26342 -173313 830377 1571079 1064242
827 1064242 -345761 -504882 -1265580 -1123189 194094 212395 -656556 307240 474024 77613
817 77613 -344805 -449872 -618989 -54406 916380 1032946 682325 549468 382187 1179621
807 1179621 1112375 1795222 1158387 1063708 116396 248284 -456580 -307085 131370 657983
797 657983 1355329 -91416 -1585795 -1204861 -1089392 -2073260 -229676 855754 -265094
788 -265094 -216061 447656 -589148 -351414 -1043919 -166494 136567 -158122 -226893 829538
778H29538j500529L81528J323727J3910l06257r65944Q8939j86340r2648o01397
768a015473J197893M61017p31989k07551R834q5262m55579L56031L93916p73144
758h50307O16838m8557J403670L49277K37823j148942J95494m00121J009477r54754
748D09898j562445l61529O82424J29881J744829J040940j659083l47031R27390
739A005274J82766j258810j133674K69014M11872j187976J648150R07542l79903
730D64255J75730J8074O930K18969O36094q65192J33423j53534L2715j1966o28361
719B7137j206921l35393J531775j57483K28848K75146n26835J29505J323554o09924
709F79409j374404l775O64232m23429M421J83259o79927P82319l4417n16523J67539
$$ plain form
778 829538 -670991 -289463 1034264 1048174 741917 -224027 -135088 -321428 -414076 -1015473
768 -1015473 182420 643437 -88552 -296103 -286269 -371531 -827110 -471079 -77163 -850307
758 -850307 -233469 -282026 1121644 1470921 1708744 559802 755296 355175 1364652 409898
748 409898 -1152547 -1514076 -831652 -701771 1043058 2083998 424915 77884 1005274
739 1005274 1188040 -70770 -1204444 -935430 -523558 -1711534 -63384 844158 464255
730 464255 639985 658059 664989 883958 1520052 654860 788283 634749 667464 655498 27137
719 27137 -1179784 -1515177 16598 -140885 87963 363109 -163726 -34221 1289333 679409
709 679409 -694995 -698770 -34538 -457967 -453546 -270287 -950214 -167895 -202312 -718835 -551296
698e51296O93152M55281l91670Q89465J60083l98885M9233n8269o84804O82362
688H44652J32839P22492l59841j75308j137293O55918q5988l76832Q36547j3379
678A043807j2826j188941o52922K09649L7403R98873l09408J95442j140445J427887
668F08519k10068j152334j75737K98346J239542J064874r62239j103320Q74566
659D82149k5093n98376m94567M82464j022045J121702n13575O50276n49822q79594
649a346481J375662M51286K79622O16080m77790j057175R60739o92689Q84J57281
639B67419K51627k71729L63553Q0614J46782l11499p7963p53089P97036K26203
629G18954L982n70848O26173M87642j998987p58716n70095J356031N41137p6270
$$ plain form
698 -551296 141856 597137 205467 1094932 1255015 856130 905363 847094 162290 844652
688 844652 977491 1699983 1340142 1164834 27541 683459 597471 220639 1057186 1043807
678 1043807 1030981 -157960 -810882 -601233 -563830 435043 125635 321077 -819368 608519
668 608519 398451 -753883 -929620 -631274 608268 1673142 710903 -392417 482149
659 482149 457056 -141320 -635887 -153423 -1175468 -53766 -567341 82935 -466887 -1346481
649 -1346481 29181 480467 760089 1376169 898379 -158796 801943 109254 110138 267419
639 267419 519046 247317 610870 691484 838266 526767 448804 -304285 492751 718954
629 718954 722936 152088 778261 1265903 -733084 -1491800 -2061895 -705864 -164727 -240997
619b40997k23088K252162m94517m18267p02159J335127L69719j147484j572453
610h41957Q92676K56823m02080J87668J88403k74277k93697N67169j67576K48687
600C61839j9984k45247r9993K91964L62125p50146n14348J026077J40556m19229
590A33614r58487J421067k23625q9255O94364k62036L24276n01845M66030J70860
580A174963p75863O30352n29275R77613o36148n13683m30623Q66957L40557j5164
570A089686K19999k12888o31760m28145m6290M15259N8960P79158m54901n02804
560B86274J545532K47889q52597j502342n21376O59269L25831j331452Q85223
551b57749N53978J021958J31032J50019q61681j057845L22830J70743o42345J324086
$$ plain form
619 -240997 -464085 1788077 1293560 875293 173134 1508261 1877980 730496 -841957
610 -841957 50719 307542 -94538 93130 281533 7256 -286441 280728 113152 361839
600 361839 341855 96608 -3385 288579 650704 -99442 -613790 412287 552843 133614
590 133614 -824873 596194 372569 283314 977678 715642 1039918 538073 1004103 1174963
580 1174963 399100 1029452 500177 1477790 841642 327959 -102664 764293 1104850 1089686
570 1089686 1309685 1096797 465037 36892 -9398 405861 464821 1243979 789078 286274
560 286274 1831806 2079695 1227098 -275244 -796620 -137351 188480 -1142972 -257749
551 -257749 296229 1318187 1449219 1599238 737557 -320288 2542 173285 -469060 855026
541H55026r93436j140739N87186J266328q17777r2119r10374P04900j2094n86880
531a139979J230987R1129l35038m08600j65061Q07686J13129Q26560n73252j91082
521B56479J151103K29978R76650q25425j064479l74432J222860O15615k61601
512A926748r07641N83561l69502r46042p94184P94866J27662l96498O24092J205159
502A848221m32141j106854K04576j177628M90353m43456J078142K81577l87586
493C55204M78717r03821N08777N48215J19529L69404p7120q50080k55791l50568
483e7534L04892R85645j34420N3843j233505L07759L53685J77277K29084L58204
473A344930R88413l6108k089007o6502J520254o77194l08200q19421M8480L59148
$$ plain form
541 855026 -138410 -1279149 -691963 574365 -243412 -335531 -1245905 -541005 -553099 -1139979
531 -1139979 91008 182137 -152901 -561501 -726562 81124 194253 1020813 447561 256479
521 256479 1407582 1637560 2614210 1788785 724306 349874 1572734 2188349 1926748
512 1926748 1019107 1602668 1233166 287124 -507060 287806 415468 18970 643062 1848221
502 1848221 1416080 309226 513802 -663826 -173473 -616929 461213 742790 355204
493 355204 833921 -69900 438877 987092 1106621 1476025 1398905 548825 293034 -57534
483 -57534 247358 1233003 1098583 1152426 -81079 226680 580365 757642 986726 1344930
473 1344930 2333343 2297235 208228 141726 1661980 984786 676586 -142835 -94355 264793
463B64793J34317r75723p73471N64576R88273J444871J22207q28455P22615p65357
453H98646L85964j518810m21233J55289L56064Q67241n36711r55269O15319L25647
443A72147Q58661q55006J41898J107853p20713l66790k91000Q57890k12179N82837
433A275598j371966j57846L69684m89337L55384P52863n6716j214859J418257
424H81062l32299n62184m21564P43362r31048K03692J179064q78771o51324J238839
414D68829o54282P01513n51432P25564K56276o0972K91866p45314K20044r3091
404E59001L23869K92458k13375n9703O63937j075024j968962P444J988393j307399
394g89361l30309k41108O02269O87260o29105o6856J178052L12922r24547N84906
$$ plain form
463 264793 399110 -576613 -1350084 -785508 202765 1647636 1769843 941388 1664003 898646
453 898646 1284610 -234200 -655433 -500144 -144080 723161 186450 -768819 -153500 172147
443 172147 1030808 175802 317700 1425553 704840 338050 47050 904940 692761 1275598
433 1275598 -96368 -254214 115470 -373867 -18483 734380 677664 -537195 881062
424 881062 548763 -13421 -434985 308377 -622671 -418979 760085 -118686 -770010 468829
414 468829 -185453 516060 -35372 690192 946468 885496 1177362 432048 652092 559001
404 559001 882870 1175328 961953 902250 1566187 491163 -1477799 -1470355 518038 -789361
394 -789361 -1119670 -1360778 -758509 -71249 -700354 -767210 410842 723764 -200783 384123
384C84123P36646o50628N37426m85852K09187Q54420n28216J89061P60592p12314
374A294445j2457N64640k88565N21692o20640j66282M82082j174980K3898l24181
364B99652Q82467O4748q46730m25244J419913k20768k46040l02467J82641N63372
354A371544l30133n07533j140139M76647m44284N93980P02944j56516M65395j87298
344H44607k011k37273K18392q80115P41300O85795m68531k10637o73404M92311
334E10434K67835p5807j63269j224143J146791k23037l48324M35966J051694j078208
324B99932p09954R03336J51993k5876Q28966j71313r92387K62604j002962J324983
314H69322N8110j12395J31307m27779m94198l84789N90088n47823k05259m8200
$$ plain form
384 384123 1120769 470141 1007567 521715 730902 1585322 1057106 1246167 2006759 1294445
374 1294445 1281988 1846628 1558063 2079755 1459115 1292833 1774915 599935 623833 299652
364 299652 1182119 1246867 400137 -25107 1394806 1174038 927998 625531 808172 1371544
354 1371544 1041411 533878 -606261 -129614 -573898 20082 723026 566510 1031905 844607
344 844607 842596 605323 823715 -56400 684900 1370695 902164 691527 18123 510434
334 510434 778269 702462 539193 -684950 461841 238804 -109520 326446 1378140 299932
324 299932 -410022 493314 645307 619431 1448397 1277084 284697 547301 -455661 869322
314 869322 927432 815037 946344 518565 24367 -360422 229666 -318157 -523416 -571616
304e71616q84609K24562K186367J113663r21645m24860J266408p39631o10370
295F38269K1232j306037P67484O73020N89176o07393p92198q9769J027339j47904
285G73219j120217J079665m65101o9868J468901o4301n72466j725791N10353M58242
275B72636N26395r11149Q46337m75789J52967R42193J34579N65104n67759N10305
265A995819k076965J17879L18809o73924J221671p58285R96776o60159m78468
256C153P79978o90259P19926p03086J74672J232962k62516L72826l63132q40313
246D24211o09404n38340R2485J761301J493126k609892r77299K336219n98507
237G73900l61252P47133O292l83026j127605Q54644N79027q34807L25106J020310
$$ plain form
304 -571616 -1456225 -1231663 954704 2068367 1146722 721862 1988270 1248639 638269
295 638269 659501 -646536 120948 793968 1383144 775751 -16447 -106216 921123 773219
285 773219 -346998 732667 267566 197698 1666599 1602298 1029832 -695959 -185606 272636
275 272636 799031 -112118 734219 258430 411397 1353590 1488169 2053273 1485514 1995819
265 1995819 -81146 36733 355542 -318382 903289 145004 1141780 481621 3153
256 3153 783131 92872 812798 109712 284384 1517346 1254830 1627656 1264524 424211
246 424211 -185193 -723533 -631048 1130253 2623379 13487 -963812 1372407 773900
237 773900 412648 1159781 1166073 783047 -344558 510086 1089113 254306 579412 1599722
227A599722k98364L23795k6000J33200l41522p05106L65263j92393j017713J680013
217A520895o3587N9947j15948N81893K38594j316334l41977J417565O16312j8064
207B579296j105447l08422L96014j024716M8896o44536L8599j01092k75168r17334
197a313910J549824k54618K24898P18313J56764j453618l20754R18660m46038
188b20479P78637j65614K47468J25283O92574j63808j496140p4760n47533J219769
178C95397m62636R70708K96190j024785m76922N07162N85457r62826J20001O30036
168E77782J59371L66521k01068j204530L91610L45985Q67571o1443k32246j91466
158H18087j60376J450185q22006n89446O03371q67859J203100K88241q39897K9480
$$ plain form
227 1599722 1301358 1625153 1599153 1732353 1390831 685725 1050988 858595 -159118 1520895
217 1520895 1457308 1517255 1401307 1983200 2221794 905460 563483 1981048 2597360 2579296
207 2579296 1473849 1165427 1561441 536725 585621 -58915 -20316 -121408 -396576 -1313910
197 -1313910 235914 -18704 206194 924507 1081271 -372347 -693101 225559 -220479
188 -220479 558158 392544 640012 765295 1457869 1294061 -202079 -276839 -824372 395397
178 395397 -67239 903469 1199659 174874 -302048 205114 790571 -172255 -52254 577782
168 577782 737153 1103674 902606 -301924 89686 435671 1303242 1241799 1009553 818087
158 818087 657711 2107896 1285890 696444 1299815 431956 1635056 1923297 1083400 1112880
148A112880K93714n18690k98968k5216m64300J274255o26737M077n78036r63588
138g90609J712150l19331p30607Q16398K90053P8175m75143n72405R82489j41295
128H49875p66254K29859m30421p0846Q61967K37710P50285j41446m00315m87284
118F33130N94435l08024L33685L00144K64902J06738q63835o92160K56594O63068
108A288677m33526J86612P20069j113282p12857J216201L58013r46761m3587J48005
98F67564J63790j087730K71174L90436J44653K15534n02795L89804N7779n69619
88A40590l07631K7522N71711j62241N32363P1456n47438N4737N78990L34012l10790
77I83281N25799K98019j053438p8644O10989o94562N21616J2934q56168P0641
$$ plain form
148 1112880 1406594 887904 588936 563720 99420 1373675 746938 751015 172979 -790609
138 -790609 921541 602210 -128397 688001 978054 1056229 581086 8681 991170 849875
128 849875 83621 313480 -116941 -187787 674180 911890 1662175 1520729 1120414 633130
118 633130 1227565 919541 1253226 1553370 1818272 1925010 1061175 369015 625609 1288677
108 1288677 855151 1041763 1761832 648550 -64307 1151894 1509907 563146 519559 667564
98 667564 831354 -256376 14798 405234 549887 765421 262626 652430 710209 140590
88 140590 -167041 -139519 432192 269951 802314 873770 326332 381069 960059 1294071 983281
77 983281 1509080 1807099 753661 675017 1286006 591444 1113060 1125994 269826 340467
67C40467P35790K07206o99183k87857j1382M57439M93289K99793o90890l69740
57D74932Q83610j38334r3418k32543J81460J2253K20380n5101L4803n08202K67034
46A046874k20752l72184n69409K02776k6116K78066N3580P14393L55441q89377
36E73292K31942J04170l33383j23905l81900m56990J164762N58334J79079K47485
26A762886r95124K02425j61633l35587n62598M8283P89845o04397N18677j16830
16E45947K26814P03317M52420j48519m24694M21133o094j468245o89670N84105
6A96514j17903R9791Q57399M3026K51492o1720
0A268599
$$ plain form
67 340467 1076257 1283463 584280 296423 285041 742480 1235769 1535562 844672 474932
57 474932 1358542 1220208 1126790 894247 1075707 1087960 1308340 1253239 1288042 779840 1046874
46 1046874 826122 453938 -115471 87305 61189 339255 392835 1107228 1462669 573292
36 573292 805234 909404 576021 452116 70216 -386774 777988 1336322 1515401 1762886
26 1762886 767762 970187 808554 472967 -89631 -41348 748497 144100 662777 545947
16 545947 772761 1476078 1928498 1779979 1355285 1776418 1770324 302079 -387591 196514
6 196514 78611 178402 1035801 1078827 1330319 1268599
0 1268599
$$ Imaginary data points
##PAGE= N=2
##DATA TABLE= (X++(I..I)), XYDATA
16383c053427l3755J83884N23144j47160M06668j80143j216135P23405m72272
16374c265791j59438O65431J86654J203239n31928J8949R80736l65445p09343
16365a976936J76424M13925l78053n10531K23935N07167n15660Q17402p2794m49758
16355a764879j42265K33865Q37252J67629L8577k66735j056533m52892n1767P96372
16345a661376O23026r26604O86163L44867r25352j08892o93301J559813J065751
16336c5905l66311l99775m63857Q17146k51803j44883l36737L8993n72513N41357
16326a174288J50440K52539j147931l9272J717610K16388j54615p89080j56138
16317a124347k25K48465o46759Q50482k38609n29451J36956O69977P24557p62822
$$ plain form
16383 -3053427 -3087182 -2903298 -2380154 -2527314 -2120646 -2300789 -3516924 -2793519 -3265791
16374 -3265791 -3425229 -2759798 -2573144 -1369905 -1901833 -1882884 -902148 -1267593 -1976936
16365 -1976936 -1800512 -1386587 -1764640 -2275171 -2051236 -1544069 -2059729 -1242327 -1315121 -1764879
16355 -1764879 -1907144 -1673279 -836027 -668398 -629821 -896556 -1953089 -2405981 -2457748 -1661376
16345 -1661376 -1038350 -1964954 -1278791 -933924 -1859276 -1968168 -2661469 -1101656 -35905
16336 -35905 -402216 -801991 -1265848 -448702 -700505 -845388 -1182125 -1143132 -1715645 -1174288
16326 -1174288 -1023848 -771309 -1919240 -1958512 -240902 -24514 -179129 -968209 -1124347
16317 -1124347 -1124572 -876107 -1522866 -672384 -910993 -1440444 -1303488 -633511 91046 -671776
16307f71776K10024O41571J9150n74662p28008L78053R09847o62409l32919K91591
16297e19538R6501n0394O2774m62938J093782q38828K44318L12j52691j9772L95880
16286a50594q3386M12677P65300j155105J096579Q52358q55394r56913N00116
16277D25638n59403k54948j25451k69260L11890n06434L35044R35492k94524J12856
16267A10900N14412M18628J92550j73040K57872n23014o28806K43346o46715l878
16257b37745P11566J32421Q33597J31186j007531N81545L9937p57896l18388l70272
16247b61580K02144J139130K07016k97536J91055j334726M19574K32046m0953
16238D56170j63550M79431L44042n7163l26669n11223Q50540n04711M97268R78482
$$ plain form
16307 -671776 -461752 179819 198969 -375693 -1103701 -725648 184199 -478210 -811129 -519538
16297 -519538 -423037 -473431 -410657 -873595 220187 -618641 -374323 -374011 -526702 -546474 -150594
16286 -150594 -233980 178697 943997 -211108 885471 1737829 882435 -74478 425638
16277 425638 -133765 -388713 -514164 -783424 -471534 -977968 -642924 292568 -1956 110900
16267 110900 625312 1043940 1236490 1063450 1321322 798308 169502 412848 -233867 -237745
16257 -237745 473821 606242 1439839 1571025 563494 1145039 1184976 427080 108692 -261580
16247 -261580 -59436 1079694 1286710 989174 1180229 -154497 265077 497123 456170
16238 456170 292620 772051 1116093 1058930 732261 221038 1071578 566867 1064135 2042617
16228B042617p70365o98811M27740P25835j87900L19337M11307l7692p05145o23123
16218I03800J077508l68261q09651n7309n06238R33182o18786p67224J48233L56466
16208B91720j9884l40301J709460P52364p58579n92912J1913Q68776k51691n65524
16198A105342Q29160o05147M8523n7521J342175p66271k047591M29855L79164
16189F57689J565082l64709P36658j06450j262301L86592M88574Q49551j859764
16180A090922o86386M97608J204169p4070q2301j206519P83202K79275q90153
16171I15747m8272o8163n97005j36855K141463M37418l65995n54351j21098J008587
16161B611476j426974l1483Q81496O59019k20007p78893K32967j62677k03993
$$ plain form
16228 2042617 1272252 573441 1001181 1727016 1539116 1858453 2269760 2232068 1526923 903800
16218 903800 1981308 1613047 803396 746087 239849 1173031 554245 -212979 -64746 291720
16208 291720 271836 -68465 1640995 2393359 1634780 1041868 1053781 1922557 1670866 1105342
16198 1105342 1934502 1329355 1377878 1320357 2662532 1896261 -151330 278525 657689
16189 657689 2222771 1858062 2594720 2488270 1225969 1612561 2101135 2950686 1090922
16180 1090922 404536 902144 2106313 2032243 1949942 743423 1526625 1805900 915747
16171 915747 867475 799312 202307 65452 2206915 2644333 2278338 1723987 1602889 2611476
16161 2611476 1184502 1153019 2034515 2693534 2473527 1694634 1927601 1764924 1560931
16152A560931p3120j84740k02206J214603r37249J05450J216204o36175L98408
16143B462106P49588o58314l8577J09249J9293o67537O50875k8665j897160l55979
16133C44879Q87599m86339p58410J598490j35100j20803O91533l4824j49051n35972
16123A302002l33108l05274L28798j74954M75544J1379l015R39251L23285M49893
16113C013801j004956p28230m6197J096153M27724r90493J01588P36957M48750
16104C055097k011487N51141O41454q09900m68567K028926O40447o21029r41075
16095B065007N55876j02107q45808l08256n26079O75007k96710J72892J58748
16086A548570L36128j37307L42528L2211r18599R06878K7804n26973K0203j1439
$$ plain form
16152 1560931 1487811 1303071 1100865 2315468 1378219 1483669 2699873 2063698 2462106
16143 2462106 3211694 2553380 2514803 2624052 2643345 1975808 2626683 2598018 700858 344879
16133 344879 1232478 746139 -12271 1586219 1451119 1330316 2021849 1987025 1837974 1302002
16123 1302002 968894 663620 992418 817464 1293008 1304387 1301372 2240623 2563908 3013801
16113 3013801 2008845 1280615 1234418 2330571 2758295 1767802 1869390 2606347 3055097
16104 3055097 1043610 1594751 2236205 1426305 957738 2986664 3627111 3006082 2065007
16095 2065007 2620883 2518776 1672968 1364712 838633 1513640 1216930 1389822 1548570
16086 1548570 1884698 1747391 2089919 2122130 1203531 2110409 2138213 1611240 1631443 1620004
16076A620004J21306p7427m18322l10961P80094J042014J87136k94574L63077
16067C012347m50373n89376j055733J509987K64422j508367N79612J57002n78532
16058A340989L80389L54459j049803k41954L68430O5550J044508J51759L20710
16049B735037p39200R59469K3131p65431P60056Q0540k62896P85520K01275k272795
16039A504706j004371Q85105R17582o51771p74294M60054K94053m97637r9597
16030A033830m05100J808511j92445P24028j287211L34116j8383k12049q28739
16021I56558K98140N07749r07858N84256q3351N22067L30426m82326j58684L62174
16011A929151k99471l823n01972J055213j76297n09093l42808K9407j30307M25818
$$ plain form
16076 1620004 1741310 1663883 1245561 934600 1714694 2756708 2943844 2649270 3012347
16067 3012347 2561974 1972598 916865 2426852 2691274 1182907 1762519 1919521 1340989
16058 1340989 1721378 2075837 1026034 784080 1152510 1218060 2262568 2414327 2735037
16049 2735037 1995837 2955306 2978437 2213006 2973062 3053602 2790706 3576226 3777501 1504706
16039 1504706 500335 1385440 2303022 1651251 876957 1337011 1631064 1133427 1033830
16030 1033830 628730 2437241 2244796 2968824 1681613 2015729 1997346 1785297 956558
16021 956558 1254698 1762447 854589 1438845 1355494 1877561 2207987 1725661 1566977 1929151
16011 1929151 1629680 1625857 1123885 2179098 2002801 1493708 1150900 1180307 1050000 1475818
16001A475818P40287K39399j290790O52185K20179J16299r00418r07744J328073
15992A673288n82221k42418J404041J46736p63956q8170J333891J45120k54878
15983B771433m6315n56665o72972O66340L63806q32031L62764j57061n5271r70341
15973H73687J26952P30246j22287r22593P62124k56809J92811j43025M77614Q31596
15963B550316q15251p67377J70260o07135M63655J48202O33318j67096j795965
15954a87073K301324Q1500m84321J0750R49544o23550N22533N10848p57940M56823
15944B780438P13580r07915N1257n47792m57895J69692K44836r67783J295462
15935B373880q84825K55914J77744k61804Q45327k68290J92959L0604M34994K70125
$$ plain form
16001 1475818 2216105 2455504 1164714 1816899 2037078 2153377 1252959 345215 1673288
15992 1673288 1091067 848649 2252690 2399426 1635470 1547300 2881191 3026311 2771433
15983 2771433 2725118 2168453 1495481 2161821 2525627 1693596 2056360 1899299 1844028 873687
15973 873687 1000639 1730885 1608598 686005 1448129 1191320 1384131 1241106 1718720 2550316
15963 2550316 1735065 967688 1137948 530813 994468 1142670 1775988 1608892 -187073
15954 -187073 2114251 2195751 1711430 1722180 2671724 2048174 2570707 3081555 2323615 2780438
15944 2780438 3494018 2586103 2637360 2089568 1631673 1801365 2046201 1078418 2373880
15935 2373880 1489055 1744969 1922713 1660909 2506236 2237946 2430905 2461509 2896503 3166628
15925C166628n19007N4974n06367j671083O3845L47809J69688l52182J378183
15916B132488o6594J093557j80421o20957l11706O39658j074608l28041P47972
15907B031348Q33115K04819k78079k03094j54089o20682m13244J25480m34651
15898A090923o5896j09730J050094L35837j087695m72488J278082O83648l6607
15889B666168m87785j233624J276497M66640j178616J99072l77948k25361K31213
15880A336256k4463J360083Q06410p48455o34608r17769J378353r3856j25802
15871B336149j09759K86035L70317n48453p91426J10182K80988J04069P16043
15862B754145r31424N51565n29784Q6102N52975J354038o69995o0842p52925j67078
$$ plain form
15925 3166628 2647621 2702595 2196228 525145 588990 936799 1106487 754305 2132488
15916 2132488 2065894 3159451 2979030 2358073 2046367 2686025 1611417 1283376 2031348
15907 2031348 2864463 3069282 2791203 2588109 2434020 1813338 1400094 1525574 1090923
15898 1090923 1025027 915297 1965391 2301228 1213533 741045 2019127 2702775 2666168
15889 2666168 2178383 944759 2221256 2687896 1509280 1708352 1330404 1105043 1336256
15880 1336256 1311793 2671876 3478286 2729831 2095223 1177454 2555807 2461951 2336149
15871 2336149 2226390 2512425 2882742 2334289 1542863 1653045 1934033 2038102 2754145
15862 2754145 1822721 2374286 1844502 1930604 2483579 3837617 3167622 3106780 2353855 2186777
15852B186777r3239k27395L17439K98306N7851j029991P55937M86732p02587m79965
15842A569865r95810N19890P86562k91164J65424k72086L09889O72865l11203
15833B154232j346736J001973m82689L22891O80011o70287p77744N30355J853895
15824C265901j111802m16057J68136L41129J13965p7447j204750q61924J635894
15815A853045J211353q71883o6930J725607p37066K51p82735J596712j473289
15806B455065j536593R9748J250924j66774o87912p12762P2848P85008O64148
15797B223700Q55151m11505o51836j548936K147236l41785o43497N44141q26266
15788A346403l63139p70271Q23437q5327J373435l82485Q1814n73686l03115R95740
$$ plain form
15852 2186777 2093538 1866143 2183582 2481888 2539739 1509748 2265685 2752417 2049830 1569865
15842 1569865 574055 1093945 1880507 1589343 1754767 1482681 1792570 2465435 2154232
15833 2154232 807496 1809469 1326780 1649671 2329682 1659395 881651 1412006 3265901
15824 3265901 2154099 1738042 1906178 2247307 2361272 2283825 1079075 217151 1853045
15815 1853045 3064398 2192515 2125585 3851192 3114126 3114377 2331642 3928354 2455065
15806 2455065 918472 1018220 2269144 2102370 1414458 701696 774544 1559552 2223700
15797 2223700 3078851 2667346 2015510 466574 2613810 2272025 1628528 2172669 1346403
15788 1346403 983264 212993 1036430 951103 2324538 1942053 2023867 1450181 1147066 2142806
15778B142806o64275M93378p80384O73746o40195L83434L56935j8172j52448L92652
15768B187477Q53558K39186q56952l92716o33986J46455P26402k7319J76015r9724
15758B318396j210258Q25515N56312p75315K26115M04843n33980J227212n06283
15749B532557l09712o27814J49252m1208Q89081k30650n83959O37968N01925o45277
15739B272163j348199K88389Q0834L87018N72300K24474J34103R04752r86020
15730B529814k91463q24694k98899q09646J868773J045434j613259r97498l383
15721F05179J418014M55995r99619J26804j10487k45761M30538K60261o5206J55994
15711B031712K10864k36878K16421n69343M74580J047097k68793j17272k84646
$$ plain form
15778 2142806 1478531 1971909 1191525 1865271 1225076 1608510 1965445 1947273 1794825 2187477
15768 2187477 3041035 3280221 2423269 2030553 1396567 1543022 2269424 2242105 2418120 2318396
15758 2318396 1108138 1933653 2489965 1714650 1940765 2345608 1811628 3038840 2532557
15749 2532557 2222845 1595031 1744283 1703075 2592156 2361506 1777547 2415515 2917440 2272163
15739 2272163 923964 1212353 1293187 1680205 2252505 2476979 2611082 3515834 2529814
15730 2529814 2238351 1413657 1114758 305112 2173885 3219319 1606060 608562 605179
15721 605179 2023193 2479188 1479569 1606373 1495886 1250125 1680663 1940924 1875718 2031712
15711 2031712 2242576 2005698 2222119 1652776 2127356 3174453 2905660 2788388 2503742
15702B503742j497136P02895N06440n14831K71724r88811K80980n185K15070O09960
15692B084848J013943p80850l48049J477964q40233n33924o53786m8026Q65011
15683B236898n54831J185285n47485M64591N50648q65398J88864L88029K05342
15674C251943l95331j281245q02349K81462P51054M30830o22996O0679J554598
15665C228645j008796n66689J0308O31810k57386r2759k18351R72315J44360n20733
15655B322724J30247n99060j25572P19317n70272o95462O2251M86877q8826j270171
15645C72053N67103J174385N05119j324783J147660M16447M22199j174789O96666
15636B802060L78533j005009j97527m998N21716n42005q34836J20968N11077P4734
$$ plain form
15702 2503742 1006606 1709501 2215941 1701110 1972834 984023 1265003 1259818 1474888 2084848
15692 2084848 3098791 2317941 1969892 3447856 2607623 2073699 1419913 1371887 2236898
15683 2236898 1682067 2867352 2319867 2784458 3335106 2469708 2658572 3046601 3251943
15674 3251943 2856612 1575367 773018 1054480 1805534 2236364 1613368 1674047 3228645
15665 3228645 2219849 1653160 1663468 2295278 2037892 1945133 1726782 2699097 2843457 2322724
15655 2322724 2452971 1853911 1728339 2447656 1877384 1181922 1244173 1731050 1642224 372053
15645 372053 939156 2113541 2618660 1293877 2441537 2857984 3280183 2105394 2802060
15636 2802060 3180593 2175584 1978057 1973059 2494775 1952770 1117934 1238902 1749979 1824713
15626A824713k35153l51029J816099k64176j356050Q47332M36536l95136L05630
15617B628766k85542j201214R68876k38715n2772J443846j745589J06826J207652
$$ plain form
15626 1824713 1589560 1238531 3054630 2790454 1434404 2281736 2718272 2323136 2628766
15617 2628766 2343224 1142010 2110886 1872171 1819399 3263245 1517656 1624482 2832134
$$ [...]
##END NTUPLES=NMR SPECTRUM
##END=
