##TITLE=1H_EC-3254(4-31)
 CDCl3, 8 sc, 
 5.07.2021
##JCAMPDX= 6.0         $$ Bruker NMR JCAMP-DX V2.0
##DATA TYPE= NMR SPECTRUM
##DATA CLASS= NTUPLES
##ORIGIN= UXNMR, Bruker Analytische Messtechnik GmbH
##OWNER= root
$$ XWIN-NMR		Version 3.5
$$ Mon Jul  5 11:38:49 2021 Russian Standard Time (UT+4h)  she@DPX200
##.OBSERVE FREQUENCY= 200.131506
##.OBSERVE NUCLEUS= ^1H
##.ACQUISITION MODE= SIMULTANEOUS
##.ACQUISITION SCHEME= undefined
##.AVERAGES= 8
##.DIGITISER RES= 18
##SPECTROMETER/DATA SYSTEM= spect
##.PULSE SEQUENCE= zg30
##.SOLVENT NAME= CDCl3
##.SHIFT REFERENCE= (INTERNAL, CDCl3, 0, 17.4971)
##AUDIT TRAIL= $$ (NUMBER, WHEN, WHO, WHERE, WHAT)
$$ ##TITLE= Audit trail, XWIN-NMR		Version 3.5
$$ ##JCAMPDX= 5.01
$$ ##ORIGIN= Bruker BioSpin GmbH
$$ ##OWNER= she
$$ F:/spectra/data/she/nmr/H-F/1/pdata/1/auditp.txt
$$ ##AUDIT TRAIL=  $$ (NUMBER, WHEN, WHO, WHERE, WHAT)
(   1,<2021-07-05 11:37:38.60 +0400>,<she>,<DPX200>,
      <created by zg, POWCHK disabled, PULCHK disabled
       configuration hash MD5:
       00 E9 B6 7A A2 85 ED C7 34 08 36 98 17 FE 4E 26
       data hash MD5: 16K
       10 DE F3 71 AD 1B 66 77 F2 22 61 CD E5 3E D4 4F>)
(   2,<2021-07-05 11:37:41.00 +0400>,<she>,<DPX200>,
      <Start of raw data processing
       efp BC_mod = 2 LB = 0.24 FT_mod = 6 PKNL = 1 PHC0 = -12080.41 PHC1 = 23.80099 SI = 16K 
       data hash MD5: 16K
       21 4A 5B AD AF 67 E0 93 96 00 96 65 4D 0E 9A 2F>)
(   3,<2021-07-05 11:37:56.03 +0400>,<she>,<DPX200>,
      <pk PHC0 = 4.451825 PHC1 = -8 
       data hash MD5: 16K
       23 B3 55 80 AB 0C D0 4D 2A 68 36 70 4C 5E 5B C5>)
(   4,<2021-07-05 11:37:59.03 +0400>,<she>,<DPX200>,
      <abs ABSG = 5 
       data hash MD5: 16K
       F0 E7 00 CB 7A 4C 98 F3 F9 4B AC 5E 51 E3 7B 34>)
$$ ##END=
$$ 
$$ hash MD5
$$ DC AE 55 6B A4 97 19 74 A7 EC D2 B9 F8 08 71 0E
##$RELAX= 
##$RELAX= 
##$RELAX= 
##$RELAX= 
##$RELAX= 
##$RELAX= 
$$ Bruker specific parameters
$$ --------------------------
##$DU= <F:/spectra>
##$EXPNO= 1
##$NAME= <H-F>
##$PROCNO= 1
##$TYPE= <nmr>
##$USER= <she>
##$AMP= (0..31)
100 100 100 100 100 100 100 100 100 100 100 100 100 100 100 100 100 100 
100 100 100 100 100 100 100 100 100 100 100 100 100 100 
##$AQSEQ= 0
##$AQ_mod= 1
##$AUNM= <au_zg>
##$AUTOPOS= <>
##$BF1= 200.13
##$BF2= 200.13
##$BF3= 200.13
##$BF4= 200.13
##$BF5= 200.13
##$BF6= 200.13
##$BF7= 200.13
##$BF8= 200.13
##$BYTORDA= 1
##$CFDGTYP= 0
##$CFRGTYP= 5
##$CHEMSTR= <none>
##$CNST= (0..31)
1 1 145 1 1 1 1 1 1 1 1 1 1 1 1 1 1 1 1 1 1 1 1 1 1 1 1 1 1 1 1 1 
##$CPDPRG= <>
##$CPDPRG1= <>
##$CPDPRG2= <>
##$CPDPRG3= <>
##$CPDPRG4= <mlev>
##$CPDPRG5= <mlev>
##$CPDPRG6= <mlev>
##$CPDPRG7= <mlev>
##$CPDPRG8= <mlev>
##$CPDPRGB= <>
##$CPDPRGT= <>
##$D= (0..31)
0 1.2 0 0 0 0 0 0 0 0.06 0 0.03 0 0 0 0 0.0002 0 0 0 0 0 0 0 0 0 0 0 0 
0 0 0 
##$DATE= 1625470658
##$DBL= (0..7)
120 120 120 120 120 120 120 120 
##$DBP= (0..7)
150 150 150 150 150 150 150 150 
##$DBP07= 0
##$DBPNAM0= <>
##$DBPNAM1= <>
##$DBPNAM2= <>
##$DBPNAM3= <>
##$DBPNAM4= <>
$$ [...]
##$SUBNAM3= <"">
##$SUBNAM4= <"">
##$SUBNAM5= <"">
##$SUBNAM6= <"">
##$SUBNAM7= <"">
##$SUBNAM8= <"">
##$SUBNAM9= <"">
##$SW= 20.0188882624521
##$SWIBOX= (0..15)
0 0 2 0 0 0 0 0 0 0 0 0 0 0 0 0 
##$SW_h= 4006.41025641026
##$TD= 16384
##$TD0= 1
##$TE= 0
##$TE2= 300
##$TE3= 300
##$TEG= 300
##$TL= (0..7)
0 120 120 120 120 120 120 120 
##$TP= (0..7)
150 150 150 150 150 150 150 150 
##$TP07= 0
##$TPNAME0= <>
##$TPNAME1= <>
##$TPNAME2= <>
##$TPNAME3= <>
##$TPNAME4= <>
##$TPNAME5= <>
##$TPNAME6= <>
##$TPNAME7= <>
##$TPOAL= (0..7)
0.5 0.5 0.5 0.5 0.5 0.5 0.5 0.5 
##$TPOFFS= (0..7)
0 0 0 0 0 0 0 0 
##$TUNHIN= 0
##$TUNHOUT= 0
##$TUNXOUT= 0
##$USERA1= <user>
##$USERA2= <user>
##$USERA3= <user>
##$USERA4= <user>
##$USERA5= <user>
##$V9= 5
##$VALIST= <valist>
##$VCLIST= <CCCCCCCCCCCCCCC>
##$VD= 0
##$VDLIST= <DDDDDDDDDDDDDDD>
##$VPLIST= <PPPPPPPPPPPPPPP>
##$VTLIST= <TTTTTTTTTTTTTTT>
##$WBST= 1024
##$WBSW= 4
##$XGAIN= (0..3)
0 0 0 0 
##$XL= 0
##$YL= 0
##$YMAX_a= 10463
##$YMIN_a= -8096
##$ZGOPTNS= <>
##$ZL1= 120
##$ZL2= 120
##$ZL3= 120
##$ZL4= 120
##$ABSF1= 17.50322
##$ABSF2= -2.51582
##$ABSG= 5
##$ABSL= 3
##$ALPHA= 0
##$AQORDER= 0
##$ASSFAC= 0
##$ASSFACI= 0
##$ASSFACX= 0
##$ASSWID= 0
##$AUNMP= <proc_1d>
##$AZFE= 0.1
##$AZFW= 0.1
##$BCFW= 0
##$BC_mod= 2
##$BYTORDP= 0
##$COROFFS= 0
##$CY= -3
##$DATMOD= 1
##$DC= 0
##$DFILT= <>
##$DTYPP= 0
##$F1P= 0
##$F2P= 0
##$FCOR= 1
##$FTSIZE= 16384
##$FT_mod= 6
##$GAMMA= 0
##$GB= 0
##$INTBC= 1
##$INTSCL= 1.334414e-10
##$ISEN= 128
##$LB= 0.24
##$LEV0= 0
##$LPBIN= 0
##$MAXI= 10000
##$MC2= 0
##$MEAN= 0
##$ME_mod= 0
##$MI= 1.114404
##$NCOEF= 0
##$NC_proc= -11
##$NLEV= 6
##$NOISF1= 3.799351
##$NOISF2= 2.8
##$NSP= 0
##$NTH_PI= 0
##$NZP= 0
##$OFFSET= 17.49711
##$PC= 1
##$PHC0= -12075.96
##$PHC1= 15.80099
##$PH_mod= 1
##$PKNL= yes
##$PPARMOD= 0
##$PSCAL= 0
##$PSIGN= 0
##$REVERSE= no
##$SF= 200.130007508227
##$SI= 16384
##$SIGF1= 3
##$SIGF2= 2
##$SINO= 5.538805
##$SIOLD= 16384
##$SREGLST= <1H.CDCl3>
##$SSB= 0
##$STSI= 16384
##$STSR= 0
##$SW_p= 4006.41025641026
##$SYMM= 0
##$S_DEV= 0
##$TDeff= 16384
##$TDoff= 0
##$TI= <>
##$TILT= no
##$TM1= 0
##$TM2= 0
##$TOPLEV= 0
##$USERP1= <user>
##$USERP2= <user>
##$USERP3= <user>
##$USERP4= <user>
##$USERP5= <user>
##$WDW= 1
##$XDIM= 16384
##$YMAX_p= 423228083
##$YMIN_p= -5718554
$$ End of Bruker specific parameters
$$ ---------------------------------
##NTUPLES= NMR SPECTRUM
##VAR_NAME=  FREQUENCY,     SPECTRUM/REAL,   SPECTRUM/IMAG
##SYMBOL=    X,             R,               I
##VAR_TYPE=  INDEPENDENT,   DEPENDENT,       DEPENDENT
##VAR_FORM=  AFFN,          ASDF,            ASDF
##VAR_DIM=   16384,         16384,           16384
##UNITS=     HZ,            ARBITRARY UNITS, ARBITRARY UNITS
##FACTOR=    0.24454680195387, 1,            1
##FIRST=     3501.69682908422, 0,            0
##LAST=      -504.713427326039, 0,           0
##MIN=       -504.713427326039, -5718554,    0
##MAX=       3501.69682908422, 423228083,    0
$$ Real data points
##PAGE= N=1
##DATA TABLE= (X++(R..R)), XYDATA
$$ [...]
7156 -1088770 -822947 -646838 67556 -74773 -856194 94732 94763 318995 -1022675 -596312
7146 -596312 -589895 -1715585 -1154490 -567901 -806037 457880 1085917 689348 348786 -284912
7136 -284912 -519097 360621 -29945 25108 -565285 325475 734876 -435296 -1341391 -1123180
7126 -1123180 -453370 23539 853286 1186526 1046109 955497 1275103 -702497 -495581 -929364
7116 -929364 -147012 -1044604 -1541790 -1378013 -423093 -1100599 -1694705 -149196 -95714 -664059
7106 -664059 -4226 -63894 -190322 -851111 -380905 749837 21934 -193880 184086 -779660
7096 -779660 -676107 -78379 -195978 514598 370454 429106 376628 -234591 -197690 -62793
7086 -62793 -230067 -89797 79092 653879 -545034 -2024583 -1789840 -692208 -378948
7077 -378948 102179 654514 44538 -1077810 -1285463 -1430912 -505220 -215343 -254750 -1126932
7067 -1126932 -999285 -59321 -895150 -885233 -1525007 -596707 -534394 -844483 -664501 -923784
7057 -923784 -222709 -170455 -364907 326 519910 -608120 -1409922 -150368 -51433 -323613
7047 -323613 61948 -322707 -758028 -723192 73015 -625899 -1225040 -637281 614876 -531258
7037 -531258 -811520 307145 -56803 -816676 -372315 791475 1064842 -218820 -238371
7028 -238371 -396940 -590897 -1499505 -1285064 -2760651 -1952819 -1558082 -1765341 401352
7019 401352 459342 591645 442685 21058 392862 1371678 577790 1004326 597394 273512
7009 273512 -410455 -876551 360086 1188247 181091 99495 -440326 334782 459494 -1058015
6999 -1058015 -1568017 -996373 -86407 308764 -694044 -1067475 204741 423428 240969
6990 240969 -1315198 -34585 255460 64308 7271 -1156659 -1065720 -1006129 164945 -887290
6980 -887290 -1086686 -629083 -826942 -317591 745287 362037 453207 -440096 158888 288504
6970 288504 -662951 66374 -120168 382335 141130 -758382 651206 882059 1049403 -419270
6960 -419270 -983694 -838135 -185656 -658115 -1003543 -171766 -468594 1061474 844086 -1002110
6950 -1002110 -1283513 -818087 -1080987 -296053 -524800 166309 -816208 -911551 -1028289 53492
6940 53492 -50760 600030 -727105 -1191255 450110 561089 614497 235081 -229606 -663599
6930 -663599 -698426 590830 -439922 224759 1578988 852211 463239 770046 1809134
6921 1809134 318096 -744130 -1300874 -1375435 -672760 345409 466614 292334 -927794
6912 -927794 -956926 -463729 -1823283 -1968168 -72517 594142 -615533 -1583803 -811355
6903 -811355 -361756 832348 448945 -31656 295699 100043 619891 -39306 253357 754743
6893 754743 -691079 92545 1286489 490219 124405 584364 1316792 -296512 -259540
6884 -259540 362235 -724506 275691 462901 1060625 250901 239186 86989 609532 154287
6874 154287 -822758 -559317 -394175 -1507375 -1395040 -1292162 -743168 341931 -652810
6865 -652810 -1434678 49844 311277 1043408 1715256 971957 -580956 -1519165 -921851
6856 -921851 -561636 -1399310 -92419 722019 -781940 233696 488690 -33978 -390091
6847 -390091 165742 438745 891101 541915 773722 737236 -287603 -1135574 -774505 -95468
6837 -95468 462597 347163 588050 -132527 -378342 -136063 706684 -68940 -427089 1051187
6827 1051187 596546 615717 484621 163438 -472805 461474 -620636 -832599 353937
6818 353937 -66028 590530 923347 716296 290866 1513468 575384 -759100 -801039 -27170
6808 -27170 -700785 -1093592 395198 222976 -1319514 282927 -63317 143399 -724253
6799 -724253 -401867 -893014 -525433 -411795 -27147 -4916 26307 -275833 574555 796120
6789 796120 864841 683513 -51857 341339 -99314 -399531 -514071 -835297 -321111 450433
6779 450433 388806 1189110 -373251 -485501 590816 799218 -487991 459085 -458123
6770 -458123 -456207 -297368 -404462 27827 -719844 -1118750 -417117 -403531 523389 490072
6760 490072 -160007 -803941 770914 777247 -400184 -1127403 -1163404 -123450 545197 423198
6750 423198 308515 -667324 -423427 93811 1966319 2709363 1860764 1156286 608560 837056
6740 837056 357811 -714963 1187472 1340272 1326967 1393545 -355939 124513 172846 264886
6730 264886 -571413 -486887 -590849 257677 220472 -737403 27738 1134735 1330320 1416141
6720 1416141 925531 1343899 939517 -245228 243376 15317 -707895 -436971 -412446 -459176
6710 -459176 -740815 -859977 169693 1232738 985639 173577 646319 474433 1354811
6701 1354811 897888 205099 -56495 -1015387 295309 1395507 -168651 -711754 -827772
6692 -827772 -188519 565210 -282330 -1172782 68357 140447 -513520 417453 103226 143945
6682 143945 767316 1582588 191858 -390444 -116233 -277302 16168 -334507 -559251 -1417575
6672 -1417575 -1184715 -1167301 -1794618 -779981 -175549 832869 1062308 -530839 560441
6663 560441 1424223 920970 431945 -61622 -224453 -228702 1385389 -181496 -352186 673691
6653 673691 769273 838701 230431 -361724 -1447498 -362683 -436601 -280753 1138028 413068
6643 413068 207175 -784826 -531771 -918682 -818538 -289072 581233 -207981 -476745 1284887
6633 1284887 949008 -115529 -404004 362921 924826 -692724 -2302893 -2738302 -1217382
6624 -1217382 -674387 22303 38732 -355059 -272302 -498565 -1831124 -1716521 68714 969794
6614 969794 861940 -326647 -36378 508154 56962 124968 -191575 -677018 -127970 -779150
6604 -779150 -648941 1001530 2465917 2609135 1585962 989389 -524056 -835339 92436
6595 92436 353726 -758916 -1508571 -855637 646883 558650 860968 1106918 738566 614693
6585 614693 66183 -686898 -557602 1497933 1611458 1214009 -26494 771867 414271
6576 414271 1070770 902852 -140706 -1359949 -778119 -70488 -147746 -259340 228825 7091
6566 7091 -183562 -14207 -254322 -334559 -287827 763766 801228 1356986 1740808 514786
6556 514786 -752534 -2147073 -1048658 -256909 -8382 383151 -222191 -757524 235096
6547 235096 660653 1176830 894783 192112 227910 -267486 -1496061 -1562564 -1196925 -297969
6537 -297969 255211 -14120 -722450 454857 1220767 189667 1050718 396144 54850
6528 54850 -297044 -515561 -491363 335957 172521 65163 -70119 -534891 -1472769 -396136
6518 -396136 -523254 152355 1629781 245403 -168250 805617 1337711 508701 -55123
6509 -55123 -1159026 -676052 555531 -215995 -1281871 -899751 594528 441516 -627564
6500 -627564 -532573 725833 811521 -196008 1238141 1548038 -117001 -897372 -1522602
6491 -1522602 -398643 -131475 -1106088 -298839 310104 183245 -604579 -351111 605808
6482 605808 -329500 827411 1095124 746364 1046030 846907 453514 876687 -260590
6473 -260590 -118417 262698 -384927 -612780 -1520090 -926977 -531279 -1283879 -1138899 -963777
6463 -963777 -531524 265867 313386 165909 138853 406222 178679 -524866 -718997 -391780
6453 -391780 80047 -207165 489002 937158 28258 122998 -899858 -504936 902849 920796
6443 920796 967538 231145 992668 937132 -331259 919579 671623 210178 608491 376542
6433 376542 -30750 -158351 -352517 -48089 -402106 -359592 539367 -171715 -115518 -860366
6423 -860366 -145582 -242013 -592176 994352 -338054 -1154866 127695 -22727 822304
6414 822304 1326907 491254 881068 -831226 -867086 333944 951647 815153 265558 -1284029
6404 -1284029 -434707 641597 18773 240116 -139465 -1554578 -570433 54232 935172
6395 935172 756628 608548 256200 -1163211 -995525 -867903 342805 -1295149 -860633
6386 -860633 1019721 920478 1413549 664605 -120323 1019605 1215336 20706 344716
6377 344716 840067 268874 247175 -819071 -1130086 182393 155506 -1418379 -1201999 -497377
6367 -497377 -735127 -1017367 -737533 247812 679743 434462 607661 338765 -1007541 -1297717
6357 -1297717 -794017 -1202764 -1289440 -1412008 -1176020 -645722 382216 819617 1726996 2311041
6347 2311041 631836 344977 133571 -1204006 -597273 467510 -419837 -68671 -612383
6338 -612383 -187616 907999 899576 -238590 1525538 1044889 379411 303856 1376498 926326
6328 926326 -396411 1173621 544548 202034 444173 389643 -932687 264924 157745
6319 157745 -321505 -1548970 -926792 -956672 -1299528 -1134465 188270 743610 -869793
6310 -869793 -155934 -317410 -148691 228618 -736224 -1267374 -805118 1261066 -131018
6301 -131018 -3786 -1731766 -1288344 -118531 -603046 -453788 87212 826035 -201366
6292 -201366 -144259 -767616 238644 260407 -421032 -485068 198803 99855 49118 210342
6282 210342 -134524 -412701 -271038 -418068 -191656 -482057 391497 -1416511 -377143
6273 -377143 -480636 -141902 -89620 -408630 -1067718 -938497 279804 127948 882055 320144
6263 320144 275839 -375012 -732169 -688773 -1160165 -1549289 -1452023 -475368 1007425 -144520
6253 -144520 -1322446 -445895 151137 503889 385042 157713 1017877 392494 339789 986808
6243 986808 1463239 134276 -1109294 -1236591 249274 -263422 -1036013 -572995 -714150
6234 -714150 -472387 240691 -449006 -166170 209908 -47992 705488 36184 -928691 -607031
6224 -607031 4598 -346127 383445 -114474 -621627 91851 811805 157552 -621649 -411508
6214 -411508 -320443 -523700 -819122 191375 -817066 171712 474552 -180093 52936 -562205
6204 -562205 337728 776012 514827 1011486 405814 -910293 109463 191817 -141201 -557515
6194 -557515 -432201 -554607 -981042 -704299 -686623 -38973 149706 -1270495 -1043614 -1145689
6184 -1145689 -843986 -446725 -2106526 -1933230 -1108934 -635480 18710 37248 -958503 -1518004
6174 -1518004 566081 400353 243403 73547 3233 -70022 546719 494022 563597 208344
6164 208344 449314 1047964 288735 1015113 -432802 60773 1168601 196874 -453081
6155 -453081 -112648 300166 -319209 -1216452 -1212112 -105109 705403 1400759 124748 -899241
6145 -899241 -688619 194359 -204308 -460268 -829224 -435276 70493 -125774 -716265 -1785306
6135 -1785306 -564271 295857 736291 959626 -18775 -1681112 -475161 -249296 -614669
6126 -614669 -1203611 -805032 -2240627 -2075650 -1066436 -1023005 -719705 318282 -947773
6117 -947773 -1295879 -474528 345849 -729855 -404036 -1092644 -1496156 -938912 -890738 386471
6107 386471 1472717 839992 -117528 25749 543333 504926 -664024 -1283420 357913
6098 357913 580123 533542 1170814 1107129 475229 -202908 -178389 -201798 332674 -312275
6088 -312275 -285271 494886 341618 -646016 201427 -123786 196263 570707 782555 919153
6078 919153 2012157 512150 -793338 -177081 -591288 -809466 -504398 -411369 -224312
6069 -224312 -1049076 -461921 -1314813 -19862 -540273 9544 -608366 -373231 -1053160 -593795
6059 -593795 -1188908 -534913 119671 -1280818 606555 362689 -467979 -200797 66996
6050 66996 82968 -33529 -1018687 -912345 -809449 -449314 -892259 -1169844 732254 79569
6040 79569 283432 -397555 -1037102 256337 -856147 94262 -776239 910920 310016
6031 310016 -71804 830012 -540969 -856559 -1178725 -1519359 -291030 513827 717922
6022 717922 -470222 -430388 -22771 -175237 836998 1013915 -24343 -1298618 -1998288
6013 -1998288 -1813075 -701473 -19391 -1058044 -1037621 241680 -135557 -65752 -924922
6004 -924922 -777428 -253632 -617053 -1312626 -1762651 -1463349 -2121058 -1253538 -488275 -672061
5994 -672061 -819086 -845797 -1191350 -1953425 -1989887 -792781 197644 421472 -674947 -606462
5984 -606462 -1061317 -296189 -168121 -1377516 -1714057 -911491 -479614 7142 -729794 722108
5974 722108 1892053 465746 -540493 -666585 -1130855 -1489774 -887254 -239392 173197
5965 173197 -107647 -982523 -914271 -1255108 -446715 458492 329932 182658 -48973 16284
5955 16284 -1647679 -2122779 -639001 364527 857925 237095 -773527 -1003513 -1234001
5946 -1234001 -402902 679353 630392 46699 392250 -138590 -310658 434424 1523460
5937 1523460 414068 250990 417414 632217 226919 60793 -530228 -94897 351651
5928 351651 906745 57041 -110029 -261911 439909 639842 2019153 2476792 1639595 2285431
5918 2285431 2918615 2730411 1652298 1122690 989948 833522 568423 760248 1086829
5909 1086829 1723662 1905627 2143838 3245120 3597800 3983216 3466195 2234648 2672295
5900 2672295 1996415 2110911 2230745 1562315 1824443 3660524 2649782 2124341 1929793
5891 1929793 1601585 2351015 2114947 1143774 1201492 96190 223572 573705 1374308 1689786
5881 1689786 1095732 495305 -766716 -1087949 16224 -902079 -1664024 1201134 1771192
5872 1771192 1101313 242686 -609633 -1636976 -1678709 35526 208800 596177 -436232
5863 -436232 102155 939957 -38125 -155197 145878 59838 103305 977415 895973 726392
5853 726392 1078280 816433 633212 489434 287845 1498082 626650 2249590 2844242
5844 2844242 1305816 1643708 2288285 3303158 3273891 2593553 2239271 1982580 674837
5835 674837 45389 797215 725976 526869 671402 196911 314802 1304670 1650219 1190262
5825 1190262 1910064 1606749 1327751 1352192 1221735 1678490 1492554 772035 525055 726354
5815 726354 1158481 1531632 1948164 1076826 -228086 175060 -331007 -374341 148515 111297
5805 111297 -845337 198892 976667 399433 6317 -402316 226283 -343996 363985 2052106
5795 2052106 850875 -17988 688275 780566 1548198 1756010 1961934 2054706 996185 -384840
5785 -384840 -504765 -394244 328622 970468 -838444 109753 125921 -567224 -1313369 -677878
5775 -677878 -649798 -1439772 -2086223 -279335 -81882 -1328540 -558040 150372 683424 853161
5765 853161 79376 -183749 774091 581014 1013640 433356 78238 -9907 804396 -36975
5755 -36975 -481146 -871322 407337 341723 -983934 -596152 -885075 204240 -15222 38739
5745 38739 -1223526 -1031935 -653446 957792 582972 627663 253648 -330993 -172316 -1115849
5735 -1115849 217640 -778474 -734138 -1005525 -462350 127046 -71324 119728 -662405 -863459
5725 -863459 -399395 -904659 -790129 -1677133 -1357558 -964237 -659504 -168596 112468 -772079
5715 -772079 -573828 977464 107252 39183 85629 -799774 -39052 -117004 95073 -1060353
5705 -1060353 -1338678 -570613 321329 -569461 -293131 -251355 -1128411 -1109349 -873769 114194
5695 114194 -458339 -1010318 -254375 51187 -120761 -277490 -590636 -234334 78890 1547671
5685 1547671 369653 -135830 534321 851447 747139 -1108168 -125195 -232450 96706
5676 96706 1198320 872607 715697 1146512 619406 499609 389419 395136 -292896 -25862
5666 -25862 -19435 619817 977933 1366327 587360 -313892 -348441 -141189 -113578 -1207922
5656 -1207922 1219284 1024989 963288 3066695 1892786 160635 -2983 -603379 346216
5647 346216 662573 562991 1219411 1702072 1964000 1493478 432506 427852 -507031 541318
5637 541318 40633 212571 1503002 1866956 186474 -464510 -113935 890794 -151826
5628 -151826 354599 224279 1348353 2433474 1613965 1090369 858639 1089842 1172926 329535
5618 329535 1311257 917394 871017 1090154 1718980 731425 -440097 -364243 1605610 1007859
5608 1007859 449278 1215797 1392402 1229284 558511 1443218 136586 358189 62872
5599 62872 1177268 1475793 1848173 2221419 2324805 1277697 871104 1094928 602179 843271
5589 843271 1806010 1453490 524780 373203 1141293 714248 1485986 651013 908010 903553
5579 903553 1052763 1502808 1342104 664054 482213 1622816 2054317 1043278 286082
5570 286082 1061839 2566002 2297620 1276557 -243177 -322542 398783 -423940 -234751
5561 -234751 697875 205284 2042634 984327 98293 401785 814759 498343 341989
5552 341989 626303 477731 661768 1011842 430929 536226 1153900 1288610 646661 -117073
5542 -117073 714992 1217550 1278622 306803 -256930 149247 897564 691150 1568867 1002223
5532 1002223 211362 1299744 2194441 2674756 2008016 1085321 473954 482207 -265619 -878220
5522 -878220 18817 369009 -306286 -1192727 -498797 -53003 836213 -626131 -716743 -470810
5512 -470810 -239640 -556536 -275168 -478574 -824752 -1245892 -578673 -596857 -768854 -267013
5502 -267013 -625712 19832 624705 603166 -33106 -890335 -1053615 -321171 486137 1037547
5492 1037547 -194802 301737 151475 680981 1297217 1256349 1170026 326687 504647 938413
5482 938413 -160832 -1842262 -878982 -1125216 -600458 -371927 300872 539222 1626008
5473 1626008 637579 1000824 1552000 918587 749451 -645675 249351 199415 -15983 -801509
5463 -801509 443182 -2430 -639001 -93881 4818 -1010610 -928595 -1264118 -1175145 -2241918
5453 -2241918 -2271895 -1260999 -1457058 -932251 -797931 338434 -30130 2130 179142 363918
5443 363918 -615289 482412 331363 -1066487 -1281265 -166088 1199148 383858 285777
5434 285777 502006 147021 -37492 345977 873079 -128836 -423975 987416 -386427
5425 -386427 -694645 -760479 122498 780453 1952781 368032 -192444 -278555 -62706 1001616
5415 1001616 570792 -278374 542916 -150142 190543 239759 -139762 1277367 757278 1554948
5405 1554948 895519 -388894 -811207 -380320 -690275 286481 194281 723499 35142 -182564
5395 -182564 725879 320220 382920 164482 391103 800761 730923 -490694 -777173 464138
5385 464138 521101 1244210 602778 708948 1332079 2074944 1271733 1218882 522957 594112
5375 594112 1188771 1626887 403541 -1455487 -903975 472065 386702 965701 2043869
5366 2043869 2375713 2573635 1416889 1480029 1723310 1886669 1874238 972149 1426318 1780916
5356 1780916 1555756 335556 504868 1349530 433492 450608 481443 1731103 -27024
5347 -27024 -763056 -343268 432814 1589703 1495367 -62677 592405 -93452 1400847 2376640
5337 2376640 1411998 -75790 929463 572663 -104800 1267886 1055598 2156119 1664704
5328 1664704 3051299 2409511 1504556 1480198 1244875 1550046 1745243 1312376 172548
5319 172548 1355629 1299035 1411356 1163326 1485032 2146704 1778360 846185 753480 1547222
5309 1547222 2178236 3035161 2044770 3360335 3383806 2581772 1573782 757872 713807 684357
5299 684357 991077 2359864 2529267 927359 627823 574612 1521468 1600550 -74707 659229
5289 659229 2464240 2469174 991083 1164185 1111369 989453 995247 1152544 2852011 2336823
5279 2336823 1947829 2144595 2389868 1934180 2018433 1768088 1444739 1288845 853093 1034175
5269 1034175 1221731 836924 405743 311632 85327 591656 -694654 343081 1656670
5260 1656670 1129737 1625059 891276 272016 1131505 1562525 2402111 1878586 2369483 2431681
5250 2431681 1387346 973538 958232 1293 -842843 36505 -88731 925006 1144499
5241 1144499 1383891 1662968 3103026 1961773 1105598 1401774 1929226 1283660 811219
5232 811219 1829524 1755481 2706323 3389584 1677473 1468806 2320714 2520640 595197
5223 595197 1011332 2918783 2147974 2404239 1292511 934872 1484471 1177584 1847270
5214 1847270 1810630 1734346 1594466 1031247 1646687 1402739 1437418 880844 2109998 1823787
5204 1823787 1598664 742213 1267098 1649513 2924820 1896323 1915433 2308003 1195072
5195 1195072 1373540 488366 1965968 1504194 1644531 1489757 2665015 1296891 1915087
5186 1915087 2436904 1714897 1730228 1743264 900043 1107970 2147172 396956 912872 1468763
5176 1468763 980476 677376 301469 1140957 1859195 704697 1632388 1902909 1763337
5167 1763337 1081681 1113393 1233892 1852114 1309605 1086495 1707351 2573188 2634944 847002
5157 847002 1122750 1594206 1620884 727610 1984734 1748238 1388470 1912508 2495538 2729663
5147 2729663 1960641 2422574 1927085 3041054 2657447 2209113 2198295 2592545 2644430 2461235
5137 2461235 3100425 2363779 2149432 3890288 4538105 3672292 3626742 2669268 2752935 3973909
5127 3973909 3725081 2790057 3060044 4766703 5156652 5270126 6424647 6402210 6615824
5118 6615824 6296154 6328381 5718137 4337087 4322035 4263642 6877606 7725355 7707948 7749372
5108 7749372 6874253 6153557 7120923 7517275 6713491 8269498 8799975 9224405 9507638
5099 9507638 10060891 9544156 9885813 10290247 8825920 8778552 9166209 8008505 7467641
5090 7467641 7565472 7617002 6632315 6049384 5666378 6088953 7351655 7151434 7496046 8228957
5080 8228957 6831892 6438453 6563770 6872277 6115283 5808842 5606046 6096967 6670638
5071 6670638 6544120 5827699 4756276 4099591 4226461 5431896 4103603 3226566 2633315
5062 2633315 4061950 3513632 2840274 3235316 3820354 4627520 4141254 3243955 2368649
5053 2368649 2204601 2466618 3177373 3699880 4286222 3966700 4654807 3918588 4122356 3882312
5043 3882312 2465652 1387300 2148388 2149147 1459403 2010037 2117811 2895749 2741302 2007689
5033 2007689 2015957 689937 764273 3069377 4377215 3928778 2398216 2772970 3605311
5024 3605311 3109321 2300072 3055991 2349441 1611988 1400876 1661193 2121848 2089110 1727085
5014 1727085 2694316 3608250 2928194 2167470 2137292 2853175 1910219 2152037 2176320 2016797
5004 2016797 3063588 2875160 1465853 2117347 2000849 2627940 3107739 2765610 2552063
4995 2552063 2875813 4536967 4418320 4548204 3430079 3258555 2654570 2085001 2537785
4986 2537785 3542987 3496147 2879354 3373465 3584527 3898142 3780933 4507179 5016751 5346595
4976 5346595 4207363 3608118 3869040 4075122 4913190 4887574 5510936 6219803 5039338
4967 5039338 5163432 5299995 5701818 6502545 6209488 5415201 5396370 7528550 6722703 7019153
4957 7019153 7808910 8157724 7845752 8106275 8413910 9350164 9237461 8977469 9323030 9808840
4947 9808840 9809238 9843389 11187902 12593591 14573125 15341823 15596260 17019450 17562702 18546111
4937 18546111 20423719 22593077 25097456 28084904 32050385 35435756 38961675 46111086
4929 46111086 53893149 62444389 75442136 91805192 111521877 128200430 134429110 120715099
4921 120715099 103840603 86883164 69148204 56115648 45693751 39220594 33396509
4914 33396509 29848423 25495997 22021552 19965825 18821245 17009424 15466499 15099140
4906 15099140 14495116 13447614 13297153 12187367 11653097 11898622 11165202 9926737 9738801
4897 9738801 9787090 9429018 9366709 8778807 7665960 7237512 6977438 6521520 5627112 5717144
4887 5717144 6728870 6842470 7022051 7452219 6988054 5768515 5811341 5254842 4937749
4878 4937749 5321320 4301570 2790499 3297725 3371425 2928391 2230987 1837177 3556903
4869 3556903 3908542 4366791 4137187 3062472 2490375 3494323 3857169 3447060 3884212
4860 3884212 2401846 2439510 2407354 3419318 3384381 2937427 2044437 2663892 2406127 2254953
4850 2254953 3966950 4930219 3979313 3052959 2047987 1713432 2218199 905665 1678658
4841 1678658 3168375 1293000 1316567 1627689 1659028 2236170 2192646 1987605 2576916 1092885
4831 1092885 262562 1197391 2465376 2316658 2717450 3972108 2269438 2546267 1829283
4822 1829283 2913191 3108833 3043556 1785596 1087534 2674856 3432085 3931405 2856102
4813 2856102 2886373 1835392 1789699 2389864 2440956 1581640 2249776 3545276 2996068 2096248
4803 2096248 479430 16882 788233 1355560 1255404 1185109 769894 794479 1818018 2221688
4793 2221688 1127547 749302 1203110 274284 279710 1166750 1280326 311548 308609 166137
4783 166137 373300 509652 1060663 1769206 818708 1345667 848228 1699065 1559556 904044
4773 904044 1054052 800037 36390 508598 1181504 1025512 229165 1201789 1818920 908777
4763 908777 156915 210855 -266613 887124 -551914 -182173 44041 646025 2024424
4754 2024424 1750941 832441 516514 107235 315339 373037 289299 644178 328561 -494840
4744 -494840 -1345516 -1335019 -1551832 -221376 -793836 -546523 -355814 -1095574 -366472 277869
4734 277869 501414 608749 1286520 319849 849384 205777 -1245474 -1595399 -1401249 -509557
4724 -509557 369732 750910 40182 1379005 632885 759725 -69130 1446848 1336246
4715 1336246 500990 49686 633512 413075 -523651 -670961 60621 -541039 501908
4706 501908 286065 -1432276 -1052575 -1375959 -300132 -781466 -791400 -126618 -754961 -1065003
4696 -1065003 -382686 -448969 234725 309396 -210777 -246595 -727941 -444611 266016 -429899
4686 -429899 -663022 557261 864961 857339 300873 767224 -44203 573466 1171940 571316
4676 571316 680772 866968 -1062035 -1122686 164757 -338536 -591993 -588138 538831 990842
4666 990842 1195939 -26489 -569943 -1436673 -1229572 -12833 183837 688754 820727
4657 820727 649765 128276 -252247 120463 -85776 650429 388031 332051 619173 1606027
4647 1606027 1392475 844008 1155120 1628102 550011 -1643200 -1847821 -394884 162334
4638 162334 215220 1483581 557319 1110772 1898874 235698 1512442 1550062 -276253
4629 -276253 -465051 170134 1290635 1929304 662591 293462 951608 334186 80471
4620 80471 -765862 -935540 305288 112440 -132996 -376652 -1073485 -886627 -17219 785808
4610 785808 -385578 772090 1511406 325404 -329782 149762 1071824 384396 -14083
4601 -14083 150531 -879550 -521169 -348168 -443303 95724 -491206 9209 -313901 1088506
4591 1088506 1217096 385040 1097648 598097 1036455 1246131 104404 1445467 2484296
4582 2484296 1065591 211180 920630 1857871 558393 -358918 -384070 170839 1022330
4573 1022330 820288 -848063 -849935 885845 489008 -10439 -798854 142162 -197304 100585
4563 100585 -92254 -476787 -173185 -937410 405047 796120 450101 -131059 -1595879
4554 -1595879 -1588752 -925812 1091029 1632153 957757 519982 -951469 615330 257272
4545 257272 -529149 -262360 268566 -314330 124389 529932 850727 132559 -627601 344827
4535 344827 1324983 648684 850858 439551 219799 874819 -133674 689407 1581169 505002
4525 505002 942283 557024 959294 1021567 -426623 -255683 -181324 178119 -241676 -728464
4515 -728464 -1419414 -154342 -435253 -812013 261584 178449 -81586 682692 729341 -219308
4505 -219308 182940 618601 684024 143457 412244 511258 565854 719444 856399 1340295
4495 1340295 833717 1919660 1585929 52239 534499 1150495 1265778 1040433 1361125
4486 1361125 1077610 720709 1038641 790942 1126424 -223664 -605064 477870 514758
4477 514758 761949 181917 -103814 -268959 -185569 -534684 -618527 -720802 -732754 -527612
4467 -527612 94412 760819 497410 -653319 -105366 707681 1047135 549158 -152053 916009
4457 916009 -315361 -104627 682393 272441 1380812 1698892 -343073 571346 532761
4448 532761 63164 585664 1248168 294679 -93881 1065451 1917006 1363016 259861
4439 259861 -277756 640253 263603 1346181 536461 -740575 -394575 -200697 214660
4430 214660 1370260 1590606 561769 1339919 1331799 252117 586898 709037 -916772
4421 -916772 207559 1131437 94257 1084759 811057 -77204 51998 -282562 304388
4412 304388 989129 870865 932823 1128204 779244 675672 1746857 2474774 1261957 2403257
4402 2403257 2100168 2203851 1166410 1395668 1317646 2022480 2507629 1894067 2234276 1667055
4392 1667055 2063353 1366782 -518686 -323166 585125 365682 172729 719197 753365 -247469
4382 -247469 -725524 696673 -221215 -168183 247041 -732199 -337701 35317 134926 -14960
4372 -14960 426955 1147546 1892130 1040193 326470 933238 -106503 -527141 418698 610262
4362 610262 1306492 865017 1561879 1224660 -858234 -705813 -514718 -117024 -173414 151108
4352 151108 -100562 209542 -902650 -37278 331841 40009 842184 753616 771117 544301
4342 544301 11555 570120 810111 126532 -1092283 -1037944 -1092318 -809700 -577830 -112936
4332 -112936 1066712 796987 178464 -42374 -244394 -354959 -885273 -1216210 -363655 -1156686
4322 -1156686 42298 71212 501829 130284 494301 -143253 290455 -106246 -1159727
4313 -1159727 76590 52227 351832 -527544 -946368 -8019 1184790 1041570 563491
4304 563491 -453714 -792690 303572 1481508 1350230 925 285098 292231 649828
4295 649828 -231689 71280 562524 243897 -566297 -472896 -565379 -953594 -232772 -438219
4285 -438219 -1368299 -837221 -366419 341098 451871 903993 701973 263953 -266835 177627
4275 177627 -451456 -882144 663162 -11703 174537 783345 -394371 -202273 -1294693
4266 -1294693 -1205887 9406 781100 2399170 17230 24741 414739 -389244 594946 850875
4256 850875 822505 575370 1096903 517490 131592 1352955 1101843 1310435 1064777 1773741
4246 1773741 807217 819554 384629 183220 196948 -584724 -804970 -921121 485921 1198873
4236 1198873 2137783 1319949 1347509 2540518 1597453 2180477 2980679 3227120 3502096 3707412
4226 3707412 4110185 4146664 5299487 6843413 6154347 5079506 5006148 4485421 4183860
4217 4183860 2816447 3655047 3675948 2184807 2028719 1179630 1400909 2165555 2215061 1728577
4207 1728577 1490968 1507033 362867 1007220 1603681 1085103 119530 -893944 -121090
4198 -121090 660897 1692140 1001659 1708742 1194112 336023 176062 98492 550371 1225421
4188 1225421 276636 -213147 520867 208781 2215385 1792041 1349116 616383 593431 -226301
4178 -226301 -644531 156456 -211288 -390836 519474 -121900 -638539 94814 230961 584273
4168 584273 518800 1729848 1991193 1845231 1101433 1402257 2000177 1867807 1327809 1031356
4158 1031356 843580 556122 964496 1576198 1168897 1453401 -216867 -652848 259613
4149 259613 787262 959935 352077 1046679 1984652 690857 722644 1279827 1155413 1807213
4139 1807213 1828481 1719860 1269622 1163895 2193913 1202365 1769788 500719 273538
4130 273538 793432 -931637 -68472 151339 538791 329118 -387922 -155890 -168459 445161
4120 445161 1365177 972232 966405 770371 1016810 86628 -413540 359094 1028041 373192
4110 373192 1068567 2483531 1379512 414057 527793 1135967 1495801 1107136 372750
4101 372750 184390 115919 993428 1020602 951620 104589 -635719 2115 843125 937372
4091 937372 244102 -688996 -10048 -469651 -558455 425609 -864002 -266980 -634995 -88656
4081 -88656 -181022 1005473 1211974 351099 58607 1124430 1259174 894718 392175 58986
4071 58986 -916359 -1617301 -511004 61150 354674 404325 1499712 2102149 1512357 200034
4061 200034 -542658 1419202 1489853 1941249 1808335 927508 1493677 1873979 2113448 1152029
4051 1152029 1741560 2272214 1911141 1483591 454502 277829 371462 162459 -309965 1131071
4041 1131071 1194051 858737 483897 273959 456074 -438512 -118934 976896 2260974
4032 2260974 2316670 2425439 1926528 2122269 1700146 1382798 3088159 2002864 2019238 1460089
4022 1460089 715110 865927 327245 1420559 2832738 1989240 1361586 2019142 2635346
4013 2635346 2493556 3105652 3843494 2767203 3097233 3650083 4125278 2902196 2488867
4004 2488867 2806249 3250110 2840560 2660545 1762099 4176047 3522322 2293995 1436802
3995 1436802 2247833 3116818 2347000 1386909 2422896 3624827 3225419 3264951 2161131
3986 2161131 1501708 2061351 1866800 1578403 2112587 1768030 1330226 1380858 2038473 3479786
3976 3479786 3049613 2769536 2691934 3172590 2717012 2522144 2938848 2417265 3995566 3662939
3966 3662939 3068373 2517538 3104893 3563752 4254071 3867397 3606185 4700034 3988750
3957 3988750 4387782 3616904 2446409 2866504 2784307 3482045 3625408 3755008 3522564 3046969
3947 3046969 2296688 3497318 3271614 3938776 3160294 4157440 4638242 3794891 5417051
3938 5417051 5109862 4079488 4283004 3659543 4020710 5484868 3947700 3933214 5063198
3929 5063198 5691904 7382926 6044858 5425522 6165827 6771465 7780302 7455888 8695788
3920 8695788 9503782 8164692 7360526 7702279 7605095 5925749 5081830 5406343 6480022
3911 6480022 5943922 5515199 5987897 5489025 4828735 4665913 5644843 5038534 4910019 5424555
3901 5424555 6331251 6573932 6909434 7031057 6975916 7420884 8135810 7789541 7599557 8234709
3891 8234709 7991991 8631800 9318693 10891868 10949582 9877386 9560361 8843659 8551531
3882 8551531 8117988 7698272 8010202 7260371 7434188 7386311 7392549 8435010 8611975 9422992
3872 9422992 9282116 9762314 8921246 9194206 9099725 9823835 11257133 11496168 12878650
3863 12878650 13269959 12999770 13964767 15182082 16986235 17849837 19289115 20916388 23178429
3854 23178429 24877806 27785098 32376191 38071840 42117939 47889718 55826860 63577621
3846 63577621 66294073 59645614 51924321 44132457 37033736 29867901 25445086 23102465
3838 23102465 21049708 19392184 17860420 17361823 17002963 16459175 15270015 14147395 12817546
3829 12817546 12540169 12828830 13576091 12390306 10715652 10795078 10477847 9476207 10263490
3820 10263490 10896707 11286514 11708615 11512535 11213641 11024017 11508877 10587147 10523093 9141924
3810 9141924 8694302 9040480 10095065 10289750 9016458 8085604 9473127 8929094 8885870
3801 8885870 8829110 7893377 7996753 8358714 6441899 6545961 8503784 8618954 7280308
3792 7280308 7301851 8629548 7979224 7047855 7284803 7450465 6674892 6910516 8254282
3783 8254282 8955427 8732121 9448685 10047860 8851589 8726111 8300978 9568567 10296261
3774 10296261 9582256 8825597 7923640 8101094 8116664 9474507 8924595 7881783 7680980
3765 7680980 8081184 8572397 9508755 9575158 8822882 8998986 8090726 8341312 8581819 8365112
3755 8365112 8976850 9237559 9605113 9815336 9273271 7707095 8216103 9341113 8817617
3746 8817617 8232552 9473429 10352538 11352488 11199742 9888671 9827615 9762351 9102505 8778793
3736 8778793 9588445 10423852 10913579 10972106 10380944 10929772 10818485 12064689 12797049 12862098
3726 12862098 12923223 12757468 13802850 14304740 13655925 11946670 13157302 12229747 13168955
3717 13168955 13509554 12931660 13504648 12796663 12924270 12136686 11688390 11179142 10782610
3708 10782610 10721389 11181775 11005670 10910987 10822117 11255353 10629787 11605094 11655869 10797027
3698 10797027 10475078 10489349 10411077 11167052 10665745 10381383 10484992 9752907 9679223 10019531
3688 10019531 10306197 9372731 8802385 8832178 7871296 7819830 6956463 7678393 7667968 8229021
3678 8229021 7507256 6834451 7217863 6713008 7392340 7369815 9354567 9585691 8585887 9123030
3668 9123030 7896235 7374392 7184377 7494107 7630486 8460599 9013531 7378524 7652969
3659 7652969 7997880 8323745 8152687 8291583 7932091 8647208 9271629 8592907 7357491
3650 7357491 8399833 8206803 7747112 7632678 7230685 7050235 7652910 6924026 6887143 5914098
3640 5914098 6261456 7381135 6029515 5842945 6361450 7888134 9720083 10267504 9195950
3631 9195950 8751402 8182305 7415002 8009437 8025093 8082662 8027309 8206969 8640081 8369723
3621 8369723 8115333 7104763 7652211 8477476 8035970 7838600 8225435 7671689 7410019
3612 7410019 7843058 6669762 6368851 7865686 8615334 8240065 7597644 7291048 8038677
3603 8038677 8817475 8672373 7798032 7616950 7272725 6574200 7431583 8258882 8619980 8978871
3593 8978871 9521306 10311633 10690001 10429575 8915882 9907329 9696869 10318480 10802433
3584 10802433 9634328 10682609 11423346 10544439 11302884 11659781 12227935 13199802 11145969
3575 11145969 11513420 12930275 13855345 13998474 14456241 14075767 13383412 13197955 14403759
3566 14403759 14661506 14552155 13801067 14389959 12895195 11349003 12770117 11837575 13054620
3557 13054620 12142202 13077536 13004479 13059937 13089469 10727730 11966133 11604345 12067184 11876174
3547 11876174 11325691 11392692 11459874 12061139 11068819 11065839 12539005 13234384 11915408 12035257
3537 12035257 13485897 13152148 13274282 13315292 13330055 14644886 14087018 13659979 13581340 12933606
3527 12933606 13530551 14256852 15079422 14984509 14598783 14562748 14244763 15148859 16271432 15680880
3517 15680880 15838688 16457375 15479398 15943931 17345043 18072447 18087288 17837300 18342529
3508 18342529 18890382 18011006 18129049 18314729 19189484 20462042 20606404 20907777 20912280 20798541
3498 20798541 21490619 22044804 21146498 20894522 21851633 23703422 23465465 23480887 24856259
3489 24856259 26516396 26187680 27873941 27239955 27579523 27077037 28625253 28905512 30009476
3480 30009476 30072369 30543573 32372948 33754743 35675064 35766114 37259386 36717428 38095390
3471 38095390 39214325 40267653 40325805 41917882 43340734 44742374 44758633 46313989 47036797
3462 47036797 47716406 49068638 50970456 51483773 53303258 54937380 55950524 57055410
3454 57055410 59179050 61354394 63513381 64383290 65518564 66447824 66961100 69371429 69735888
3445 69735888 71076268 72519456 74441741 74500820 75166783 75805749 76953100 77960679 80354029
3436 80354029 81558323 83513830 85478024 87202126 88366325 89036743 92558666 95002702
3428 95002702 97374701 99032050 100995779 101753865 104492151 107220502 109808106 112027703
3420 112027703 115093685 117695919 119424850 122600747 126233077 130059946 133366791 137692987
3412 137692987 140724857 145149193 147477121 150230244 152819374 155610322 157669239 160047133
3404 160047133 162322540 164232508 166940880 166532619 166762828 168168248 168703452 167715507 167377387
3395 167377387 165248505 162883177 161345026 158768448 154627750 151710987 149802268 145092643
3387 145092643 142315615 139382187 135270057 132116758 127861667 124984404 120119991 117148981
3379 117148981 113248729 109709941 107773566 104017550 100530299 96932321 93519630 90535520
3371 90535520 88036829 84352433 81709495 79717631 77163833 75736685 72613427 71169287
3363 71169287 68258429 66104433 64988361 61720443 59898272 57340279 56500477 55478736
3355 55478736 55274972 52719871 51653057 50656173 49596887 47541509 45137367 43932083
3347 43932083 42744569 42350452 40922848 39374721 39265550 39433189 37440410 36661958 36708669
3338 36708669 35745623 33695698 33964218 32953402 31546417 31372469 30732085 29353405 29521664
3329 29521664 30076432 29743365 29300158 27776840 26716911 26700343 26107413 25741255 25913645
3320 25913645 25616205 25743793 23612636 22200275 22941799 22865212 21681137 21536067 21101700
3311 21101700 20626654 19088938 18263286 19362025 19653764 18138938 17598504 18482346 18671718
3302 18671718 18622426 17537649 18042331 18031574 17478048 17378042 17203054 16033767 15814554
3293 15814554 16290198 16282735 17839538 16554251 15841738 15544047 14676273 14040994 14267003
3284 14267003 14845414 14347588 13661661 12618086 13592278 13531596 13881628 13778294 13629019
3275 13629019 13331181 13392153 12448651 12105028 12589352 13134571 12970398 12245670 11260376 11419681
3265 11419681 11933462 11765821 11614822 11846166 11835534 11465222 10751915 11596839 12788213
3256 12788213 12026983 11018551 11014012 10977075 10031845 10859806 10889674 12476696 11892924 11620786
3246 11620786 11059250 10190619 10283605 11660348 11681689 11426040 11262151 10789589 12397540
3237 12397540 12428192 12992272 13070071 12619305 12622543 12741317 11941045 12376427 11926057 10658676
3227 10658676 10688658 11339416 12061574 11217144 10574320 9555402 11207656 11250809 10215288
3218 10215288 10189728 11039875 10623347 11099410 11093334 9343977 9376398 10327335 11778651 11810893
3208 11810893 11467721 11855848 11343339 10882883 11288253 12185063 11839550 10699354 10551131
3199 10551131 11538754 12205798 11226658 12505166 13285099 12607386 12183349 11628916 12629702
3190 12629702 13210669 14000905 14270812 13350945 12197655 13335142 13474674 12287781 13160862
3181 13160862 12681801 13164087 14274351 14350824 13146565 13455248 13762875 14358483 14067219
3172 14067219 14480466 14917677 14344619 15302449 16462754 16274824 16588551 16674283 17436723
3163 17436723 19758373 17933779 17446749 17510332 18047447 18225548 18386904 20109966 19809324
3154 19809324 19942465 20159153 21066227 21346717 22166252 23196123 23380170 22206215 22476307
3145 22476307 23989451 24546813 24915157 24633900 25155409 25203580 25967097 27266922 27771579
3136 27771579 27316571 26486967 28456008 30039660 31287392 31349591 30661771 31801918 31582586
3127 31582586 32273350 33660810 35531340 35824566 36331082 37506014 38329244 38758522 39551611
3118 39551611 40852523 41605638 44343858 45381538 47342318 48407078 50836069 52363830
3110 52363830 54324108 56440372 59273201 62878507 64806658 69266925 72915827 75600826
3102 75600826 80242395 86079438 92021172 96992513 103395845 110182247 117979177 127218742
3094 127218742 135669196 140303241 142409057 142138914 137188762 130807774 121890475 111347179
3086 111347179 101429827 92714970 84765247 77982528 72208272 66879049 62843690 58246109
3078 58246109 54354026 51570566 50046201 48277392 46191966 44378656 41905481 41409374
3070 41409374 39908744 38493970 36995010 38001514 36984871 36007043 34921028 33390876
3062 33390876 33427315 31694341 30105776 29012678 28407608 27899069 26001651 25868830 24304043
3053 24304043 24664547 23815162 21874359 22224500 22247432 20436263 20190025 20413189 19730034
3044 19730034 19060681 17458550 16906256 17106848 17882254 16333133 16722112 17438097 16149325
3035 16149325 16149702 16307228 15175285 14751668 14567830 13851810 13398505 13170788 13104634 13532917
3025 13532917 12735212 12228002 12582958 12248407 11258537 11417480 12568076 12120547 12043371
3016 12043371 10792743 11506844 10744057 9776157 11165613 9439688 9720667 10664729 10108498
3007 10108498 9693505 9234820 8777190 10004036 9772933 9942597 8370244 8026562 7939632
2998 7939632 8351614 8726763 9604490 8967699 7504700 8029287 7178102 7485858 7726587
2989 7726587 6463399 7118954 8298946 7032595 6308325 7339066 7648767 7225456 6744900
2980 6744900 7305010 7551542 7024066 7707482 7581717 7594726 7256670 6847050 6527282 7086420
2970 7086420 8166528 7931587 7005736 6770549 5896144 6332197 7441780 7207568 6578754
2961 6578754 6124827 6685332 6596998 5268457 5078307 6431944 7041489 5751180 5456387
2952 5456387 5806745 6705190 6181859 5475498 6172491 6012330 6057797 5715285 6367355 7459553
2942 7459553 6760714 6523839 5895150 5463524 5592833 4997526 5288994 6651867 5855476
2933 5855476 5517025 5763066 6038866 5006236 5063400 4189084 4063954 3819031 4409756 5046396
2923 5046396 3999976 4173494 4741667 4859105 5236968 5308273 4525699 4693155 4445105 4857557
2913 4857557 4597904 4977807 4373345 3783951 3751653 5775906 5858222 4876137 5290039 3974863
2903 3974863 3475336 4035124 4163686 3409314 3602731 3626479 3692150 4310551 5115966 5623195
2893 5623195 4680524 4080202 4491385 4528155 4527873 4781053 4731890 4726824 5447071 4811085 3094646
2882 3094646 3272980 3465746 4857992 5108627 5300062 4314607 3077327 4045203 4684875
2873 4684875 4567062 5141531 4856140 5006861 4136735 3316021 3401293 4251560 5240734 5273308
2863 5273308 5063043 5508824 5665059 5114647 5256840 5724171 4335459 4555850 5347773
2854 5347773 4395599 5946593 6614336 5693150 7221379 7302886 7189655 7199142 7440752 6991762
2844 6991762 6920826 7180482 7076489 6739301 6882196 7387071 7750722 7935688 8540416 8653611
2834 8653611 8326166 8647026 7996022 8437456 8227684 9349176 7376720 7921059 9641409
2825 9641409 9663545 8552387 9136415 10278063 9940438 10647110 12304422 12502511 10740316
2816 10740316 10641451 11632878 11710400 12946331 13635631 14875569 13937268 12909843 13298408
2807 13298408 13836246 15740937 16208255 15735043 16716855 16421937 15570913 15759393 15471703
2798 15471703 16362449 16777279 17459148 17293344 17820153 16986893 17693216 19452665 20386129
2789 20386129 21028728 22484545 23137750 24538988 24197829 24595767 24270387 22366847 20870971
2780 20870971 20234441 19726381 18007370 18931030 18123393 18359763 17758557 17042173 18157210
2771 18157210 18484758 17328349 17600690 18319644 18013534 18040373 19001365 19208825 19669271
2762 19669271 20008465 19790039 20303599 20537100 19515331 19524504 18893796 17922954 16764544
2753 16764544 16501522 16030077 13873247 13533447 12910815 13413668 13711655 12874923 12386072
2744 12386072 13026460 13417208 12567504 13819825 13606574 12714538 13553997 13714241 11398912
2735 11398912 10990790 10345999 10366095 8898831 8469599 8331410 7139151 6937642 7936236
2726 7936236 8280483 7224909 7003189 6528598 6696909 4405715 5941967 6745406 4872441
2717 4872441 4898904 4995572 5242552 5065212 6475227 7630423 4860267 4363760 4077052
2708 4077052 5362235 4509624 5057822 5472703 4583042 3766046 3573905 3907883 4501652
2699 4501652 4251298 3238065 3422699 3116130 3512736 2447683 4131316 4254604 3754450
2690 3754450 2898310 3122210 3058636 3399189 3796496 3754325 4030951 3015939 1714146 2197443
2680 2197443 2579082 2424921 1529494 1566860 1371512 446425 48966 252709 2294691 3370193
2670 3370193 3258285 1796662 1856514 1736118 1529153 1597111 2159441 2166229 1788895 1507545
2660 1507545 1708112 2093516 1572217 1493828 1818903 1632180 1237887 816941 1635148 1260501
2650 1260501 2571337 2050926 1946758 2238639 1706334 2434837 2140745 386503 -60040
2641 -60040 1494750 2356413 2984136 936522 284063 -392401 -1073176 68516 -64636
2632 -64636 787729 445125 -380892 957988 1388454 274268 -264518 1113314 984753
2623 984753 481306 1253177 695465 -551311 612647 898439 167573 1600288 755470
2614 755470 -493097 531602 407900 693232 786941 -352800 231243 -165606 107577
2605 107577 -963790 -750001 726258 1403443 337926 712025 -713707 -383731 1045425
2596 1045425 740837 -62394 -861189 3052 163292 -392588 -307727 841318 -154259 -139487
2586 -139487 359310 -282795 -1222922 -554693 1055467 68772 -227792 -175153 -723052 -1210573
2576 -1210573 -1396728 -1225406 -1573856 197709 229180 1065444 -111472 518619 596458 -163023
2566 -163023 -79764 -428191 -1427887 -33410 -996780 -747483 -348871 -766509 -1072098 -410376
2556 -410376 485966 259622 1168000 -280163 -597284 -266899 -115889 -1206426 -470551
2547 -470551 231714 520322 294895 560110 -178125 -626355 727784 774728 -28223 -89786
2537 -89786 616839 -509275 75909 -272073 -1032337 -1641967 -301951 -525505 -308859 332727
2527 332727 387576 -304255 -1540631 -1192220 -280407 -672453 -1044595 -1092748 -1144760 -502520
2517 -502520 -1646795 -1253640 -1217252 -971354 -386504 -157913 729379 871297 858936 1373536
2507 1373536 880232 193902 -867912 -1319409 -1288002 -162049 1384072 1000433 663782
2498 663782 -709523 -1311757 -123995 -821036 -307886 857834 911391 -1239243 -268438
2489 -268438 305950 238222 501356 -679603 -653022 -750854 -676481 -793539 -242577 -346695
2479 -346695 -510719 -57026 -199612 -625318 -625428 -334521 283114 259680 -706725 -700418 -406536
2468 -406536 -166016 106115 223911 221636 -1434720 -1194125 -1295917 -2321924 -1658068 -244722
2458 -244722 -1206980 -1675743 -218944 -623952 -143777 -260844 -534122 -418503 14995 -1339372
2448 -1339372 -1238372 690284 -436604 -670362 -441527 -706747 402470 -16356 -545494
2439 -545494 454435 439896 -1072717 -103804 -1142188 -1683104 -1549715 -1149242 -476972 122776
2429 122776 779143 112368 -1607298 -1636618 -88511 -1142089 -1402834 -1462001 -1578854 -720059
2419 -720059 216154 -342920 -1138262 766682 -48427 -570255 -48904 -524503 -1066026 -294584
2409 -294584 -52955 93418 -562223 -963994 -1098239 -364355 932954 -150175 -887828
2400 -887828 -1361058 -1361643 -757033 -262105 172021 -419745 -621172 -480665 -1232816 -848775
2390 -848775 -2009179 -2436823 -1132682 -1405212 -616997 -569145 12065 -1171325 -774511
2381 -774511 -733316 -1039537 200248 404031 -909242 -1091362 -727189 -1714715 -283875
2372 -283875 -1642177 -1970631 -1324464 -1942143 -2220041 -2613210 -1883172 -1092269 -218428 -77072
2362 -77072 -805633 -1274468 -770108 -25063 -535947 546438 -359591 -842668 -1816114 -580555
2352 -580555 244334 -837931 -1516166 -1183829 -2094980 -1145074 -1020016 -1462601 -1692398 -1482914
2342 -1482914 -1960244 -517102 -417632 -102549 -663762 -1993287 -1327190 -1559895 -1435958
2333 -1435958 -934947 -1079911 -81215 -1163572 -563933 657038 -444573 479323 782602
2324 782602 -42664 -98361 -777777 136080 1168970 26012 -191897 -737202 -730687 -823628
2314 -823628 -544230 525378 477306 466223 1017287 1632113 1366107 1204451 1535096 2670159
2304 2670159 2330900 706730 2085763 1389306 701339 712296 139155 235555 562916 1082283
2294 1082283 577076 -85414 -748169 -1465467 -1165785 -1005001 -677779 -1139549 -1224654 410340
2284 410340 866456 -366077 -370998 -1014702 -71086 1099235 820494 818383 186961 -153275
2274 -153275 -302001 -1082192 -56355 -815907 -1674159 -1188007 -1406220 -1115685 -270524 -223764
2264 -223764 737661 1206685 810543 1786437 1151732 -1260170 185383 326979 35918
2255 35918 -855326 -701062 536165 821847 720288 124818 -855398 545498 219026 -371010
2245 -371010 439952 881173 726393 1077079 981352 644604 -356947 -550517 799155 809066
2235 809066 511882 1216961 1459400 442207 80297 267503 589559 1230402 937978 723734
2225 723734 795674 427917 664896 803518 146243 -88656 915099 1359521 1901173 1396986
2215 1396986 117841 148039 62435 -230818 1177742 1500965 1264915 887818 963342 722445
2205 722445 -125092 -1283916 -1461721 -714295 704171 1499374 307395 837264 1433871
2196 1433871 1663297 2839426 3015362 2189468 1301961 1113494 1225358 795599 1495426
2187 1495426 2142944 1974531 1214073 489137 3482 -921439 1349691 2323264 937212
2178 937212 828355 2410633 1074605 475451 1917235 2176697 1379961 1578001 2475194
2169 2475194 2031033 2104263 1948645 2209341 3495953 2648445 1071057 734562 1284592
2160 1284592 1718448 992133 2018743 1739632 841909 2404178 3725210 3736880 2991985
2151 2991985 3516996 3052695 2693028 2165498 1505682 2581736 4295848 2740410 3223570
2142 3223570 3656458 5349264 5111371 4782985 5533980 6048187 6494696 7486731 7400108 6067658
2132 6067658 5751265 7358005 8013514 7446526 5882640 7146412 7183689 6742942 7355917
2123 7355917 7401855 9043481 9085191 9578656 9176558 9208140 8538265 8219461 10175635 11033050
2113 11033050 11321933 11620255 12055132 12061767 12730153 13794419 14092799 14829791 14875096 15070674
2103 15070674 15811247 15880657 16296081 17418852 18033318 19430021 19163827 19077809 20232736
2094 20232736 22530149 22838699 24677315 26088427 26091775 27271608 30428038 32529407 34884440
2085 34884440 35641594 39513198 44371747 47415187 52801094 57220536 62564196 69611195
2077 69611195 75041166 81830011 89814454 98222287 108929658 122814866 138924097 162607529
2069 162607529 191115585 229068047 276824938 338218237 394390389 423228083 389534670
2062 389534670 331980556 284524366 228795868 184489503 152831530 131325003 114824546
2055 114824546 102156949 92118056 83822726 75539449 70260287 65339929 59534167 55137643
2047 55137643 51416027 46429994 43418387 40488604 36901200 34418830 33719199 31982681
2039 31982681 29870456 27669517 26681501 26202924 25205572 23623197 22483062 21029071 20252762
2030 20252762 19836608 20093725 18316967 16105303 15242864 15642388 14762861 15130088 15235973
2021 15235973 13650113 12258150 11382618 11684251 10789215 9716071 9366544 10220464 11027593
2012 11027593 9505324 10067523 11194514 9505395 8006775 7530431 7837117 7818115 8121843
2003 8121843 7382887 7012955 6922325 6722010 5898188 6325755 7554271 7223190 6977414 6928217
1993 6928217 6959050 6207756 5531870 4526569 4617567 4739032 4449038 3297253 4206219 4054643
1983 4054643 4356624 3896060 3654973 4305731 4166943 3070636 3119739 2322201 2687153 2991123
1973 2991123 2967273 2617318 2263082 2912548 3046141 2838557 1481364 1997692 1800996 2175875
1963 2175875 1795941 1518606 2434278 4010465 3413545 2172165 1271671 1695001 2649869
1954 2649869 2883982 3293973 978357 1985071 2851019 1977805 2078736 2019395 2036940 2206840
1944 2206840 1750015 991113 2272280 855150 750986 1160972 1627058 1134744 864415
1935 864415 805208 1243688 895793 1520627 451271 287465 944996 1795981 1761385 1096136
1925 1096136 2454750 2773888 1260704 1061676 634206 607934 19539 -302321 -65234
1916 -65234 321361 445286 15230 -1369390 -553333 940718 -150121 498802 234971
1907 234971 -1213773 -1371199 -916033 -1168784 242980 383537 229210 -18514 -1066353
1898 -1066353 -21535 34289 -67665 332954 -292414 611783 1300703 1009777 285468 283263
1888 283263 236302 -462680 -1786107 -1139908 -834582 132993 1066440 657360 45189 -344994
1878 -344994 -839636 -976281 665846 248317 115597 40268 -754179 -260734 257883 904873
1868 904873 940417 -83811 -523763 -437849 17837 507186 673805 -403319 -12973 -524555
1858 -524555 -4395 86401 774117 518481 248935 472564 -491290 -44461 91498 1062985
1848 1062985 987582 879781 696566 360007 -614441 -1572162 -1778425 136210 64121 210665
1838 210665 513333 475814 -557638 -757861 -144432 902349 1179061 1630346 479706
1829 479706 -207396 258945 1048817 102876 643714 1869855 1903205 2519251 2461593 1807438
1819 1807438 492612 681079 1169831 1206734 917459 -828690 -168609 401971 -396517
1810 -396517 -263523 79502 -648905 -471391 -29313 -1038615 -405530 -49329 164504 -505006
1800 -505006 289105 -663445 -993582 -579605 -217883 -44700 350968 848687 -290282 -672591
1790 -672591 -638508 -1286913 -1088859 -836833 -227152 124746 -965934 56391 265652 717781
1780 717781 321410 78091 -603753 -1162780 157445 -526419 -356673 -2202039 -1297924
1771 -1297924 -243997 -826045 -1449665 -1955754 -361067 -692215 -1032107 306999 1082348
1762 1082348 244668 -680350 -1768856 -622660 -711023 -456855 159253 -461438 -545543 -109165
1752 -109165 -297060 -862561 -659375 -414291 -880812 -1176440 -287982 -136106 -224480 -1460553
1742 -1460553 -232393 -210214 -247937 4073 -2173493 -1543977 -117085 -755705 -1098044
1733 -1098044 -817229 -1140872 -1544412 -1963297 -722184 -1095979 -667117 400307 -151230
1724 -151230 -562030 -448494 -520830 -1033354 64850 992342 -438202 -2290077 -1527482
1715 -1527482 -989164 -1387643 -1973051 -1470525 -1049498 -1762 385008 1713658 1500841
1706 1500841 178823 -120659 108452 -459862 584617 125132 423395 925 -664401
1697 -664401 -1957555 -1290386 -708740 -331441 -421731 280610 1037700 393981 624840 -315739
1687 -315739 364299 -91271 -1361654 -1595536 -956311 -853766 -1235704 636472 1093077
1678 1093077 -389311 531591 224341 -565591 -2065326 -69843 -167300 -1169524 -530249
1669 -530249 -178986 -63507 -1575351 236792 607503 71945 156515 225419 -619311 -331330
1659 -331330 -37462 -229197 -257653 -1286869 985390 1536067 791328 -63612 206460 1184340
1649 1184340 234263 100054 962461 540128 126370 -218308 -566932 -830039 -53389 61124
1639 61124 740745 252918 -1413988 -1625283 -1033180 -1390294 -231056 -308717 -226795 180336
1629 180336 969578 892988 394028 412403 599371 -315498 279423 -351630 82418 588467
1619 588467 -385091 -160699 -15902 88951 319394 -185181 -955006 -509842 626248 1247442
1609 1247442 209679 -862367 -489322 210418 -187836 77583 176665 -1656459 -2445121
1600 -2445121 -1379705 -978406 -1683362 -1333841 -882533 -994357 -1371172 -1100511 102846
1591 102846 1653 -522678 794299 206173 875098 818267 -676699 -1405406 -1477328 -2399073
1581 -2399073 -1937878 -853911 -1382329 -284573 296784 -44826 -1711578 -1612569 -1105886
1572 -1105886 -429563 90301 -931411 -1401810 -904678 -1548251 -799983 -1338318 -1018281
1563 -1018281 -259104 -1140232 -1345794 -957895 -1158187 -140449 -14909 -82875 -244716 360221
1553 360221 -1080074 -1471619 -1116832 174968 150723 -879949 -276072 354084 665135
1544 665135 9176 755605 -760262 -1503118 -805616 -200631 -1210087 -1355542 -1490304
1535 -1490304 -569621 237582 -1099698 -109245 542999 961109 618376 330232 -953731
1526 -953731 -771441 -1081042 301419 820775 -924552 -2323349 -719486 -73210 -221932
1517 -221932 -13437 906472 378415 -193780 513491 -814923 303010 222709 -1682586
1508 -1682586 -881133 -698052 494847 -109016 -1350371 -862725 -261054 -516361 -503416
1499 -503416 -442264 -1315760 -1241290 -921208 -117822 47660 -256914 -406282 -856345 -1310953
1489 -1310953 -896818 -315996 -452948 -616978 -239290 -534754 -705529 -1030230 -780064 -682538
1479 -682538 -632273 472321 769058 708897 746601 939656 574365 -444916 -212816 100898
1469 100898 561277 444495 707467 505249 152408 -71741 -682633 -653011 -444648 -909290
1459 -909290 -102258 -279156 -264390 -2070396 -1985708 -1144786 -1706118 -1146035 920397 1737461
1449 1737461 2095492 983158 1026030 382789 -265459 -501809 -534776 -682894 -875583 -510076
1439 -510076 -560974 -1064495 -1227824 -1210176 -229838 348033 -570383 64793 389871 1262572
1429 1262572 659745 586644 795707 -216524 332049 -37013 -982070 -677204 -914807 -106174
1419 -106174 -894972 -743172 -297378 -1512357 -1248172 -1736246 -1561027 -1201491 -501919 294922
1409 294922 545939 913775 1533594 350691 362742 340705 328216 340701 189167 -211682
1399 -211682 -231917 117564 -843793 -530951 -219941 134718 -218044 -776218 -245621 -70488
1389 -70488 -333667 -310293 115597 731431 -487471 -663003 1455443 1016257 559314 1268297
1379 1268297 -98018 -736121 160782 898420 -406200 -217934 301593 -921336 -90061
1370 -90061 523080 58428 902781 790875 -481010 -848209 -266999 -3571 -279862 -466629
1360 -466629 324990 -41796 -935155 -470500 550862 713128 34439 -557984 -1160913 -514871
1350 -514871 -375106 -766345 -723624 539374 1021475 503321 -251717 -2117662 -312403
1341 -312403 383268 -492544 -217568 131209 2286 -277169 -681714 -460754 651122 -84912
1331 -84912 -1224531 -892106 -1001387 -884503 -26141 -617796 -624131 870846 158583 -795598
1321 -795598 -186425 -28400 -741446 692525 1306999 217754 -365164 374964 -511168
1312 -511168 -1154394 -1338387 -460790 -370226 131081 771001 -667790 -170737 707618 391741
1302 391741 1050172 -197269 554089 892662 -321282 -637950 -289153 277020 -155606
1293 -155606 543628 -87435 -713384 213961 -150784 667759 258190 -1122016 -470925 668581
1283 668581 1636975 1929814 2148517 -2573 -189669 -526067 -751325 -418544 369927 -579621
1273 -579621 -1494257 -742923 -41472 119916 570081 -416071 -1367550 -1536214 -2160074 -984119
1263 -984119 133879 -472332 -553035 -491565 -300070 -215135 -482631 -468807 -623677 -1723057
1253 -1723057 -1978277 -624578 -633134 -2449938 -461384 791228 -387606 357829 -84817
1244 -84817 -460755 -1151470 -1019009 -1104680 -757645 -1214574 -887234 -11862 -770223 -1015040
1234 -1015040 -335277 941984 837019 543144 -131562 257167 199579 476803 849851 1386963
1224 1386963 -481556 301396 1314795 952470 1125840 843641 -245242 1410286 1251542
1215 1251542 576468 794546 -621333 -682302 -1299539 -867710 -259177 -716901 -1835851
1206 -1835851 -1026513 -607304 -193052 -123773 167475 587123 516022 -371449 -784561 681860
1196 681860 512473 -1148233 -334649 483655 647656 373369 890911 411659 157211 68119
1186 68119 56122 87008 242906 409967 -833500 -1612479 -1008570 -1030567 -910804 -249885
1176 -249885 81408 -38200 -477235 -1206865 -1714059 -133989 -778229 -773841 -1216733 -1407883
1166 -1407883 495034 450156 1561065 668146 505863 23741 650444 747348 -1034281
1157 -1034281 -64140 -1123094 -1373393 -1492224 -1091156 241922 369690 -357320 -1168527
1148 -1168527 128528 -616769 -1484780 -1255518 -741509 -50909 -86382 -7343 -272733 -284534
1138 -284534 -325719 -56141 97327 349881 1001503 6010 378997 626633 -266787 -373222
1128 -373222 -1220448 -1277470 -1382872 -1060307 -1735406 -559335 539994 -114110 -1188773
1119 -1188773 -998211 -150152 239373 -257029 107253 -202926 -1710691 -1259359 -103399
1110 -103399 198740 1052132 1724221 126978 -111045 -389265 -1274573 -811525 862680
1101 862680 304414 892326 338180 177076 358743 -1227328 -614641 -356339 -245441 -174768
1091 -174768 134573 73486 -94241 292223 214800 72770 376558 253341 357699 -373436
1081 -373436 227005 822026 1017819 119244 -29300 -642659 -308803 334898 -343917 551606
1071 551606 1032812 514001 898881 -466972 465604 891910 254201 684752 1461439 1749110
1061 1749110 436295 -918253 506069 498647 -63247 -489108 -1144971 737747 -45916
1052 -45916 -358572 -1066794 497406 321513 433006 346788 1127271 445740 -518011 358455
1042 358455 -500006 294149 740916 41998 -752059 -516822 363331 565026 -777367 -801087
1032 -801087 1086491 864511 151909 -798794 395530 -260454 513769 -125349 542286
1023 542286 329367 -167738 -158259 -1198211 -1142370 -1746352 -844068 1024260 322294 226684
1013 226684 -6837 -358340 -1139264 -635244 -437974 317463 992966 -250222 -169309 244307
1003 244307 301054 603653 -246813 -981224 -454230 941957 542201 50514 -425049 -976966
993 -976966 327723 685622 54649 -1658155 231041 -746302 -318573 -1234267 -1291153 -1774602
983 -1774602 -1162559 329413 1015024 273364 443923 -601758 -781204 439776 621266
974 621266 648197 -929680 -907586 -136466 164703 73467 -1404001 -1160648 -8479 -809704
964 -809704 -638700 87458 782684 1511795 828606 275260 246557 -1218527 -1106022 -589100
954 -589100 -620055 -521652 -673721 -346228 44475 1397664 1059230 140155 690781 83804
944 83804 -28566 284744 -249897 -267898 -377579 375885 656650 58595 1364611 508046
934 508046 475004 -178154 -1121314 819027 491990 297211 -32887 -1169940 -946240 -912307
924 -912307 -1457809 157355 -281561 413675 -136559 1072869 23307 -580130 624731
915 624731 701958 1789938 1161047 692114 -95263 -389434 59440 -557819 143932 -274379
905 -274379 724251 -17629 -586246 504872 307957 292032 -1065898 178147 618430 -530991
895 -530991 -12309 756693 835902 -54503 340560 725205 -495644 -697960 -605853 1162515
885 1162515 1635524 1820394 1174011 455575 577571 1110836 -573072 101856 922958 1060715
875 1060715 -182790 546650 218616 1053572 619780 613339 323634 -619617 -8408 -1472770
865 -1472770 -1080056 -414477 -906350 -889017 -683039 34484 825350 -58852 -351541 890468
855 890468 369096 484263 145410 351503 1426509 718936 949059 -70580 -129769 648438
845 648438 225151 32419 -313294 312180 340882 -198676 -943290 -357490 -1131752 416791
835 416791 -75788 -226110 -234214 -1021868 -171329 -161151 412114 247049 1208618 873026
825 873026 589253 391625 -290628 391071 406274 -314692 215954 402177 329938 418626
815 418626 1942667 1790226 -69352 -1176146 -541813 313228 -1502923 -1261428 -16530
806 -16530 700342 1093622 -192299 1015142 343139 147373 963689 1406996 712391 802661
796 802661 -1397 132313 -1407485 -702973 270698 -452521 -863885 -911952 264997 -280961
786 -280961 138070 1223315 989722 467337 489952 -1122219 -1185356 -620532 -440879 646060
776 646060 35435 -1581011 -1563554 -811983 253039 603908 247704 669916 928457 1124763
766 1124763 502274 539776 1484430 565927 555101 28594 75433 125157 605928 1717573
756 1717573 1168432 703885 1089138 1843602 429948 -625443 531769 671539 1297559
747 1297559 1639285 344090 -396869 378661 749264 467259 603678 947187 320824 1161895
737 1161895 1012031 733208 593650 306818 1248561 1216253 1464654 1245282 1540223 852705
727 852705 347169 112806 637573 139646 691690 784715 117506 565125 302043 -1593571
717 -1593571 -4074 408792 164046 1100769 851816 620463 -47610 115323 369417 133615
707 133615 888006 -446341 -331253 732642 348803 -203925 -1141090 -259079 737448 278514
697 278514 -264610 254981 217957 29959 -257612 -201855 278229 -129176 -555796 417842
687 417842 122666 215935 -136518 64839 775734 -133654 -760690 -1097671 -28690 -831267
677 -831267 -258639 -227437 189120 493576 210480 -200608 -542047 458702 -67485 648945
667 648945 311076 485800 385187 -1467121 -1023599 630468 143234 -1308395 -245578
658 -245578 930529 -39861 -429482 -801791 331758 -733962 -19851 -251456 -12791
649 -12791 493041 451100 1074293 498358 167775 436786 246706 860253 -310523 -313819
639 -313819 -1535818 -160080 1144529 91319 -681665 -549203 -301559 -35055 -540457
630 -540457 -831544 -120923 7015 -163642 953048 1690952 473960 1421887 759746 620159
620 620159 -255714 -918352 -437354 -418196 120437 365062 474860 1180418 922954 1307464
610 1307464 676204 -400658 749150 -353646 589722 364621 -447240 449793 454626 1275139
600 1275139 990474 1546460 528813 358433 263826 -410167 -891314 -421194 571995 509226
590 509226 33475 -427852 1120239 1646865 614921 1062428 1205920 1531877 763608 1279757
580 1279757 621138 -466233 563712 274271 -516075 110600 -135317 -327748 -898405
571 -898405 -979317 59888 479497 440757 550871 706101 -37193 195118 -352364 -464633
561 -464633 263006 818147 80960 -133414 -297888 355109 1401551 1380674 835276 803975
551 803975 2464665 724807 380635 342283 632883 1048828 257951 -487324 406486 -94754
541 -94754 1130095 535325 -112272 -532288 340536 1213364 62733 313764 729342 898382
531 898382 564036 51670 -544385 -457340 -548317 473190 1210454 2291293 668971 -351676
521 -351676 338583 1331416 -263005 -709332 462541 -6433 65455 1267462 582781 697229
511 697229 1745992 392184 -841551 318913 1289903 4868 789711 558021 -1020235
502 -1020235 407086 1102859 1921745 667703 434871 1462436 709687 51744 1539906
493 1539906 1033392 366041 -474117 -612724 -109413 616248 845371 433679 -808327 -267744
483 -267744 1476177 574936 341731 -258731 -450608 -858135 -659230 -430736 140033 -423866
473 -423866 140757 266055 1149690 1192326 338905 299345 869824 770982 894642 -740806
463 -740806 -1216170 226040 920677 1408278 843542 -893116 -188179 1257465 1487385
454 1487385 1023449 -315174 57634 331843 697655 265362 -292781 483796 1081102 1452315
444 1452315 383857 -63230 -477680 -368741 316027 1316885 659609 -595167 342584
435 342584 -641286 -1457376 -849955 1229510 688482 413656 72063 730436 1322785 809270
425 809270 563319 1083874 818109 -573882 251482 1006254 2325090 1526808 938748 1584150
415 1584150 554436 -290338 -1385782 -89277 316539 -155073 727697 1124817 -366048
406 -366048 -514893 -239628 507018 781010 395995 1311393 632173 750350 1320075 270300
396 270300 426498 1269389 1277891 2139102 1411884 912727 913877 1156011 1030384 844810 209836
385 209836 856165 725619 -91824 275145 174914 330907 594257 352248 1107229 264259
375 264259 76339 213626 439078 147142 994 -379907 -967982 419157 -90524 857803
365 857803 657745 468356 375574 37432 698064 1148393 368656 -650289 -422179 327098
355 327098 -517793 -861580 -441545 756404 2150304 1844892 1211379 1468765 613688 898303
345 898303 1197394 462325 2127999 1134708 -100693 403128 406583 988317 1483089 1122791
335 1122791 1407500 2338337 520308 458993 -213265 1075096 2381240 1182883 -343453
326 -343453 552932 488764 358190 218186 278929 283408 -91235 960581 563313 -504025
316 -504025 -1401170 -268334 307139 301055 1207615 659555 1101498 1525424 1377560 1769461
306 1769461 362323 734602 457547 631576 -178701 -293827 913280 753098 943894
297 943894 288168 420015 1218268 -93767 -433571 408573 699967 818415 1586930 -194347
287 -194347 125483 61956 -113578 841474 2273133 1822584 1876254 556014 99347 -4711
277 -4711 269424 2110875 1784404 1494344 1178669 763793 -17471 -308188 402411 844820
267 844820 911003 812037 -459315 396830 927285 1018767 1209205 486351 62354 -352399
257 -352399 576538 390606 -1435548 -373533 74321 466675 765287 -609233 -118737
248 -118737 1545322 2065716 1085030 1341813 673842 1103284 951659 356988 406366 159297
238 159297 548183 928965 1866623 2335551 1820127 1024098 900194 1430208 1058483 259046
228 259046 1096423 1569477 1066394 1651034 1251334 -28632 -344245 874938 644478 665843
218 665843 395720 54991 286541 155068 1135413 1451158 766199 -657254 -643553 520929
208 520929 1119421 1053258 674566 -158202 -437111 -1420614 -87321 -208833 515544 2003186
198 2003186 1838466 449981 -412550 585116 391591 -199632 690139 -80813 14245 -14958
188 -14958 488951 133670 96736 1052757 937983 630615 292309 153835 -855429 -156037
178 -156037 1013450 1634315 455050 -989870 279030 270845 1240204 1581460 1889716 2538822
168 2538822 2876771 2109984 99254 989077 1207035 1589658 188825 -811505 -525168
159 -525168 475847 -421635 -287828 1196246 1133633 1001044 418650 209095 -466755 -345641
149 -345641 728758 1384042 1068198 667331 442596 446296 1081527 854620 -81455 -360453
139 -360453 -249526 829619 1427910 1066067 238012 43943 -160125 1233865 615436 140209
129 140209 -220854 192901 247171 451761 989690 1238506 1345610 1629112 1109459 557679
119 557679 498420 772716 1119827 747126 1278476 853069 548811 352633 986376 2068037
109 2068037 2830853 2544901 1298934 258583 672376 473536 753119 354103 902214
100 902214 281315 -626515 237007 56426 498865 444255 185585 1664514 1546203 1103296
90 1103296 734249 1327472 1080868 894683 1229438 1633950 895888 808598 1098577 1520005
80 1520005 1279694 1073632 928930 79821 773142 362253 928167 887564 646520 395181
70 395181 891633 736440 715078 1893492 1042671 1097850 333389 106668 580228 987078
60 987078 771934 122747 -748581 619726 405818 200819 151739 -58973 14322 1403133
50 1403133 1484580 485309 946682 -36998 329604 613959 1354526 322062 239903 425345
40 425345 1022599 478594 1279116 1530335 387629 -52873 -72186 841868 1091978 1185955
30 1185955 485465 -382188 -781879 -637202 -686004 -569522 171902 370816 470366 1113577
20 1113577 121436 310526 849914 738092 689011 392745 -141645 812865 1747524 1836145
10 1836145 965608 1503154 1421945 762823 210267 285520 1916990 1882168 703347 934643
0 934643
$$ Imaginary data points
##PAGE= N=2
##DATA TABLE= (X++(I..I)), XYDATA
16383 -2297220 -1401265 -2108923 -1294947 -1545046 -2707984 -2600548 -2263697 -2463192 -2669490
16374 -2669490 -3543926 -3441509 -3147208 -2721201 -2207145 -3096169 -2925736 -2441109 -2930481
16365 -2930481 -2696522 -2598797 -2496799 -2243000 -2114209 -1799431 -2109538 -2204525 -2644245 -3565274
16355 -3565274 -2015437 -1891576 -1780306 -1949053 -1502626 -1058794 -1076361 -1581545 -1746679
16346 -1746679 -777918 -1135132 -835547 -1034106 -1512815 -1277141 -1751293 -2069328 -1741050
16337 -1741050 -1443865 -2182045 -2509700 -1954276 -1707401 -1558880 -2115161 -2026643 -1830913 -767765
16327 -767765 -904711 -1679023 -1696643 -974219 -2163284 -2123920 -717650 -1866026 -2390446
16318 -2390446 -1233995 -1412900 -1306749 -1769736 -1185284 -437327 -1285547 -934622 -1397444
16309 -1397444 -1022289 -1411437 -1449631 -711758 -1868046 -1192937 -783497 -360986 45938
16300 45938 -819317 -560410 -1198858 -1357331 -1479929 -788771 -1154675 -537226 45938 -207729
16290 -207729 -478266 -671123 -269096 -496401 -72517 -595476 -985709 -169843 -112200 -842633
16280 -842633 -687200 -554360 -491304 -594574 -256447 -91857 70357 -481031 -134040 -916942
16270 -916942 17511 77991 312261 -633545 -41447 811529 330577 -1175658 -636669 -666350
16260 -666350 -1063118 49630 271052 -227411 -723746 -1171956 -419846 102404 -976565
16251 -976565 715258 1022420 909854 265083 -260010 440988 336824 289209 702551 351578
16241 351578 523245 524321 779249 504030 -234325 -946 169832 75723 557039 1518827
16231 1518827 1358715 -527112 -1071135 516730 222768 788016 1106174 371666 1237529
16222 1237529 431453 1305670 1766668 444856 -216098 529527 194836 367308 270070
16213 270070 989658 1520044 1079478 1134372 -22501 867255 632032 493856 665334 -275568
16203 -275568 108275 1488249 1034180 1033060 1678937 1407049 899530 1616130 1872349 355528
16193 355528 719423 1158837 268033 -31412 115553 -368101 -319441 454357 1218863 -11856
16183 -11856 -56431 -58677 -219407 -123588 -488521 455187 1033576 152722 1381145 990855
16173 990855 907182 1232661 1645677 2607322 1231147 1248088 1566817 1510553 886232 541561
16163 541561 1453923 395736 1199026 1502252 1094664 1171316 1653114 2570291 1909660 2219713
16153 2219713 2633304 1989872 1991127 1917723 -77321 272467 937968 1117936 1886410 -59181
16143 -59181 -479441 1466958 2237685 1215391 920970 1310179 669522 900024 1433947
16134 1433947 1537241 1198427 1972777 1967267 1154207 768895 394418 1142685 1647200 1597641
16124 1597641 1833769 287034 -691935 899129 1617657 740611 1201970 1909809 378675
16115 378675 642213 800417 881160 -151123 412319 66018 -86079 1495693 377677
16106 377677 -94679 16268 450094 949229 23306 169020 922156 192147 1114555 1736791
16096 1736791 1345492 429596 870943 2205662 1574293 952476 1195919 1800169 1457173
16087 1457173 1232403 1127925 1016646 1838486 1451124 1695791 2708745 1999208 2059204
16078 2059204 2179267 1136987 2474149 503083 317096 788210 -101891 -432795 799184
16069 799184 1320452 951210 1458942 1741477 2179714 2363959 2287577 1638642 270903 551587
16059 551587 1483635 421609 339245 1368393 2339171 1618317 758304 1470872 1532622 719733
16049 719733 44578 1004331 2173229 3142335 1952645 1592359 623613 -25019 42883
16040 42883 457179 1265157 575697 641966 562286 2031373 1869800 559744 462433 -89200
16030 -89200 378849 898631 1161239 830683 1591108 1810135 178400 1088621 2281779
16021 2281779 1866840 1309872 958582 1362961 2787056 2475219 1529122 1036032 1819889
16012 1819889 878548 1371352 2412728 2018488 1643238 1988227 1896293 1716897 2513655
16003 2513655 2294049 3576536 3546393 1383526 1053765 693637 1156086 670842 610563
15994 610563 1043148 672856 923890 1739700 1785890 1366317 1385832 1309472 598714 998211
15984 998211 829363 1216634 1776156 1487221 1808109 1773918 1920901 2077285 2504087 2469985
15974 2469985 2046695 2025772 1683535 1733420 2326028 1840963 -81933 1020356 1780641
15965 1780641 752682 1329376 1872543 2969305 1249106 208186 -393392 779720 1288187
15956 1288187 1666514 645646 1307458 1575993 933770 358877 -308532 549063 731449
15947 731449 1265556 1220760 1820888 1967766 1973066 1256695 1188239 1155117 1514362 2544952
15937 2544952 2995661 2824353 2796169 3041302 2252281 397500 700427 842802 1179039
15928 1179039 1176141 2134733 1170381 850434 2783309 3555177 2405510 1171276 503753
15919 503753 418416 1011938 1494641 3331483 2964155 3565214 3361724 2455711 1414067
15910 1414067 1070539 1765615 1365369 243969 523523 505005 1393425 2320616 2838611
15901 2838611 2622813 1803019 1481716 1181420 1925159 2272930 1618072 1301489 1919113
15892 1919113 1414287 153768 334928 483749 1091909 1939112 1404360 1863590 2416616
15883 2416616 2231700 1301406 1914190 512163 753539 902955 1641624 2173328 1372635
15874 1372635 505116 1005359 596372 1233090 1333178 416228 -83954 543736 1316833
15865 1316833 416552 -251677 211127 1268769 1923328 2205940 1899319 1508472 880056
15856 880056 386422 950654 2288565 992384 1849150 1553335 1914405 1710844 1096189
15847 1096189 1423399 2653380 1908472 1366463 1481066 1508553 1436453 1346953 1161948 1366724
15837 1366724 1546355 915529 597405 637427 674186 1913450 1199135 1034607 1680106 1368196
15827 1368196 1403525 881206 1738446 2030753 1806639 1316667 208034 88344 277219
15818 277219 771992 1248681 1055061 467019 382644 93372 139125 1940608 776060 555475
15808 555475 1110407 1508439 825077 520446 873970 2031726 2349339 1389892 1368769 1089310
15798 1089310 411680 264169 1322968 1589352 1810241 1281083 2172192 2626917 2180348
15789 2180348 1236321 -105403 -198886 335481 1269317 2008245 2239764 2120191 2500487
15780 2500487 3058385 2604398 1559675 1208300 1870156 1819826 537242 -288364 281828
15771 281828 405105 979643 1010587 732129 325799 160527 1276821 18307 1004058
15762 1004058 2149240 717509 -511879 574043 1111610 1765903 1628148 1440028 1309514
15753 1309514 919996 1114045 1895734 1193024 660342 864107 790348 1203095 1214503 1249804
15743 1249804 1303715 2569013 2952309 1841564 1730354 1383293 -409284 -284875 57338
15734 57338 1471786 2206612 2344018 2040921 1701628 946278 26974 -150205 1875031
15725 1875031 1341759 1548034 2462097 2514448 1350841 409923 739962 1175131 1151117 96203
15715 96203 827648 2423357 2476137 1615546 1803780 1286977 1564879 877362 -400281 842674
15705 842674 1703536 1160130 1582556 884494 1612796 2266079 2443029 2540912 1302917 844779
15695 844779 1271915 1403592 732365 -93967 613249 150656 1008353 1085465 2247958 1325093
15685 1325093 1999327 2163124 1128119 2042860 674799 474946 969181 456481 1374019
15676 1374019 1209862 1695017 2047970 1113897 1804808 1828653 1574375 2318424 3420806
15667 3420806 1534469 1319629 546532 483000 1988554 2799085 2301719 2189006 982538
15658 982538 832630 851631 1027333 1343259 1449823 1097785 1176797 1652078 1732446 1513077
15648 1513077 580814 730744 1094292 2236385 2060041 1448301 2010089 1625591 1350133
15639 1350133 1974611 723264 1493382 1975091 1933769 2469817 1545914 1373872 1417263 671287
15629 671287 1709805 1630604 2856580 3168669 2030436 1478385 2167313 2344738 1808013
15620 1808013 1646266 940119 831693 134666 1019289 1400979 1425680 668343 -386124
15611 -386124 -206674 355732 1801318 1041846 148551 -290784 383140 2360021 2581795
15602 2581795 1719092 28916 663209 1096809 1585596 820718 943883 1239393 952900
15593 952900 460205 1053488 674103 1569900 843184 1323875 1366720 1106776 1324535 1133252
15583 1133252 1804346 1158643 875296 1253912 1386380 2077881 1878282 396610 407928
15574 407928 2002555 2921340 1378883 1461042 961915 1386602 1736012 1790830 1511650 1491812
15564 1491812 1694613 1277627 1743723 1216183 1270535 1598260 2035653 2110752 1605010 1556410
15554 1556410 923292 1775887 2275209 2033919 1387958 462081 822755 2092132 833904
15545 833904 785226 1455591 1143984 1176821 671780 424745 671522 838770 1636504 2212142
15535 2212142 2485225 1833816 1493403 482975 765717 -37854 837404 517892 454254
15526 454254 1559892 1723032 2273413 1886587 948991 1108741 1088566 752264 18189 948387
15516 948387 1242891 665556 1175120 314335 943641 899579 1590937 1317699 1493051 1809913
15506 1809913 2258798 2724584 3091261 3270142 1854162 1338295 2115646 2093268 1911258
15497 1911258 1808783 1816948 1466077 555886 1113266 1276987 2287295 1851419 1229507 2381252
15487 2381252 1838970 1396916 1855835 1211927 1683607 3313193 926865 2081700 1616368
15478 1616368 1864309 2227848 2192235 1561125 1096970 1441091 2006210 1426729 367268
15469 367268 184030 1303689 172707 -162219 747902 224325 568033 1018334 1375317
15460 1375317 2412906 2318324 1037793 443928 486619 930062 1109850 2321803 1139751
15451 1139751 992217 836256 881374 1458993 1829374 2109929 2191289 2044166 439671 1008393
15441 1008393 1592303 1582254 1298723 1844442 1878958 569677 1258818 761863 337601 509464
15431 509464 941660 1679930 2454108 2214114 1734722 949527 1434181 1165626 1393672 1195568
15421 1195568 1603955 857839 1383299 403248 1115149 751902 126850 655559 1703760
15412 1703760 1988262 1073489 1742244 1517969 2176950 2847207 2121263 2283987 1028514
15403 1028514 30193 1091253 891816 609826 419082 1224595 2332078 1513227 1107045
15394 1107045 1648375 1626130 1385384 1703808 1149947 1165800 2627230 3300397 2517656 1043916
15384 1043916 166830 849815 870596 960557 746756 164130 500467 38982 644816 1730881
15374 1730881 1778881 2386170 2555078 1725030 2089848 1035217 1209643 745697 2556042
15365 2556042 2048964 1060501 1153871 1787842 1772022 1559258 1212196 1089479 2614328 2887589
15355 2887589 509155 773702 606118 1294317 1292489 562404 702879 794069 1055870 718350
15345 718350 1077461 1658542 1757600 1987408 1077518 -55089 1744049 1530227 1216495
15336 1216495 405815 433514 1474131 1451678 1629778 980432 1131268 773901 865227 1956805
15326 1956805 1835604 1046021 727223 810713 1167849 1752077 1725004 1745375 1336217 1431587
15316 1431587 1963717 1262549 1109364 1535491 1366103 1889216 1350728 1647531 1264245
15307 1264245 1587191 1227409 291524 698678 1001340 1829044 1408899 893971 602139
15298 602139 1613605 1664349 1168045 1806037 3127558 2746167 2268626 2085819 2026858 2181306
15288 2181306 1361304 2450640 1897897 1161829 969851 638877 1732895 2381299 1266529
15279 1266529 1454525 1482789 1376433 1166870 461131 -1045125 585117 1414148 1696544
15270 1696544 1962506 1598611 1972548 1889160 2002036 813892 32013 1827575 1974594
15261 1974594 1084507 1589484 1419194 1719896 1515833 1693138 1005854 1908236 2386839
15252 2386839 2166196 1996927 771314 817665 1657436 1516267 1261126 1401189 584819
15243 584819 1148648 1444290 1145159 1349609 1373985 1067152 1245072 2161376 2651476 827625
15233 827625 1539127 2005345 1538732 1596948 1596138 1109076 1101491 1829375 865961 -123658 990308
15222 990308 2251426 1892485 1835820 816032 1254980 765505 914413 3209423 2071106
15213 2071106 1340395 1772780 1475641 1529118 838459 1293365 1145527 2062452 1441481 1417461
15203 1417461 1806937 2196615 1632313 568183 1488746 1984026 2117669 1535268 1809727
15194 1809727 1543630 325740 1609386 1054415 1602445 2221448 1326167 1214481 995838
15185 995838 1423229 2105502 1924407 1471149 1251733 1956904 1535377 1011692 1200436 1377572
15175 1377572 2252381 1665482 2314772 2068761 1547552 1266386 1705523 3047347 2526499
15166 2526499 1155375 1759776 1123719 191898 445251 1081204 1599314 2316234 1742079
15157 1742079 1453853 1994862 1383739 1266646 2476826 3155560 2161434 679625 1231646
15148 1231646 1995852 1596762 2515900 2695501 1514174 601631 1031292 1962011 1954991 795739
15138 795739 958096 932722 892503 1037751 1132510 1397061 1865705 2522883 2628559 2697597
15128 2697597 2661482 1760669 1730531 1708852 1240698 1782872 1343287 2464217 1943525 871511
15118 871511 1621601 2984316 2427108 1274094 1157518 1473026 709669 534536 596174
15109 596174 1971682 2565392 2656743 2693873 1983600 779791 454115 2847511 1836705
15100 1836705 1761752 2074995 -187292 571781 1378525 103062 404350 61086 1045535
15091 1045535 1701226 2167301 909421 791658 532497 127008 568161 483278 152523
15082 152523 293344 1178461 878321 1368993 1052871 1628757 2134615 1097659 337506
15073 337506 681797 1079646 1089748 2110513 1873975 1784634 1894388 1636682 704542 1040678
15063 1040678 1458259 358826 454010 482377 357906 1941180 1852910 1719964 2014538 2372988
15053 2372988 3045306 1742670 1827510 1750684 1599774 1782644 1917755 1214578 863149 1664687
15043 1664687 1658168 2014045 3237625 2017314 1035877 558105 1110409 1411897 1685618
15034 1685618 2363299 3027713 3416137 2138991 1200431 1737543 1269379 1572985 3529395
15025 3529395 3492232 2381321 2054395 2508879 2716097 3017139 2039100 1580341 1787411
15016 1787411 890276 664089 867386 933327 -42179 726041 1537975 2376044 2402253 1641438
15006 1641438 2317886 1880679 2814782 2720683 808371 1211397 1757169 713382 1473661
14997 1473661 1770276 1494744 2575610 2108119 2297104 2507591 1356128 2098049 1827315
14988 1827315 1675430 1789632 1081998 -127504 872651 917082 1553814 815220 473816
14979 473816 1436096 1653860 1279070 1399559 1919252 1442173 1826802 1228866 955841 814589
14969 814589 -419068 60771 750293 871617 1267355 1009037 1553853 3372842 3412596
14960 3412596 2168127 1003468 1528178 1865292 1391631 1648970 1641583 1699888 165562
14951 165562 1446785 1794485 612123 607354 1614320 1032112 1104191 1227466 1821895 2019618
14941 2019618 2665592 1899620 1596718 1372312 871579 81464 591346 1635333 1587501
14932 1587501 2078380 1023701 886273 1673115 2408504 1339779 1530849 2741093 1948342
14923 1948342 1182783 1057839 1031239 -21754 788983 677774 579594 1167996 432364 940494
14913 940494 1166748 1822466 1997215 1434338 1559542 1463520 1112004 1175448 704312 2828932
14903 2828932 3805543 2601798 2447499 2819537 1171242 1140980 1875032 884457 544133
14894 544133 761430 413021 1342145 221945 903022 1843773 3678795 3222842 1502953
14885 1502953 1563381 1262862 1899099 1659630 1690611 809479 476600 673259 2274617 2625176
14875 2625176 2663087 2274755 1815187 2088276 2680078 2539273 2057611 3015728 2138666 1080665
14865 1080665 2149403 1752112 2094634 2406394 1512958 -326528 -19278 597136 708185
14856 708185 1052660 873962 857334 1370346 2117879 1682448 605663 1418458 1780682 2128230
14846 2128230 1553381 890323 1094204 1463469 1053254 1427005 1305278 766727 1094124
14837 1094124 1312956 1661452 1062121 1742148 1173715 776959 1827221 1764096 2050460
14828 2050460 1361197 1507794 1881479 1319721 1976915 1946078 507291 644268 1405852
14819 1405852 218421 699220 567252 506702 766765 441926 -328200 -378371 665396
14810 665396 141970 508713 1247262 977794 1274238 1270604 1455536 2646684 4251637 2710858
14800 2710858 1306951 184124 435871 435817 932386 1072908 2223803 2900611 2919149 1963584
14790 1963584 1504834 876749 859179 1025987 1353785 890732 1142535 1821216 1315444 2416642
14780 2416642 859982 686643 1218862 1470582 1113473 697349 933790 1774292 1951753
14771 1951753 507403 -281035 -831492 809878 2413009 1475312 1483813 2287160 1375843
14762 1375843 884501 155306 -175564 262612 1407369 1268709 1532409 644167 1359108
14753 1359108 1125080 1090713 1846650 2134584 2745810 2720617 2516415 2914040 3035257 2025150
14743 2025150 1644779 2386456 2563405 1555937 1288666 1351589 364148 568745 1200084
14734 1200084 732377 747527 476584 1339004 1888326 2177989 919347 2593753 1839162
14725 1839162 1311309 -51961 1007338 1235477 521939 940372 1978733 1538385 934213
14716 934213 853531 1228309 1846798 2324839 2449919 2539868 1939916 1472066 608641 707850
14706 707850 685633 1370758 755690 1874403 1971278 2017589 735560 979010 749833 932623
14696 932623 1684234 967722 1522279 1513054 1443018 1441676 2176701 955993 537588 321980
14686 321980 700111 250804 1242150 417595 434610 1332737 1176837 1606207 1793752 1377438
14676 1377438 1040007 1420881 1090917 849624 720771 -696186 -1190 329047 145309
14667 145309 664581 1090883 2289648 2417625 3850584 2715126 1766471 2104143 1382019
14658 1382019 1098178 1168925 2159563 1955274 1798751 1559122 2627752 1879822 855547
14649 855547 1254930 2568674 2519878 2782596 1960803 2553812 2056070 1921871 2373119 3190481
14639 3190481 2241573 916183 2918396 4564463 3063572 2070965 3042006 2538103 1446148
14630 1446148 1572425 1891856 1515464 1437983 2406955 1334839 1397334 2288888 3115567 2718871
14620 2718871 1603674 1227380 2290865 1200717 1113943 1536610 1968782 1939321 2243870
14611 2243870 2384341 2466846 1732107 510328 1378616 508765 296299 703708 1424222
14602 1424222 1101151 1196521 994821 1578665 1765897 884511 1091232 1730057 1417359 564827
14592 564827 151668 -568354 1219506 855814 716406 819849 381035 353513 610650 2211206
14582 2211206 2346897 2801380 1835026 1670631 1472159 2188383 2165512 1754451 3184973
14573 3184973 2784426 2391469 3099056 2126983 1126915 2564469 2848232 1698795 1857930
14564 1857930 2565613 2678136 1666009 2338582 2529267 2693163 1385840 1349366 1809826
14555 1809826 1565161 1980124 2014772 1612661 800667 1834730 1015451 415640 706219
14546 706219 -377442 556991 -1118143 -267835 757233 434994 661022 485970 695153
14537 695153 1439232 1094498 1478767 790533 1368359 1342827 1596701 1748298 1946535 2158606
14527 2158606 263659 543880 634562 986602 1402209 507793 1103765 1467545 1373605 1530026
14517 1530026 906909 626917 1673254 1120028 1235530 1574057 1533258 1427301 1545710
14508 1545710 3074458 2276015 1941814 735699 1199237 1622657 1162462 1036523 1094339
14499 1094339 2194088 1145019 514904 860345 1031762 1252568 797820 1009757 1523248
14490 1523248 1070329 204380 1050651 2589128 2960248 1927022 1544540 767711 -3461
14481 -3461 46400 750172 1650781 596726 -4717 -85025 848346 1488172 1594130 1358877
14471 1358877 1098529 623712 728431 855937 818865 1923509 1911024 1751065 1269442 1628199
14461 1628199 1339784 934018 1029956 1238206 843622 1040321 1477612 1074649 1431060 1948664
14451 1948664 1468048 1305183 2010933 2091927 2063677 1702803 2380817 2967494 2775740 1952636
14441 1952636 2115519 3561160 3246568 2471480 1768686 3225022 2485407 1788561 2446127
14432 2446127 3414376 2454394 1499795 1850619 1205712 1001442 1055366 632457 1714872
14423 1714872 1464903 1076815 666143 1564505 1485593 2059549 1421982 1831647 2356880 2282506
14413 2282506 2144986 611467 1348950 1402569 1480401 2156237 1846904 1535798 2163243 2189111
14403 2189111 2383306 570298 426580 1548238 2015421 1620344 1715857 2130611 1648582
14394 1648582 221820 354991 1430874 1643925 1753231 1327439 956057 1939285 137107
14385 137107 370140 1255495 1802551 2096849 917610 1766235 2598522 2626143 1794203 2172304
14375 2172304 1505372 768895 597870 1157762 2037049 2314663 822353 1037854 1202049
14366 1202049 723823 381348 951579 2445390 1386161 644832 1760263 2861112 2709334
14357 2709334 1772835 1625321 2767973 3165738 2043228 1929388 3072991 2480279 1609810
14348 1609810 1276368 1081426 1276164 2039618 1019717 410795 1468079 1510577 1221375
14339 1221375 1237854 1077079 1566965 2288124 2259418 1087861 1059915 -57513 252595 918333
14329 918333 1413711 1555473 1334866 1882892 1226192 1448109 1991438 2107496 2316750 1750002
14319 1750002 739368 1201090 1768361 1116599 529509 1477104 1949784 1419785 1669138
14310 1669138 1075351 622378 1030663 1161017 983810 1100067 1130075 880588 1747812 2599843
14300 2599843 2027213 1609095 1104150 1287572 1589880 2162193 1486081 967956 737351
14291 737351 588800 667069 923426 1166623 2024612 1101978 587187 1139996 516219 1825900
14281 1825900 2631790 2508122 1897827 981227 488985 1065893 1260498 2589086 2479865
14272 2479865 1416463 1245110 -336827 -850673 -458894 951043 1222162 1896288 1957286
14263 1957286 2663354 1027918 985768 2345081 2567664 2280311 12739 73354 710662
14254 710662 508189 997620 925589 199512 1446244 2172170 2355969 2250416 1655330 2613092
14244 2613092 2701196 3289501 2843990 1690226 2662140 2579811 2034514 1749320 1591410 494972
14234 494972 859305 330873 492111 690424 1430384 527288 1240874 1826100 2080054 2439329
14224 2439329 2232385 1499069 1673464 2597711 3174232 1439497 1227105 1370686 1132074
14215 1132074 1300881 1886025 1801425 1354377 1859385 1470996 1188490 1592797 1230655 1316348
14205 1316348 887380 -38943 679074 1701557 2572928 2165514 1791292 1816084 1906272 1898158
14195 1898158 1105011 368862 1141239 1544032 1444480 988733 801371 1470168 1332744 1697506
14185 1697506 1067602 -417101 139657 1204498 1522899 573394 468243 -131824 441970
14176 441970 -331589 -628669 -347485 -82535 280617 1290621 2093288 1156290 463316
14167 463316 268469 1362587 2484842 2128312 1613805 1116524 -220540 746296 2168472
14158 2168472 1500103 1443334 480649 -365320 754639 1143182 2719585 3240843 1901304
14149 1901304 1542790 769570 1913771 1176660 1701639 1099808 827490 1518952 1116564
14140 1116564 2216011 2763707 2298176 1647296 1779068 1734678 2355093 1273895 1629830
14131 1629830 1422450 1413758 1767823 -461754 305455 432030 943542 957390 1374011 1976815
14121 1976815 872725 1629250 1353868 978180 1003972 458286 1067545 1223791 1031136
14112 1031136 2193070 1580305 1104708 1056611 1879197 1885536 2507403 1113854 334687 1750128
14102 1750128 1737941 1151485 1193808 1404183 1723721 797365 468372 595738 229269 657025
14092 657025 1181710 881874 746415 1070943 1619791 1367124 1142326 2658514 2935928
14083 2935928 2141426 1358534 2419560 2095266 1833467 2340965 2410994 2365238 3087954 2507327
14073 2507327 2478332 1697984 2500026 1983005 1531532 1774580 2039572 1804749 2633536 3698237
14063 3698237 3987588 4610159 3941888 2829585 1931093 1057378 1576361 1122105 56354
14054 56354 3633 1118340 1761843 969077 645799 2073344 2473230 1523831 1113685 1383693
14044 1383693 1729810 1289876 449457 1069432 3049290 1590236 2060162 2663706 2524393
14035 2524393 1943777 2449429 1660666 1134844 1082492 1838919 1541035 -149154 355355
14026 355355 -269093 -605570 854521 1545491 2105522 2276202 1625932 1939917 2833967
14017 2833967 2944886 1502213 842819 1463390 -505791 1240370 546220 160082 613132
14008 613132 892278 1077160 2679001 3297974 2465053 1967693 1863987 2501924 1908123
13999 1908123 1622685 2580880 2111260 1699265 2304979 842103 -19749 -109282 1016606
13990 1016606 2279664 2003579 663969 319936 1406510 2731644 2163770 2382851 2691374
13981 2691374 2401207 2089459 2022833 1561269 1917960 3180591 3478605 3230908 2642057
13972 2642057 3094180 3890289 3004138 2101508 1527831 1590286 1226302 1497276 851065 786680
13962 786680 682866 1829051 1819522 1758051 1062902 2218371 1238475 337225 1244927 1515258
13952 1515258 3171196 3728185 1801742 2164393 1304564 1074070 1492887 1736212 1386786
13943 1386786 1511175 1338917 1363218 1964406 1891253 2042587 1098057 2033158 1475105 2171968
13933 2171968 1569089 1463996 1398582 677554 1453507 2003158 2162014 2315889 1535098 986613
13923 986613 701071 1852857 1323749 1848066 2296918 1905183 1619900 1551316 2695346
13914 2695346 3282673 2518038 2229162 2381498 2583254 2671034 2285302 3228712 2591526 1276889
13904 1276889 498007 821455 402798 -136655 1323823 635229 1581307 2139071 2395838
13895 2395838 2605356 2750358 2355726 1814658 2838023 2449479 1552005 2063821 1912786
13886 1912786 2468804 2029674 906416 976994 1028938 750708 1207210 1361605 1381777 761537
13876 761537 1345429 1492861 1462628 1420964 805177 1238049 1591722 1545434 1204543 2009273
13866 2009273 1973830 2355222 2577017 1854873 1253285 1490230 2000515 1111602 1270295 1777051
13856 1777051 1236965 2879513 1886294 238698 211799 2184927 2004755 1926412 2722783
13847 2722783 2074701 1439377 1989965 1908849 1540690 1388349 1599636 1443632 1323697 2237027
13837 2237027 1504637 2017760 1279620 791923 1445192 2287712 2868819 3487437 2021388
13828 2021388 864071 988869 1439211 1405869 1497613 2087572 1769667 1190933 1883030 3460347
13818 3460347 2374868 1364331 241423 1164086 1289678 1002633 425361 1201386 833383
13809 833383 1757074 2135951 1154159 1404076 887718 1250045 1788688 2075750 1969654 2426937
13799 2426937 3620599 2522001 1303302 1689743 2310504 2070967 1083954 1448800 1467373
13790 1467373 1849631 1136273 41003 -107750 342878 1321561 3322695 2492931 1921215
13781 1921215 1219024 1657285 3077733 2377281 1774947 1593175 1250511 925204 1313580
13772 1313580 902823 1634758 1200363 1561940 997988 670683 941755 1285773 1649259
13763 1649259 1214718 998401 1622886 1717174 1779028 1264214 1267248 211729 1076409 101230
13753 101230 242191 1506719 2036398 1850761 989641 1849144 1414031 1617067 1813405
13744 1813405 1453013 2764762 2813245 1434162 1927118 1905683 2965193 2477164 2994714
13735 2994714 2673623 2840813 2968932 2858044 1769845 1602527 359045 1086608 1474886
13726 1474886 1669731 1365931 2241931 1548117 1711151 1500664 1889819 1264745 1417913
13717 1417913 1757421 2996398 2713619 1321552 1375623 2053895 1672951 520340 1666778
13708 1666778 2841231 2671685 1906704 3318629 3310013 2123234 2829512 2803212 2475652
13699 2475652 3056583 2928662 2953789 2663123 3879353 3195570 2459759 1743980 2876783
13690 2876783 1306315 1468440 688703 1400267 1187053 1580663 1098633 1425862 2641701
13681 2641701 2510072 2306529 2560462 2113760 2145038 2921718 2660860 2146030 1772622 2165562
13671 2165562 2116487 2524236 1199389 1096936 1419672 1879857 1284621 1937538 2669716
13662 2669716 3026054 4157490 2092104 1801413 3090036 2108293 1267519 1483449 1454502
13653 1454502 1594810 2008922 1525648 2041943 2282987 1360860 1028601 1223930 1151663 225536
13643 225536 -1149378 -51439 1270589 1849554 1851729 2440174 2605652 2605284 2948977 3230280
13633 3230280 2247292 1790245 313310 -336868 -562746 -79889 1281259 1360010 749371
13624 749371 1408706 1614359 2023368 2657770 1544119 2321434 2311913 1352723 1321232 2754941
13614 2754941 2652355 1621739 1346059 981466 625662 801326 18523 768013 1629894
13605 1629894 1364801 2268217 2545985 1993402 1691808 2266217 2853588 2207395 1431725
13596 1431725 1585890 2106541 2249468 2003589 1952238 2706452 2245260 1787549 1510253 1293855
13586 1293855 1651399 1797545 1966120 1679310 1222768 1068450 1311072 1285571 955446 1142031
13576 1142031 1905515 1298585 974393 2270705 1268223 974162 1692680 2155036 2347787
13567 2347787 3178924 2923646 2468316 2211207 2031664 1651170 1506539 1647964 2154624
13558 2154624 1389668 1065066 2663948 3010386 2567189 2102799 1985532 980370 1770133
13549 1770133 2564077 516957 1394722 -188211 146995 2200994 3239744 3133254 2240348
13540 2240348 2266486 910720 -470036 533898 1796217 1370098 1371180 2012334 2905171
13531 2905171 1802087 2984504 3797315 2997659 1799054 3159516 2653848 1524984 1254627
13522 1254627 1577293 2215397 658401 798209 1302289 1399212 2337305 2172960 2515958
13513 2515958 1746613 442471 917157 1623158 1182549 2212046 2150840 894013 916588
13504 916588 995309 1431966 970082 2280432 3284197 3051964 2815914 3428271 2075856
13495 2075856 1660026 1963942 821089 1727752 1884774 1478960 1059147 2350596 1989238
13486 1989238 2921754 2181478 806763 1129090 1902685 2214796 3240502 2963991 3194267
13477 3194267 2560700 2356020 1804157 1741492 1874355 1850065 2853704 1909775 2431016 2950259
13467 2950259 1547870 1186325 838227 882627 1631387 1641125 1660910 3283659 3231140 2467993
13457 2467993 2261572 473676 704912 780993 630638 507501 1968513 2138394 3292776
13448 3292776 3209346 2324676 3452206 1933721 1687188 1508483 790155 1036813 1280256
13439 1280256 2886340 2092372 2034411 2977405 2288206 1421812 368591 -1444 730222
13430 730222 1481630 324391 99854 488802 510903 1821616 1419184 671634 1321264
13421 1321264 1553594 1605933 1867858 1159056 2371437 2092459 1902348 1304550 1057917
13412 1057917 1685419 2413211 1817996 2550877 1677015 713958 700559 1023594 1574415 1068818
13402 1068818 1671213 1522643 1282213 1411002 1611921 747708 1175349 1474913 1107100
13393 1107100 2298177 1352120 1788545 1458298 463001 1616634 1217011 585602 304346
13384 304346 342332 652964 623827 108020 1523773 2259042 1936899 1687740 1860026 2195720
13374 2195720 2643509 3831304 2103648 848689 584746 1613001 1649873 1897707 2600664
13365 2600664 1934020 2050674 1593862 1584601 1885516 680215 717484 1447743 801353 851647
13355 851647 1238764 944293 1128298 2833637 2080359 1846903 2750933 2068834 1844011
13346 1844011 2449979 2607238 3354094 2108479 2468846 998384 1280340 1534641 942659
$$ [...]
##END NTUPLES=NMR SPECTRUM
##END=
