##TITLE=1H_EC-3254(4-3)
 CDCl3, 8 sc, 
 1.07.2021
##JCAMPDX= 6.0         $$ Bruker NMR JCAMP-DX V2.0
##DATA TYPE= NMR SPECTRUM
##DATA CLASS= NTUPLES
##ORIGIN= UXNMR, Bruker Analytische Messtechnik GmbH
##OWNER= root
$$ XWIN-NMR		Version 3.5
$$ Fri Jul  2 09:53:14 2021 Russian Standard Time (UT+4h)  she@DPX200
##.OBSERVE FREQUENCY= 200.131506
##.OBSERVE NUCLEUS= ^1H
##.ACQUISITION MODE= SIMULTANEOUS
##.ACQUISITION SCHEME= undefined
##.AVERAGES= 8
##.DIGITISER RES= 18
##SPECTROMETER/DATA SYSTEM= spect
##.PULSE SEQUENCE= zg30
##.SOLVENT NAME= CDCl3
##.SHIFT REFERENCE= (INTERNAL, CDCl3, 0, 17.5069)
##AUDIT TRAIL= $$ (NUMBER, WHEN, WHO, WHERE, WHAT)
$$ ##TITLE= Audit trail, XWIN-NMR		Version 3.5
$$ ##JCAMPDX= 5.01
$$ ##ORIGIN= Bruker BioSpin GmbH
$$ ##OWNER= she
$$ F:/spectra/data/she/nmr/H-F/1/pdata/1/auditp.txt
$$ ##AUDIT TRAIL=  $$ (NUMBER, WHEN, WHO, WHERE, WHAT)
(   1,<2021-07-02 09:51:48.89 +0400>,<she>,<DPX200>,
      <created by zg, POWCHK disabled, PULCHK disabled
       configuration hash MD5:
       00 E9 B6 7A A2 85 ED C7 34 08 36 98 17 FE 4E 26
       data hash MD5: 16K
       96 FC EB 31 3B BF 76 C5 3E 3F E7 FC 85 20 52 4C>)
(   2,<2021-07-02 09:51:51.75 +0400>,<she>,<DPX200>,
      <Start of raw data processing
       efp BC_mod = 2 LB = 0.24 FT_mod = 6 PKNL = 1 PHC0 = -11912.17 PHC1 = 9.00099 SI = 16K 
       data hash MD5: 16K
       D3 78 CD 7E BB EB 01 3F 1F 75 2C 9B B0 C5 D2 AE>)
(   3,<2021-07-02 09:52:13.35 +0400>,<she>,<DPX200>,
      <pk PHC0 = -3.275577 PHC1 = 4.6 
       data hash MD5: 16K
       4B C8 B1 34 7E 7D 5B 73 D4 63 50 29 10 05 A9 C2>)
(   4,<2021-07-02 09:52:17.71 +0400>,<she>,<DPX200>,
      <abs ABSG = 5 
       data hash MD5: 16K
       D1 93 A3 8C 27 AE 86 77 3B 0E 59 5A A9 71 DE E1>)
$$ ##END=
$$ 
$$ hash MD5
$$ 76 F3 32 51 24 D6 28 52 8A F5 43 93 96 37 28 36
##$RELAX= 
##$RELAX= 
##$RELAX= 
##$RELAX= 
##$RELAX= 
##$RELAX= 
$$ Bruker specific parameters
$$ --------------------------
##$DU= <F:/spectra>
##$EXPNO= 1
##$NAME= <H-F>
##$PROCNO= 1
##$TYPE= <nmr>
##$USER= <she>
##$AMP= (0..31)
100 100 100 100 100 100 100 100 100 100 100 100 100 100 100 100 100 100 
100 100 100 100 100 100 100 100 100 100 100 100 100 100 
##$AQSEQ= 0
##$AQ_mod= 1
##$AUNM= <au_zg>
##$AUTOPOS= <>
##$BF1= 200.13
##$BF2= 200.13
##$BF3= 200.13
##$BF4= 200.13
##$BF5= 200.13
##$BF6= 200.13
##$BF7= 200.13
##$BF8= 200.13
##$BYTORDA= 1
##$CFDGTYP= 0
##$CFRGTYP= 5
##$CHEMSTR= <none>
##$CNST= (0..31)
1 1 145 1 1 1 1 1 1 1 1 1 1 1 1 1 1 1 1 1 1 1 1 1 1 1 1 1 1 1 1 1 
##$CPDPRG= <>
##$CPDPRG1= <>
##$CPDPRG2= <>
##$CPDPRG3= <>
##$CPDPRG4= <mlev>
##$CPDPRG5= <mlev>
##$CPDPRG6= <mlev>
##$CPDPRG7= <mlev>
##$CPDPRG8= <mlev>
##$CPDPRGB= <>
##$CPDPRGT= <>
##$D= (0..31)
0 1.2 0 0 0 0 0 0 0 0.06 0 0.03 0 0 0 0 0.0002 0 0 0 0 0 0 0 0 0 0 0 0 
0 0 0 
##$DATE= 1625205108
##$DBL= (0..7)
120 120 120 120 120 120 120 120 
##$DBP= (0..7)
150 150 150 150 150 150 150 150 
##$DBP07= 0
##$DBPNAM0= <>
##$DBPNAM1= <>
##$DBPNAM2= <>
##$DBPNAM3= <>
##$DBPNAM4= <>
$$ [...]
##$SUBNAM3= <"">
##$SUBNAM4= <"">
##$SUBNAM5= <"">
##$SUBNAM6= <"">
##$SUBNAM7= <"">
##$SUBNAM8= <"">
##$SUBNAM9= <"">
##$SW= 20.0188882624521
##$SWIBOX= (0..15)
0 0 2 0 0 0 0 0 0 0 0 0 0 0 0 0 
##$SW_h= 4006.41025641026
##$TD= 16384
##$TD0= 1
##$TE= 0
##$TE2= 300
##$TE3= 300
##$TEG= 300
##$TL= (0..7)
0 120 120 120 120 120 120 120 
##$TP= (0..7)
150 150 150 150 150 150 150 150 
##$TP07= 0
##$TPNAME0= <>
##$TPNAME1= <>
##$TPNAME2= <>
##$TPNAME3= <>
##$TPNAME4= <>
##$TPNAME5= <>
##$TPNAME6= <>
##$TPNAME7= <>
##$TPOAL= (0..7)
0.5 0.5 0.5 0.5 0.5 0.5 0.5 0.5 
##$TPOFFS= (0..7)
0 0 0 0 0 0 0 0 
##$TUNHIN= 0
##$TUNHOUT= 0
##$TUNXOUT= 0
##$USERA1= <user>
##$USERA2= <user>
##$USERA3= <user>
##$USERA4= <user>
##$USERA5= <user>
##$V9= 5
##$VALIST= <valist>
##$VCLIST= <CCCCCCCCCCCCCCC>
##$VD= 0
##$VDLIST= <DDDDDDDDDDDDDDD>
##$VPLIST= <PPPPPPPPPPPPPPP>
##$VTLIST= <TTTTTTTTTTTTTTT>
##$WBST= 1024
##$WBSW= 4
##$XGAIN= (0..3)
0 0 0 0 
##$XL= 0
##$YL= 0
##$YMAX_a= 322923
##$YMIN_a= -438620
##$ZGOPTNS= <>
##$ZL1= 120
##$ZL2= 120
##$ZL3= 120
##$ZL4= 120
##$ABSF1= 17.502
##$ABSF2= -2.517038
##$ABSG= 5
##$ABSL= 3
##$ALPHA= 0
##$AQORDER= 0
##$ASSFAC= 0
##$ASSFACI= 0
##$ASSFACX= 0
##$ASSWID= 0
##$AUNMP= <proc_1d>
##$AZFE= 0.1
##$AZFW= 0.1
##$BCFW= 0
##$BC_mod= 2
##$BYTORDP= 0
##$COROFFS= 0
##$CY= -3
##$DATMOD= 1
##$DC= 0
##$DFILT= <>
##$DTYPP= 0
##$F1P= 0
##$F2P= 0
##$FCOR= 1
##$FTSIZE= 16384
##$FT_mod= 6
##$GAMMA= 0
##$GB= 0
##$INTBC= 1
##$INTSCL= 1.334414e-10
##$ISEN= 128
##$LB= 0.24
##$LEV0= 0
##$LPBIN= 0
##$MAXI= 10000
##$MC2= 0
##$MEAN= 0
##$ME_mod= 0
##$MI= 1.114404
##$NCOEF= 0
##$NC_proc= -6
##$NLEV= 6
##$NOISF1= 3.799351
##$NOISF2= 2.8
##$NSP= 0
##$NTH_PI= 0
##$NZP= 0
##$OFFSET= 17.50688
##$PC= 1
##$PHC0= -11915.45
##$PHC1= 13.60099
##$PH_mod= 1
##$PKNL= yes
##$PPARMOD= 0
##$PSCAL= 0
##$PSIGN= 0
##$REVERSE= no
##$SF= 200.1300055535
##$SI= 16384
##$SIGF1= 3
##$SIGF2= 2
##$SINO= 5.538805
##$SIOLD= 16384
##$SREGLST= <1H.CDCl3>
##$SSB= 0
##$STSI= 16384
##$STSR= 0
##$SW_p= 4006.41025641026
##$SYMM= 0
##$S_DEV= 0
##$TDeff= 16384
##$TDoff= 0
##$TI= <>
##$TILT= no
##$TM1= 0
##$TM2= 0
##$TOPLEV= 0
##$USERP1= <user>
##$USERP2= <user>
##$USERP3= <user>
##$USERP4= <user>
##$USERP5= <user>
##$WDW= 1
##$XDIM= 16384
##$YMAX_p= 313206812
##$YMIN_p= -343350
$$ End of Bruker specific parameters
$$ ---------------------------------
##NTUPLES= NMR SPECTRUM
##VAR_NAME=  FREQUENCY,     SPECTRUM/REAL,   SPECTRUM/IMAG
##SYMBOL=    X,             R,               I
##VAR_TYPE=  INDEPENDENT,   DEPENDENT,       DEPENDENT
##VAR_FORM=  AFFN,          ASDF,            ASDF
##VAR_DIM=   16384,         16384,           16384
##UNITS=     HZ,            ARBITRARY UNITS, ARBITRARY UNITS
##FACTOR=    0.24454680195387, 1,            1
##FIRST=     3503.65195290302, 0,            0
##LAST=      -502.758303507244, 0,           0
##MIN=       -502.758303507244, -343350,     0
##MAX=       3503.65195290302, 313206812,    0
$$ Real data points
##PAGE= N=1
##DATA TABLE= (X++(R..R)), XYDATA
$$ [...]
6318B0166J5552j3466L6533l746j31527L9970N9794l9438L9667L8187M9055p4882
6306C5865j5342J9696m0874M0427k8346m9491J07383k6411M2740L379j77931O1347
6294b7558O8442l6660j08515k187J29404r1027R0959O1765J4935M5354m9815L0898
6282A25995P7737k9800l336m5204J39404N3256j36675N852r5405R324m4002N6901
6270A14047P1557k4595L9960n9506m5877m9587j4196Q2975P5506j23731N9369
6259A25922L3475q8890R3144P0428n1647q0488K803O2004k1109p7580J20868N4824
6247B43754P765j44190o1630q3768o9873Q8785P0202p7262P0479K1134K5254J1578
6235A02228k3517P598L871J9185J43771j08393n38J13038q4638p8142j01251P5650
$$ y = [20166, 35718, 22252, 58785, 55039, -76488, -36518, 23276, -16162, 23505, 61692, 110747, 35865, 20523, 40219, -655, 39772, 11426, -38065, 69318, 42907, 85647, 89026, -88905, -27558, 40884, 4224, -104291, -106478, 22926, -68101, 22858, 84623, 99558, 144912, 95097, 125995, 203732, 173932, 170596, 125392, 264796, 318052, 181377, 187229, 91824, 101148, 57146, 114047, 185604, 161009, 200969, 141463, 95586, 45999, 31803, 114778, 190284, 66553, 125922, 159397, 70507, 163651, 234079, 182432, 101944, 104747, 166751, 145642, 68062, 188930, 243754, 251519, 107329, 45699, -38069, -107942, -19157, 51045, -26217, 44262, 65396, 90650, 102228, 78711, 86309, 90180, 109365, 253136, 144743, 144205, 257243, 172605, 94463, -6788, 68862]
6223F8862J7476J26543p1934m2979o1014O4698L9284q3704J00683l8860M3730
6212A62785O0566l7694N432m2513J4269n761j01480J34836P8327k00535P4834
6201A43066J12578m3995N6332l6405p2533P2723m5672J01016M0662m7025j9856
6190B60891J22840p104q8393O05j4277N2269K05326k9483j20904n4126J70733
6179D98377J53684r6118p0275O4400Q3364J1529j883j12955O7754m528j07114
6168D86235J2616L9292O1041K8861j09063m1760J2956o814k4164m9449j91627
6157B18124Q0881n2844p0595M1613P6524k9847N5623O0630j48716L1121j7128
6146B45386P2127k280k19653L3254P1986j6638q7199N5168J3590j3406q5851N2492
$$ y = [68862, 86338, 212881, 140947, 97968, 36954, 101652, 140936, 57232, 157915, 119055, 162785, 223351, 185657, 191089, 148576, 162845, 157084, 55604, 190440, 268767, 68232, 143066, 255644, 211649, 267981, 231576, 159043, 231766, 186094, 287110, 327772, 280747, 260891, 383731, 376627, 288234, 288839, 274562, 326831, 532157, 502674, 381770, 327644, 498377, 652061, 555943, 485668, 550068, 633432, 644961, 643078, 530123, 597877, 593349, 486235, 498851, 538143, 599184, 628045, 518982, 477222, 490178, 483364, 459200, 409751, 218124, 299005, 246161, 175566, 217179, 293703, 263856, 319479, 380109, 231393, 262514, 245386, 317513, 315233, 95580, 128834, 200820, 184182, 96983, 152151, 165741, 152335, 66484, 118976]
6134A18976M7163L5937P830L5573n2695j0080n7094q3194Q8852l6252l2306K6506
6122H9216J09226N2980m8657o8600N1396N0279o7449o3968J07265N1440n3005
6111B10123o6223J7591q7525P4495L5562o4363P7716p6335N9397N6698n9414l2199
6099A45523J14548r7417P5615J17746k5236k0517p7651o0064l3534K2608K0836
6088A82457L2672o5812k534n1516Q4351Q4039O5298J0269p6388K053N1440J5124
6076C31453j1885p8850L7394J09229q7905m384N0321k2036n0495K8600l1321j21981
6064A48140N1725L56K51J67523j2347k5639p6155r8454J9172k6695P0154p6617
6052A41414j2066L2209m4139l5663K5466j293l863J06008o7254p3724J5658P5420
$$ y = [118976, 166139, 202076, 209906, 245479, 192784, 182704, 125610, 42416, 131268, 95016, 62710, 89216, 198442, 251422, 202765, 134165, 185561, 235840, 168391, 104423, 211688, 263128, 210123, 143900, 161491, 73966, 148461, 184023, 119660, 197376, 121041, 180438, 237136, 177722, 145523, 260071, 162654, 238269, 356015, 330779, 310262, 232611, 172547, 139013, 161621, 182457, 215129, 149317, 146783, 95267, 179618, 263657, 328955, 339224, 262836, 264889, 316329, 331453, 319568, 240718, 278112, 387341, 299436, 295052, 345373, 323337, 272842, 301442, 270121, 148140, 199865, 200221, 200472, 367995, 355648, 330009, 253854, 155400, 174572, 147877, 218031, 141414, 129348, 161557, 117418, 81755, 107221, 105928, 102065, 208073, 140819, 67095, 82753, 158173]
6040A58173O182M848P2750o8150j0638m959j8610M0322J12465j29165L8919m1619
6028A60518j00721l2051O8574N7324n3436j8995N3188n2585J09375K5720n0627
6017A66284o4482r9080j0891L2323J17752M0569j09800L5005k2649j01985N5256
6006C8302K5046J4665O4650P8273J4141m9331p380Q089l378o9476Q5090P3591
5994B72282j08658j49604O2209P5007p35J2328M5311J53906j53118k4469P026
5983A91485o6507M8081M76P2001M0102r1323m1157p3280K9468P4386o4274N6725
5971A76183j9631J5906j8298j6437J6666Q2404Q3106r5664j6654K5910L0459m4561
5959B19389J47645J5699j76627m054L2721k2650K9812N3443R4755o1164j67863
$$ y = [158173, 164355, 169203, 241953, 173803, 163165, 158206, 139596, 179918, 292383, 163218, 202137, 160518, 59797, 27746, 96320, 153644, 100208, 81213, 134401, 81816, 191191, 216911, 166284, 101802, 2722, -8169, 24154, 141906, 182475, 72675, 107680, 85031, -16954, 38302, 63348, 78013, 142663, 220936, 235077, 185746, 178366, 186455, 183077, 113601, 198691, 272282, 163624, 14020, 76229, 151236, 150501, 162829, 208140, 362046, 208928, 184459, 191485, 124978, 173059, 173535, 245536, 285638, 194315, 153158, 79878, 109346, 183732, 119458, 176183, 156552, 172458, 154160, 137723, 154389, 236793, 319899, 224235, 207581, 233491, 263950, 219389, 367034, 382733, 206106, 202052, 234773, 212123, 241935, 295378, 390133, 328969, 161106]
5948A61106r7127J52044q9607J0029Q5809P2906j54888O4109J5441N3157j00559
5937A72420l6846J35046l3453m474O6365M4760j08700p0266K7305m6028N0373
5926A96502P3462m9174l0232r8101P9322M8264j8015Q4677l6874l05j24120n929
5914A19477N4673M7261M101J3353J6910r4531K4308l8138O9077k0807P1719N4293
5902C21696j61950k1127O4395Q0900o1768m2874R1992q1485l1998n2580m7605
5891E7596P3560o3505K1378N8127N2183J10728m9130k5390m2706P1684o6231J6058
5879B14352k3787M2914L8210J6829j15055J7791J04024j7560P6338K844p0776
5868B86124J4591M3011p034j6678j04258Q2662j0381M9340M3419r3255o0041J5519
$$ y = [161106, 63979, 216023, 126416, 136445, 222254, 295160, 140272, 204381, 219822, 272979, 172420, 135574, 270620, 237167, 232693, 299058, 343818, 235118, 164852, 192157, 146129, 196502, 269964, 220790, 190558, 92457, 171779, 220043, 202028, 286705, 249831, 249526, 125406, 119477, 174150, 221411, 225512, 238865, 255775, 161244, 185552, 147414, 216491, 195684, 267403, 321696, 159746, 138619, 203014, 283914, 222146, 179272, 271264, 189779, 157781, 105201, 57596, 131156, 67651, 89029, 147156, 199339, 310067, 260937, 235547, 192841, 264525, 198294, 214352, 190565, 233479, 271689, 288518, 173463, 191254, 295278, 277718, 354056, 356900, 286124, 300715, 343726, 336692, 320014, 215756, 298418, 288037, 337377, 380796, 287541, 227500, 243019]
5856B43019j4750m3028m5299M574J09769n3916m2515J05951N3448r093L5205K9412
5844C72777N1043j0786l0721j45048L845M0293J00280l4052m8831j9743m4806
5833B34251K3575M6314L563l3135L6147J5804J04503n0676p8114p8434q668J37692
5821C52822o0647N6641m4533n8158J03433K2240r0169L1603j9037N6965Q3898
5810D35058k15562N6672r7798j8304K00931j96685J8748J56707j13302J5922J15642
5799C58029n1794j07361J62329j13529R592J16971J6185n1006r3223o0318k9273
5788A56602J82125k251M4454m333m0671O241j4576L7630l9073j09295P4031m3667
5776B47217J2155k4484k5650M7452M1879N2697n0383K7288J08564k9779j6288
$$ y = [243019, 228269, 185241, 139942, 144516, 254285, 200369, 157854, 263805, 317253, 308160, 343365, 372777, 423820, 413034, 382313, 237265, 241110, 281403, 381683, 347631, 298800, 279057, 234251, 257826, 304140, 307703, 274568, 310715, 326519, 431022, 380346, 302232, 223798, 215130, 352822, 292175, 348816, 304283, 246125, 349558, 371798, 281629, 313232, 294195, 351160, 435058, 219496, 276168, 178370, 160066, 360997, 164312, 183060, 339767, 226465, 242387, 358029, 306235, 198874, 361203, 247674, 257266, 374237, 390422, 339416, 246193, 185875, 156602, 338727, 336476, 380930, 376597, 335926, 342167, 327591, 365221, 326148, 216853, 290884, 247217, 259372, 234888, 209238, 256690, 298569, 351266, 300883, 328171, 436735, 406956, 390668]
5765C90668Q1533j53772o1982O4101J9929l5841P7018l8925q7732N6203q224O301
5753C09277q2824O7794M2445m9379R7457J13836l4239l9281J05767J5904r5639
5742D51118p738n3993p508N7192j6077R295k4992K2925M8779L5872o2812k4043
5730D28018J10342p4555O5217k142p1271K9046r7678p0175K34934J5126n2957
5719E13905R7463l6446J33171L4187q0238j34320o9197K3102M7858O7451o8482
5708E28454J0232Q3301r508J02074r986Q8180m0240p9751n1489L925L9127J55896
5696H20215K8549K7332O5941L8789n2124K1339r1596P3288J00286k9230J53671
5685A156460j1038n9962k9658P9378o6614j52690M4689J07070o5959k9284J44216
$$ y = [390668, 472201, 318429, 256447, 320548, 340477, 304636, 381654, 342729, 254997, 311200, 302976, 309277, 226453, 294247, 336692, 287313, 384770, 498606, 464367, 425086, 530853, 546757, 451118, 443380, 389387, 381879, 439071, 422994, 432289, 407297, 430222, 479001, 514873, 452061, 428018, 538360, 463805, 529022, 526880, 455609, 484655, 386977, 316802, 551736, 566862, 513905, 611368, 574922, 708093, 742280, 662042, 527722, 458525, 481627, 529485, 596936, 528454, 538686, 621987, 612479, 714553, 704567, 792747, 752507, 672756, 621267, 625192, 664319, 820215, 848764, 876096, 942037, 980826, 928702, 950041, 858445, 931733, 1032019, 1002789, 1156460, 1145422, 1085460, 1055802, 1135180, 1068566, 915876, 960565, 1067635, 1001676, 972392, 1116608]
5674A116608n4557k089j4893R1757p377K0497J11418N4418L7741K9953M3802J01083
5662A528361M6198J18217R5956J02255j8508j11168o7827O0057o1452j22584n3536
5651A515969j49944K0855N0445j39921r1883N7198r4086N5191j68504r2269J62057
5640A125108M306L5589P8570R5787J24956k4957N3614o0996m311p227K1763o5685
5628A376517j04433K705m6119j01283L4152o2115q6983k3685l736J19193l4348
5617A069865j08127Q0600n195K8505m4327q9280k0679L9350n3646l3191J12272
5606I76147J06174p2899n2494m1674j6321J5546l0882M2560N3628j12127J2333
5595H79991r323P8080k6566J2147M8332Q831p7983M3124j0303k0892j17056L2052
$$ y = [1116608, 1062051, 1059962, 1045069, 1136826, 1129449, 1149946, 1261364, 1315782, 1353523, 1383476, 1427278, 1528361, 1574559, 1692776, 1788732, 1890987, 1872479, 1761311, 1693484, 1753541, 1692089, 1569505, 1515969, 1366025, 1386880, 1437325, 1297404, 1205521, 1262719, 1168633, 1223824, 1055320, 963051, 1125108, 1129414, 1165003, 1243573, 1339360, 1464316, 1439359, 1492973, 1431977, 1427666, 1420439, 1442202, 1376517, 1272084, 1274789, 1228670, 1127387, 1161539, 1099424, 1012441, 988756, 985020, 1104213, 1069865, 961738, 1042338, 1037143, 1065648, 1021321, 932041, 911362, 950712, 897066, 863875, 976147, 1082321, 1009422, 956928, 915254, 898933, 914479, 883597, 926157, 979785, 867658, 879991, 870668, 948748, 922182, 934329, 982661, 991492, 913509, 956633, 946330, 925438, 808382, 840434]
5583H40434J64913m985K3188j940M2341O2966K0338o2203K7374Q499P8791j7784
5571A181932r9092j4300J13396m753o6585N1722L9110k3076M6182r6304L309J15450
5559A246991M3549r3633P7052l2004N9539q7466J9885N209k2638K00441Q993j77992
5547A247926O6667O0281m0727o7989R4415N2757m1813J51621P5603q4950K9560
5536A543351J16658L8044j0212J1593J05775L646R678Q8391J9985K9528q7078
5525A869359p2404P7296J1416J61523J8851P8736n8188L274J18817P2265J25099
5514B406044J37019L9515N0997J00935M8253Q7289P3992N5447J94748J65931J15340
5503C475510K18791J49403R1611L61998K00058K07204K85750K53753M26110L14492
$$ y = [840434, 1005347, 1000362, 1023550, 1021610, 1063951, 1126917, 1147255, 1085052, 1112426, 1120925, 1199716, 1181932, 1082840, 1068540, 1181936, 1177183, 1110598, 1162320, 1201430, 1178354, 1224536, 1128232, 1131541, 1246991, 1290540, 1196907, 1273959, 1241955, 1301494, 1214028, 1233913, 1239122, 1216484, 1416925, 1425918, 1247926, 1314593, 1374874, 1334147, 1266158, 1360573, 1413330, 1371517, 1523138, 1598741, 1513791, 1543351, 1660009, 1698053, 1687841, 1699434, 1805209, 1808855, 1818533, 1906924, 1926909, 1956437, 1869359, 1796955, 1874251, 1885667, 2047190, 2066041, 2144777, 2086589, 2089863, 2208680, 2280945, 2406044, 2543063, 2582578, 2633575, 2734510, 2782763, 2870052, 2944044, 2999491, 3194239, 3360170, 3475510, 3694301, 3843704, 3935315, 4297313, 4497371, 4704575, 4990325, 5244078, 5670188, 5984680]
5493E984680K70837K16097K7742r3877j50591k24868j79426j72147j59312j71263
5483E347872M5463R887r2641q934N7160L5695J51476K11396J69684K80361K80141
5472F487560K59388J98270L71891L52949K90948L72175L44054K90422L40267J94438
5462I502362N1504N6173l149k41293k90545l14013k59799j73879k91435l25062
5452G710864l05788j30290l99673k42097j56798j4590p5135p5143r311J12716
5442F414755l7550K47148K07253M6203K37347K57218K79877K91009L38940L41463
5432H623663K21743K06195J01063k14768N487j57579j87773r5496N9622J43208
5422H705365Q4892K83172J90191M47272P59335M88981N33489P95250R09930R39624
$$ y = [5984680, 6255517, 6471614, 6499356, 6405479, 6254888, 6030020, 5850594, 5678447, 5519135, 5347872, 5393335, 5403222, 5310581, 5301647, 5358807, 5394502, 5545978, 5757374, 5927058, 6207419, 6487560, 6746948, 6945218, 7317109, 7670058, 7961006, 8333181, 8677235, 8967657, 9307924, 9502362, 9553866, 9610039, 9606890, 9365597, 9075052, 8761039, 8501240, 8327361, 8035926, 7710864, 7405076, 7274786, 6875113, 6633016, 6476218, 6461628, 6386493, 6311350, 6302039, 6414755, 6377205, 6624353, 6831606, 6877809, 7115156, 7372374, 7652251, 7943260, 8282200, 8623663, 8845406, 9051601, 9152664, 8937896, 8943383, 8785804, 8598031, 8502535, 8562157, 8705365, 8790257, 9073429, 9263620, 9710892, 10470227, 10959208, 11492697, 12287947, 13197877, 14137501]
5412A4137501R01375P36086M22763l3252l39643o50653p77413p05205p89072o05706
5402A2296781l94344l94859j76731N8653r7482J33662L12592K88346M63111N00097
5392A2989826P38551Q45564J124667J037429J189110J320359J429870J670517
5384B2345893J581409J430550J045676N07336j42511r14405j347803j676559j934764
5375B0894822j832471j482464j370965j158248j023426q06229o39291n63764l27445
5366A1690519j87279j84845j06914J30815K48496R5725K54587L81372M74813P81075
5356A3578364O38297O46177O23186N24340K02307k12293p28953j021908j163127
5347A3086390j193330j012481q69586r77133p06503n67199n64671m54922m76269
$$ y = [14137501, 15038876, 15774962, 16197725, 16164473, 15824830, 15174177, 14396764, 13691559, 12902487, 12296781, 11902437, 11507578, 11330847, 11389500, 11292018, 11425680, 11738272, 12026618, 12489729, 12989826, 13728377, 14573941, 15698608, 16736037, 17925147, 19245506, 20675376, 22345893, 23927302, 25357852, 26403528, 26910864, 26768353, 25853948, 24506145, 22829586, 20894822, 19062351, 17579887, 16208922, 15050674, 14027248, 13221019, 12581728, 12017964, 11690519, 11503240, 11318395, 11211481, 11342296, 11590792, 11686517, 11941104, 12322476, 12797289, 13578364, 14216661, 14862838, 15486024, 16010364, 16212671, 16000378, 15271425, 14249517, 13086390, 11893060, 10880579, 10010993, 9033860, 8327357, 7760158, 7195487, 6740565, 6264296]
5338F264296k94241k36147l10735l83022k26879k32919j80742j92968k57292j26947
5328C822404k48725j80534n3425n4377j46820j22077k9330j28787M2570q350o5415
5317B827134j35221j5391k5051j27077q2115k0845j89193j22441m4825p5090J0446
5306B000331l1722O3148n5721j50738o3903q4354Q2079L8642j09207j08803N6765
5295A636517k3319k2165m1150K3412J63071j15914L8637R701k366j00123L3907
5284A600208J28349j99347J10869O5795j60190j9138l3901k4932r8090r0689R1709
5273A370643L0445m4751j97254K1492O4310r374m2586o215K3653o7675O0936j7154
5261A186470k09298J26691J3538O0615p1256j20070P3943J4959n971J79165o834
$$ y = [6264296, 5970055, 5733908, 5423173, 5040151, 4813272, 4580353, 4399611, 4206643, 3949351, 3822404, 3573679, 3393145, 3339720, 3285343, 3138523, 3016446, 2987116, 2858329, 2900899, 2892549, 2827134, 2691913, 2676522, 2651471, 2524394, 2442279, 2421434, 2232241, 2109800, 2064975, 1989885, 2000331, 1968609, 2031757, 1976036, 1825298, 1761395, 1677041, 1759120, 1797762, 1688555, 1579752, 1636517, 1613198, 1591033, 1549883, 1573295, 1736366, 1620452, 1659089, 1668790, 1666424, 1566301, 1600208, 1728557, 1529210, 1640079, 1705874, 1545684, 1526546, 1492645, 1467713, 1369623, 1278934, 1370643, 1401088, 1356337, 1159083, 1180575, 1244885, 1235511, 1192925, 1186710, 1210363, 1142688, 1203624, 1186470, 977172, 1103863, 1117401, 1178016, 1106760, 986690, 1060633, 1075592, 1069621, 1248786, 1241952]
5250A241952j60187P0282p9579L4181j05496Q9492L9911K1074m4757O6898o1865
5239A111906j54992L9121N8135N6398J15786q4088j12003j76452J38595J09347
5229A101753J5334l4138K7728n9859J17068j15515j8242J01076n8405m3466l7592
5218I95742k2750J16458M6922p5758p056o4718R5078J3938o9084p5474q3328N6447
5206I26417k8294N2925M7820K3886q8476K6175J04682K0540k1910J2227R0090
5195A166082Q846j08728o0148n1825J02778J09190j529M4939m2532M2075o4888
5184A144260q149n2909J30401n3126L7001r9855l9316Q9042J79809j01982R908
5173A235084K7844N3805j3256r0563M069J00340Q9707Q493k6845j39739N4090
$$ y = [1241952, 1081765, 1152047, 1072468, 1106649, 1001153, 1090645, 1130556, 1151630, 1106873, 1173771, 1111906, 956914, 996035, 1054170, 1110568, 1226354, 1142266, 1030263, 853811, 992406, 1101753, 1117087, 1082949, 1110677, 1050818, 1167886, 1052371, 1034129, 1135205, 1076800, 1033334, 995742, 972992, 1089450, 1136372, 1060614, 1053558, 988840, 1083918, 1097856, 1028772, 953298, 869970, 926417, 898123, 951048, 998868, 1022754, 934278, 960453, 1065135, 1085675, 1063765, 1075992, 1166082, 1174928, 1066200, 1006052, 954227, 1057005, 1166195, 1164666, 1209605, 1167073, 1209148, 1144260, 1136111, 1083202, 1213603, 1160477, 1197478, 1097623, 1058307, 1147349, 1327158, 1225176, 1235084, 1262928, 1316733, 1303477, 1212914, 1216983, 1317323, 1407030, 1415523, 1388678, 1248939, 1303029]
5162A303029J39146r732r7673L8774P9513P6916Q3209m2327M6951J91697n3833
5151A755670N5514R140p1091Q7732J41357m1561J07251J6473p7350M4408P6481
5140B104024K0288K3536Q5320O7066K4694R1307N9101l8712M3272n5557Q2393
5129B506732M2037l7591r9254P2738J25604Q6609L5093J48628O7268J06862L9392
5118C094118r9731j02005Q8039r5921K8559l4628P4396J30329P7276l8098M0467
5107C162801M6387O691j25898L1095l0880j50055J0298k3097P9252l0540l3600
5096B942454K8902L4818p6767n0603Q1254J47836L7854M1093Q9654l1184l6461
5085C208850J19962J71466J73466M0455J82881J38647L19806K36989N0312q9298
$$ y = [1303029, 1442175, 1432443, 1334770, 1373544, 1453057, 1529973, 1613182, 1570855, 1617806, 1809503, 1755670, 1811184, 1820324, 1749233, 1836965, 1978322, 1936761, 2044012, 2060485, 1983135, 2027543, 2104024, 2124312, 2147848, 2233168, 2300234, 2324928, 2416235, 2475336, 2436624, 2479896, 2424339, 2506732, 2548769, 2511178, 2411924, 2484662, 2610266, 2696875, 2731968, 2880596, 2947864, 3054726, 3094118, 2994387, 2892382, 2980421, 2884500, 2913059, 2878431, 2952827, 3083156, 3160432, 3122334, 3162801, 3209188, 3215879, 3089981, 3121076, 3090196, 2940141, 2950439, 2927342, 3006594, 2976054, 2942454, 2971356, 3006174, 2929407, 2878804, 2960058, 3107894, 3145748, 3186841, 3276495, 3245311, 3208850, 3328812, 3500278, 3673744, 3714199, 3897080, 4035727, 4355533, 4592522, 4642834, 4553536]
5075D553536k32473k12897k036j47129o6043p4522M754K5795J10863P053J4567
5064C981468J316J02016J47752J59495J65370p4762M9165K62052K63402J11666
5054E168940J48715K54869L41320L66347L04663K64682Q8645M5637m8095j08220
5044F827503K1098R3757J39442K76676J64199L63657M78566K11579M60156M03148
5034I439781L92993N44637P19944O82666P89801Q60207J073053J229189J283473
5025A7015744J523471J564781J893526K293994K521157K564725K643674K612615
5017C4633687K514463K561016K346847J923725J288734N13758n02432j336822
5009D3942976k150091k417301k422984k576679k542399k491544k478432k414706
$$ y = [4553536, 4321063, 4108166, 4106130, 3959001, 3892958, 3818436, 3823190, 3848985, 3959848, 3966901, 3981468, 3982784, 4084800, 4232552, 4392047, 4557417, 4482655, 4531820, 4793872, 5057274, 5168940, 5317655, 5572524, 5913844, 6280191, 6584854, 6849536, 6938181, 6983818, 6935723, 6827503, 6848601, 6942358, 7081800, 7358476, 7522675, 7886332, 8364898, 8576477, 9036633, 9439781, 9832774, 10377411, 11097355, 11780021, 12569822, 13430029, 14503082, 15732271, 17015744, 18539215, 20103996, 21997522, 24291516, 26812673, 29377398, 32021072, 34633687, 37148150, 39709166, 42056013, 43979738, 45268472, 45782230, 45279798, 43942976, 41792885, 39375584, 36952600, 34375921, 31833522, 29341978, 26863546, 24448840]
5001B4448840k077656j965056j721692j482994j321761j135244q41390j020087
4993A2882960q06243n92699o81849n58873k48805m76847l18527l69603m08123
4984H421391k36946j53986k39390k52666k03459k7412j65640j32406j61213k56065
4974F592208j51244k43236j45917k75580k13678r4792n1193q3570j95482j55005
4964D982511o6033p0375j62624j42248p7824J0326j00120j71041r4907o6497L0172
4953D071340j1138k3873j09237j57272p8809m9326j9055n2928j50927j8500k16
4942C400059j4212k06850L4653q8873L0411k11153m5700K5914O835P333q010r049
4930B921358l0088l66J13266o291J304M8940O5718O3568k0012j08064n68j08151
$$ y = [24448840, 22371184, 20406128, 18684436, 17201442, 15879681, 14744437, 13903047, 12882960, 12076717, 11484018, 10802169, 10243296, 9994491, 9517644, 9199117, 8829514, 8421391, 8184445, 8030459, 7791069, 7538403, 7334944, 7307532, 7141892, 7009486, 6848273, 6592208, 6440964, 6197728, 6051811, 5776231, 5562553, 5467761, 5416568, 5332998, 5137516, 4982511, 4916478, 4846103, 4683479, 4541231, 4463407, 4473733, 4373613, 4202572, 4107665, 4041168, 4071340, 4060202, 4036329, 3927092, 3769820, 3691011, 3641685, 3622630, 3569702, 3418775, 3400275, 3400059, 3385847, 3178997, 3213650, 3124777, 3155188, 2944035, 2898335, 2924249, 2931084, 2938417, 2930407, 2921358, 2891270, 2890904, 3004170, 2997879, 2999183, 3048123, 3113841, 3177409, 3157397, 3049333, 3048765, 2940614]
4918B940614L2340J8851m2593q7443L3895M8811o492M9599o5592J87248j3721
4907C095517O4696Q9123j2435J78119L51564J90177R5380K25992n614J43308O211
4896D422038k12016o2721q9922j45099k07979k14683r1884j7050j76980l5080
4886C168624j3452q2405j07530o6979j28854m1689J4144J25304J00533O56P7689
4875C046041P276J01340J06198P8463m0040N0810K92402K62526J74012K35854
4865D314882L15836M07122M41861M74134O93353O35764P48864P27468J251188
4856A0010472J580985J860850K222879J891922M23152j832675k350184k394938
4848A1412463k209365j532202j024782o89054n94255l59002m10383m58085k07719
$$ y = [2940614, 2972954, 2991805, 2949212, 2861769, 2895664, 2944475, 2937983, 2987582, 2921990, 3109238, 3095517, 3160213, 3249336, 3236901, 3415020, 3766584, 3956761, 4052141, 4278133, 4272519, 4415827, 4422038, 4210022, 4147301, 4057379, 3912280, 3704301, 3489618, 3397734, 3380684, 3203704, 3168624, 3155172, 3072767, 2965237, 2898258, 2769404, 2727715, 2741859, 2867163, 2967696, 2968352, 3046041, 3053317, 3154657, 3260855, 3339318, 3299278, 3350088, 3642490, 3905016, 4079028, 4314882, 4630718, 5037840, 5479701, 5953835, 6647188, 7282952, 8031816, 8759284, 10010472, 11591457, 13452307, 15675186, 17567108, 17990260, 16157585, 13807401, 11412463, 9203098, 7670896, 6646114, 5957060, 5362805, 5003803, 4593420, 4135335, 3927616]
4839C927616j41017k12403k41166j59860L1977q2239j41076k02553j13335q4541
4829B581403j17903j06894k9410K633o7893j02711N3467j07758K913n2531j01508
4818A953808q8096k0576P2230J5161J9242r1098j30072N8877k5534j71322r0976
4807A501644M0120L6264N1326J2109J0093m1406j00281k15117L4558J28979K785
4796A461074K5588m6820o5650L1071r7038k8183J12141J73320j54427m8666j08542
4785A253868M559J4163q596N8475j8580K3534j67870R0093k5717N1074P9938O243
4773A361184j17192M5000L8056j6018o2004p490L2454L1246K287J2227j6066J34816
4761A438500n9067p8277j7253P7063n2825o9305Q0472P489Q103k3268j01097M0642
$$ y = [3927616, 3786599, 3574196, 3333030, 3173170, 3205147, 3122908, 2981832, 2779279, 2665944, 2581403, 2463500, 2356606, 2327196, 2329829, 2261936, 2159225, 2212692, 2104934, 2107847, 2055316, 1953808, 1865712, 1845136, 1917366, 1932527, 1951769, 1860671, 1730599, 1789476, 1763942, 1592620, 1501644, 1541764, 1578028, 1629354, 1641463, 1651556, 1610150, 1509869, 1294752, 1329310, 1458289, 1461074, 1486662, 1439842, 1374192, 1405263, 1308225, 1280042, 1392183, 1565503, 1411076, 1362410, 1253868, 1258427, 1272590, 1263994, 1322469, 1303889, 1327423, 1159553, 1249646, 1223929, 1275003, 1354941, 1361184, 1243992, 1288992, 1327048, 1311030, 1249026, 1241536, 1273990, 1305236, 1307523, 1319750, 1303684, 1438500, 1379433, 1301156, 1283903, 1360966, 1308141, 1238836, 1319308, 1326797, 1334900, 1311632, 1210535, 1251177]
4749A251177R5464l7630M5390Q6872l0130o536m2860O2859J27009p5715R3001
4738A568901j458j14434J7058N5642O5648R934o8347r3345q6801m4936M1717J29131
4726A478710k3960j68691J21290q9822j4267L8924q7093p748o6856M834P0874
4715A256195q2470J0391M0750P5243L789m9040J3455m1730Q530k9728M5728l5848
4703A215265Q6931p9883n7817M9305j26522J22721J35259p2719j9556M1998j1805
4692A283177L3795P9531K0354p2676R047j48571j7464j3440R359O7654O236r1733
4680A165269N8459O0667p7668R4642j00114R0070J0252K783N2161O9258K2515
4669A448294o3029n3040m7046K3829p1768R843O7123r2043P5303K2089K4395k1046
$$ y = [1251177, 1346641, 1309011, 1354401, 1441273, 1411143, 1404607, 1361747, 1424606, 1551615, 1475900, 1568901, 1567443, 1453009, 1470067, 1525709, 1591357, 1601291, 1532944, 1439599, 1352798, 1307862, 1349579, 1478710, 1454750, 1286059, 1407349, 1317527, 1303260, 1342184, 1255091, 1247343, 1180487, 1185321, 1256195, 1173725, 1184116, 1224866, 1300109, 1303898, 1254858, 1268313, 1226583, 1235113, 1205385, 1251113, 1215265, 1302196, 1222313, 1164496, 1213801, 1087279, 1210000, 1345259, 1272540, 1252984, 1294982, 1283177, 1316972, 1396503, 1416857, 1344181, 1353228, 1204657, 1187193, 1173753, 1183112, 1250766, 1257002, 1165269, 1223728, 1284395, 1206727, 1301369, 1201255, 1291325, 1301577, 1304360, 1356521, 1425779, 1448294, 1385265, 1332225, 1285179, 1309008, 1237240, 1247083, 1314206, 1222163, 1297466, 1319555, 1343950, 1322904]
4657A322904n7790n7395L0389P5496K8555m6999o589Q6232N9999o0011J4211o5422
4645A323580j0194J83734l3132n5747J1628j8620m1403J6188j05787P1625L5492
4634A377364K6463j41614j01504K12459m721j15695N0575m9940K8889o1494N8404
4623A279186P9761P3332k2697J8656k1296j12878J45588r4472k7606N6331o3077
4612A310828L9300l0293j64491R8865P220q9652J3324N631L3391K720L8014m1460
4600A223397k1004J53436n8298K2044k9564R2567M5678j04431J63154K0183r0324
4589A416838M7786J2266k0063P5190L2250r2769J15065O671J3691P0232j17859
4578A559298M6018M6518p421O3140l2554m775L4218N3509K706R6266l7465k0697
$$ y = [1322904, 1265114, 1207719, 1238108, 1313604, 1342159, 1295160, 1288571, 1374803, 1434802, 1374791, 1389002, 1323580, 1313386, 1497120, 1463988, 1408241, 1419869, 1401249, 1359846, 1376034, 1270247, 1341872, 1377364, 1403827, 1262213, 1160709, 1373168, 1368447, 1252752, 1303327, 1253387, 1282276, 1220782, 1279186, 1358947, 1432279, 1409582, 1428238, 1406942, 1294064, 1439652, 1345180, 1317574, 1373905, 1310828, 1350128, 1319835, 1155344, 1254209, 1261429, 1171777, 1185101, 1190732, 1224123, 1226843, 1264857, 1223397, 1202393, 1355829, 1297531, 1319575, 1290011, 1382578, 1428256, 1323825, 1486979, 1507162, 1416838, 1464624, 1476890, 1456827, 1532017, 1564267, 1471498, 1586563, 1593234, 1606925, 1677157, 1559298, 1605316, 1651834, 1644413, 1707553, 1674999, 1670224, 1704442, 1757951, 1760657, 1856923, 1819458, 1798761]
4566A798761l8404K29404L1098o0773K539o9507N0563J22110N0868k4348O9182
4555B161493N2452O976j1525j3765k3703O6911k1449M6754J7253J18316K5752
4544B425465R9099J11937j5654N0158J07681J36983k5721O8474O1643o8931k009
4533B949125R0826J40530l7964l342N2339O8462k1205J28396R5795P2965R9775
4522C635702J18200J21924K1340O5395J96122R4462J49019J05860L21234L24962
4512E154220K82110J64217K93387L08155L55330K76452J83103K00532L5705J1391
4502G264602j01856p9585k57093k20031k0440o1503o4834p8689m8037K8495P2880
4491F433909R6580J75760L47950J01571J1967K14065P4422K22290J85250L4554
$$ y = [1798761, 1760357, 1989761, 2020859, 1960086, 1962625, 1893118, 1943681, 2065791, 2116659, 2092311, 2161493, 2213945, 2220921, 2209396, 2195631, 2171928, 2238839, 2217390, 2264144, 2281397, 2399713, 2425465, 2524564, 2636501, 2620847, 2671005, 2778686, 2915669, 2889948, 2958422, 3020065, 2951134, 2949125, 3039951, 3180481, 3142517, 3139175, 3191514, 3259976, 3238771, 3367167, 3462962, 3535927, 3635702, 3753902, 3875826, 3897166, 3962561, 4158683, 4253145, 4402164, 4508024, 4829258, 5154220, 5436330, 5600547, 5893934, 6202089, 6557419, 6833871, 7016974, 7217506, 7253211, 7264602, 7162746, 7083161, 6826068, 6606037, 6585597, 6524094, 6459260, 6380571, 6332534, 6361029, 6433909, 6530489, 6706249, 7054199, 7155770, 7167737, 7381802, 7456224, 7678514, 7863764, 7898318]
4481G898318L40431K94864L03549K36006P2232Q7036K35038J10094K15803M3626
4471I836997O5466K3463r5186j72145k12319j51076j8387j18426j4853J40675
4461I284209J7947Q447M4112P1863O4566R0048k8623J32250J69369J79134O4710
4450A0098032K22940J17826o688M0861J35583K83679K12242L88285M68119M32253
4440A2393132M99807M41479L94437L98282J27585J94473M1885n7202j29665j65580
4430A4138633j50747j0376N07J54667Q1842M2466K00906J66945J35277K87062
4420A5047182K42228K79104L62949M70047N65897O68679O53775O55163R47954
4411A9892978R10231J015887J123554J212242J128289J305562J231440J363438
$$ y = [7898318, 8238749, 8533613, 8837162, 9073168, 9145400, 9232436, 9467474, 9577568, 9793371, 9836997, 9902463, 9925926, 9830740, 9658595, 9446276, 9295200, 9276813, 9158387, 9143534, 9284209, 9302156, 9310603, 9354715, 9426578, 9491144, 9581192, 9552569, 9684819, 9854188, 10033322, 10098032, 10320972, 10438798, 10432110, 10472971, 10608554, 10892233, 11104475, 11492760, 11960879, 12393132, 12892939, 13334418, 13728855, 14127137, 14254722, 14449195, 14491080, 14433878, 14304213, 14138633, 13987886, 13977510, 13978017, 14132684, 14214526, 14256992, 14457898, 14624843, 14760120, 15047182, 15289410, 15568514, 15931463, 16401510, 16967407, 17636086, 18289861, 18945024, 19892978, 20803209, 21819096, 22942650, 24154892, 25283181, 26588743, 27820183, 29183621]
4403B9183621J505712J485406J429745J541839J474298J570083J521838J626220
4395D1338762J839759J962466K174208K247349K196421K255988J895838J660799
4387E7571590J434694Q64992M51275j81373r41905j645662k412578k863706k967128
4378D9310199k899509k514571j993661j463280r07047q42879p47039j130029j621332
4369C5190852k009967k367670k445330k315794j869697j588836j196917j292465
4361B0104176j080661q99836p59248n49045o01619m90022k29092l64715k37974
4352A4891964l13371j58471k69879m33602l54651m99704l71839l67765k73095
4343A1849587l06955l65829l82730k20171k47115j91875j66070k09678k79439
$$ y = [29183621, 30689333, 32174739, 33604484, 35146323, 36620621, 38190704, 39712542, 41338762, 43178521, 45140987, 47315195, 49562544, 51758965, 54014953, 55910791, 57571590, 59006284, 59871276, 60322551, 60141178, 59199273, 57553611, 55141033, 52277327, 49310199, 46410690, 43896119, 41902458, 40439178, 39532131, 38689252, 37942213, 36812184, 35190852, 33180885, 30813215, 28367885, 26052091, 24182394, 22593558, 21396641, 20104176, 19023515, 18123679, 17364431, 16815386, 16213767, 15723745, 15494653, 15129938, 14891964, 14578593, 14420122, 14150243, 13716641, 13361990, 12862286, 12490447, 12122682, 11849587, 11542632, 11176803, 10794073, 10573902, 10326787, 10134912, 9968842, 9759164, 9479725]
4334I479725l08778k88063j95108j25837k66943k16309j65348j59332j77244j18184
4324G458579k22236j16085j28727n5846n5855r6987p1945j12067k79336p1849
4314F247646j11295p1886q6702j94044K1790l5728n0905Q0446o6384j4726j2830
4303E705382p7666L0658l4442q4175r3674K5111N0r5394Q9850J01705m3599j38312
4291E385494R5840n0642M1345N6955n1580p71Q3112R6059l9410J69425l9461m3118
4279E703248J1205k8877K52228K21391J6686O7979J07233R9908O043J91475l0988
4268F617531J67492Q5254J98967J58063J78604J97177J86052K12045L50238L17273
4258H668696K99424M46929M46655L79783L23795J74323J43267O3823p9326j7693
$$ y = [9479725, 9170947, 8882884, 8687776, 8561939, 8294996, 8078687, 7913339, 7754007, 7576763, 7458579, 7236343, 7120258, 6991531, 6935685, 6879830, 6782843, 6710898, 6598831, 6319495, 6247646, 6136351, 6064465, 5977763, 5783719, 5805509, 5769781, 5718876, 5799322, 5732938, 5718212, 5705382, 5627716, 5658374, 5623932, 5539757, 5446083, 5471194, 5471244, 5375850, 5465700, 5567405, 5523806, 5385494, 5481334, 5430692, 5472037, 5528992, 5477412, 5476641, 5559753, 5655812, 5616402, 5785827, 5746366, 5703248, 5714453, 5685576, 5937804, 6159195, 6175881, 6243860, 6351093, 6451001, 6457044, 6648519, 6617531, 6785023, 6870277, 7069244, 7227307, 7405911, 7603088, 7789140, 8001185, 8351423, 8668696, 8968120, 9415049, 9861704, 10241487, 10565282, 10739605, 10882872, 10946695, 10867369, 10849676]
4248A0849676j33643j37789j18078Q8488O8922n9932R3381J97022J35729K06373
4238A1190149K64336K62320L38622M19587N10274O12300N14225P12480Q87840
4229A5712133Q78153P46664Q10035P35682M92596M34586N7352k38066j11641r3827
4219A9423667N5278K25685M90995O72239P07662P46342Q75992N97715M02318L2109
4209B4230002m76703m80453n42649n89086l07128k15548j04147M9468J40311L10873
4199B2014940L78084M50207L65196M12555L38528L56580L80391N70362Q27224
4190B6094067R17834J096966J268597J510342J651026J833293J649859J162000
4182C7183984L99314n43418j327033j924632j981511j918493j532002j154162
$$ y = [10849676, 10716033, 10578244, 10460166, 10548654, 10617576, 10557644, 10651025, 10848047, 10983776, 11190149, 11454485, 11716805, 12055427, 12475014, 12985288, 13597588, 14111813, 14824293, 15712133, 16590286, 17336950, 18146985, 18882667, 19375263, 19809849, 19867201, 19629135, 19517494, 19423667, 19478945, 19704630, 20195625, 20867864, 21575526, 22321868, 23197860, 23795575, 24197893, 24230002, 23753299, 23272846, 22730197, 22141111, 21833983, 21618435, 21514288, 21563756, 21704067, 22014940, 22393024, 22843231, 23208427, 23620982, 23959510, 24316090, 24696481, 25266843, 26094067, 27011901, 28108867, 29377464, 30887806, 32538832, 34372125, 36021984, 37183984, 37583298, 37039880, 35712847, 33788215, 31806704, 29888211, 28356209, 27202047]
4174B7202047p33221n81810m30206l71329o8509J60664J27122K32144O51380O67352
4164B6855634O01929Q45908J110561J341455J517154J901644K118296K509938
4156C8802519K892603K983943K801413K651558K394143K527549K867018L510249
4148F1430995M317533N624126O659275P302113O973883M667875J96518m947420
4140I2224898q260786r352821r059754p677207o198321m814176l885461l207940
4132C9768432k542373k255362j974094j657159j416843j240976r95861r19071
4124B6766693o71429o34139o21247n39151m96230o17650n62068o82226o47228
4115B1295325n93551m64611m80221m08720k09923j32861q3360j99402r8189J28642
$$ y = [27202047, 26468826, 25887016, 25456810, 25085481, 25016972, 25177636, 25304758, 25536902, 26188282, 26855634, 27457563, 28303471, 29414032, 30755487, 32272641, 34174285, 36292581, 38802519, 41695122, 44679065, 47480478, 50132036, 52526179, 55053728, 57920746, 61430995, 65748528, 71372654, 78031929, 85334042, 92307925, 96975800, 97172318, 92224898, 83964112, 74611291, 65551537, 57874330, 51676009, 46861833, 42976372, 39768432, 37226059, 34970697, 32996603, 31339444, 29922601, 28681625, 27685764, 26766693, 26095264, 25461125, 24839878, 24300727, 23804497, 23186847, 22624779, 21942553, 21295325, 20701774, 20237163, 19756942, 19348222, 19138299, 19005438, 18922078, 18722676, 18624487, 18753129]
4105A8753129M5390R2216k617J83055K43662K53568K46830L41403N25127N69021
4095B1250784M78031L80255L29679n1057j47349k39606m97386m75882l52443l07587
4085B0367439l11814k72846k11614k15876j66370n9080m6385j58066k17705k18199
4075A8489484j53637j80846j9905j57420j00525j02066j20387j10274Q3244k6751
4065A7600917J11698P8457K54770M08262M41185M46875L69696J04773k2082j11320
4055A9683231l35117n18791l31009k36081m67359l65591l77984m01594m75379
4046A6174326l89151l95624k48363r9876l86182l37346j29309j21660r4040p3648
4036A3899127K6185J25034J6447P5039J54102J72630J15269K14490J89807K15833
$$ y = [18753129, 18798519, 18890735, 18888118, 19071173, 19314835, 19568403, 19815233, 20156636, 20681763, 21250784, 21728815, 22109070, 22438749, 22387692, 22240343, 22000737, 21503351, 21027469, 20675026, 20367439, 20055625, 19782779, 19571165, 19355289, 19188919, 19129839, 19083454, 18925388, 18707683, 18489484, 18335847, 18155001, 18135096, 17977676, 17877151, 17775085, 17654698, 17544424, 17627668, 17600917, 17712615, 17791072, 18045842, 18454104, 18895289, 19342164, 19711860, 19816633, 19794551, 19683231, 19348114, 18829323, 18498314, 18262233, 17794874, 17429283, 17051299, 16649705, 16174326, 15785175, 15389551, 15141188, 15041312, 14655130, 14317784, 14188475, 14066815, 13972775, 13899127, 13925312, 14050346, 14066793, 14141832, 14295934, 14468564, 14583833, 14798323, 14988130, 15203963]
4026A5203963K00649K68124J42395L6525j3394k72617k08937j95020j66638k41439
4016A4753611O47j32573j16046J22628K80547R2274O7172J88527K39661J65985
4006A5662433J95507J84969K83652L50352M45219N02534N38035N82760P23187
3997A9468648M93845N92573M19164L86378L94458N45759O01614Q79674J080231
3988B4862344J279575J427019J631031J958533K212789K583214K784399L395137
3980D2134041L937363M728350N268462N398221M275222J867092j239944l406148
3972F2962659m455468m417430m075945l477927k700333k132153j830175j305219
3964C8568009j157300j114072p58135o00564l77341j54291k1398j6673P0442J17585
$$ y = [15203963, 15404612, 15672736, 15815131, 15851656, 15838262, 15565645, 15356708, 15161688, 14995050, 14753611, 14754258, 14621685, 14505639, 14628267, 14908814, 15001088, 15068260, 15256787, 15496448, 15662433, 15857940, 16042909, 16326561, 16676913, 17122132, 17624666, 18162701, 18745461, 19468648, 19962493, 20555066, 20974230, 21360608, 21755066, 22300825, 22902439, 23782113, 24862344, 26141919, 27568938, 29199969, 31158502, 33371291, 35954505, 38738904, 42134041, 46071404, 50799754, 56068216, 61466437, 65741659, 67608751, 66368807, 62962659, 58507191, 54089761, 50013816, 46535889, 43835556, 41703403, 39873228, 38568009, 37410709, 36296637, 35538502, 34937938, 34560597, 34406306, 34384908, 34368235, 34438677, 34556262]
3954C4556262j8051j30348m67565n65613n44695q34072p46898o00435m48791n25916
3944B9673878l10300j38227j03246o4031N094K67121J48476J40815L36177L35307
3934C0291064M85687O43130P48542P72644J021017J263074J302934J354723J614858
3925C9497673J652240J768924J716944J752040J847630J404816O87420l13519
3917E0014168j347654j894343k184398k011338j482754q88097o75789n94947j38907
3908C8795941n9515j09469j95253k3412J84456J71130L78150O97813P20309Q39338
3898D1399488R25884R26033Q58588M34069K34034O7526q9049J03732Q7882M95502
3888D5443689Q68322J137719J566169J655307J616251J504878J563449J825427
$$ y = [34556262, 34538211, 34407863, 33940298, 33374685, 32829990, 31995918, 31249020, 30648585, 30199794, 29673878, 29363578, 29225351, 29122105, 29058074, 29063168, 29330289, 29478765, 29619580, 29955757, 30291064, 30776751, 31419881, 32168423, 32941067, 33962084, 35225158, 36528092, 37882815, 39497673, 41149913, 42918837, 44635781, 46387821, 48235451, 49640267, 50327687, 50014168, 48666514, 46772171, 44587773, 42576435, 41093681, 40205584, 39529795, 38934848, 38795941, 38736426, 38626957, 38431704, 38408292, 38592748, 38763878, 39142028, 39839841, 40560150, 41399488, 42325372, 43251405, 44109993, 44544062, 44778096, 44845622, 44756573, 44860305, 44948187, 45443689, 46312011, 47449730, 49015899, 50671206, 52287457, 53792335, 55355784, 57181211]
3880E7181211K177026L021321L808279M917650N834085O891703O466451L577308
3872I3875034o70956l174133l737528l342641k563361k549344l708300n213045
3864F8915726n782100n526498m816502l889554l156870k473428j973139j828364
3856C9469271j524911j230846j071908r52502q36211q23823p62826q88899p32504
3847C0644841n91009o60018o11477m56909l30340l81428l64690j85653k3021j17860
3837B6922436k76239r3868j27946j8902O8557N7542J49106K82715J95800J9845
3827B7179046j71079l76608n21866m79623n40685m87509k90923k43632j60963
3818B3906158k51544m09558j93949j77547l5769n8990j65435j30880K6406J10628
$$ y = [57181211, 59358237, 62379558, 66187837, 71105487, 76939572, 83831275, 90297726, 93875034, 93204078, 90029945, 86292417, 82949776, 80386415, 77837071, 74128771, 68915726, 63133626, 57607128, 52790626, 48901072, 45744202, 43270774, 41297635, 39469271, 37944360, 36713514, 35641606, 34689104, 33852893, 33029070, 32266244, 31377345, 30644841, 30053832, 29393814, 28782337, 28325428, 27995088, 27613660, 27248970, 27063317, 27040296, 26922436, 26646197, 26552329, 26424383, 26405481, 26474038, 26531580, 26680686, 26963401, 27159201, 27179046, 27007967, 26631359, 26109493, 25629870, 25089185, 24601676, 24310753, 24067121, 23906158, 23654614, 23245056, 23051107, 22873560, 22837791, 22778801, 22613366, 22482486, 22508892, 22619520]
3808B2619520l909N6267j7612O7793J53838k1816J36793J25651Q8342K1192K53000
3797B3479059K99206N4449R8223L21441K17616L88111K18137N87301M11132M78617
3787B6553292M82730M53567N93807N09933O83746P31265Q88662Q66247Q76377
3778C2639626R28750J043354J072428J315776J181338J294586J323850J253952
3770D2053660J094831J193821J166363J139841J165511J236716J332183J449333
3762E1832259J536751J692021J701857J785373J689981J841572J907937J929085
3754F5916836J920708J965671J961336K112507J980470J842953J983752K027949
3746H1712182J731303J689873J564292J491959J505370J212384J200751J086552
$$ y = [22619520, 22615611, 22671878, 22654266, 22722059, 22875897, 22854081, 22990874, 23116525, 23204867, 23226059, 23479059, 23778265, 23832714, 23930937, 24252378, 24469994, 24858105, 25076242, 25663543, 26074675, 26553292, 27036022, 27489589, 28083396, 28593329, 29277075, 30008340, 30897002, 31763249, 32639626, 33568376, 34611730, 35684158, 36999934, 38181272, 39475858, 40799708, 42053660, 43148491, 44342312, 45508675, 46648516, 47814027, 49050743, 50382926, 51832259, 53369010, 55061031, 56762888, 58548261, 60238242, 62079814, 63987751, 65916836, 67837544, 69803215, 71764551, 73877058, 75857528, 77700481, 79684233, 81712182, 83443485, 85133358, 86697650, 88189609, 89694979, 90907363, 92108114, 93194666]
3738I3194666Q88317P81258O80776M71538L42945J13439k08219k73995m49066
3729I5541659p56192q67989j044288j163565j227772j556885j475241j717394
3721H5732333j782920j793291j983543k078734k144402k255647k369611k280604
3713F9043581k321667k363628k283751k168141k176275k215383k371240k107761
3705E1035735j863880j951997j887744j837016j971402j642050j691309j516341
3697C6673996j453850j293257j456967j221849j169761r45189r86348j040723
3689B7106052p26934q53893p76350o64072p05821p39328n96272o19002n20210
3680B0904170n28895m22311l39923l61085l80433m18976k51216q8145j86205k37319
$$ y = [93194666, 94082983, 94864241, 95545017, 96016555, 96359500, 96472939, 96264720, 95990725, 95541659, 94785467, 93917478, 92873190, 91709625, 90481853, 88924968, 87449727, 85732333, 83949413, 82156122, 80172579, 78093845, 75949443, 73693796, 71324185, 69043581, 66721914, 64358286, 62074535, 59906394, 57730119, 55514736, 53143496, 51035735, 49171855, 47219858, 45332114, 43495098, 41523696, 39881646, 38190337, 36673996, 35220146, 33926889, 32469922, 31248073, 30078312, 29133123, 28146775, 27106052, 26379118, 25525225, 24748875, 24084803, 23378982, 22639654, 22043382, 21424380, 20904170, 20375275, 19952964, 19613041, 19251956, 18871523, 18452547, 18201331, 18113186, 17926981, 17689662]
3670A7689662l41208j38000k1595r7931r9819j45500k53488j48639n5316J3759
3660A6401925r3304j75295K5921O2499L3356R7017R9446J72496J53816K31503
3650A7009380L64101L61904M28623J77063J97195L09102J75438J00470k2389L2028
3640A9132915J2014L9717o292J18222J10468p3740k973q4761K89432J04624N6945
3629A9696571L69769K48871L90646N60152N78521N46778O02665Q09041R51084
3620B4754098R53180Q80767P62676N02449J78297K8632k99486n07741n05531n34890
3610B6212451l87571k95711l53570j73039j74313k48098r4474k02724m1507o3553
3600B4177891M0300J80547J57484M70860M04475N63596O90167P09646R52479R21358
$$ y = [17689662, 17348454, 17210454, 17188859, 17090928, 16991109, 16845609, 16592121, 16443482, 16388166, 16401925, 16308621, 16133326, 16159247, 16221746, 16255102, 16352119, 16451565, 16624061, 16777877, 17009380, 17373481, 17735385, 18164008, 18341071, 18538266, 18847368, 19022806, 19123276, 19100887, 19132915, 19144929, 19184646, 19178354, 19296576, 19407044, 19333304, 19330331, 19245570, 19535002, 19639626, 19696571, 20066340, 20315211, 20705857, 21266009, 21844530, 22391308, 22993973, 23803014, 24754098, 25707278, 26588045, 27350721, 27853170, 28031467, 28060099, 27760613, 27252872, 26747341, 26212451, 25824880, 25529169, 25175599, 25002560, 24828247, 24580149, 24485675, 24282951, 24241444, 24177891, 24218191, 24398738, 24556222, 25027082, 25431557, 25995153, 26685320, 27394966, 28347445, 29268803]
3590B9268803R06373P62457L31119q7159l86342o38706q71315r80006r60364q55304
3580B6489556p32956o89836m26141l40021m09282l79531l79556k66337p3464R2030
3570B2884462j26497p5688O7071J28037K76381L78457M10726N03254O67570N84004
3560B5697777M44919L89542K47322k46084n51787o18422p14185p23478p15437
3551B3210167n43747o13678m99520l86102k57636l64370l42013k10198j76797
3542A9816106k73847l18732l77263m19264l66221l61483l12972j28650l5302j73799
3532A7048573k29762k37286j06382j01562j25565k56581l85190k90696k46847
3523A5068702j79865p9532j32857j20357Q8352j35927J14j7965l9670P5110M8352
$$ y = [29268803, 30175176, 30937633, 31268752, 31181593, 30795251, 30156545, 29285230, 28305224, 27344860, 26489556, 25756600, 25066764, 24640623, 24300602, 23891320, 23511789, 23132233, 22865896, 22792432, 22884462, 22757965, 22682277, 22749348, 22877385, 23153766, 23532223, 23942949, 24446203, 25113773, 25697777, 26142696, 26532238, 26779560, 26533476, 25981689, 25363267, 24649082, 23925604, 23210167, 22666420, 22052742, 21553222, 21167120, 20909484, 20545114, 20203101, 19992903, 19816106, 19542259, 19223527, 18846264, 18427000, 18060779, 17699296, 17386324, 17257674, 17222372, 17048573, 16818811, 16581525, 16475143, 16373581, 16248016, 15991435, 15606245, 15315549, 15068702, 14888837, 14809305, 14676448, 14556091, 14644443, 14508516, 14508630, 14490665, 14450995, 14526105, 14574457]
3512A4574457J79444J51056k5532J36876J30231J33841J40277J19085J87625K28036
3502A5955396K76143L55486L40104L82216L28291L38182M07498L64807P47732
3493A9495855O68662O35643O51399Q91142J017550J062060J121213J320044J377123
3484B8240691J338022J480429J582350J453351J747656J856281K049972K067257
3476D1816009J926883J677094J508893J311498R35030N50917M66049M14939M79832
3467E1087144L33833O12788P96101Q74338Q09290Q79970M91722M90471J73479
3458E6549136j40362j65962k42915j10467j97587q3746R022J28873P3932M04087
3448E6224011L30977L25853O19471M39427N02717N15040O39778N18911M05877
$$ y = [14574457, 14753901, 14904957, 14879425, 15016301, 15146532, 15280373, 15420650, 15539735, 15727360, 15955396, 16231539, 16587025, 16927129, 17309345, 17637636, 17975818, 18383316, 18748123, 19495855, 20164517, 20800160, 21451559, 22342701, 23360251, 24422311, 25543524, 26863568, 28240691, 29578713, 31059142, 32641492, 34094843, 35842499, 37698780, 39748752, 41816009, 43742892, 45419986, 46928879, 48240377, 49175407, 49726324, 50192373, 50607312, 51087144, 51420977, 52033765, 52829866, 53704204, 54513494, 55393464, 55885186, 56375657, 56549136, 56408774, 56242812, 55999897, 55889430, 55691843, 55608097, 55617119, 55745992, 55819924, 56224011, 56554988, 56880841, 57500312, 57939739, 58442456, 58957496, 59597274, 60116185, 60522062]
3439F0522062M05735K56001L70159L59052L76096L38474M62527L80309O86219
3430F4156634O38895P82788Q94167J119579J167903J288258J308348J656427J678949
3421G4691948J673089J867593K297201K313854K541468L117981L561349L718439
3413I5782922M043161M582342M923891N296044N672333O065936O608687O957031
3405A39932347P077255P226775P408268P106108O977261O490738O050156N751868
3397A94020776N317213N283577N065930M979305N047017M887266M547323M192834
3389B33341241L648142L211491K562682J830763J185908J017911R21335Q23835
3381B48543308R65619J320443J563387J906651K365527K884166L484070M100247
$$ y = [60522062, 60927797, 61183798, 61553957, 61913009, 62289105, 62627579, 63090106, 63470415, 64156634, 64795529, 65578317, 66472484, 67592063, 68759966, 70048224, 71356572, 73012999, 74691948, 76365037, 78232630, 80529831, 82843685, 85385153, 88503134, 92064483, 95782922, 99826083, 104408425, 109332316, 114628360, 120300693, 126366629, 132975316, 139932347, 147009602, 154236377, 161644645, 168750753, 175728014, 182218752, 188268908, 194020776, 199337989, 204621566, 209687496, 214666801, 219713818, 224601084, 229148407, 233341241, 236989383, 240200874, 242763556, 244594319, 245780227, 246798138, 247719473, 248543308, 249508927, 250829370, 252392757, 254299408, 256664935, 259549101, 263033171, 267133418]
3373B67133418N034792N767327O268519O495483O157487N367739M584526L457085
3365C10266376J911930R61023O7483n31728j038790j378326k005679k621581l619346
3356C02011362m683125n922503p315095q860407j0235128j1274502j1679762j1867356
3348B30173484j1958146j1679320j1511643j1406990j1351457j0960526j0717127
3341A50588275j0258367r417101q582982p647070o724340n812998n048104m430287
3333I2667026l983248l576017k998778k792878k626324k305524k426085k060649
3325F9897523j817848j931924j718914j502229j365013j409226j224169j557823
3317E7370377j361613j383467j596587j574898j553141j514405j566104j531013
$$ y = [267133418, 272168210, 277935537, 284204056, 290699539, 296857026, 302224765, 306809291, 310266376, 312178306, 313139329, 313206812, 312675084, 311636294, 310257968, 308252289, 305630708, 302011362, 297328237, 291405734, 284090639, 275230232, 264995104, 253720602, 242040840, 230173484, 218215338, 206536018, 195024375, 183617385, 172265928, 161305402, 150588275, 140329908, 130912807, 122329825, 114682755, 107958415, 102145417, 97097313, 92667026, 88683778, 85107761, 82108983, 79316105, 76689781, 74384257, 71958172, 69897523, 68079675, 66147751, 64428837, 62926608, 61561595, 60152369, 58928200, 57370377, 56008764, 54625297, 53028710, 51453812, 49900671, 48386266, 46820162, 45289149]
3309D5289149j471024j441551j376492j240931j345006j423822j293211j338373
3301C4358739j244062j203176j196837j067156j194206j118110q97910r32690
3293B5504592r26215p52029q27901p92740n69469n85859o75921o17193n01697
3284A9255568n18581n36136m39361n18340l43897m36805m47666k90917l75053
3275A5348812k91542l01127l33515l80268k88896k99300k37746l70101k56124
3266A2590193k69724j95725j87427k85556l33344k28137q7920k99476k90204j97573
3256A0215107j32810k50484k01651k02714j09038j16657k02903k09166j19500
3247H670184q5615j26757k95707j6440j52294j84072j3071j56763k18840j1769
$$ y = [45289149, 43818125, 42376574, 41000082, 39759151, 38414145, 36990323, 35697112, 34358739, 33114677, 31911501, 30714664, 29647508, 28453302, 27335192, 26437282, 25504592, 24578377, 23826348, 22998447, 22205707, 21636238, 21050379, 20374458, 19757265, 19255568, 18736987, 18200851, 17761490, 17243150, 16899253, 16462448, 16014782, 15723865, 15348812, 15057270, 14756143, 14422628, 14042360, 13753464, 13454164, 13216418, 12846317, 12590193, 12320469, 12124744, 11937317, 11651761, 11318417, 11090280, 11002360, 10702884, 10412680, 10215107, 10082297, 9831813, 9630162, 9427448, 9318410, 9201753, 8998850, 8789684, 8670184, 8584569, 8457812, 8162105, 8145665, 7993371, 7809299, 7796228, 7639465, 7420625, 7408856]
3237G408856r1596j96729j61397q1583k3932m267k11004k21782r7281j8622J45915
3226F446578j76825j16419r47n6661j85673j51071M3741q1472k5439l7758p6151
3215E581903k4756j22540m1731j37520j0652K6937j76817j29407l0096m2302k1983
3204D871036p0591k13392J1966M5155q4162r1212k3223n668K0339m4538o6245
3193D349465j28257n1260j14932Q4994Q8688o2405j53766j38530O3058j05217
3183C831838N9181o8527k4864j00029q6057j18448O4010j45789j13019J65262
3173C463558n0767M9326j11833l8524O4233K0703j1372j71302L5332k6262K632
3162C225724r432q6181J0250N6800o1687k109O9889R876K795j65643M1683j2033
$$ y = [7408856, 7317260, 7120531, 6959134, 6877551, 6853619, 6849352, 6638348, 6416566, 6319285, 6300663, 6446578, 6269753, 6153334, 6152387, 6095726, 5910053, 5758982, 5802723, 5721251, 5695812, 5658054, 5581903, 5557147, 5434607, 5392876, 5255356, 5244704, 5271641, 5094824, 4965417, 4935321, 4893019, 4871036, 4800445, 4587053, 4599019, 4644174, 4560012, 4468800, 4445577, 4439909, 4460248, 4415710, 4349465, 4221208, 4169948, 4055016, 4140010, 4228698, 4166293, 4012527, 3873997, 3937055, 3831838, 3891019, 3822492, 3797628, 3697599, 3611542, 3493094, 3557104, 3411315, 3298296, 3463558, 3412791, 3462117, 3350284, 3311760, 3375993, 3396696, 3385324, 3214022, 3249354, 3223092, 3225724, 3216292, 3130111, 3140361, 3197161, 3135474, 3133365, 3203254, 3213130, 3215925, 3050282, 3091965, 3079932]
3150C079932J7615J28310P7430J8286J4410J6705p2997L7289m8868O5407k105
3139C331414N6214J5826j21270Q2101N555J43625M5394j28305j35152L0112O6514
3128C392028M3638J27895n3571o7215L2162j052j06234j8338m609J04247J4250
3117C463201m314j3174Q908p263J11134K1255M0846q3406K6019L0502p7886O1757
3105C577579J3861K8460J9423N7943p6584R1898j5656P0879l8621o5364k4665
3094C639153j17682K3962O0982P7825l9415M6571J14590m4920p58J12249J6384
3083C888941O4723O0252P5933P0778J30223J70282k09473k73984m11443k93550
3073C272682j32617j53367r9356o8140j44946r4294r5161j7383j7726R4410J43734
$$ y = [3079932, 3097547, 3225857, 3303287, 3321573, 3335983, 3352688, 3279691, 3316980, 3268112, 3333519, 3331414, 3387628, 3403454, 3282184, 3364285, 3369840, 3513465, 3558859, 3430554, 3295402, 3325514, 3392028, 3435666, 3563561, 3509990, 3442775, 3474937, 3473885, 3367651, 3349313, 3344704, 3448951, 3463201, 3458887, 3445713, 3454621, 3447358, 3558492, 3579747, 3620593, 3537187, 3563206, 3593708, 3515822, 3577579, 3591440, 3619900, 3639323, 3697266, 3620682, 3712580, 3696924, 3767803, 3729182, 3663818, 3639153, 3521471, 3545433, 3606415, 3684240, 3644825, 3691396, 3805986, 3761066, 3760308, 3872557, 3888941, 3953664, 4013916, 4089849, 4160627, 4290850, 4461132, 4251659, 3977675, 3566232, 3272682, 3140065, 2986698, 2887342, 2819202, 2674256, 2579962, 2484801, 2467418, 2449692, 2544102, 2687836]
3062B687836o7972K9121j9180q1038J43901J97370Q9625K20812K41400L15803
3052C757678K44712M41278L25521j81534j33442m25203n35763m09617k78546k64892
3042B540192k13048q2733j51419j8671j36667j67170L7002J692J07220P2787l8995
3031A950190l2311M1693l128j8769K7993O5236O9559J72566L20156Q4648K7129
3020B704962N124k51883j75591k75309k13576j10079j02795p2450K2144r4660
3010A435887m9280l8947o1795O557N7699p5381j36587Q8870j39797m9683Q5119
2999A122662L9428l4534o2217k3048L3902J8541j89889l5438Q600J09291p3985
2988I13313J01301q6449J6227N087q0243K0499j01603Q4606k1506O0817r2917
$$ y = [2687836, 2619864, 2648985, 2629805, 2548767, 2692668, 2890038, 2979663, 3200475, 3441875, 3757678, 4002390, 4443668, 4769189, 4587655, 4454213, 4029010, 3493247, 3083630, 2805084, 2540192, 2327144, 2244411, 2092992, 2074321, 1937654, 1770484, 1807486, 1809178, 1916398, 1989185, 1950190, 1917879, 1959572, 1956444, 1937675, 1965668, 2030904, 2100463, 2273029, 2593185, 2677833, 2704962, 2710086, 2458203, 2282612, 2007303, 1793727, 1683648, 1580853, 1508403, 1530547, 1435887, 1386607, 1347660, 1285865, 1292422, 1350121, 1274740, 1138153, 1227023, 1087226, 1037543, 1122662, 1162090, 1127556, 1065339, 1042291, 1076193, 1094734, 904845, 869407, 878007, 987298, 913313, 1014614, 928165, 944392, 949479, 869236, 889735, 788132, 872738, 851232, 912049, 819132]
2977H19132O1219J01943M0969n5155P8705j47429j12782k876j8478L1029o867
2966G89410k1840j31j7335k2581M0218l1581K4095K8553p1685j03871m2995K9023
2954E99280p0702Q6177O1008M4340m5177N5556K7249m7626n4263j9675N3488J62120
2942H51775p1612o5804l7925o5526J16265J16079p4372j65211p5934M6506N892
2931E80133K3078P3789q6661K4986M6995J0085P2082m0406O354Q26N562N6170
2919G72993L5958n241p1580r151n6209K1402j0601l2052q1121M224J15667K6883
2907G11172J9241r577q1603M9554n5962J4247M3322p3139k9581P8990p0793l7470
2895E58401K2466L520Q3407K5457l5717j1157n4797K2672K4195J04868q3626j55024
$$ y = [819132, 880351, 982294, 1023263, 968108, 1046813, 899384, 786602, 783726, 765248, 796277, 789410, 767570, 767439, 750104, 727523, 767741, 736160, 760255, 788808, 717123, 613252, 570257, 599280, 528578, 614755, 675763, 720103, 674926, 730482, 757731, 710105, 655842, 636167, 689655, 851775, 780163, 714359, 676434, 610908, 727173, 843252, 768880, 603669, 527735, 574241, 580133, 603211, 677000, 590339, 615325, 662320, 672405, 744487, 704081, 710435, 711261, 716823, 772993, 808951, 803710, 732130, 722979, 666770, 688172, 677571, 645519, 564398, 568622, 684289, 711172, 730413, 720836, 639233, 688787, 632825, 647072, 690394, 617255, 587674, 666664, 595871, 558401, 580867, 584387, 667794, 693251, 657534, 646377, 591580, 614252, 638447, 743315, 659689, 504665]
2883E04665J25761n8509K8570k884p6271r3865P7964Q0845m7502O0417r0895j01285
2871D07011o1067J06281N1554l1818n8568M1410J4479o4150K1773j6987R890P6340
2859D96148L176M3832o7747m909L1008p9125Q923l0043N5476l0881L6140K3236
2847D85234j15057P606J30683J5257l9812j1867n582K4214k06411q4154J72535
2836C72646P2057K3988n9212q6954R1224P276L2180J6818n4009J5546J0802k613
2824D39749l0828j07825m9544P6437O2168k9584m3345P6963K0613Q6578o3130
2813D38252j6915Q2604q991J8378K7872p8029j09510k512m223M396L4102J13101
2801D98525l2645n1746L0585M6557K0018j33082M3253M0671m2013K0291K0108
$$ y = [504665, 630426, 571917, 600487, 597603, 521332, 427467, 505431, 586276, 538774, 599191, 508296, 407011, 345944, 452225, 503779, 471961, 413393, 454803, 469282, 405132, 426905, 409918, 419808, 496148, 499324, 543156, 475409, 470500, 501508, 422383, 431306, 401263, 456739, 425858, 461998, 485234, 370177, 377783, 508466, 523723, 483911, 472044, 466462, 490676, 284265, 200111, 372646, 444703, 468691, 409479, 322525, 413749, 421025, 453205, 470023, 416014, 431560, 442362, 439749, 408921, 301096, 251552, 327989, 390157, 360573, 317228, 394191, 414804, 501382, 438252, 421337, 503941, 494950, 513328, 541200, 463171, 353661, 351149, 346926, 351322, 385424, 498525, 465880, 414134, 444719, 491276, 511294, 378212, 421465, 462136, 420123, 440414, 460522]
2790D60522K3769j7703l328j9664L2925J11775K1537j72865K6407j7297j9962
2779D26116R7516j6964l0726k2801j41138L2231p8076L2176N7259M8397K2953
2768D26943j00787L8585o4449J33709J9235q2709m7968l0744J5653P7299p0977
2757C13790J94523J01954j62480j2238l2712O0963p1668k7111k4634p033P755
2746C41109N8193q5957j10739j2166K5472J3578n377J7572L0743J51927n2105
2735C72250J103q7392O9775r1436R167P2823o6729j09551O4671n94q8299J14101
2723B59889Q143m991q4988R6317K0804n6453N486r9498M2366K0857l012J7523
2711B22443j07523J1149K1760k7980J3203K6582P7056m1135r9188j3745M9022
$$ y = [460522, 484291, 466588, 463260, 443596, 476521, 588296, 609833, 436968, 463375, 446078, 426116, 523632, 506668, 475942, 453141, 312003, 344234, 266158, 298334, 355593, 403990, 426943, 326156, 364741, 300292, 434001, 453236, 370527, 322559, 291815, 307468, 384767, 313790, 508313, 610267, 447787, 435549, 402837, 463800, 392132, 365021, 340387, 333354, 341109, 399302, 313345, 202606, 190440, 215912, 229490, 224113, 241685, 272428, 424355, 372250, 373353, 285961, 355736, 264300, 273467, 346290, 279561, 170010, 234681, 234087, 145788, 259889, 268032, 263041, 178053, 274370, 295174, 238721, 244207, 144709, 187075, 207932, 204920, 222443, 114920, 126069, 147829, 119849, 133052, 159634, 236690, 195555, 96367, 82622, 131644]
2700A31644k5084k2247J04955o5608J70j9482l1700R9468o2287J0517J07613k3361
2688B04598k6750o4649l4163k9585M9779m8979J6449J2946m4335O9554L4702o8376
2676G1191Q749J07125K2012j9458k6993O5750k5541R687l0062k5879p2899k4579
2664E9103P0714n2337o8618o411P2322M0644j13640j40237K9197P6538R7891J5349
2652H0515K8551q2594p1142O0501M4772n0507L7811P8527j71494p0650O6319M2664
2640f727l700R6450M0370r7084P6605j9767j2387Q6662j77283M4502j1435N0214
2628F6420r7660n248J40999j35063J50542K3129J644l1991j4464q6819m8030P0002
2616C3461r5677J06411N2235n9647l3960O8898j53003Q5298J69151j36844L2503
$$ y = [131644, 106560, 84313, 189268, 123660, 123830, 104348, 72648, 172116, 109829, 120346, 227959, 204598, 177848, 113199, 79036, 49451, 99230, 50251, 66700, 79646, 35311, 104865, 139567, 71191, 79940, 187065, 209077, 189619, 162626, 228376, 202835, 212522, 182460, 156581, 83682, 59103, 129817, 77480, 8862, 2451, 74773, 115417, 1777, -138460, -109263, -32725, 65166, 80515, 109066, 26472, -44670, 15831, 60603, 10096, 47907, 126434, -45060, -115710, -49391, -6727, -10427, 86023, 126393, 29309, 105914, 86147, 73760, 160422, -16861, 27641, 16206, 66420, -31240, -36488, 104511, -30552, 119990, 143119, 144763, 112772, 98308, 11489, -36541, 33461, -62216, 44195, 96430, 36783, 2823, 71721, -81282, 4016, 173167, 36323, 68826]
2605F8826n823L5837N4943q8013k1682L9363l7483k4341L4562R8784l8271l2491
2593H4211r6393J2354j2032P7633N3259l7180n4766J1452N5102j7337P507r7189
2581a3379r695J559J1187K398P8781Q0316m667k4983r2790L5433J2072r7955O4205
2568D2482K3133l9861J0713J43449n8709j48885J5679K3446M3047j0369k7081
2557A7044J6411J01978q13n783m7385p5346j6894N9768n6866j0346L4238r6146
2545h0140O1764J41242o2519j36098M1133J1091q888J04530M1324n5102m8286
2534A0051M3344k5368J29110L4172n9989l8674j01226m0721P8225L5768r4361
2523b9669O3633r3471j9496N7308L9261O610j4446J6517K895Q0526j40066k0869
$$ y = [68826, 63003, 98840, 153783, 65770, 44088, 83451, 45968, 21627, 56189, 154973, 116702, 84211, -12182, 172, -11860, 65773, 119032, 81852, 27086, 38538, 93640, 76303, 83810, -13379, -23074, -21515, -10328, -7930, 70851, 151167, 146500, 121517, 28727, 64160, 76232, -21723, 42482, 65615, 25754, 36467, 179916, 121207, -27678, -11999, 11447, 54494, 44125, 17044, 33455, 135433, 134620, 128837, 81452, 6106, -10788, 48980, -7886, -18232, 16006, -80140, -18376, 122866, 60347, -75751, -34618, -23527, -32415, 72115, 113439, 58337, 10051, 53395, 28027, 157137, 191309, 131320, 92646, -8580, -49301, 28924, 64692, -29669, 33964, -59507, -79003, -21695, 17566, 24176, 9730, 26247, 29142, 109668, -30398, -51267]
2511e1267o327J14211K746j13227J13418o284N170n822m1474p0569p9341J5057
2499a23709K903N0772l3937N6756L7482j34918N2966J10423k0282p938J6446K3540
2487C0504J56486j80099j81335J1868K07248J9970j22305K0019p829K5558Q6268
2476F6353k5528k9381l1360j5497R269M1647o1635m2460L2605q921l2547J5849
2464h1606Q512M127L2081o7938J15573J36396r3611n4368j1494r464N0041J19347
2452A47596M2519j05265j19966J16680o2812m9772P3753o1829K1570L3148o6459
2441c0837L1734K8040Q5217k6222n9980J04740j15297j12344K942P4663J849J0409
2429e086R51K9558k4696N6437Q26L528n1472J37145l3655j28598Q8813r3695L4204
$$ y = [-51267, -57594, 56617, 59363, -53864, 59554, 53270, 58440, 52618, 11144, -59425, -138766, -123709, -120806, -70034, -103971, -47215, -9733, -144651, -91685, 18738, -1544, -9482, 6964, 30504, 186990, 6891, -174444, -162576, 44672, 64642, -57663, -37644, -45473, -19915, 66353, 40825, 11444, -19916, -35413, -26144, 15503, -46132, -88592, -55987, -64908, -97455, -81606, -73094, -68967, -36886, -104824, 10749, 147145, 53534, -834, -12328, -21792, 28249, 147596, 190115, 84850, -35116, 81564, 18752, -31020, 42733, -19096, 2474, 35622, -30837, 897, 28937, 114154, 87932, 27952, 132692, 17395, -94949, -92007, -17344, -15495, -5086, -4135, 25423, 727, 57164, 57990, 61518, 10046, 147191, 113536, -15062, 73751, -19944, 14260]
2416A4260M0215M1013k2114o9359L3578n5187m1569p848L3373r1310K8240j9766
2404a16474Q5717l9030n2359P2533J1705J1579q5138P6011m2534J3437l393K2985
2392d4961q2237J50623k8139o7316k0691J826J6373l1688L1878m0463J02424M2365
2380B9994m9404O8948j946o0712K2877j6061n9006q5640J02562K7289Q8851p8871
2368a1119p2033R2248M8950j10104l7166p7330K2735J22397O6609J6367m0867
2357B0687O7489j6657r827j04138M3629M3328J6727j79539N8546M4040j01743
2346a17458J00846L8876K8786j3342K2216j26212n7070M3662j2487O9208M4704
2335B1729r4123O3102L2508O7574O4936j02851r1882P1510p0100J12557n6597
$$ y = [14260, 54475, 95488, 73374, 4015, 37593, -17594, -59163, -67011, -33638, -124948, -96708, -116474, -30757, -69787, -122146, -49613, -37908, -26329, -111467, -35456, -77990, -64553, -67946, -44961, -127198, 23425, -4714, -72030, -92721, -90895, -74522, -106210, -74332, -114795, -12371, 29994, -19410, 49538, 47592, -13120, 9757, -6304, -65310, -150950, -48388, -21099, 67752, -11119, -83152, 9096, 58046, -52058, -89224, -166554, -143819, -21422, 45187, 61554, 20687, 88176, 71519, 61692, -42446, 1183, 44511, 61238, -118301, -59755, -15715, -117458, -16612, 22264, 51050, 37708, 59924, -66288, -123358, -79696, -92183, -22975, 21729, -72394, -9292, 23216, 90790, 155726, 52875, -39007, 32503, -37597, 74960, 18363]
2324A8363j9640Q966r4628R1411N0258M6091o3944O5231l6745p6600m1877N4972
2312A858L9501p19J6246J8391P758O1039O4312q7739k5004j0098K4594R3586K5886
2299B29611J21874n1090J0517k0405p9047j03976j7708N9339q6374L3448M6891
2288A43080j26357p6410J85457J0675n7741n3889n2415J10986n7608l9270R3814
2277H0322K6285m5036P956K1644l3684L9747j33706O0901j0216O3255n9904j04348
2265h6784j3904J56359j74850Q5229J35330p0602K1612m5689j11358m0359J00699
2254d4317l3981R6477K1616j1224J7877J14549M1013p3066m9181o3395j94842
2243a78474K04084J16788j03581O4538q4250p5964J11739N9632l555j80514J18040
$$ y = [18363, -1277, 7689, -86939, 4472, 54730, 100821, 36877, 102108, 65363, -11237, -53114, 1858, 41359, 40640, 56886, 75277, 83035, 144074, 208386, 120647, 95643, 85545, 110139, 203725, 229611, 351485, 300395, 310912, 290507, 211460, 107484, 89776, 149115, 62741, 96189, 143080, 16723, -59687, 125770, 136445, 78704, 24815, -27600, 83386, 25778, -13492, 80322, 106607, 61571, 69527, 91171, 57487, 97234, -36472, 24429, 14213, 77468, 17564, -86784, -100688, 55671, -119179, -33950, 101380, 30778, 52390, 6701, -104657, -145016, -44317, -78298, 18179, 39795, 28571, 46448, 160997, 202010, 128944, 79763, 16368, -178474, 25610, 142398, 38817, 103355, 19105, -56859, 54880, 114512, 110957, -69557, 48483]
2232D8483k0203N2678o9610J17622p79L0949o9772p2466P5746n7400P0480J6640
2220A22368j48718P7328L4506j7944O5571j34872K3391M4573N4116m7466o9684
2209C169m935O5657J03706n5904p3189Q6885Q190r895N480O0695l4364K7267M7434
2196B30196j50113l5610P5210J7656J36881m8618l4672r6527q5235Q3812O7733
2185A60713M4379j47520o0662l6086N664R8015L2302L1699M1168P9366k9196J44044
2173C63886j28911r8547N3371J43912j22941p7251P8753L6718M4602j03910r6842
2162I2840P7584J27638M7192J30103k6949l7631J1905o4815p7375O3907m0873
2151C03526L5208q5320P0107N0565m6192O6496O2385K569J56006P0609m7403k6012
$$ y = [48483, 28280, 80958, 11348, 128970, 128191, 159140, 89368, 16902, 92648, 35248, 105728, 122368, -26350, 50978, 85484, 67540, 133111, -1761, 21630, 66203, 120319, 72853, 3169, -1766, 63891, 167597, 111693, 38504, 125389, 133579, 123684, 129164, 189859, 155495, 182762, 230196, 80083, 44473, 119683, 137339, 274220, 225602, 190930, 94403, 9168, 92980, 160713, 205092, 57572, -3090, -39176, -33512, 64503, 96805, 128504, 169672, 249038, 219842, 363886, 234975, 136428, 189799, 333711, 210770, 133519, 212272, 248990, 293592, 189682, 92840, 170424, 298062, 345254, 475357, 448408, 410777, 422682, 357867, 280492, 344399, 303526, 338734, 253414, 323521, 374086, 327894, 394390, 456775, 459344, 615350, 685959, 638556, 612544]
2139F12544k0844L6957l5977k4250n897k4092P4395n6827Q2698R482l1041P3387
2127F90535M5091K0007L4799O6458o1368n6198j4285Q5130J26543Q940m5187K2138
2115I22603j6031j623j944m8884Q8847J08069J7810P9717N2176j00287J7441L0712
2103A148606N4293P5671L6349J7312j06551K26456q6577j9005O2927J33510J48516
2092A691507Q8946q307J32180N8412J37792K55184J10169K6939J38873K8922K14211
2081B874828J65750K03425K61260J85298J61726K61280K39369M50342M11432L91597
2071E606307O61634P99083Q27037O98492P91953J137222J013970J450229J758274
2062A4744201J900031K512990L526036L937841N058225N701864M033835j264295
$$ y = [612544, 591700, 628657, 592680, 568430, 562533, 538441, 612836, 556009, 638707, 648189, 617148, 690535, 735626, 755633, 790432, 856890, 795522, 739324, 725039, 810169, 936712, 945652, 900465, 922603, 906572, 904949, 903005, 854121, 942968, 1051037, 1068847, 1148564, 1200740, 1100453, 1117894, 1148606, 1202899, 1278570, 1314919, 1332231, 1225680, 1452136, 1365559, 1346554, 1409481, 1542991, 1691507, 1780453, 1772146, 1904326, 1962738, 2100530, 2355714, 2465883, 2492822, 2631695, 2660617, 2874828, 3040578, 3244003, 3505263, 3690561, 3852287, 4113567, 4352936, 4803278, 5214710, 5606307, 6267941, 7067024, 7894061, 8592553, 9384506, 10521728, 11535698, 12985927, 14744201, 16644232, 19157222, 22683258, 26621099, 31679324, 37381188, 41415023, 40150728]
2054D0150728n483090n375084o003011m568730l152791k252688j714127j188687
2046A0412520r93227p83250n41638m08471m96776m73400o20379n69812n84232
2037D941335m70368k84963l40109k05532j11112l14711j67786j73420j03532q0355
2027B689447K918j47481m3517m3344j79719r4401j59992l3848P0364l4812j76464
2016A849151j14746O767j82450j48318N7344p3097r2325r936j18780K9255M2119
2005A244984l9973N079k10178m1594j8490J9567j33566j518J997J20784K2312
1994I69404j17288l7535k7089j00837o1210L8543O7233L9943j33858k6401N8168
1983F69073j24914P3811J7292N1628j18382M4219N4686o7009n7118q6517l1796
$$ y = [40150728, 34667638, 29292554, 23289543, 18720813, 15568022, 13315334, 11601207, 10412520, 9419293, 8636043, 8094405, 7685934, 7189158, 6715758, 6095379, 5525567, 4941335, 4470967, 4186004, 3845895, 3640363, 3529251, 3214540, 3046754, 2873334, 2769802, 2689447, 2692365, 2544884, 2501367, 2458023, 2278304, 2183903, 2023911, 1990063, 2060427, 2025615, 1849151, 1734405, 1741172, 1558722, 1410404, 1467748, 1394651, 1302326, 1292390, 1173610, 1202865, 1244984, 1205011, 1210090, 999912, 958318, 939828, 959395, 825829, 824311, 826308, 947092, 969404, 852116, 814581, 787492, 686655, 625445, 663988, 731221, 771164, 637306, 610905, 669073, 544159, 617970, 635262, 686890, 568508, 612727, 667413, 600404, 543286, 456769, 424973]
1972D24973K6406m8639K5626R1118j12649m8329J04841l5400k9246L2733k1925
1961D09509K144m1294R122m6221o0512J7768J78859j12048L0026j60200m2069
1950A85084q7630M1893m285P3751R8748k4620M679k7864L1412J3207j30756r5807
1938G7812J29084k4076L8458q899J5438O681k945n5622l3890J3489n3429M6475
1926A48576J9359n6884l1991J9223M4715q7296J2677N5956l430M601M7059m9532
1914A23033P0418j4799j4538j05133J15206p0053R4786p5366j20672K20712j5915
1903B07679j1146L8154L9503L99r9978n1491M1444J8188o5474L8180Q2013j46063
1891I1408j38174O4389M9301P1697j12152J2724J8721k7350j7654j2305N2385
$$ y = [424973, 451379, 402740, 428366, 519484, 406835, 358506, 463347, 427947, 398701, 431434, 409509, 411653, 370359, 379481, 333260, 272748, 290516, 469375, 357327, 387353, 227153, 185084, 97454, 139347, 135062, 208813, 307561, 282941, 287620, 259756, 291168, 304375, 173619, 77812, 206896, 182820, 221278, 212379, 227817, 234498, 231553, 175931, 142041, 155530, 102101, 148576, 167935, 111051, 79060, 98283, 142998, 55702, 68379, 124335, 120905, 125506, 172565, 123033, 193451, 178652, 164114, 58981, 174187, 104134, 198920, 123554, 2882, 223594, 207679, 196533, 234687, 274190, 274589, 174611, 123120, 164564, 182752, 117278, 155458, 237471, 91408, -46766, 17623, 66924, 138621, 26469, 39193, 57914, 30564, 12910, 605, 52990]
1880E2990O2974J33j4042J2557j68287m9777J87781M5638p5137q1044K651R0392
1868F6829l0972j4683l4786m9913m0612K20892p3355L1660l6271J8411k5272K3603
1856E5531J54506r3672n1110N6329o9390n3670J14372l3691M3731k7635j79936
1845h4635l6273J32570J34983p5333m9121j8899n252J2304P9204O2707j04108
1834D8147N640m0319p8992L6178J6285N6918j5890J448O011L4585K6478J20308
1822B16797r852j09920J01347N9264L013m1119k0846N2828j8423J9722m239O3421
1810C11993o7059J6220k1044k77202M9764K1558j13097J374P9342j05850N5620
1799d8381J13573j27277J1917J12251m5723n4049q6058J02167o0953Q47J07225
$$ y = [52990, 115964, 116097, 102055, 114612, -53675, -103452, 84329, 129967, 54830, -26214, -23563, 66829, 35857, 21174, -13612, -63525, -104137, 116755, 43400, 75060, 38789, 57200, 31928, 55531, 210037, 116365, 65255, 121584, 52194, -1476, 112896, 79205, 122936, 95301, -84635, -120908, 11662, 146645, 71312, 22191, 3292, -1960, 10344, 89548, 152255, 48147, 53787, 13468, -65524, -29346, -13061, 43857, 27967, 29415, 35426, 70011, 96489, 216797, 206945, 97025, 198372, 257636, 260649, 219530, 198684, 251512, 233089, 252811, 248572, 311993, 244934, 261154, 240110, -37092, 12672, 34230, -78867, -77493, 1849, -104001, -48381, 65192, -62085, -50168, 62083, 16360, -37689, -123747, -21580, -82533, -81686, 25539]
1788B5539M5306k7812j38385J02549j2413j0516n862J7705k8687J0035M5075n250
1776A7284k5893K262K3447M8420J9576j20689l4281l993J6781q136O8430O2411
1764F5619o3045m3252J1537M9679K4563J7467k2462j45633j6544M63M9567O16
1752g1425l2585J35337n858n6244K4215Q9993K3617j12676o6470j25022N4106
1741a43012R1167k4492J16784P7631j23280j00897J37713Q2276J200l8407j04963
1730b8280j26661M1799L4613N5172j0706k0066n6923P6849J3943N4275m5298m4209
1718e5492J5079P9949J4203m3545l5804Q960O610Q9127l2080o6684L3782j14402
1706a00297J01554O1061l8442r8653R332J6729p1844K2664P7687q3444o7151J7355
$$ y = [25539, 70845, 43033, -95352, 7197, -5216, -15732, -21594, -3889, -32576, -22541, 22534, 17284, -8609, -6347, 17100, 65520, 85096, -35593, -69874, -73867, -57086, -65222, 3208, 65619, 2574, -40678, -29141, 20538, 45101, 62568, 40106, -105527, -122071, -121608, -72041, -71425, -104010, 31327, 25469, -30775, -6560, 83433, 107050, -5626, -72096, -197118, -143012, -51845, -76337, 40447, 118078, -5202, -106099, 31614, 113890, 115090, 76683, -28280, -154941, -113142, -78529, -23357, -34063, -54129, -111052, -34203, -20260, 34015, -11283, -55492, -40413, 39536, 53739, 10194, -25610, -16650, -10040, 79087, 47007, -19677, 14105, -100297, 1257, 62318, 23876, -74777, -65445, -48716, -120560, -97896, -20209, -103653, -170804, -153449]
1694a53449P6153O6205J43199j22265j8563K0033N3303q4677k4003K2007q4753
1683a06810M3040J7690j969j73108P9335J49731O7525J5444j03278j23661Q0812
1672e5249n0198n6739O9461J46946k6397o1188K9244j24222q33R5802J0636m2849
1660f5586J49498k6901j4509J3439q7587q360J6397m4896J9886K9552m8771N1176
1648a6662J32502r3609r6896p5768J92278j3525o597j7652k4491K3621l4515l0766
1636f2080M8563J01105j01524j13450n225J10529q0948J00972k6232P4895m9368
1625b763r1267n4509j02256K18890M2748r7466o325O6324o2380j50229Q8539L5419
1613a15275R143R8264j80328K7077P8053J09615L8935j2099j15976O13m9727P8317
$$ y = [-153449, -77296, -11091, 132108, 9843, -8720, 11313, 64616, -20061, -44064, -22057, -106810, -63770, -46080, -48049, -221157, -141822, 7909, 75434, 90878, -12400, -136061, -55249, -105447, -162186, -92725, 54221, 27824, -33364, -4120, -128342, -129175, -33373, -22737, -65586, 83912, 57011, 42502, 55941, -31646, -40006, -23609, -68505, -48619, -19067, -67838, -16662, 115840, 22231, -74665, -150433, 41845, 28320, 21723, 4071, -20420, 3201, -31314, -62080, -13517, 87588, -13936, -127386, -132611, -22082, -103030, -2058, -28290, 46605, -2763, -94030, -148539, -250795, -31905, 10843, -86623, -92948, -26624, -89004, -239233, -150694, -115275, -106132, -7868, -188196, -161119, -83066, 26549, 65484, 53385, -62591, -61978, -111705, -33388]
1601c3388o7694r319R7933J70994p7591q0610N0784q3932j1171K3504J0022j2305
1589b2773K2989k566p8228k6753K1454m9861J78935p658k4842j57714J24665j1497
1577c3849Q654L7294Q499O0477l0890o5612K8980k231p7157p5336J48104l5476
1565b8543J882J32501J395j34849j9029k3577K4515K3517J0308r5589N1197m86
1553e6758n5051R0228L8377j04850M5739N27J6332l3329J7526j6137O3097J15444
1541A21145k05100J27020K3554Q0369k8758j40664J03143l0163o9188L2025o1402
1530d8019Q4805M179l3010q5344J0635J22211k1586j27229P7204M6967r8495L9100
1518b8582k365N7510n2690L213J09326j01573j4171J5208p2445L077O5597r2448
$$ y = [-33388, -101082, -110401, -12468, 158526, 80935, 325, 51109, -32823, -43994, -20490, -10468, -22773, 216, -2350, -80578, -107331, -85877, -135738, 43197, 35539, 10697, -147017, -22352, -33849, -25195, 12099, 20598, 81075, 50185, -15427, 13553, 11322, -65835, -141171, 6933, -28543, -26661, 105840, 107235, -27614, -46643, -70220, -45705, -22188, -11880, -107469, -56272, -56758, -111809, -21581, 16796, -88054, -42315, -41788, -25456, -58785, -41259, -57396, 5701, 121145, -83955, 43065, 66619, 146988, 118230, -22434, 80709, 50546, -18642, 13383, -48019, 36786, 40965, 7955, -77389, -66754, 55457, 33871, -93358, -16154, 30813, -67682, -28582, -30947, 26563, -26127, -22914, 86412, -15161, -29332, -14124, -86569, -83492, -17895, -110343]
1506a10343L295l102P1576N6684o5994P3787p5120J86622p4162o9841j509n126
1494a3233J70909j21489p2233n5218M1097O6127n1109J6535k6627k7254J13257
1483D0762j3984j4410R026n1013J00396N5532L5243q8029P588j17230j9854j560
1471e7533P4541R8347j33527k6504m2928j0496J5063o9100J02122J27218k20664
1460a43461K7742o0889N9193J18412K7219l2030J10776k3179N251l2376K1513
1449G8171n8736q6073J17798l5223r2747M5491P069N9583o4009p7986L3941R0838
1437A8117O7843m4793k0270K073K8376O4387o314p4846k2300j13959N5963L1011
1425a4712m8611o3635R7933N3469j3786k1010K3682L3759K9535j58369K9907K9851
$$ y = [-110343, -107048, -110150, -38574, 18110, -47884, 25903, -49217, 137405, 63243, -6598, -8107, -13233, 157676, 36187, -36046, -91264, -50167, 15960, -35149, -18614, -45241, -72495, 40762, 26778, 12368, 21394, -29619, 70777, 126309, 161552, 73523, 81111, -36119, -55973, -57533, 17008, 115355, -18172, -44676, -87604, -98100, -83037, -152137, -50015, 77203, -143461, -115719, -176608, -117415, 997, 28216, -3814, 106962, 83783, 89034, 56658, 78171, 19435, -66638, 51160, 15937, -76810, -31319, -24250, 35333, -28676, -106662, -72721, 18117, 85960, 41167, 20897, 22970, 51346, 115733, 109419, 34573, 12273, -101686, -45723, -14712, -63323, -126958, -29025, 24444, 10658, -10352, 13330, 47089, 76624, -81745, -51838, -21987]
1413b1987P9285K6236p8612K8561j06387M0468p3148L6783k3982p7448k1137K92763
1401A01395l3938m8099l4896K7685j30259R776J18939O6363k5197j9499N4096
1390H6366J00567p5221o8141p1532L3067K5503l8806R5229J5994q2609R859L4266
1378F4542n9788j0559n7384R3565K9342P821n0879j65922N4721J15856j41339
1367a20024J77663n7020K3092J0853K6308k7821q130l0922j5347l5575O864M6638
1355c421l1219J4561N8543l2209O8595l8054q8983J37838o8340o5733m0778j4663
1343a03863M8776j686J16630q7787O7986j04293r93K8917o5514j4820l4952P3256
1331g8343J46239L6621K2297m7594j9507p1633j26150n1168R3439K9989J81255
$$ y = [-21987, 57298, 83534, 4922, 33483, -72904, -32436, -105584, -68801, -92783, -170231, -191368, 101395, 67457, 19358, -15538, 12147, -118112, -108336, 10603, 76966, 51769, 32270, 86366, 186933, 111712, 43571, -27961, 5106, 30609, -8197, 87032, 103026, 20417, 30276, 64542, 4754, -5805, -63189, 30376, 59718, 67539, 16660, -149262, -94541, 21315, -120024, 57639, 619, 23711, 34564, 60872, 33051, 24921, -6001, -21348, -56923, -50059, -3421, -34640, -20079, 38464, 6255, 74850, 36796, -52187, 85651, 17311, -48422, -89200, -103863, -55087, -56773, 59857, -27930, 40056, -64237, -65230, -36313, -101827, -116647, -151599, -78343, 67896, 104517, 126814, 79220, 59713, -11920, -138070, -189238, -95799, -65810, 115445]
1320A15445j2714k14858l3259J6550K13008p4033k06697K0852J54517N1333J9679
1309D9823m5114q3737M3271m1158J33163J12208n5560p7328j7470N6560r8959
1298b4301j3833J5194J0081L2021L1729o5758r6769J02880l2318O0259L9779L2743
1286I1707j10471K7476j6778J5390K2351K4023m7130q0925j35618N9291K03655
1275E2971o428R1647q3631l1052J6609l9214j30965P8683J7873M1382R380n7274
1263d0019n62l8161l7861O4331m2887O2423K4289O754j62877O3180J1916k3137
1251a12611N6210Q1441m3202q9212n3609j1714M1714J33784j11399P4360j1884
1240d6122j8209J09508m0047q0014Q6397l7986o8912O4378L3524l0675j4764J13874
$$ y = [115445, 102731, -112127, -145386, -128836, 84172, 10139, -196558, -175706, -21189, 30144, 49823, 4709, -79028, -35757, -76915, 56248, 168456, 112896, 35568, 18098, 74658, -24301, -38134, -22940, -12859, 19162, 50891, -14867, -111636, -8756, -41074, 19185, 58964, 91707, -18764, 8712, -8066, 7324, 29675, 53698, 6568, -74357, -209975, -150684, 52971, 46543, 138190, 54559, 23507, 40116, 902, -130063, -51380, -33507, 7875, 17255, -40019, -40581, -78742, -116603, -52272, -95159, -32736, -8447, -1693, -164570, -101390, -89474, -112611, -56401, 25040, -18162, -107374, -160983, -172697, -130983, 2801, -108598, -34238, -46122, -64331, 45177, 5130, -74884, 11513, -26473, -95385, -31007, 2517, -28158, -42922, 70952]
1228G0952p1327J2365l7279j1742K0534j853R3707M543Qn2727L8120m3113j13765
1215i1577M4607K1885j31425P6973r8440J65433K7342O8754M2558j69116Q0747
1204C7741m0928l3932J05398p82m8419j3611k9088k028J3593L9025L9415o3326
1192C058k9569l090n649q4040O5449L5270k1766J9832N7480p4328K4646P0349
1180E7642m3485m1957m2142R539Q332M5856p4456J38657j9813k6746j1029N3241
1168E3639r6243L9387J6039r2789j28468J21442L017l7757k7722J58568q4895
1157g5782P2246m624J21876j65822l54P1700M8111j23322k7117J00628n5403R083
1145b8780N0406Q5215r7895L4474J07421j23411l4865K5741l176K9173n7158l5698
$$ y = [70952, -375, 11990, -25289, -37031, -16497, -18350, 75357, 79900, 79908, 27181, 65301, 22188, -91577, -46970, -25085, -156510, -79537, -177977, -12544, 14798, 83552, 126110, -43006, 37741, -3187, -37119, 68279, 67497, 19078, 5467, -23621, -25649, -12056, 26969, 66384, 3058, -26511, -29601, -35250, -119290, -53841, -18571, -40337, -20505, 36975, -37353, -12707, 57642, 14157, -27800, -69942, -60403, -52071, -6215, -80671, 57986, 38173, 11427, 398, 53639, -42604, -3217, 12822, -79967, -208435, -86993, -83976, -121733, -149455, 9113, -75782, -3536, -8160, 113716, -52106, -52460, 19240, 67351, -55971, -83088, 17540, -37863, -28780, 21626, 106841, 8946, 43420, 150841, 27430, -7435, 18306, 15130, 44303, -12855, -48553]
1133d8553M1485l7882n9937J46919m8982l3569O4808j5431j62125J28761N6893
1122C2387m4147M5150k7194K5606l7503K1178K3425o1841L7904N85m7213O2835
1110C1172M891m7670M4018j50713l8218Q2587n010K9315n219k9953J09131k7531
1098c200j3406K0212n7990J03154N0241j57051O7386n681J7527J7076Q357O0337
1086A06962m5344l1739K321q4289l4699J38786J0140J14464o8326m0421k1458
1075D6397M0609K3793q0204m9973J4471Q0999j8534j45964J47713k4836r4941
1064f0470M9543k4141R7185L1939l1716n9389J4042N2741J6459q8089O3097q4760
1052b3559k9130J2688P8678P6244q7885j2775J46607j16874M5319p7203r0869
$$ y = [-48553, -7068, -44950, -104887, 42032, -6950, -40519, 24289, 8858, -153267, -24506, 32387, -11760, 33390, 6196, 31802, -5701, 15477, 38902, -22939, 14965, 15550, -31663, 31172, 36063, -11607, 32411, -118302, -156520, -73933, -78943, -49628, -54847, -84800, 24331, -3200, -16606, 3606, -54384, 48770, 99011, -58040, 9346, 3665, 21192, 38268, 46625, 106962, 61618, 29879, 32200, -52089, -86788, 51998, 62138, 176602, 108276, 67855, 46397, 87006, 110799, 30595, -19378, -4907, 76092, 57558, -88406, 59307, 34471, -60470, -10927, -35068, 62117, 94056, 62340, 2951, 16993, 69734, 86193, -1896, 61201, -23559, -52689, -40001, 38677, 114921, 27036, 14261, 160868, 43994, 89313, 12110, -78759]
1041g8759k7453M3011j19297R5667J34024j2866J90139o6825m1038j16712j57728
1030a57837J67275N4394k3984j69353J16318k9101j30228M9502M0381j09798R5696
1019i6735R0385K4718N9935j02925R988o272n6651j6900p132o0402P3556N8326
1007c0109j3730k3741O3157l6941L5110m5590j03070J01476J13835j29580j00641
996a69824R8449N4393K3495j327J18609q3260p1046N1282o3681K498M1691Q1948
984H3227J3775l2439k5725j5001k3365J8477p3113J07900j40186M0820P3805j7661
972A0514j09581M2295O2236o3259J9250P0770o2510k6714R9503K9116m5084n9907
960c3371p0053R2966l7918K8982Q1668j8611j05631q0593J37611l7953O1668j7262
$$ y = [-78759, -106212, -63201, -182498, -86831, 47193, 34327, 224466, 157641, 116603, -109, -157837, 9438, 63832, 39848, -129505, -13187, -42288, -172516, -123014, -82633, -192431, -96735, -6350, 18368, 78303, -24622, -14634, -20906, -77557, -94457, -101589, -161991, -88435, -30109, -43839, -67580, -4423, -41364, -6254, -51844, -154914, -53438, 60397, -69183, -169824, -71375, -16982, 6513, 5186, 123795, 40535, -30511, 20771, -42910, -40412, 1279, 83227, 97002, 64563, 38838, 23837, 472, 18949, -54164, 53736, -86450, -45630, 28175, 10514, -99067, -56772, 5464, -57795, -38545, 32225, -30285, -56999, 42504, 71620, 26536, -33371, -103424, -10458, -48376, -19394, 62274, 43663, -61968, -142561, -4950, -42903, 18765, 1503]
948A503N3987j8601k2501L105K7649l1606R84K6513l0342j09375j4306J6830K5976
935g0184N5288j9824M1056j9724l8854Q0834L526j0387n432j7843j1288N4215
923D1383J4001j29704m7369M7321R4039n5311M4912j34657J08290K3833j17074
912a10336M8707M0016j14359J12913N8361k4770J2690O3738N99q6150J452l5570
900c2709o3016M5763Q5388K589j11916p6092K3500Q5583n7147k1666K7876J02108
888A0261k1641o1030J8127j17790R1502J53410o9847o1162Q9921l5667n048N7290
876D8326r232K6179M7673j69359n2724K6816j320O1690n437m846L7035q7724l0704
863a13627j7319J46338j368m4365j16335J3061J4565J41971l1942q1277O6170
$$ y = [1503, 55490, 36889, 14388, 17493, 45142, 13536, 14520, 41033, 10691, -98684, -112990, -96160, -70184, -14896, -34720, 6336, -13388, -52242, 28592, 32118, 21731, 16299, -1544, -12832, 41383, 55384, -74320, -121689, -74368, 19671, -35640, 9272, -125385, -17095, 6738, -110336, -61629, -21613, -135972, -23059, 35302, 10532, 23222, 86960, 87559, 1409, 2861, -32709, -95725, -49962, 35426, 38015, -73901, -149993, -126493, -40910, -98057, -119723, -91847, 10261, -11380, -72410, -54283, -172073, -80571, 72839, 2992, -58170, 31751, -3916, -8964, 48326, 39094, 65273, 112946, -56413, -109137, -82321, -83641, -21951, -27388, -32234, 4801, -82923, -113627, -130946, 15392, 14024, -30341, -146676, -133615, -119050, 22921, -9021, -90298, -24128]
852b4128o7393M6757J48349q6444k0528K529n7002n6053l8583m3686J42450J14841
840F1109j54319J11644L7419M4270o7402m5102L5136j12880P7617R6471l9114
829D4849J7795L8518O475n2721M1947j73153K3357M6900p5133j36935R5453J53250
817C0602j13495P9171J9857L363q6176M5085J53526L6367r5494q181p7475Q0546
805F7696n0710l9147K9111K8810p1865j2072M7963l9881P1458O7631l5442r0148
793b6596M5028K7980M8070j33304j60083J78830K6221m7507K4930o6836m5953
782a29220r688M1045P4171j1480P7N5771J03680j21895n0668M2362m018Q1484
770G1621L0583K1787l5085q2775l2800K5943K2532M9379j3988N3861K9639o2868
$$ y = [-24128, -91521, -44764, 103585, 17141, -3387, -858, -57860, -113913, -152496, -196182, -53732, 61109, -93210, 18434, 55853, 100123, 32721, -12381, 22755, -90125, -12508, 83963, 44849, 62644, 101162, 107637, 54916, 96863, -76290, -52933, -6033, -81166, -218101, -122648, 30602, -82893, -3722, 16135, 19498, -66678, -21593, 131933, 168300, 72806, 64625, -12850, 67696, 16986, -22161, 6950, 35760, -36105, -48177, -214, -40095, 31363, 98994, 63552, -26596, 18432, 46412, 94482, -38822, -198905, -20075, 6146, -41361, -16431, -83267, -129220, -138908, -97863, -23692, -35172, -35095, 20676, 124356, 2461, -48207, -5845, -9863, 71621, 102204, 123991, 88906, 6131, -26669, -726, 21806, 71185, 57197, 111058, 140697, 77829]
758G7829r1189M7080o6391J7346K9137j0996J1275K1470J9698m1553L42p9917
746f5869J28637L2809p2485j5143j22861J01113q6644L0930J5316N6825n6642
735e4014L9577R1870j05236p0645k2883O6453J4073K191O26p3444O1065J50872
723A00505o6309n8762Q5743M9995L1046l9621l4181k965K2507P119J0806r3127
711A2756q0940N8392R1901r9005L2494l7000r499M6338L8060r458L7239O6974
699A48252j19342p653j16094L4294p5953J07847M2347m441k0867r900M7982j012
687B5460r827j26021q563J04265R1503n3733j31783O9417J12675L3889l6304q8291
675a7313M8154K7362N3149m0606l4474m6899q7185J02851L8703J6845K2976M2329
$$ y = [77829, -13360, 33720, -32671, -15325, 13812, 2816, 14091, 35561, 55259, 13706, 14048, -65869, 62768, 95577, 23092, 7949, -114912, -13799, -100443, -69513, -54197, 2628, -54014, -14437, 77433, -27803, -98448, -121331, -54878, -40805, -38614, -37988, -111432, -50367, 100505, 34196, -24566, 61177, 111172, 142218, 102597, 68416, 65451, 87958, 95077, 105883, 12756, -68184, -9792, 82109, -16896, 15598, -21402, -30901, 15437, 53497, 44039, 81278, 148252, 28910, 21257, -94837, -60543, -136496, -28649, 13698, 9257, -11610, -21510, 26472, 25460, 15633, -110388, -118951, -14686, 76817, 23084, -108699, -39282, 73393, 107282, 70978, -17313, 30841, 58203, 111352, 70746, 36272, -10627, -97812, 5039, 43742, 60587, 83563, 125892]
663A25892N8382j61033j0716M1772J3221r2408Q986l7276R719J5464L6991J7017
651B6011K0887N740l8603r98P0233l5516j54678r170K1644J97999j3590Q2192
639A72151j16603k7253r6724l2004J29296k7065j763K7499K2321j1440l2758R8287
627A03944l3856r0173j6796J07068l2128n589M3477j09549K6832Q8725q6053J29437
615A25339L3383j73475M8650k7035p3219m4803J3333Q1563O5487J30375n48q9106
603H9944O8664o6870j28980n433m7473J37240J15477q0540J5471L0977j14336
592A4141m5420l6620R4777M6315J15085p6509j84978l6622P48J23674m9535R1372
580E6428m6822r8048Q7250J07822o6028j14890P6851Q6517n7748K5389R508q7471
$$ y = [125892, 184274, 23241, 12525, 54297, 67518, -24890, -15904, -53180, -43461, -27997, 8994, 26011, 46898, 52638, 14035, 13037, 83270, 47754, -106924, -116094, -94450, 103549, 89959, 172151, 55548, 28295, -68429, -100433, 28863, 1798, 35, 27534, 49855, 38415, 5657, 103944, 70088, -20085, -36881, 70187, 38059, 32470, 75947, -33602, -6770, 81955, -4098, 125339, 158722, -14753, 33897, 6862, -66357, -111160, -97827, -16264, 49223, 179598, 179050, 89944, 158608, 91738, -37242, -42675, -90148, 47092, 162569, 82029, 97500, 128477, 14141, -31279, -67899, 26878, 73193, 188278, 111769, -73209, -109831, -109083, 14591, -34944, 56428, 9606, -88442, -1192, 106630, 40602, -74288, 2563, 89080, 31332, 56721, 66229, -21242]
568b1242Q9234k6820n1277O5664O0309k7596J2835K4604j02443L2498o1076l3757
556c9067K5770o642P7121L7191K1295m3690j42353P7614N3859j48444j1017M0713
544e7650J5767J17191l2255K1549k0151J37285j02222k8374q6094Q0336m610j56317
532a15545J32187Q6959p9206J1765m7968J43636O1041j21333K9270n7864q5539
521d2597L2839j818L6383P500j55913m0902R5964l2056q6126Q9932R4090K4497
509B1793j22699M2991L9603Q4087j5646o9026k4895L6804j7619l9234J19336r382
497D6113J9331k7712p150N9731q7863L9963K0355r6702J4566N0024m8359Q3131
485F5428l4458m7453o515J01051P2656j02782m7311k5510n2836N5412K4974j5706
$$ y = [-21242, 67992, 41172, -10105, 55559, 115868, 88272, 101107, 125711, 23268, 55766, -5310, -39067, -13297, -19939, 57182, 94373, 115668, 71978, -70375, 7239, 61098, -87346, -98363, -57650, -41883, 75308, 43053, 64602, 44451, 181736, 79514, 51140, -34954, 45382, 40772, -115545, 16642, 103601, 24395, 36160, -11808, 131828, 192869, 71536, 100806, 42942, -42597, -9758, -11576, 24807, 32307, -123606, -164508, -68544, -100600, -186726, -96794, -2704, 21793, -100906, -57915, -18312, 65775, 50129, -18897, -43792, -6988, -24607, -63841, 55495, 46113, 65444, 37732, 30582, 90313, 2450, 42413, 62768, -33934, -19368, 30656, -17703, 65428, 30970, -16483, -22998, 78053, 150709, 47927, 616, -24894, -77730, -22318, 2656, -13050]
473a3050j6406k3707M6324L4763J6486K6934q761O4335n9033n8880R250r2655
461g4400Q710k0523L7154J46276K456k1879m6923J33837k6282P434j43509J3220
449A5571j045K0516n3002J2100L8854K4447P1127r5807n3975K4772j8486n258
437b0186M984n0628N0540M5246J44968m6843o5927q093j6052n3249l3694j03710
425a52644M3217J21556J1655k9987P8964j5590J0033o0890o639O1387n3332j02915
413i5185k7774q970J2248n65J47182O5535k6771k2703k9564J6469l3446m8374
401e1918m1485J64346O4122m5727m6344p5425J97790m5931r8966j02761o4919
390a47218J19765j3442Q4562N2150J4745j8034k6982n8315k7070L8479O1777l9340
$$ y = [-13050, -29456, -53163, -6839, 27924, 44410, 71344, 62583, 126918, 67885, 9005, 18255, -74400, -65690, -86213, -49059, 97217, 99673, 77794, 30871, 164708, 138426, 145860, 2351, 15571, 14526, 35042, -17960, -5860, 32994, 57441, 128568, 32761, -21214, 3558, -14928, -20186, -15202, -65830, -15290, 29956, 174924, 128081, 62154, 54061, 38009, -15240, -48934, -152644, -109427, 12129, 23784, -6203, 72761, 57171, 67204, 6314, -325, 61062, 7730, -95185, -122959, -131929, -119681, -120246, 26936, 92471, 65700, 42997, 13433, 29902, -3544, -51918, -93403, 70943, 135065, 89338, 42994, -32431, 165359, 119428, 20462, -82299, -147218, -27453, -40895, 43667, 95817, 110562, 92528, 65546, 7231, -19839, 18640, 80417, 41077]
378D1077r345P63m5197j01904K8105M3384L8045l2313R7586J11750j31386p2674
366c2109j01453R6097O1259P6100j18201l1237k1778J00648l8819K3405o1j22271
354a08420J24534O8803q3814J1658O7476l9536p3206j2057N0874M4995l3505q5960
342f8158Q0760L8158L6867Q3179P4136j08379N823q8844k0471l9169M9660P028
330E0590k2303R7794n7423J9671n4164o1429N8583n8402J0001J17085R0872j4160
318A76715j20240P2301j00627l6564n2208J0974K5849o051J1305K3963J79920
307A85337j20567Q652k508Q858j35854k6910N2146Q2308O6310p9760j4896K1883
295D4999l1685K0101k9794J8299n7533P4954p2591q8542J36901J72895j26121
$$ y = [41077, 31732, 32495, -12702, -114606, -86501, -43117, -5072, -37385, 60201, 171951, 40565, -32109, -133562, -37465, 23794, 99894, -18307, -49544, -71322, 29326, -9493, 13912, 13851, -108420, 16114, 84917, 1103, 12761, 80237, 40701, -32505, -44562, 6312, 51307, 17802, -68158, 12602, 50760, 87627, 170806, 244942, 136563, 142386, 53542, 33071, -6098, 43562, 50590, 28287, 126081, 68658, 88329, 34165, -27264, 31319, -27083, -17082, 100003, 190875, 176715, 56475, 128776, 28149, -8415, -60623, -49649, -23800, -29851, -18546, 5417, 185337, 64770, 73422, 70914, 79772, -56082, -82992, -30846, 51462, 117772, 38012, 23116, 44999, 13314, 33415, 3621, 21920, -35613, 39341, -33250, -121792, 15109, 188004, 61883]
284F1883j06878O5584k481J34174n8078o7851o9884o1868R8395J4806L304N5152
272F6258m8125L8651o3304N8390J5580n0463N861P182m3852K1408P5047k5840
260E6793m2179P2738n8157k4463n11j4274n7235R5979p2849m3676O9929j08658
248a26563J5285k4643J40719P1722o3947k8762o7953N3894O7918j7245K0591O3923
236A04939Q715M27n8749l2235j42891n393J45456N3884j704j46229M9803M3065
224A9088J2150P8600K0381l7433p2438K0273J8025O7038L8452l8474j46310J0541
212a0107j48153L9463R6763P5321n4855o959J23727k7806k8412n6985J59688m0107
200A21578n0128m9184Q971R4261j4538JJ8189n5311q8867o938p126M8731k9679
$$ y = [61883, -44995, 20589, 18108, 152282, 94204, 26353, -43531, -105399, -7004, 7802, 11106, 66258, 18133, 56784, -6520, 51870, 67450, 16987, 22848, 30030, -13822, 7586, 82633, 56793, 14614, 87352, 29195, 4732, 4221, -10053, -67288, 28691, -44158, -87834, -17905, -126563, -111278, -135921, 4798, 76520, 12573, -16189, -84142, -30248, 37670, 20425, 41016, 104939, 113654, 114081, 55332, 23097, -119794, -125187, 20269, 74153, 72449, -73780, -23977, 19088, 31238, 109838, 130219, 92786, 20348, 40621, 58646, 125684, 164136, 125662, -20648, -10107, -158260, -118797, -22034, 53287, -1568, -8527, 115200, 87394, 58982, 1997, 161685, 121578, 71450, 22266, 31237, 125498, 110960, 110961, 129150, 73839, -15028, -21966, -29092, 19639, -10040]
187a0040n9432o756N8838J17938q3433n3535q4607m7148Q7826R3006O439O4818
175H3914N6717m4731q4386p7839J2867J00551m6720K6041j6807P2025m0375P587
163D8844j9332o4787M0479O0675j7284J03132k8508k14426O8025M854j3140J09251
151G7783k9226N3678K8461J9125j0181j01049q2031J17374K7646j19127J5736
140a811l8012j3430M051N0262j39775M0387r243J16418P8145M3307O226j15588
128B0937p3795J00448p7358R639Q664j4017J47483q6397k717N2073p4580n6558
116d6178J10607j1085k5382J04375o6945o8606l1759K3370P0316k4783o4167m669
104c4906j416M2276P3873L3141J01279q5868n3139q0034n136J710r846K0032p789
$$ y = [-10040, -69472, -76228, -17390, 100548, 17115, -36420, -121027, -168175, -80349, 12657, 19096, 83914, 140631, 95900, 11514, -66325, -53458, 47093, 373, 26414, 9607, 81632, 41257, 48844, 29512, -35275, 5204, 65879, 48595, 151727, 123219, -91207, -23182, -18328, -31468, 77783, 48557, 102235, 130696, 149821, 139640, 38591, -43440, 73934, 101580, -17547, -1811, -39823, -53253, -49202, 1060, -138715, -98328, -107571, 8847, 86992, 130299, 136525, 20937, -52858, 47590, -29768, -20129, -11465, -25482, 122001, 35604, 32887, 84960, 10380, -46178, 64429, 53344, 27962, 132337, 65392, -3214, -34973, -11603, 58713, 33930, -30237, -34906, -36322, 5954, 79827, 112968, 214247, 128379, 75240, -4794, -9930, -8220, -18066, 1966, -5823]
91e823k4950R8411N5985j666q8869o7270M447q3324N2374J04397k1132k4235R1918
78I0263j14346l656M7643K3045K8910o1378K469j8367O306M507N5699K7878m5017
65D3956l7707j4235P0335m975n510k2148M2187j10882J6958J04273m7096L7234
$$ y = [-5823, -30773, 67638, 123623, 121957, 33088, -34182, -29735, -113059, -60685, 43712, 22580, -1655, 90263, -24083, -27739, 19904, 42949, 71859, 10481, 12950, -5417, 889, 5396, 61095, 88973, 43956, 6249, -7986, 62349, 57374, 51864, 29716, 71903, -38979, -22021, 82252, 35156, 72390]
$$ [...]
##END NTUPLES=NMR SPECTRUM
##END=
