##TITLE=1H_EC-3254(4-2)
 CDCl3, 8 sc, 
 1.07.2021
##JCAMPDX= 6.0         $$ Bruker NMR JCAMP-DX V2.0
##DATA TYPE= NMR SPECTRUM
##DATA CLASS= NTUPLES
##ORIGIN= UXNMR, Bruker Analytische Messtechnik GmbH
##OWNER= root
$$ XWIN-NMR		Version 3.5
$$ Fri Jul  2 10:02:11 2021 Russian Standard Time (UT+4h)  she@DPX200
##.OBSERVE FREQUENCY= 200.131506
##.OBSERVE NUCLEUS= ^1H
##.ACQUISITION MODE= SIMULTANEOUS
##.ACQUISITION SCHEME= undefined
##.AVERAGES= 8
##.DIGITISER RES= 18
##SPECTROMETER/DATA SYSTEM= spect
##.PULSE SEQUENCE= zg30
##.SOLVENT NAME= CDCl3
##.SHIFT REFERENCE= (INTERNAL, CDCl3, 0, 17.5008)
##AUDIT TRAIL= $$ (NUMBER, WHEN, WHO, WHERE, WHAT)
$$ ##TITLE= Audit trail, XWIN-NMR		Version 3.5
$$ ##JCAMPDX= 5.01
$$ ##ORIGIN= Bruker BioSpin GmbH
$$ ##OWNER= she
$$ F:/spectra/data/she/nmr/H-F/1/pdata/1/auditp.txt
$$ ##AUDIT TRAIL=  $$ (NUMBER, WHEN, WHO, WHERE, WHAT)
(   1,<2021-07-02 10:00:45.46 +0400>,<she>,<DPX200>,
      <created by zg, POWCHK disabled, PULCHK disabled
       configuration hash MD5:
       00 E9 B6 7A A2 85 ED C7 34 08 36 98 17 FE 4E 26
       data hash MD5: 16K
       36 5D 3B EE 0E C8 DB 5E 9E 16 27 BF 9B 8E D6 DA>)
(   2,<2021-07-02 10:00:48.48 +0400>,<she>,<DPX200>,
      <Start of raw data processing
       efp BC_mod = 2 LB = 0.24 FT_mod = 6 PKNL = 1 PHC0 = -11915.45 PHC1 = 13.60099 SI = 16K 
       data hash MD5: 16K
       41 4D E3 D2 76 35 59 6D 5B 0B 20 92 00 0A 04 08>)
(   3,<2021-07-02 10:01:09.68 +0400>,<she>,<DPX200>,
      <pk PHC0 = 1.047252 PHC1 = -0.5999998 
       data hash MD5: 16K
       A2 B0 A2 1C 3D D9 76 D0 17 5F D8 30 CD D2 1F 1D>)
(   4,<2021-07-02 10:01:13.76 +0400>,<she>,<DPX200>,
      <abs ABSG = 5 
       data hash MD5: 16K
       F7 4F 68 C7 FC F9 A6 07 00 5E 14 C3 18 72 1C BB>)
$$ ##END=
$$ 
$$ hash MD5
$$ 9D 44 AC 7A 31 C6 F2 51 B8 0D 37 40 EC C5 DF 69
##$RELAX= 
##$RELAX= 
##$RELAX= 
##$RELAX= 
##$RELAX= 
##$RELAX= 
$$ Bruker specific parameters
$$ --------------------------
##$DU= <F:/spectra>
##$EXPNO= 1
##$NAME= <H-F>
##$PROCNO= 1
##$TYPE= <nmr>
##$USER= <she>
##$AMP= (0..31)
100 100 100 100 100 100 100 100 100 100 100 100 100 100 100 100 100 100 
100 100 100 100 100 100 100 100 100 100 100 100 100 100 
##$AQSEQ= 0
##$AQ_mod= 1
##$AUNM= <au_zg>
##$AUTOPOS= <>
##$BF1= 200.13
##$BF2= 200.13
##$BF3= 200.13
##$BF4= 200.13
##$BF5= 200.13
##$BF6= 200.13
##$BF7= 200.13
##$BF8= 200.13
##$BYTORDA= 1
##$CFDGTYP= 0
##$CFRGTYP= 5
##$CHEMSTR= <none>
##$CNST= (0..31)
1 1 145 1 1 1 1 1 1 1 1 1 1 1 1 1 1 1 1 1 1 1 1 1 1 1 1 1 1 1 1 1 
##$CPDPRG= <>
##$CPDPRG1= <>
##$CPDPRG2= <>
##$CPDPRG3= <>
##$CPDPRG4= <mlev>
##$CPDPRG5= <mlev>
##$CPDPRG6= <mlev>
##$CPDPRG7= <mlev>
##$CPDPRG8= <mlev>
##$CPDPRGB= <>
##$CPDPRGT= <>
##$D= (0..31)
0 1.2 0 0 0 0 0 0 0 0.06 0 0.03 0 0 0 0 0.0002 0 0 0 0 0 0 0 0 0 0 0 0 
0 0 0 
##$DATE= 1625205644
##$DBL= (0..7)
120 120 120 120 120 120 120 120 
##$DBP= (0..7)
150 150 150 150 150 150 150 150 
##$DBP07= 0
##$DBPNAM0= <>
##$DBPNAM1= <>
##$DBPNAM2= <>
##$DBPNAM3= <>
##$DBPNAM4= <>
$$ [...]
##$SUBNAM3= <"">
##$SUBNAM4= <"">
##$SUBNAM5= <"">
##$SUBNAM6= <"">
##$SUBNAM7= <"">
##$SUBNAM8= <"">
##$SUBNAM9= <"">
##$SW= 20.0188882624521
##$SWIBOX= (0..15)
0 0 2 0 0 0 0 0 0 0 0 0 0 0 0 0 
##$SW_h= 4006.41025641026
##$TD= 16384
##$TD0= 1
##$TE= 0
##$TE2= 300
##$TE3= 300
##$TEG= 300
##$TL= (0..7)
0 120 120 120 120 120 120 120 
##$TP= (0..7)
150 150 150 150 150 150 150 150 
##$TP07= 0
##$TPNAME0= <>
##$TPNAME1= <>
##$TPNAME2= <>
##$TPNAME3= <>
##$TPNAME4= <>
##$TPNAME5= <>
##$TPNAME6= <>
##$TPNAME7= <>
##$TPOAL= (0..7)
0.5 0.5 0.5 0.5 0.5 0.5 0.5 0.5 
##$TPOFFS= (0..7)
0 0 0 0 0 0 0 0 
##$TUNHIN= 0
##$TUNHOUT= 0
##$TUNXOUT= 0
##$USERA1= <user>
##$USERA2= <user>
##$USERA3= <user>
##$USERA4= <user>
##$USERA5= <user>
##$V9= 5
##$VALIST= <valist>
##$VCLIST= <CCCCCCCCCCCCCCC>
##$VD= 0
##$VDLIST= <DDDDDDDDDDDDDDD>
##$VPLIST= <PPPPPPPPPPPPPPP>
##$VTLIST= <TTTTTTTTTTTTTTT>
##$WBST= 1024
##$WBSW= 4
##$XGAIN= (0..3)
0 0 0 0 
##$XL= 0
##$YL= 0
##$YMAX_a= 148813
##$YMIN_a= -292342
##$ZGOPTNS= <>
##$ZL1= 120
##$ZL2= 120
##$ZL3= 120
##$ZL4= 120
##$ABSF1= 17.50688
##$ABSF2= -2.512159
##$ABSG= 5
##$ABSL= 3
##$ALPHA= 0
##$AQORDER= 0
##$ASSFAC= 0
##$ASSFACI= 0
##$ASSFACX= 0
##$ASSWID= 0
##$AUNMP= <proc_1d>
##$AZFE= 0.1
##$AZFW= 0.1
##$BCFW= 0
##$BC_mod= 2
##$BYTORDP= 0
##$COROFFS= 0
##$CY= -3
##$DATMOD= 1
##$DC= 0
##$DFILT= <>
##$DTYPP= 0
##$F1P= 0
##$F2P= 0
##$FCOR= 1
##$FTSIZE= 16384
##$FT_mod= 6
##$GAMMA= 0
##$GB= 0
##$INTBC= 1
##$INTSCL= 1.334414e-10
##$ISEN= 128
##$LB= 0.24
##$LEV0= 0
##$LPBIN= 0
##$MAXI= 10000
##$MC2= 0
##$MEAN= 0
##$ME_mod= 0
##$MI= 1.114404
##$NCOEF= 0
##$NC_proc= -7
##$NLEV= 6
##$NOISF1= 3.799351
##$NOISF2= 2.8
##$NSP= 0
##$NTH_PI= 0
##$NZP= 0
##$OFFSET= 17.50077
##$PC= 1
##$PHC0= -11914.4
##$PHC1= 13.00099
##$PH_mod= 1
##$PKNL= yes
##$PPARMOD= 0
##$PSCAL= 0
##$PSIGN= 0
##$REVERSE= no
##$SF= 200.130006775393
##$SI= 16384
##$SIGF1= 3
##$SIGF2= 2
##$SINO= 5.538805
##$SIOLD= 16384
##$SREGLST= <1H.CDCl3>
##$SSB= 0
##$STSI= 16384
##$STSR= 0
##$SW_p= 4006.41025641026
##$SYMM= 0
##$S_DEV= 0
##$TDeff= 16384
##$TDoff= 0
##$TI= <>
##$TILT= no
##$TM1= 0
##$TM2= 0
##$TOPLEV= 0
##$USERP1= <user>
##$USERP2= <user>
##$USERP3= <user>
##$USERP4= <user>
##$USERP5= <user>
##$WDW= 1
##$XDIM= 16384
##$YMAX_p= 269348737
##$YMIN_p= -2129560
$$ End of Bruker specific parameters
$$ ---------------------------------
##NTUPLES= NMR SPECTRUM
##VAR_NAME=  FREQUENCY,     SPECTRUM/REAL,   SPECTRUM/IMAG
##SYMBOL=    X,             R,               I
##VAR_TYPE=  INDEPENDENT,   DEPENDENT,       DEPENDENT
##VAR_FORM=  AFFN,          ASDF,            ASDF
##VAR_DIM=   16384,         16384,           16384
##UNITS=     HZ,            ARBITRARY UNITS, ARBITRARY UNITS
##FACTOR=    0.24454680195387, 1,            1
##FIRST=     3502.42933251808, 0,            0
##LAST=      -503.98092389218, 0,            0
##MIN=       -503.98092389218, -2129560,     0
##MAX=       3502.42933251808, 269348737,    0
$$ Real data points
##PAGE= N=1
##DATA TABLE= (X++(R..R)), XYDATA
$$ [...]
8451 613263 686869 816159 390353 458656 598896 621552 765712 752357 885350 1130476
8441 1130476 1256411 1463982 1346618 1587709 1557513 1328231 1096161 946526 834980 934673
8431 934673 800968 559755 456253 431609 394903 379058 355625 309525 606080 287733 366832
8420 366832 461085 540862 580640 389958 364676 423097 349315 582296 522422 451481 486128
8409 486128 307557 278639 357903 223920 340495 315783 250423 447878 314441 175398
8399 175398 36567 24937 308949 59327 176999 175337 318533 265456 183543 340901 307951
8388 307951 284855 457020 375804 33304 220879 436991 255523 144343 245454 323775
8378 323775 282496 239153 227048 181337 186553 302021 235514 318925 161402 219636 319318
8367 319318 416043 513064 354159 489142 429022 409693 268174 61353 108710 259651 322706
8356 322706 432239 351364 324487 394076 485886 358558 171645 305035 338392 309067 127050
8345 127050 290143 394712 264876 366800 533847 445712 312929 358543 514156 521478
8335 521478 380226 441427 461033 437216 378686 406444 457141 642397 582672 344495 166048
8324 166048 230091 363451 593737 715873 604392 462995 500884 467278 269367 377129
8314 377129 565979 509711 239583 318596 465263 300771 363163 579412 455949 341925
8304 341925 240620 176271 586781 325378 384571 542810 817811 663361 601662 607400 616255
8293 616255 327770 182632 380305 601704 551689 284881 590546 775516 781790 563985
8283 563985 357348 260999 298763 318941 520099 321282 487572 508575 264633 295408 489220
8272 489220 673188 983128 704485 586764 584452 776197 406881 469641 436598 483889 390273
8261 390273 292262 345736 243736 235441 191418 364659 518611 432172 284858 706576 613692
8250 613692 508968 708015 597988 568884 595131 738659 660400 574407 690719 610640 575623
8239 575623 426308 580383 763086 628749 522370 677059 737211 804955 975334 806608
8229 806608 681229 554951 690271 884844 721285 709384 740015 883031 1122591 1133324
8219 1133324 987322 1118241 1388668 1504926 1404632 1396576 1356631 1500880 1336055 1338293
8209 1338293 1218107 1540488 1285285 1468197 1219297 1276122 1495567 1893496 1604631 1817754
8199 1817754 1781016 2011203 1532248 1337667 700569 623055 -2129560 -1249672 3578039 2548463
8189 2548463 2728596 2547669 2843675 2398177 2450916 2375481 2389766 2255822 2167729 2113536
8179 2113536 2423906 2433226 2451535 2182112 2139596 2019999 1812352 1798725 1518418 1385647
8169 1385647 1572494 1601971 1431887 1508929 1477679 1531509 1496001 1634166 1482745 1636757
8159 1636757 1775049 1476350 1430291 1220878 1557647 1618406 1564205 1561600 1691299 1829980
8149 1829980 1410268 1600362 1772121 1792734 1515621 1782354 2098466 1946163 1788789 2056881
8139 2056881 1802440 1730813 1762219 1815486 1891705 1944589 1996127 2018934 1971941 2008386 2145121
8128 2145121 2231132 2116834 2218673 2230757 2326284 2313643 2101799 2126888 2306602 2465129
8118 2465129 2241646 2246761 2421395 2355211 2172516 2203368 2335231 2186868 2078670 2342435
8108 2342435 2679018 2852745 3091521 3107926 3099012 3316975 3384139 3487795 3621412 3513052
8098 3513052 3529596 3653639 3700524 3542926 3612931 3472313 3612905 3989772 4117632 4005746
8088 4005746 4317382 4431979 4409154 4281805 4393210 4761363 5039894 5533674 5719632 5718118
8078 5718118 5929025 6265253 6656916 6712542 6634458 6729508 6969707 7324880 7394695 7836990
8068 7836990 8041427 8145524 8218072 8581023 8769734 8681285 8909108 9350062 9443391 9773634
8058 9773634 9979236 10277719 10673582 11369364 11627659 12070500 12770214 13107718 13356617 13792378
8048 13792378 14038294 14423558 14902444 15353186 15561793 16070460 16566321 16912845 17485913
8039 17485913 18463962 19084603 20138884 21265319 22703967 23658979 25401905 26826756 28836239
8030 28836239 30889751 32655346 35179298 38687184 42382735 46537174 51796215 58008457
8022 58008457 64167260 71377039 79265741 88840101 100676354 115645283 134594722 159645306
8014 159645306 189700939 229678558 269348737 260113823 224751294 195540811 161604354
8007 161604354 128472850 107483895 94113569 85257420 78307338 72976514 69022955 64762271
7999 64762271 60650084 56365415 52235265 49115790 45776498 43000588 41131749 39450114
7991 39450114 38315572 37904872 37893011 37768795 38511981 39037233 39684601 40463827 40386703 39331786
7981 39331786 37827777 35409799 33364407 31827329 30357993 29377476 28756031 28313057 28158267
7972 28158267 27985477 28689381 29484494 30389829 31714134 33285163 34839275 35819906 35862637
7963 35862637 35397522 33668432 31532215 29266420 27608585 26282024 25706700 25141060 24948560
7954 24948560 25113427 25452601 26374848 27494135 28927854 30585802 31647437 31963397 31473647
7945 31473647 29813183 28088313 25872270 23835116 21795095 20347649 19429911 18620275
7937 18620275 17797409 17152555 16897882 16632158 16219937 15624916 15252397 14413638 13713251
7928 13713251 13185461 12587024 12358193 12277803 12072400 11807005 11454987 11243635 11225537 11299475
7918 11299475 11173406 10930324 10852328 10787483 11011148 11221927 11594719 11935473 11940987 11704131
7908 11704131 11274710 10974725 10541819 10353321 10380345 10372693 10259827 10211003 10034699 9887151
7898 9887151 9599121 9406405 8775346 8737766 8232093 7917870 7914462 7619185 7406933 7331918
7888 7331918 7379687 7218324 7110706 6849266 6971044 6708005 6728475 6793232 6808030 6743454
7878 6743454 7052175 7549805 7577584 7775932 7860366 8099252 8725287 9116214 9151560 8998513
7868 8998513 8852077 8741006 8682372 8868815 8774431 8952931 9306253 9594751 9878503 9818644
7858 9818644 9418497 9422306 9162376 8893567 8931664 8839588 8930051 8945485 9223051 9131191 9399337
7847 9399337 10558290 11461793 12081895 12627378 13381856 14350815 15352068 16591433 17660240
7838 17660240 19254076 20919485 22192546 22968941 22923770 22283741 21807646 21511721 21573704
7829 21573704 21978491 22805511 23649070 24311684 24357282 23800159 22559405 21141308 19498969
7820 19498969 18441256 17483015 16629698 15734242 15177619 14832988 14552743 14874002 14923655
7811 14923655 15154496 15419472 15488469 15339502 15444737 15593418 15535013 16109849 16750929 17447959
7801 17447959 18503406 19618988 21280498 22612883 23591436 24155144 23660583 22722750 22154185
7792 22154185 21764796 21759072 22258086 22817053 23785422 24260266 24164897 23443309 22210593 20517926
7782 20517926 18711412 17400672 16282106 15260654 14371120 13680446 13245647 12972556 12767372
7773 12767372 12636407 12519018 12228040 11643296 11129180 10558140 9941370 9514190 9213557
7764 9213557 8982424 8530470 8113772 8228337 8322373 7966354 7875739 7788830 7463967 7500084
7754 7500084 7551769 7568867 7488036 7471200 7263057 7379212 7395089 7584004 7807633 7993084
7744 7993084 8072619 8309332 8403213 8343907 8642442 9174414 9475303 9885440 10420019 11195976
7734 11195976 11616838 12221237 12966647 13548307 14374670 15154794 16149831 17281201 18785638
7725 18785638 20331232 20880811 21001368 20531709 19622924 18484930 17970324 17804860 18020114
7716 18020114 18498926 19035761 19432658 18997869 18277755 16950849 15981060 15426147 14802978
7707 14802978 14041393 13598197 13351804 13610522 13472799 13757444 14345626 14547730 14979835
7698 14979835 15565973 16418898 17176740 18345505 19592849 20578649 21772080 23366816 25175881
7689 25175881 27205843 29112401 30552034 31176106 30533895 29114535 27627246 26529279
7681 26529279 25778741 25674235 26061454 26810466 27063696 26453367 25103632 23434439 21386821
7672 21386821 19487304 17830401 16551918 15463523 14700885 14092741 13608807 13340046 12950744
7663 12950744 12686593 12404358 12372680 12382296 12684758 12940343 12915384 13136250 13294650 13536633
7653 13536633 14603258 15698124 16398459 17111965 17204390 16698057 16116547 15212098 14357021
7644 14357021 13932413 13790481 13834516 13885123 14140648 13983094 13447084 12344117 11143580
7635 11143580 9925821 9200118 8597202 7711187 7206514 6892138 6639129 6173717 5933902
7626 5933902 5809751 5494710 5347442 5176137 4950954 4757836 4630558 4409381 4172246 4248786
7616 4248786 4049552 4107251 3995471 3745511 3776482 3857954 3497403 3309339 3286878 3068977
7606 3068977 3019392 3449390 3271011 3110835 2899665 2966661 2939913 2583377 2462913 2431657
7596 2431657 2524981 2687110 2790014 2749839 2679454 2602606 2637159 2639781 2890890 2930893 2870175
7585 2870175 2777634 3005187 3195162 3365505 3302059 2984774 2949483 2718977 2388772 2168647
7575 2168647 1982230 2008094 1957600 1966653 1889081 1844699 1523092 1421303 1630932 1609013 1537986
7564 1537986 1575677 1440395 1362480 1338180 1492939 1439477 1280223 1070118 878666 1064661
7554 1064661 1096676 1188841 1094399 1118683 1272725 1488323 1533279 1432136 1467712 1461303 1149204
7543 1149204 1074874 1171996 921511 921338 1014542 1095488 1082770 868580 798093 1071912 795216
7532 795216 724044 659653 508221 630095 658391 736556 699878 826266 874121 664197 830741
7521 830741 737320 862071 929963 911000 1065028 991527 1104514 944441 830855 970892
7511 970892 1050989 1029270 945100 776773 768999 763989 597474 679259 753408 645479 642880 636095
7499 636095 894734 789589 741402 821078 725564 845001 937458 908257 923085 876827 842949
7488 842949 589359 586595 738634 836046 722055 734020 811030 949236 717522 850812 684325
7477 684325 781745 677249 534699 493044 593403 400195 737072 1039229 866492 668713
7467 668713 564708 1074086 809608 455391 594321 643654 504876 756511 718980 774613
7457 774613 975324 829982 550477 765299 748038 882473 757536 526076 392292 463847
7447 463847 218435 68916 394320 557758 749891 818767 689890 411568 257641 345108
7437 345108 552121 543847 393056 496355 129441 163005 321449 390141 159966 52474
7427 52474 353299 212172 95977 268474 321085 430639 251726 230198 395902 437584
7417 437584 359827 211586 13190 196829 449628 281092 349758 301689 466212 456540 378804
7406 378804 269904 226617 427051 318752 261473 246057 357175 345797 210778 193715 336528
7395 336528 365011 226116 82738 140812 409125 401066 148620 201659 260949 257595 88473
7384 88473 32149 126950 111225 261548 224323 243184 171946 289474 235727 43702 222345
7373 222345 35959 -45724 -130762 81137 477261 253677 259827 198129 296072 184670 80546
7362 80546 67182 291930 260181 163140 262407 378466 400481 548154 661206 398493 359619
7351 359619 387794 448723 413197 412125 373601 222280 33660 118837 28452 -43961 37804
7340 37804 140557 337598 340472 237011 427832 14386 -123314 255419 171214 285369
7330 285369 -27739 -84577 64362 245608 401468 290882 68312 -17580 211600 435461
7320 435461 315521 75452 31690 255199 217026 142611 279919 350057 361283 226725 140662
7309 140662 331502 235789 361224 363336 286106 427538 335989 237164 -13490 65304 78583
7298 78583 157395 171355 312326 383068 105937 64571 54795 90548 -150352 4373 88681
7287 88681 75760 22705 -89227 53958 194297 388887 221595 89418 202291 116077
7277 116077 181595 397653 231348 55406 130719 53745 117648 193473 284284 310250 275103
7266 275103 308153 85541 330372 430100 186012 70306 203132 64489 75282 143909
7256 143909 189411 -1716 -7449 -13040 142004 143826 163378 517481 499380 368094 395564
7245 395564 218267 169637 308393 398319 199833 106838 367907 233325 103883 172352
7235 172352 312464 140503 84352 204541 248513 438712 193997 53495 164604 68494
7225 68494 36299 -112163 34999 170945 46280 7731 101190 -16289 141454 42319 -57560
7214 -57560 53991 -33183 -85529 -83911 46600 -102993 -89418 26017 164092 37379 29940
7203 29940 -41152 -114504 -142525 41959 -35338 -65439 -119466 -148294 179442 -34364 -107829
7192 -107829 -156269 -34751 -114912 -116880 -260361 -15474 96751 -58667 -182652 -31120
7182 -31120 -59821 -11951 -105452 -303371 -166171 -205172 -168780 -213597 30919 55979 -147959
7171 -147959 94138 264675 -47546 -20965 -117207 -86293 -31775 -76012 -20270 -139950 21996
7160 21996 100012 166455 -31799 -338461 -205825 -132084 -104779 -217245 -145743 -5302 -249337
7149 -249337 19560 -58845 -165719 68282 -128330 62258 61764 46570 76012 119116 -76099
7138 -76099 -120665 -72201 210678 237291 -108189 206561 231318 -192963 -353373 -214531 -93050
7127 -93050 -55683 -89073 -132189 -186688 -213929 -298129 -385399 -169007 56079 -93089 -184165
7116 -184165 9667 94313 -3265 -141791 -264074 59599 94912 48936 10533 31547 44881
7105 44881 -229556 -317688 -244802 -261457 -121010 -79282 -223242 57126 15401 -202363 -238294
7094 -238294 -223371 27651 -131873 -157027 -155158 -185517 -218057 -171617 -149771 23293 370336
7083 370336 121506 -202087 55176 -51346 -169701 -32399 -144847 27032 -77127 -133768
7073 -133768 172014 -24509 -151485 27826 -65242 140120 34824 35763 38412 16402 128859
7062 128859 104299 -24953 82090 -83165 61624 256821 252590 174757 -36815 -228095
7052 -228095 -139165 -78596 74765 216612 24276 49044 16270 170045 241936 134029 -46697
7041 -46697 55765 115375 52017 20090 44214 165442 -46521 -97668 90629 183969 173959
7030 173959 21018 60490 72701 294339 358771 219367 249124 91374 155798 143051 238764
7019 238764 334872 231468 39518 70153 118717 161866 107261 -54408 144747 274246 262345
7008 262345 168221 224323 -123823 -13459 32100 -105277 -54600 120075 158853 110563 89482
6997 89482 152754 -17877 172520 265803 278847 376172 322351 353358 177190 343948 441895
6986 441895 190593 132008 101275 160318 207956 253408 390502 278049 259396 395125 320001
6975 320001 146267 128476 121932 142589 150027 165774 103531 140302 179975 74106 118490 360946
6963 360946 287343 443861 390704 291870 77298 208043 126420 7754 89449 72401 142283
6952 142283 180867 265065 291725 242751 282315 304307 299147 229635 250220 394847 457069 217412
6940 217412 252012 264890 266718 612114 393897 328357 313484 425885 583996 543357 679179
6929 679179 824734 588767 409234 564941 664404 608578 727016 829679 669866 715014
6919 715014 972951 1038935 777477 594183 509609 610966 640299 547430 496447 527482 553805
6908 553805 228433 202350 304091 372767 146266 210710 254084 330035 417723 284048 251952
6897 251952 312619 475603 532329 685311 686550 430207 286631 360966 544390 488833 409959
6886 409959 565223 267201 173147 271656 276364 268976 207394 323887 420316 459210 97506
6875 97506 333857 521945 264834 379736 638214 622786 274160 106462 204489 325434
6865 325434 548585 464290 423988 650108 547108 575792 645600 696729 527692 537296 636695
6854 636695 774704 840521 906338 757356 655963 570965 590899 730860 693405 790925 329161
6843 329161 411958 475188 476878 585282 785073 855404 676669 608338 645711 574176 437174
6832 437174 420830 134673 -79193 60991 195283 62229 8056 105499 286016 65653
6822 65653 136216 330305 341844 304688 162544 241769 264351 250777 344577 258453 326770
6811 326770 408312 282111 90565 -69658 198518 341415 166068 237034 91277 106746
6801 106746 248815 253737 349327 175122 106938 182765 17419 -60666 86731 57011 -204852
6790 -204852 -1213 103014 287976 312088 7677 4117 80440 108550 55718 142093 376452
6779 376452 217306 93855 51433 100338 109184 155883 387450 302036 126059 59997 199887
6768 199887 17775 99158 195806 326921 319179 134959 337819 316125 414304 326292 147956
6757 147956 150944 231550 277095 239415 56685 142295 243270 370789 575421 358721 200832
6746 200832 314104 197218 269957 193048 312939 362940 234957 86755 281113 348386
6736 348386 377530 419091 283148 182066 200424 452746 165925 220323 239619 214981 219030
6725 219030 117445 142639 276225 80731 -144946 -73009 208397 479476 418157 47306
6715 47306 50172 -106277 243168 311918 187339 237792 292478 115036 306776 463540 311000
6704 311000 321594 419183 417228 433328 456182 580920 517284 550577 419615 526322 622091
6693 622091 673795 601619 615219 596432 796641 683137 727530 941564 662099 748813 916140
6682 916140 753791 553657 760955 900743 811080 724283 716550 455604 683305 494295
6672 494295 144908 194839 432415 437208 413467 355541 401297 584578 544441 350724 576125
6661 576125 336802 405950 448426 625294 476955 577551 602975 726871 674487 716860 927696
6650 927696 826157 983359 858546 864989 684861 622130 785265 657613 840557 1217963
6640 1217963 973236 881123 794564 815070 756481 669524 814763 707035 692793 629445 636955
6629 636955 687306 658957 695667 622124 429186 438321 580597 513670 431372 670572 618492
6618 618492 650230 508454 472499 460238 597603 456950 281300 263303 450665 611961
6608 611961 478946 484768 416419 594329 584855 649112 781188 645254 566973 485603 399550
6597 399550 384670 519902 664808 365817 370616 377809 381754 374866 302817 183002 232140 379756
6585 379756 405213 558483 344769 143268 443766 383001 374995 503652 507939 567292 497982
6574 497982 431722 420471 594033 611866 770834 487392 328856 331988 395038 443766 319066
6563 319066 353298 299924 547627 411002 394542 182968 151430 164985 362960 445750 544999
6552 544999 435028 552118 464028 265534 20055 297112 309524 243433 434021 482162
6542 482162 209539 499396 421460 212167 392291 286759 167086 402611 539778 525560
6532 525560 487518 496924 602010 582422 576534 328500 211808 255318 351278 371891 437102
6521 437102 390511 362513 420747 647805 339632 377481 524178 568115 377810 371857 519036
6510 519036 516410 393157 410820 443373 519666 539725 731308 764258 575438 555832 698589
6499 698589 474174 439243 782528 888386 783394 695822 581992 544989 542363 716425 758623
6488 758623 774582 626557 686350 842868 974277 888801 776206 636020 494122 416489
6478 416489 400592 532042 687811 653882 655467 526453 644037 862938 748651 753986 706695
6467 706695 668043 631164 631113 614830 541369 560056 690929 820606 867445 667772 470779
6456 470779 646685 701643 790986 868054 756922 649721 310151 171950 319866 590324
6446 590324 508602 401512 403090 313202 237974 422637 545563 548978 462293 580548 606155
6435 606155 284104 338555 447844 492842 485302 456415 590028 512045 438114 391618 228983
6424 228983 402930 495396 443094 239120 164520 219654 325111 307615 430689 536701 699904
6413 699904 734230 525830 622008 490303 360382 248359 465021 391041 507383 598495
6403 598495 663292 414883 446800 732453 618917 362566 289774 532151 308381 147818
6393 147818 420597 465958 510938 611134 647627 513771 485474 521420 506393 440990 536160
6382 536160 604843 609518 488110 314193 430397 525721 568542 499513 234090 311438 483968
6371 483968 554476 548037 665322 791977 662141 648295 609015 616247 603818 619889 728620
6360 728620 556678 567854 594512 575039 442737 486898 686750 679447 769854 645553 587069
6349 587069 776697 762142 459669 528628 500083 710797 770779 542833 769780 1007814
6339 1007814 911279 715058 587113 538342 625383 734350 854086 946992 803828 833369
6329 833369 980792 860041 809342 778023 739142 694876 791802 649225 660757 773859 672588
6318 672588 692739 751645 762229 720497 595090 680168 799036 670218 819309 881240 657637
6307 657637 492529 826619 701060 442332 499202 518211 434251 438397 585551 914877 664401
6296 664401 661898 755963 791424 788305 705603 780159 729795 809770 835418 683890 867908 1046120
6284 1046120 1165023 1229808 1255697 1165585 944321 918071 808745 725950 962967 1074755
6274 1074755 1144820 1023695 1030040 1150590 970336 922414 1187549 1306455 1130519 1131188 1072830
6263 1072830 889187 881648 724006 772097 1010547 1024065 1216855 1356408 1018094 1009097 1054355
6252 1054355 1126824 1373683 1269593 1153941 1039433 1044017 1235300 1438296 1460295 1522402
6242 1522402 1357896 1566454 1584003 1577238 1672518 1748800 1551162 1571192 1587849 1691414 1710346
6231 1710346 1667405 1881695 1821030 1849255 2126205 2097761 2092514 2064823 1848510 1843461 2224128
6220 2224128 2229537 2354513 2367496 2277345 2323797 2428632 2397178 2499061 2634722 2734211 2709579
6209 2709579 2504556 2760443 2943822 3162237 3102293 2924847 3117649 3315609 3323710 3433953
6199 3433953 3603212 3791942 3930325 4094972 4314415 4378530 4581530 4629809 4546766 4832731
6189 4832731 5273736 5146334 5414204 5745555 6101636 6356463 6399178 6599733 6964542 7386760
6179 7386760 7774425 8093702 8571103 9047821 9506072 9840561 10195599 10908927 11164617 11928810
6169 11928810 12668472 13581369 14299236 15220394 15819637 16717115 17496917 18274289 18903673
6160 18903673 19619512 20262852 20613444 21071014 21449250 21540753 21201032 21420850 21401317 20919618
6150 20919618 20095148 19385201 18590525 17836555 17146531 16290755 15659264 15155688 14514360
6141 14514360 13795199 13142199 12697631 12378429 12012857 11672298 11151457 10738042 10605822
6132 10605822 10407574 10229030 9969088 9890701 9907879 9701878 9678812 9538769 9165443 8909687
6122 8909687 8904574 8682844 8622677 8536320 8269070 7894567 7475032 7551753 7220818 6731476
6112 6731476 6529811 6274743 6172708 5877944 5730329 5464882 5165029 5215024 4886052 4523528
6102 4523528 4498360 4459529 4248830 4155293 4029013 3919195 3831716 3520398 3541102 3559013 3713903
6091 3713903 3875409 3712791 3187368 3204977 3205082 3274833 3295693 3112433 2923346 2647501 2739316
6080 2739316 2569631 2457657 2546777 2469386 2231787 2352985 2293875 2301433 2150664 1933822
6070 1933822 1954623 2128438 1992163 2026296 2056751 1966417 1678806 1616556 1867595 1858282 1571440
6059 1571440 1503993 1662564 1800949 1685195 1563382 1453620 1307904 1498194 1408581 1288287
6049 1288287 1271629 1423135 1470782 1370888 1508870 1323447 1188602 1162649 1181582 1245838 1162762
6038 1162762 1187328 1188232 1210568 1068453 1033365 1235904 1081238 964355 1040692 846455 879433
6027 879433 1240198 1163873 1033704 1108622 1232462 1118774 1288007 1325784 1170103 1122217
6017 1122217 946394 1001129 1089339 1217031 1290581 962666 1030118 1178086 1232199 1106589
6007 1106589 942531 960396 1036138 833436 905575 961481 867205 989475 850805 879388 979734
5996 979734 987716 915655 1044152 902694 894200 957992 838559 808071 826060 785431 950965
5985 950965 855708 842343 786439 849402 1022188 919367 764250 1053051 1162066 1060044
5975 1060044 1131652 1073868 852105 889567 1006613 826512 635383 800195 974712 700192
5965 700192 560275 660301 669324 599542 924571 854160 601488 746909 694459 911387 892635
5954 892635 757375 831795 568887 576366 723377 674377 635786 566998 735371 827489 827750
5943 827750 774733 850706 808498 818676 1009926 867012 796619 936767 803363 838758 868564
5932 868564 863157 767340 787942 809378 755839 926667 990630 898775 811281 952915 756454
5921 756454 592831 618552 608418 826195 865468 1041321 1069894 833172 730320 832974
5911 832974 935482 1044720 1190203 995256 838506 1003504 912376 1011701 1194058 933289
5901 933289 1014777 889641 740444 942577 886297 834165 1039864 994721 1139101 974205
5891 974205 959335 1101819 1025320 857890 893353 864229 833825 1077589 1088627 1012679 1104870
5880 1104870 886093 1107785 1183842 1046368 1020161 877609 845682 776318 696046 591993
5870 591993 776354 882372 932099 827837 772310 833650 753326 632889 776584 883640
5860 883640 935799 1054188 775300 772532 1081482 1134231 942198 798123 847121 767479 641956
5849 641956 663321 923376 1104948 824303 729703 798667 725306 790838 909402 674088 589263
5838 589263 799314 683632 782089 889684 1129071 1137978 1018642 1281250 1221455 856275
5828 856275 706037 932451 1034590 1081989 1126477 1003140 1041896 1015331 1135619 945845
5818 945845 851537 1017498 1007007 978340 790276 959430 969227 939493 810280 847581 1085947
5807 1085947 907908 676495 841195 922106 1014137 1100647 940269 836362 903820 900417 1147289
5796 1147289 1242766 991049 1082681 917770 1146629 1194829 1108120 1183191 1072094 1196097
5786 1196097 1287093 1373441 1307006 1370028 1358590 1372493 1416300 1471118 1385808 1351459 1529038
5775 1529038 1388771 1293486 1392333 1503829 1478468 1254955 1332678 1597916 1335700 1256484
5765 1256484 1250016 1456158 1575825 1651544 1595563 1550189 1568852 1728778 1673854 1624121 1693222
5754 1693222 1688061 1768760 1751633 1757411 1847621 1951324 1620085 1755466 1936885 2169604 2284740
5743 2284740 2243783 2152305 1934326 1954570 2092283 2339199 2196500 2348214 2464195 2386131
5733 2386131 2516883 2283197 2237918 2485071 2745032 2393781 2474043 2625524 2500133 2738352
5723 2738352 2799359 2755663 2618929 2726618 2772704 2993955 2995523 2926658 3025442 3198460 3314709
5712 3314709 3169004 3152691 3211743 3260440 3349617 3357362 3322360 3240720 3267461 3324137 3403691
5701 3403691 3371232 3588837 3517909 3572839 3562895 3672049 3633418 3895874 3835137 3979034 4399595
5690 4399595 4239925 4385326 4501875 4505369 4495749 4933476 5263541 5506090 5539767 5654113
5680 5654113 5868753 6336449 6689378 6957986 7165376 7567068 8019638 8174585 7837808 8017362
5670 8017362 7861359 7709957 7689021 7510953 7270220 7356462 7475738 7472473 7767896 7976738
5660 7976738 8034576 8062529 8325910 8650546 8796151 9481999 9696703 9884816 10622732 11027880
5650 11027880 11823230 12643893 13320576 14138668 14734901 15097539 15451263 15557742 15613311 15648081
5640 15648081 15474027 15446885 15575664 15579422 15872405 16376736 16911879 17268383 18014287 19161267
5630 19161267 20277234 21499002 23302331 25152927 26973453 28897791 30334522 30976104
5622 30976104 30954958 30199456 29232091 28014626 27057208 26350324 25463983 24977276 24543395
5613 24543395 24263632 24320475 24453540 24894349 25214276 25805673 26446303 27328872 28908021
5604 28908021 30260811 31841655 34111598 37120785 40156623 43875587 47725760 50372279
5596 50372279 51805271 50785937 47966851 44213030 40209498 36113530 32713212 30161586
5588 30161586 28166194 26546211 25046959 23858039 23090135 22632924 22139282 22085821 21791612
5579 21791612 21749797 22072056 22283093 22778374 23505147 24642579 25782489 27208596 28815831
5570 28815831 29941232 30165925 29629406 28384812 26395819 24010993 21893647 20308298
5562 20308298 18504411 17097596 16161372 15081173 14234090 13324954 12431630 11959743 11267845
5553 11267845 10729457 10150198 9686317 9262490 8951451 8787759 8830451 8637223 8326611 7923057
5543 7923057 7785984 7672880 7799711 7586788 7546926 7584616 7431261 7615045 7733060 7589006
5533 7589006 7758671 7834750 7524713 7450695 7115461 6819067 6687308 6382159 6128599 6056999
5523 6056999 5858477 5770688 5494740 5607758 5381647 5444383 5198453 5238070 5330776 5107830
5513 5107830 4925502 4897515 5221470 5248619 5196700 5163979 5230547 5569936 5423188 5516414 5466483
5502 5466483 5325767 5333230 5116680 5055227 4879865 4776404 4552702 4569140 4525088 4489202 4455790
5491 4455790 4180314 3926055 3851924 3938747 4011395 3975619 3906330 3942944 4380843 4319586 4037811
5480 4037811 3920955 4014416 3939293 3895783 4049364 4097908 4250178 4207681 4218753 4102899 4001638
5469 4001638 3939703 3788160 3807848 3618180 3713959 3679686 3596435 3540710 3721602 3537644 3473868
5458 3473868 3481867 3314360 3199537 3183097 3291791 3230563 3255807 3043639 3167478 3294837
5448 3294837 3496792 3227277 3577141 3893088 3966086 3558937 3486000 3579188 3599138 3620490
5438 3620490 3619633 3589393 3565662 3579806 3654466 3673526 3631299 3543675 3264564 3662979 3716521
5427 3716521 3646549 3459444 3386853 3419953 3413851 3514221 3700758 3649749 3835006 3651515 3529084
5416 3529084 3504175 3541217 3824687 3872425 3943267 4158559 4225949 4083616 4309221 4433165
5406 4433165 4516678 4705769 4795645 4908435 5069829 5172933 5266520 5442936 5418011 5220999
5396 5220999 5615461 5558073 5621780 5806079 5817272 6095588 6221546 6522825 6591588 6688221
5386 6688221 7004485 7384947 7788416 8351427 8212733 8111996 8278983 8294976 8177106 8112481
5376 8112481 8041413 8099273 7854055 7868235 7916358 7782728 7837122 7679503 7648873 7711216 7792949
5365 7792949 7980656 8313683 8374543 8381506 8638420 9041531 9287395 9647197 10291924 10531665
5355 10531665 10989275 11068061 11122096 11401561 10984376 10942383 10943850 10328608 9888156 9237252
5345 9237252 8683649 8453125 8160398 7918961 7972883 7828480 7589887 7440479 7113293 6980485
5335 6980485 6932495 7050652 7008142 7217969 7111694 7176755 7045227 6987801 7262209 7420482
5325 7420482 7941688 7909131 7600159 7487161 7144888 6876369 6551804 6389786 6102674 5737642
5315 5737642 5728334 5528262 5227882 5267491 5131196 4959544 4710303 4198223 4249595 4102067
5305 4102067 4036482 3803340 3915488 3929131 3657686 3672836 3725276 4017859 3916894 3963403
5295 3963403 4036242 3825512 3693053 3470044 3468186 3661606 3658498 3693832 3835441 3992639 3793791
5284 3793791 3709943 3617309 3828130 3680670 3667936 3458208 3539711 3603359 3497618 3342528
5274 3342528 3193964 3242770 3278762 3253247 3359783 3261615 3150644 3235247 3216404 3167177 3039979
5263 3039979 3285880 3296616 3099538 2916514 2986718 3020193 2918178 2905021 2724539 2744331
5253 2744331 2716409 2687484 2714367 2787093 2722799 2697009 3032566 2799886 3082623 2965880 2786626
5242 2786626 2407316 2509590 2697954 2769759 2918598 2956861 2920711 2782670 2973640 2811726
5232 2811726 2704958 2579394 2804871 2835949 2909151 2792294 3016686 3204315 3045352 3110979
5222 3110979 2837901 2835275 2880437 2967319 3184636 3020848 2862908 2890583 3009091 3034411 3048517
5211 3048517 2887057 2677210 2932632 2956122 3042261 3144978 3241882 3293267 3187928 3064113
5201 3064113 3123454 3290460 3192082 3361278 3200839 3046298 3432443 3605064 3371831 3397032
5191 3397032 3579934 3613209 3603194 3559616 3669048 3675182 3787138 3843024 3753048 3911747 3862949
5180 3862949 3848404 3882603 3868960 3860922 3813280 3967339 3770573 3828100 3753870 4012500 4151281
5169 4151281 4228580 4425351 4197810 4392740 4569372 4525315 4657308 4798942 4949568 5014307
5159 5014307 5022201 4963330 5027064 4675904 4549407 4777372 4814912 4258543 4154755 4302587
5149 4302587 4477631 4533465 4497493 4616669 4696981 4672464 4719818 4914129 4856488 4760558 4955571
5138 4955571 5172378 5189123 5440461 5694911 5743300 5771517 5767958 5763565 5889249 5916030 5977989
5127 5977989 6112165 6311779 6358360 6506406 6429160 6635566 6610687 6339510 6012510 5923287
5117 5923287 6066126 6279554 6193640 6088886 6420888 6464000 6632416 6723139 6838405 6738676
5107 6738676 7036099 7382665 7326494 7661122 7935043 8227801 8356150 8704743 9120514 9736629
5097 9736629 9905026 10561230 11035776 11068079 10606098 10074892 9590566 9390140 9329501 9141246
5087 9141246 8843481 8746793 8800890 8922702 9095362 9218447 9552375 9486243 9755780 10007604
5077 10007604 10235320 10520926 10667895 11031786 11665858 11992702 12411422 13132526 13664891
5068 13664891 14363478 15151295 15567336 15406999 15288255 15225424 14959465 14659127 14583506 14486085
5058 14486085 14640449 15156417 15557475 15920803 16102187 16374381 16809104 17345453 17892822
5049 17892822 18432721 19290330 19938602 20280858 21160729 21732380 22668932 23607236 24656767
5040 24656767 25675201 27006860 28850955 30326121 31933894 33560309 35695866 37862303
5032 37862303 39576977 41069350 42269792 43665752 45456287 47549011 49646416 52094077
5024 52094077 55027031 58326772 61882085 65790062 70216853 74784890 79588826 84861838
5016 84861838 90195091 95650051 101596996 107253042 112722312 117906707 122091276 123767207
5008 123767207 122830838 119836891 115478431 110584047 105353656 100025161 94616800 89426200
5000 89426200 84040448 78708796 73487024 68740136 64547565 60519624 56846445 53549904
4992 53549904 50407748 47910810 45880961 44204719 42985901 41951239 40926523 39220723
4984 39220723 37048126 35043657 33006107 30779712 28938298 27547806 26076724 24837044
4976 24837044 23771346 23194561 22320670 21805511 21239301 20373109 19839617 19274180 18491987
4967 18491987 17909885 17750959 17162477 16440535 16388230 16136260 15863439 15519531 15180011 15201009
4957 15201009 14965762 14549126 14449108 14476564 14277153 14183419 13990887 13779542 13668199 13630970
4947 13630970 13374437 13207021 13104349 12778432 12837344 12639063 12268348 12320613 11975477 11931001
4937 11931001 11964025 11737214 11936009 11909215 11864467 11671452 11455830 11736367 11796507 11590928
4927 11590928 11381247 11215768 10831149 10575673 10612596 10541994 10311661 10325820 10317639 10160417
4917 10160417 9861213 9868785 9837309 9515934 9304427 9354922 9407301 9495174 9647416 9683547 9455649
4906 9455649 9393962 9383831 9407325 9503684 9299661 9270288 9449392 9453024 9496573 9369586 9543712
4895 9543712 9678425 9789369 10000512 10233822 10710761 11235223 11442372 11767678 12498926 13148232
4885 13148232 13792656 14896024 15732620 16762145 18289031 20036250 22456230 25617186
4877 25617186 29162806 33943666 36211725 33727781 30034950 26329756 22188368 18932018
4869 18932018 17007736 15368768 14479239 13605553 12787679 12091273 11495510 11057017 10655523
4860 10655523 10337483 9998010 9632460 9381312 9190797 9041574 8905939 8952341 8861764 8574502
4850 8574502 8308250 8309462 8139045 8170451 7992175 7696638 7670711 7430492 7529135 7343411
4840 7343411 7374365 7269071 7217777 7335650 7091412 6932531 7031612 7083388 6712565 6715687 6729915
4829 6729915 6994283 6744333 6667040 6570877 6231164 6230773 6335253 6367019 6396380 6401970 6525647
4818 6525647 6481152 6312754 6144538 6298249 5984324 5979757 6417824 6349412 6222651 5968090
4808 5968090 5854066 6136247 6200387 6011071 5922477 5843119 6155822 5845736 5849407 5890072 5810644
4797 5810644 5654711 5635765 5685122 5673067 5731991 5606015 5471929 5469893 5615151 5651979 5608081
4786 5608081 5672010 5667877 5571046 5455887 5196413 5251377 5600119 5720164 5540980 5419144
4776 5419144 5410822 5503831 5467574 5507681 5472724 5515452 5588192 5612497 5805318 5603450 5612500
4765 5612500 5547314 5461864 5502188 5341634 5587305 5484255 5489626 5384137 5078681 5281093
4755 5281093 5335598 5021346 4933164 4977668 5093424 5123042 5086750 5197886 5046372 4953715 5131280
4744 5131280 5075524 4932547 5122296 5234263 5179590 5126537 5048891 5263667 5024786 5070693
4734 5070693 5176163 5207163 5387672 5347063 5302073 5122983 5201115 4942118 5043772 5121799
4724 5121799 5046526 4942409 4777258 4902510 4983312 5070830 5174722 5005761 5068366 4732047
4714 4732047 4775560 4644301 4647875 4519847 4358999 4454373 4671829 4651521 4537683 4272404
4704 4272404 4131863 4344153 4354399 4394902 4261744 4267329 4219473 4393798 4438958 4316930 4293060
4693 4293060 4371406 4408878 4283816 4265714 4206378 4264104 4403172 4247293 4088248 4016079 4334906
4682 4334906 4280752 4110751 4254354 4214759 3986223 4176838 3977198 3985677 4348483 4449467
4672 4449467 4438042 4488823 4237655 4033770 4129531 4038906 4209923 4372603 4520991 4195629
4662 4195629 3929300 3954407 3805145 4070876 4194071 4097831 3941983 4030222 4086849 4140076
4652 4140076 4019673 4026122 4166448 4142384 4236165 4293807 4102122 4310052 4261006 4388894 4365962
4641 4365962 4276270 4414891 4074367 4187467 4266031 4209201 3878305 3794074 4040911 3813205
4631 3813205 3817515 3993652 3975225 3691296 3716185 3792680 3725146 3707619 3676780 3483260 3403876
4620 3403876 3532599 3545524 3536125 3534329 3570238 3565654 3629572 3492043 3427805 3522152 3309701
4609 3309701 3242499 3501469 3510883 3590298 3598744 3705916 3587448 3551237 3519438 3505366 3528808
4598 3528808 3705855 3750038 3682368 3746596 3761909 3807049 3807509 3790900 3687508 3929723 4022618
4587 4022618 3788640 3831978 3854315 3984814 4000664 3901820 3747279 3876330 3923665 4104479
4577 4104479 4154678 4038060 3807377 3914615 3944138 3906335 4286629 4289715 4160310 4097971 4256900
4566 4256900 4262302 4300731 4210731 4409367 4839727 4836859 4768772 4497917 4456040 4318283 4359432
4555 4359432 4420210 4376055 4303512 4430009 4323832 4153360 4282645 4328067 4554921 4609584
4545 4609584 4659239 4469755 4302227 4323124 4281601 4589138 4715472 4483436 4640777 4674633
4535 4674633 4620158 4771774 5110614 4984849 5048092 5017168 5000728 5164894 5086056 4851568
4525 4851568 5001221 5372214 5386457 5319693 5327252 5312735 5466263 5466183 5476586 5631649 5910637
4514 5910637 6197166 6321706 6166433 6386347 6538177 6536467 6820169 6977077 7226707 7420563
4504 7420563 7527601 7744762 8028142 8020519 8268796 8752448 9190915 9332241 9737169 9802533
4494 9802533 9746188 9714416 10071463 9934337 9677488 9800518 9663648 9797710 9826431 10132371
4484 10132371 10280835 10284495 10573256 10842990 11080792 11365112 11617326 12071301 12639717 12889659
4474 12889659 12947547 13232368 13527291 14091506 14490476 14958253 15374192 15818030 16269646 16939587
4464 16939587 17292980 17500089 17874962 18073920 18395377 18578919 18697005 18981560 19104853
4455 19104853 19438945 20095931 20538778 21046152 21359489 21722911 22418429 22802893 23221213
4446 23221213 23803450 24667611 25486782 26054015 26654255 27463881 28171630 28875918 29803127
4437 29803127 30837720 31586006 32383063 33278353 34235593 35322371 36367470 37734536 38744139
4428 38744139 40068318 41624043 43201367 44534568 45940118 47569636 49293204 50859901
4420 50859901 52688462 54687878 56336925 57692773 58980463 60262370 61451534 62765238
4412 62765238 64436544 66299398 68206471 70233642 72165455 74359946 76842128 79322069
4404 79322069 81571155 83539648 85083929 86690883 88032774 88678602 89507767 90317540 91208916
4395 91208916 92192804 93244120 94089528 95349913 96218483 96249275 95885007 94353727 92207095
4386 92207095 89785108 87366476 85092347 83868913 83005644 82769509 83421548 83956174 84848246
4377 84848246 85846683 86002973 84946584 82226302 78223148 73604100 68550947 63315799
4369 63315799 58756128 54722703 51016935 48103146 45744323 43875143 41752243 40255010
4361 40255010 39106939 37701508 36560609 35810802 34812776 34104052 33564995 32633406 31625351
4352 31625351 30625863 29490859 28245444 27249068 26433023 25436269 24388950 23385474 22755600
4343 22755600 22453856 21776597 21078580 20636541 20000114 19169354 18645162 17885871 17373134
4334 17373134 16692139 16012099 15772815 15516161 15187266 14679053 14428288 14065176 13745689
4325 13745689 13510951 13436891 13034957 12764635 12820910 12371250 11897187 11952030 11688026 11550721
4315 11550721 11319644 11227037 11094328 10829128 10633496 10599169 10539720 10509249 10387464 10353824
4305 10353824 10354597 10257382 10433948 10535415 10402235 10294943 10198135 10433314 10616446 10538944
4295 10538944 10888261 10707038 11085780 11505413 11681009 11764006 11731393 11353338 11586613 11547835
4285 11547835 11437220 11286614 10980050 11040342 11078680 10962217 11117661 11246916 11185864 11194013
4275 11194013 11443142 11680698 11707711 11775957 11793076 12038013 12157347 12410589 12787748 13267235
4265 13267235 13714613 14024744 14400896 14670156 14925088 15232404 15392413 15070287 15029542 14807462
4255 14807462 14804104 14653815 14259956 14015044 13849702 13625266 13564080 13368277 13115751 13186427
4245 13186427 13094296 12772103 12726023 12724354 12707106 12869448 13260208 13314682 13512794 13657746
4235 13657746 13494158 13880510 13944990 14251217 14287038 14462320 14528010 14442033 14427432 14413250
4225 14413250 13983691 14002355 13966623 13782012 13732953 13608729 13421343 13549603 13407766 13447669
4215 13447669 13512866 13250570 12938946 12928540 13197061 13120251 13154690 13111936 12851407 12921362
4205 12921362 13074235 13092628 13231828 13308621 13506643 13571181 13898960 14047274 14276356 14533855
4195 14533855 15131198 15294253 15333103 15628357 16104941 16696483 16951206 17338327 17941988 18142319
4185 18142319 18368664 18762574 18966854 19206047 19513782 19936376 20454274 21058952 21587001
4176 21587001 22235141 22956071 23872925 24834353 25929517 27172482 28484325 30063674 31928004
4167 31928004 33687665 35498571 37919118 40742968 44135070 47645309 51584162 56344034
4159 56344034 61689530 67572746 74381236 81964981 90314058 99847037 110045597 120951581
4151 120951581 132096372 144560508 158105431 171967294 181919258 182631975 175043384 163013023
4143 163013023 149226913 135815044 123630051 112640994 102494316 93323220 85087393
4136 85087393 77900190 71431167 66076554 61393104 57370692 53761736 50807506 48271564
4128 48271564 45903996 43907388 42253529 40894702 39189098 38169105 37177454 36211939
4120 36211939 35430715 34757440 34010705 33537836 33157174 32943829 33102672 33211744 33429965
4111 33429965 33905392 34219412 34431141 34600278 34392281 34544706 34542136 34475043 34487836 34718076
4101 34718076 35104630 35705109 36429791 36996439 37582161 38115834 38836961 40146608 41493464
4092 41493464 43125624 44896779 46505075 47791709 48021934 47360356 46330169 44851047
4084 44851047 43288260 41680533 40661174 39967186 39223246 39099784 38950802 39463811 40201787
4075 40201787 41325656 42515838 43894054 45842149 47524748 49043789 50800565 52501593
4067 52501593 54425358 56673108 59481896 62437381 65577958 67353508 67169744 64732725
4059 64732725 60733537 55986684 51318659 46869973 43128483 40446279 38324992 36628161
4051 36628161 35221174 34322948 33602108 33449745 33305631 33213593 33557863 34039822 34744749
4042 34744749 35448783 35785085 36286244 36960662 37829111 38620085 39290330 39757475 39552776
4033 39552776 38461914 36395563 34158979 31728080 29432753 27397737 25593158 24052918
4025 24052918 22986322 22043107 21433883 20766862 20199787 19752299 19510776 19038766 18586306
4016 18586306 18452675 18153320 17898252 17798448 17655878 17444422 17057821 16944891 16835005 17033186
4006 17033186 17314675 17429687 17407375 17299925 17618247 17999359 18229628 18844180 19696191 20361935
3996 20361935 21236266 22268076 23372425 24774825 26247867 27732987 29367395 30913865
3988 30913865 32609537 34636991 37566845 40763671 44891834 49246552 53491708 55772186
3980 55772186 55149679 52303993 48225273 43833945 39858877 36615276 33884818 31859026
3972 31859026 30440641 28865421 27941505 27133680 26402573 25671379 25164560 24717355 24210145
3963 24210145 23670368 23256274 22749251 22480228 21920266 21543427 20930513 20323259 19974055
3954 19974055 19425794 18650963 18104770 17767485 17085779 16777232 16548943 16337795 16103525
3945 16103525 16095312 16082217 16012242 15876394 15826033 15689858 15698469 15573899 15569486 15784706 15740194
3934 15740194 15651315 15668062 16067010 16390127 16634777 16851759 17098784 17383864 17764800 18135854
3924 18135854 18420618 18536503 18582306 18839671 18964553 19352336 19326932 19633802 19885051 20200973
3914 20200973 20672072 21216740 21691588 22601053 23370196 24440189 25320028 26541593 28031208
3905 28031208 29613440 31389964 33439687 35875508 38519163 41323588 42966469 42435533
3897 42435533 40467441 37713506 34620439 32050787 29770111 28419936 27200601 26141026
3889 26141026 25173831 24716732 24181483 23989527 23895291 24110070 24561908 25172020 25717924 26612904
3879 26612904 27601329 28906853 30334033 32332474 34337514 36558203 39070552 41756172
3871 41756172 43797313 43523580 41521508 38376467 34715730 31496594 28789001 26487929
3863 26487929 24952692 23676875 22475113 21662967 21107483 20428203 20122534 19973664 19850361
3854 19850361 19298741 19214437 19209680 19306345 19408352 19903512 20288754 20426536 20286840 20147404
3844 20147404 19438975 18587325 17783866 17260896 16700719 16552617 16209092 15949708 15699150
3835 15699150 15503022 15111589 15198714 15141907 15120044 15004613 14547441 14552123 14632658 14709872 14618747
3824 14618747 14536038 14316164 14414465 14243318 14372965 14239471 14408953 14421780 14517414 14715217
3814 14715217 14815971 15274942 15114165 15420716 15649294 15754404 15964282 16257773 16410524
3805 16410524 16568185 16973858 17243918 17655418 18008077 18413062 18420551 18659528 19175402 19258694
3795 19258694 19351449 19600172 19721167 19940632 20210114 20769428 20946697 21331905 22027369 22507044
3785 22507044 22939066 23651967 24480100 25159032 25779057 26567155 27263272 27751144 28133049
3776 28133049 28452229 28529910 28845785 29265116 29518471 29873159 30248362 30457386 30513186 30955991
3766 30955991 31376611 31874488 32267948 32788481 33303127 33758931 34434146 35058087 35666167
3757 35666167 36181769 36752951 37321632 38179714 39131433 40040513 40808686 41646656 42598479
3748 42598479 43962588 44890221 45711728 46737965 48108607 49433110 50541330 51774619
3740 51774619 52819729 53984954 55123645 56566164 57938193 59051267 60541541 61983911
3732 61983911 63262650 64429533 65955666 67403208 68753553 69979491 71425469 72897237
3724 72897237 74449304 75901393 77600808 78968394 80260135 81795808 83489464 84680593
3716 84680593 85707245 86737129 87686410 88765604 89619623 90355633 91007147 91402808 91985670
3707 91985670 92463196 92439829 92533290 92589919 92309074 91835447 91215352 90409571 89639867 88785675
3697 88785675 87809087 86771105 85694477 84815437 83572939 82283026 81211827 79765257
3689 79765257 78348695 76838724 75517578 74093552 73127069 71631601 70320565 68883776
3681 68883776 67379091 65645424 63722165 61593202 59684668 57763601 55953524 53968497
3673 53968497 52238166 50685077 49280799 47828306 46179040 44445399 42837207 41314621
3665 41314621 39736994 38126887 36626125 35417402 34156870 33065818 32025407 30840789
3657 30840789 30099429 29303203 28381481 27982211 27536073 27098329 26389049 25752576 25151750
3648 25151750 24725285 24470762 24144096 23800120 23823624 23511737 23341877 23353887 23051052 22987208
3638 22987208 23134667 23173244 23058796 23266033 23211264 23182213 23358316 23305268 23331841 23043813
3628 23043813 23048868 22869145 22736063 22458830 21992473 21822690 21730214 21575902 21379233 21289786
3618 21289786 21114901 20716034 20294414 20224941 20038380 19972366 19752817 19527977 19274117 19449855
3608 19449855 19432441 19439964 19450949 19554025 19604247 19825761 19952270 19976379 19794446 20010055
3598 20010055 20116516 20552614 20847834 20839377 21201783 21582565 21715532 21847691 22367206 22698794
3588 22698794 23011462 23423676 23990199 24321626 24661310 25059612 25601423 26246628 26973285
3579 26973285 27428441 27955176 28687176 29442421 30085460 30725836 31448904 32384055 33016394
3570 33016394 34286819 35531175 36814851 38160759 39561620 41175721 43338721 45366319
3562 45366319 47704432 50253472 53030191 56289153 59797394 63654202 68155671 73364590
3554 73364590 79264279 85657997 92658012 99866496 107716231 115629452 124148086 133500256
3546 133500256 143481750 154351525 165514894 177168975 187967967 196883870 203397292
3539 203397292 207163215 208277243 207305097 205122269 202165841 198954431 195844550 192901660
3531 192901660 190528019 188103392 185374755 181676452 176218001 169363614 160328523 149776911
3523 149776911 138689599 127345836 116573655 106852489 98661704 91341821 84944219 79739047
3515 79739047 74859935 70468427 66851871 63699520 60865246 58241654 55962241 54042345
3507 54042345 52321284 50784524 49453098 48186406 47197623 45984513 45085504 44365773 43801008
3498 43801008 43019916 42434268 42075606 41929901 41711080 41474599 41189139 41097098 41324560 41521815
3488 41521815 41748298 41952925 42255801 42792537 43521013 44156497 45164056 46319458 47464302
3479 47464302 48616725 49999167 51357578 53103507 54658673 56232829 57635932 58881020
3471 58881020 59919340 60567370 61142976 61775047 62303959 62420092 62689499 63281633 63335222
3462 63335222 63460002 63629357 63912591 63864348 63297156 63223331 63036782 62697640 62256018 61745352
3452 61745352 61835067 62015397 61992635 62576922 63058278 63660120 64242990 65238187 66115225 66963960
3442 66963960 67581583 68572621 69365070 69900449 70563559 71509946 72388783 73480246 74397177
3433 74397177 75525074 76645025 77506465 78135270 79227247 80264688 80883573 81803480 82775725
3424 82775725 84211345 85554083 87151584 88875616 90810089 93119625 95273195 97222274
3416 97222274 98971480 100179404 101586846 103261322 105240133 108079193 111557044 115301061
3408 115301061 119612391 124157743 128955504 133574534 138883904 144789511 150878887 158076805
3400 158076805 165671787 174026391 183358729 192974856 203105724 212625738 220407416 225809291
3392 225809291 229167752 231206277 232951008 234762749 237376756 240781486 244493939 247969103
3384 247969103 250906685 253053863 253389554 251860374 247972286 242222992 235062561 226985172
3376 226985172 219389115 212286783 205658830 199361741 193479922 187867006 181734703 174920489
3368 174920489 167466802 159731727 151421399 142703956 134450582 126523252 119373834 113105991
3360 113105991 107560154 102465922 97963821 93956095 90153357 86529138 83421555 79937519
3352 79937519 76890630 74276548 71752734 69291202 66944014 65319329 63466081 61779927
3344 61779927 59881592 57933520 55827981 53824504 51883815 50002082 47994515 46184434
3336 46184434 44748847 43527084 42440039 41222700 39830846 38522933 37301261 36250885
3328 36250885 35249741 34266464 33467907 32836934 32300160 31105372 30231091 29768253 29014937
3319 29014937 28293841 27492464 26969785 26071076 25222765 24568287 23824883 23191917 22540342
3310 22540342 21843581 21258674 21047439 20488821 19985711 19521517 18961943 18140805 17736961
3301 17736961 17173578 16758884 16131256 15687983 15341853 14857402 14400969 14151235 13779507
3292 13779507 13498698 13373665 13233517 13072730 12495735 12183108 12038066 11983087 11649846 11570603
3282 11570603 11360084 11130458 10775939 10654823 10500253 10432216 10099419 9865831 9988335 9971602
3272 9971602 9724136 9526163 9598800 9250487 9143171 8777121 8548184 8436792 8210496 8214837
3262 8214837 7822360 7602725 7846650 7712783 7252698 6974388 7107034 7115173 6817179 6839808
3252 6839808 6642954 6411398 6455115 6174522 6015077 6010705 5760407 5709936 5687292 5813365
3242 5813365 5766162 5628229 5359016 5193290 5101281 5087990 5066353 4948394 4870522 4848492 4932270
3231 4932270 4851583 4795420 4815450 4567642 4611005 4614374 4484808 4425010 4236181 3999617 3910122
3220 3910122 3877692 3846338 3802917 3842136 3968293 4066129 4001618 4077991 3869615 3947566 3934787
3209 3934787 3827406 3996229 3660909 3553237 3410478 3635218 3704436 3555323 3455253 3360325
3199 3360325 3315941 3349929 3378752 3338701 3463766 3529679 3453936 3538115 3652539 3716191 3530137
3188 3530137 3412596 3232383 3148981 2897116 3039524 3023214 3163561 3364813 3122860 3276547
3178 3276547 3296881 3260447 3240451 3202826 3292403 3025429 2904395 3227662 3126314 2911040
3168 2911040 2999585 2985327 3004139 3011986 2985740 2925586 2853111 2697971 2690849 2803249 3051565
3157 3051565 3167932 3095605 3046152 2884145 2929661 2995899 2925343 2979566 3072486 2955509 3041430
3146 3041430 3023113 3071767 3006161 2833969 2870801 3072708 3043538 3103504 3054310 2978124 2988626
3135 2988626 3121935 3089741 3095900 2958041 2913313 2995285 3205802 3225177 3322811 3410299 3541873
3124 3541873 3597635 3488419 3486164 3529681 3309582 3349541 3457174 3416580 3494245 3346645 3422010
3113 3422010 3377344 3464279 3560547 3523342 3429990 3336489 3362272 3346855 3448938 3336458 3461648
3102 3461648 3625940 3560739 3827953 4097996 4366855 4505548 4603361 4626651 4925462 5568539
3092 5568539 5822157 6507902 7190063 6882089 6493877 6026829 5411339 4944347 4797345 4339072
3082 4339072 4291920 4040527 3768590 3521798 3724785 3680884 3641555 3875717 3802116 3804866 4122480
3071 4122480 4142113 4463478 4604340 4842924 5447783 5830722 6321881 7178038 8187778 9409188
3061 9409188 10114035 9715557 8538237 7471222 6364402 5372424 5179113 4734187 4136984
3052 4136984 3625567 3328967 3169801 3190415 2953004 3032109 3175416 3148383 2955592 2939900
3042 2939900 3016311 3253688 3228206 3313186 3362664 3717215 3938601 4170566 4736705 5272738
3032 5272738 5417541 5221767 4859060 4253903 3547797 3192824 3133579 2727445 2577970 2371758
3022 2371758 2197208 2034627 2086336 1970682 1818057 1744680 1681929 1804217 1819558 1818578 1756913
3011 1756913 1696300 1495920 1440213 1244705 1200623 1218039 1150204 1074136 1135417 1224512 931984
3000 931984 986022 863726 854244 1101303 1024984 1006103 1153032 1158454 902282 1105672 1123103
2989 1123103 868847 873299 850377 918800 825983 731806 929925 899132 720528 858452 924986
2978 924986 927364 880359 800251 809654 935679 934266 765081 823832 1046416 870504 875738 947458
2966 947458 943878 927889 900983 832326 678681 875282 938445 927444 840572 810269 947057
2955 947057 946419 793011 575039 676931 855449 798254 826679 525012 576922 504907 535034
2944 535034 388624 371973 512510 478609 621423 666607 662032 617636 634099 675290 609732
2933 609732 573670 416684 616546 606737 554620 655430 501823 280322 349144 607921 707426
2922 707426 568653 519179 362369 503698 764251 437414 405235 639551 750073 583400
2912 583400 545804 627195 756517 600208 493667 423176 518796 563190 599932 644126 844296
2901 844296 822993 400740 332609 386712 457070 674519 698303 579663 334167 322432 229094
2890 229094 248881 295396 294884 272909 440271 417145 521310 347133 423502 524013 582121
2879 582121 643738 594195 472537 770724 842815 800137 562445 320009 487932 532393 611503
2868 611503 810590 718116 450951 501836 433787 482665 338234 529899 663817 590279 448495
2857 448495 530807 435322 631179 689567 534395 445126 418190 402316 410755 641416 531399
2846 531399 569687 795164 653492 758127 843536 813748 814747 662842 653434 467394 403387
2835 403387 418637 413227 311740 287134 220454 415219 312811 182025 475806 490497 542306
2824 542306 367716 259998 423289 483966 507691 810706 622038 323879 547283 706916
2814 706916 398674 564312 543347 485902 558558 661651 644314 518107 483650 427591 593634
2803 593634 344103 276278 513459 459801 382160 290318 177112 189990 520336 610589 538170
2792 538170 848057 768553 526562 288842 488110 654753 646443 760110 810594 874368 949830
2781 949830 691085 522273 762378 567076 662456 600490 640304 652280 861281 900581 721730
2770 721730 658738 761550 715012 897253 631145 465958 632564 470791 509677 605762
2760 605762 668353 477362 738568 867684 753399 618353 653313 468945 505396 641633
2750 641633 782991 942729 903074 988792 847107 544495 869136 1103504 1194373 1203811 1375579
2739 1375579 1378319 1115145 1014162 671946 747059 878218 966641 973135 716684 729810 820188
2728 820188 707528 536415 377257 521961 698602 390140 461153 741110 850594 823760
2718 823760 724211 590760 417478 513972 544186 776539 704049 635197 717527 639537 425626
2707 425626 403806 369576 289616 439299 146529 290357 358645 366933 177519 203585 27280
2696 27280 -23462 -2471 190285 228275 92291 50712 45085 397878 451570 322778 125142
2685 125142 384459 358608 298162 170035 -15510 17244 -46616 167042 330706 438069
2675 438069 353624 365318 314710 276631 139499 136498 17002 -68112 83476 -22255 -126086
2664 -126086 -74046 -8207 -14071 116089 -179117 -101860 -19302 -7954 -73245 -206277 -128781
2653 -128781 25141 170524 -10743 1651 98378 208665 153351 80118 85928 -103003 -76174
2642 -76174 -6083 -130603 -65527 23779 253245 346808 109879 128159 -111940 36778 129738
2631 129738 203380 134069 103146 -128928 -189743 -133595 -38645 -145594 -175984 -121987 11223
2620 11223 124546 11612 137196 -16454 185318 311331 124948 332762 247875 22966
2610 22966 -38728 146029 313656 -17868 -200350 -232315 -279003 -291798 -101084 14262 -94222
2599 -94222 -18907 169308 60458 -227101 -85004 172000 55148 311409 327296 154199
2589 154199 66687 94991 84197 137118 269788 -2211 64666 144267 -79936 -138403 -131676
2578 -131676 36586 -157912 -40262 115102 111977 190422 136639 57812 -23737 12877 -8574
2567 -8574 70237 134894 -72092 143426 189871 11875 93849 47467 -245759 -274656 -168479
2556 -168479 -208792 -159898 -130359 62515 109563 175030 169684 145182 98920 46701 -128263
2545 -128263 -95431 109373 -51579 102702 77368 -52991 63884 40652 -179913 -33667
2535 -33667 141227 16207 -38618 -116090 -39880 -92584 137242 88398 87633 275129 200401
2524 200401 89025 183321 153054 104482 85694 -113183 -109908 -104609 -55690 -317399 -163490
2513 -163490 27673 118381 155564 156088 197880 67581 -19799 102905 476793 263782 -49353
2502 -49353 -49689 31239 90854 171386 178939 104117 -11838 54625 -41619 11897 156014 -88043
2490 -88043 -307334 -177253 -223767 -286623 24495 -30715 -62669 -261614 -304563 71332 163090
2479 163090 -8162 212868 62411 -224747 -212130 -94934 16656 69315 2343 -76288
2469 -76288 -168542 -241409 -145775 -127206 2016 14059 -95298 -227416 -311854 -143044 923
2458 923 39992 123741 14841 -2577 100631 179766 68795 13809 82093 79048 131864 105410
2446 105410 -49115 125547 -31825 99154 222954 80360 83449 79551 155962 -239903 25716
2435 25716 154028 380769 310806 -178963 -59646 124540 130352 7487 149922 -29820
2425 -29820 -76690 -30684 87926 -152281 -292014 -170496 -88409 -144836 138453 122439 101960
2414 101960 204030 136821 26961 -143181 57833 61164 111683 257103 223205 -35091 25858
2403 25858 -62027 121676 155570 41751 192351 -61834 -85150 -46552 -41071 -71658 -16668
2392 -16668 -22256 -17009 59974 125847 50584 -23359 363209 317540 -115678 18222 124347
2381 124347 -15467 22679 -54724 -222272 -220356 -150784 -174782 101430 -44331 -68589 -19956
2370 -19956 -146376 11717 -25329 1022 -165789 -172212 109541 -108809 -47069 -28015 -183788
2359 -183788 -310617 -97013 46502 21563 -79292 -87204 -120663 -284551 -177375 -73768
2349 -73768 6786 -25668 226880 142313 111312 227047 66549 -51321 26185 120780 101716
2338 101716 1908 -199553 -57861 -245632 -181988 -115073 -260154 -200346 -88820 -49579 20911
2327 20911 4195 -106295 -80176 52712 -46859 -37829 79959 140721 193338 277290 254170
2316 254170 199286 157907 -217002 -268430 30469 6469 24178 104584 235810 444928 335914
2305 335914 304461 244440 398682 431154 560993 425348 392622 347739 147528 84242 -43429
2294 -43429 -86976 113169 31384 -97287 -85286 -189966 114029 142829 30787 -1094 55296
2283 55296 88362 -25309 -54405 -80104 14845 152986 159136 47115 -114147 -109222 -76991
2272 -76991 -129061 61080 -50701 -206824 45844 137057 51721 -58606 166997 333942
2262 333942 29605 -198936 -29073 194337 -102554 18782 142561 4562 61155 195265
2252 195265 14101 31271 85238 203249 244400 163252 16519 161940 173526 137512 402825
2241 402825 373396 379212 277232 116289 221818 185877 153921 31846 102863 220208 49263
2230 49263 120052 429250 208509 201670 242011 -16035 4892 251232 299788 90853 206290
2219 206290 -165771 -129881 93852 221804 142691 65166 41637 91917 21332 -113787 -184768
2208 -184768 -60328 189414 39392 230309 292153 22047 159907 243868 33061 13824
2198 13824 311519 156164 147901 180624 223031 446999 434568 427264 610746 342862 264356
2187 264356 167184 240939 196044 240994 354843 241416 181129 73899 188230 190670 206199
2176 206199 328038 465014 292195 339685 492461 313656 215296 496909 373014 535491
2166 535491 688485 526938 654130 721517 366379 369342 656814 910257 824204 561649
2156 561649 720075 794882 712726 713938 745737 476296 809451 884685 854870 684295 829210
2145 829210 944592 752821 791227 897630 602706 634059 692109 836419 909893 795550
2135 795550 808277 954978 1221423 1253515 1159934 1306171 1558342 1428093 1290737 1307138
2125 1307138 1436509 1266935 1395800 1352666 1299146 1352786 1478452 1381335 1618662 1508924
2115 1508924 1672804 1924928 1756159 1886201 1957054 1786316 1888293 2221626 2451925 2534193
2105 2534193 2842874 2874734 2687139 2956202 3371712 3271828 3459613 3666419 3781269 3946436
2095 3946436 3854057 3969219 4042966 4308575 4623186 4676732 4971242 5081239 5195737 5629851
2085 5629851 6036551 6396271 7068522 7628419 8232598 9018108 9714611 10766365 12103206
2076 12103206 13700322 15297505 16694443 18695706 20650066 22499951 24891761 27807064
2068 27807064 31429439 36537183 42745246 50770173 60145324 72884624 86122704 83981881
2060 83981881 72629425 63221890 52157573 41239304 34036937 29218479 25536971 22712213
2052 22712213 20504323 18771279 17292505 15978983 14959875 13894145 12833005 11903815
2044 11903815 10743081 9982208 9391343 8893219 8379129 7830228 7665300 7454530 7116381
2035 7116381 6935668 6794069 6276670 5792722 5441205 5214698 5078157 4966542 4833710 4601477
2025 4601477 4272125 4330209 4084134 3611128 3573744 3478609 3359442 3228183 3310548 3221864
2015 3221864 2899031 2884136 2604824 2376275 2573968 2381867 2255740 2033714 2042112 2289568
2005 2289568 2215721 2023956 1952803 2006901 1841032 1716668 1980661 1852353 1549066 1616247
1995 1616247 1474710 1329600 1160858 1276013 1569090 1451333 1483094 1634564 1469476 1334506
1985 1334506 1438068 1308587 1293815 1205259 1042776 995461 1002411 907872 779391 495166 691503
1974 691503 952215 825209 836157 711691 772802 891134 956489 833540 702443 884968
1964 884968 819568 769646 916573 813119 1162936 830574 587091 537787 633627 564500 597247
1953 597247 738870 589885 680005 606093 504304 386662 304573 392032 223702 336314
1943 336314 530373 375723 443913 334606 515413 346100 400403 592030 399493 317711
1933 317711 340744 402465 516458 532598 415124 239566 423783 555040 599400 322429
1923 322429 301592 371044 230719 387040 462404 623931 681755 669014 438761 452473 393204
1912 393204 401251 331885 444487 470841 416607 352154 606925 621762 404604 277916 152469
1901 152469 372860 375279 281170 152994 88614 17542 24856 -117109 317094 153921 28186
1890 28186 206542 77956 6795 136795 50853 6513 -28265 -76110 -3250 -135198 -277821
1879 -277821 18459 343688 297638 274568 303637 329806 313707 419234 447874 411221 482041
1868 482041 473270 297213 379165 299206 31172 87068 -89117 173161 193642 18169 158962
1857 158962 103160 235035 210665 351444 360473 210032 129471 175303 114600 68545 161232
1846 161232 -271027 -302031 55073 53158 255988 194756 119751 31769 165808 6291 243955
1835 243955 267483 518447 496384 320384 314566 356037 369853 245356 201244 88001 168615
1824 168615 369291 376793 358907 359146 242466 221024 422283 511834 353674 304936 130791
1813 130791 321559 255927 110688 325505 312916 29998 169918 -95018 -57798 15136
1803 15136 126030 126441 353196 449143 308057 175952 81837 266092 124010 -45076 -70132
1792 -70132 2941 38418 40684 198111 124259 120480 113174 237055 38452 -111323 -52329 127316
1780 127316 165363 98193 225164 264281 316749 26894 42521 -41707 34965 221417 -28221
1769 -28221 76392 43542 177040 99778 9336 11492 67921 183847 -13924 -126395 -200915
1758 -200915 -31145 233437 177487 87156 92128 -128042 -139543 -121932 -69992 327595 221063
1747 221063 51758 87891 25577 -39890 -137818 72041 210650 326192 -61538 -85295 -58543
1736 -58543 -16349 121537 -36265 -157077 122646 160831 -40511 -177894 -58790 65699
1726 65699 128945 -26534 -175162 10508 101499 140643 -45144 -4130 130681 90831 351527
1715 351527 300490 128561 30597 60655 181561 193646 105966 151013 207603 117960 21080
1704 21080 83006 38905 9675 -30697 58196 20657 -19968 -48128 35773 -82401 -170777 -222965
1692 -222965 -145850 34362 169458 98286 41483 -25515 -132964 -82299 57529 165381 -29570
1681 -29570 -215248 -298346 -183539 -244616 -28355 -65732 96857 17293 6979 8502 -84645
1670 -84645 -93286 47343 81660 34159 125558 68928 -199195 -232960 -209000 -197436 -97216
1659 -97216 -174035 14671 203636 94374 -120079 -288434 -282417 -69814 20195 -93477 42492
1648 42492 91590 -146206 -29571 58471 54725 -110518 -254925 -88982 -135916 91584 96216
1637 96216 86796 -11403 48126 -139376 -186007 -49701 70955 93154 14789 -70999 -128061
1626 -128061 -49177 -155226 -43057 -84079 185658 173940 -239433 -242842 -220467 -168981 -128298
1615 -128298 -44252 82097 181980 229361 -2068 -212113 -198705 -105123 95897 -3480 -144046
1604 -144046 -265868 -214229 -389021 -249359 -135082 -176605 -355856 -206953 108129 4493
1594 4493 -24036 131340 262102 -65925 -170242 -155378 -233306 30497 279022 -32242 -144670
1583 -144670 -69964 -45411 -7889 -107163 16494 -42419 -23522 -65261 -154097 -98984 -152465
1572 -152465 -52317 -243756 -177127 -70742 230011 35115 -3186 79937 2536 -73203 56024
1561 56024 95881 -46711 -135874 -50536 -40516 72153 12204 8452 19273 -218168 -63531
1550 -63531 47369 175114 -57632 -108245 -140229 -85184 -92822 -101953 -114273 -111958 123129 -134765
1538 -134765 51900 90839 29867 -91542 -134024 -185902 78883 -39973 4182 129447 143803
1527 143803 198515 36619 -29449 -259536 -482583 -324362 -111767 -204260 -201257 100560 -71067
1516 -71067 -76940 -64376 17226 60221 19370 248146 155314 83467 117653 -106705 -216753
1505 -216753 110943 141307 38931 137815 -190671 -453707 -160918 -306087 -194045 63878
1495 63878 106562 -52253 124659 265325 207900 8081 262132 202584 158819 -4111 -81603
1484 -81603 44924 14792 -41672 59383 121370 -17045 104601 48157 -194530 -152277 -222004
1473 -222004 -259606 -175638 -46960 -66711 -15 103343 104531 -33354 -198552 -359165 -329951
1462 -329951 -186742 99354 145115 219975 85793 40030 4352 -127243 -97433 -117233 -139853
1451 -139853 -290163 -157218 137897 138717 12838 32035 19685 47227 -39590 -83799 -82290
1440 -82290 -141460 -119933 -76432 -135363 47704 121366 -61466 85439 336376 -42576 -77142
1429 -77142 -291298 -79548 111661 259900 189155 -106308 86826 -148707 -54914 54519
1419 54519 33492 -133292 -161646 -48590 228178 277284 246239 245247 101242 204209 -52170
1408 -52170 -256318 -164805 5176 -54442 53764 220222 86621 -213161 -212451 -75789 -16357
1397 -16357 -97213 -239978 -113645 -73613 -94306 -134387 -136102 -127235 -233689 -74667 -159671
1386 -159671 201181 72674 -191295 62375 168356 158546 -166928 -102968 -14824 -126203
1376 -126203 -336097 -172557 56313 -191942 -93158 60828 87009 20644 -312707 -229043
1366 -229043 83965 -179198 -233533 -163812 -289642 -295794 -18644 19811 24721 101833 -54532
1355 -54532 94793 -4136 34440 -10763 -193378 -129584 -58682 -88786 -159320 -7027 -42288
1344 -42288 127042 -7263 18273 292645 26403 99688 -132657 3954 98814 -9335
1334 -9335 -282984 -184674 -250669 -361884 -170355 -88233 10722 -101875 -60028 60754 -63917
1323 -63917 -147051 -75317 -80313 -189009 -79664 133498 56513 47352 20870 -133302 -158583
1312 -158583 -41052 25405 -74237 -138747 -786 -87731 53304 56463 -65035 -90471 -130293
1301 -130293 -15333 144661 151512 184076 105082 7062 113217 115429 152767 24237 4484
1290 4484 -80810 -133828 -159541 -121939 71621 170206 48462 117810 74417 -103510 -152281
1279 -152281 -158556 106323 11948 45328 40333 -121066 -118125 -110015 -118693 -191962 -97304 -154251
1267 -154251 -247653 13383 359782 293240 95887 350448 484927 178541 -33790 44964
1257 44964 -108226 -60439 -99077 -235826 -172813 -57777 -75088 196252 -24777 -56145 111864
1246 111864 -48156 -77682 -101306 -60170 184641 241174 233015 -9875 -135577 -121259 -21725
1235 -21725 100855 105759 59651 -129810 -113737 17611 108650 90590 44292 233597 155552
1224 155552 -150363 -26775 99138 -11830 -110235 -69386 -26184 -146714 -273731 -270365 -129578
1213 -129578 136468 -79444 144509 135783 83725 -96571 -115695 -99431 -41508 11022 76716
1202 76716 49515 60769 68425 -281277 -334842 -165292 -4942 42576 -95133 280740 206742
1191 206742 -22912 102051 -5840 32179 187846 58110 -24037 92256 151089 139842
1181 139842 135080 138440 -211854 -223896 26170 195840 61290 -5383 -23797 -53788 -29291
1170 -29291 -311463 -177559 16868 -173520 -103980 16585 10026 -112554 -23736 85449 189182
1159 189182 362 146329 393789 90421 -150204 77382 -93204 -61756 -81255 -70803
1149 -70803 -52019 -90969 -389889 -348770 -5146 35891 -26119 -110600 -104461 -32960 -156726
1138 -156726 -196719 77828 17884 -28991 -105023 429400 102664 70732 54068 -52432 -246201
1127 -246201 -98738 133075 101294 -155199 -227112 -227075 -153395 -181755 -264175 -109177 86469
1116 86469 86900 295665 123566 -143496 -68720 -152878 -46978 10246 217344 56966 187581
1105 187581 216602 173438 258790 157563 -102307 -41895 -59281 -26150 99103 340 137718
1094 137718 37982 69995 131111 70112 54564 -69168 -92299 -348313 -183218 -96341 -128531
1083 -128531 -238456 -134537 -78969 -52812 -214723 -59966 -118915 26083 92152 56254 -23519
1072 -23519 -150998 -175731 -90087 30131 172925 31538 -163427 -18929 -153071 -4626
1062 -4626 35074 -17505 -218624 -333304 -109699 -121714 142657 131933 -29859 13995 -35138
1051 -35138 -17474 -283261 -194930 -185643 -64753 152360 63199 72017 107871 -15521 -214991
1040 -214991 -70391 -21622 228751 161659 -26729 -97669 -75293 -4306 95856 144774 28743
1029 28743 83114 99958 82396 38487 116954 -219210 33576 136159 -136536 -229787 -330636
1018 -330636 -212703 -138681 -20288 -245459 -128124 32634 28716 -47577 -72263 -34516 -33723
1007 -33723 119563 6452 33488 -81266 -262966 -279575 -67906 113681 104349 47983 -309684
996 -309684 -448734 -303986 -48463 24582 100459 -23518 -113731 113216 161225 -25851 -223840
985 -223840 -35816 173125 149020 -122995 -48719 38473 -87306 -330113 -274208 -38946 76447
974 76447 73455 -65511 -263125 -141801 -9159 258369 130340 78187 91334 -58562 -170427
963 -170427 168060 -25173 -14360 -205719 -256740 -122404 -77801 -218923 -113470 -1365
953 -1365 -71636 133866 14629 -24331 118204 202388 150726 34187 90267 90651 40241 79876
941 79876 69711 82249 -122607 88986 -10120 -168499 -285427 -238306 -122167 -38651 124462
930 124462 183009 331857 345183 93227 -85799 91133 139234 23159 -176131 -363992
920 -363992 -219496 -196223 170748 13495 -94009 -99021 63394 -10779 98433 6763 -149640
909 -149640 44198 -145554 -212337 -155308 14896 75110 162684 234218 322001 234935 -57512
898 -57512 -133063 -182952 -110299 -234069 -150249 2288 -306923 -75464 -152966 -227148 44252
887 44252 -232642 -405691 -493381 -291744 -182199 -144541 27858 24215 130057 -41335 76043
876 76043 -45407 -323495 89287 79886 99795 195404 128968 127203 21166 152958 937
865 937 89495 159764 79430 116647 104766 77717 -2248 101471 -288897 -222509 19813 -45232
853 -45232 72566 113599 43924 -85386 -276370 -105052 -52602 -59424 21445 -28541 63688
842 63688 96975 104500 156537 117795 22121 37706 74962 103030 249973 46668 25989 48155
830 48155 -1583 -39362 150758 166013 224989 -70191 -265775 -216824 -52513 209767 197019
819 197019 256088 241144 271574 62962 -921 -56393 -99346 50497 113454 34941 8788
808 8788 80180 129747 90923 148709 274226 225567 282970 119356 -151788 -293137 -199779
797 -199779 153562 159565 -63307 -196433 -219184 -242535 -131038 -99022 -116116 -63318 -114225
786 -114225 -81670 -165629 33654 186159 75497 -128464 -22022 -10566 3261 140006 59624
775 59624 38389 -84153 -4913 -30375 81694 -67915 -97901 -237796 -109471 -50727 45845
764 45845 299885 333858 -71339 10602 -183064 -29128 72308 153902 209688 268064 133142
753 133142 38706 -91406 83621 -44826 -264512 -172966 134573 -51461 -284954 -184644
743 -184644 -119956 165701 289630 197060 211158 208569 -123110 62914 159852 16421 65309
732 65309 62093 45447 43439 -76642 -143502 -145428 -73178 -78345 7641 -120199 -102976 -71122
720 -71122 41371 -172441 -179144 -60669 -68311 -28135 114168 205243 79576 231054 -14418
709 -14418 -92102 -71494 -36444 276390 -69885 -150927 100699 53060 -25366 13679 -26474
698 -26474 -20800 -83855 3513 4317 43812 73640 192292 262983 288458 221153 228516 -71085
686 -71085 93603 196250 208067 275778 241756 106821 94573 203259 335960 -33369 -85284
675 -85284 -162995 -157996 -71107 -188950 -246880 -235688 6397 99895 113549 33882 241403 121073
663 121073 188479 204876 -37432 14567 42947 160780 209955 333943 -45634 -3602 -66055
652 -66055 -255325 -44990 -3292 256054 357886 39866 -97631 -67657 -23482 108671 17210
641 17210 82438 118362 66705 -36144 160237 -34730 -185584 -143235 -186600 -92256 -215851
630 -215851 -201029 13757 97912 -29875 58551 26468 35206 20021 -296628 -240531 -227284
619 -227284 -76255 -226892 -492148 -320073 -53973 -28191 -287111 -196083 16094 -9336
609 -9336 -73941 -61070 -58043 -2277 89941 -138974 -6988 -117852 -36525 1872 -106665 -14034
597 -14034 172186 149958 -41570 -69476 -236497 -85983 -89642 -34861 -59970 -26514 192904
586 192904 154540 -51926 62333 182603 94722 87339 92323 93605 53282 -67916 -100421 40750
574 40750 44520 12307 92591 88117 13434 24521 -9442 -83463 -129788 194059 251809 277033
562 277033 -46495 -81402 76572 -99895 -9458 22944 -162841 -125389 -227928 42637 47667
551 47667 -15519 -17518 30558 81951 -162698 -88719 -58402 -20367 -19006 -7646 -150022 -180490
539 -180490 -57953 64512 42100 65125 9920 -84606 -125059 36939 176332 -71325 -4440
528 -4440 2578 48270 -70625 144179 175167 -73906 193007 24096 47593 232358 314198
517 314198 108084 -169784 -55909 36920 126864 78438 44026 -119212 -113259 6270 -13749
506 -13749 -121881 -219374 -213677 -72100 -92149 -10163 119395 42414 171846 221023 241242
495 241242 220137 110862 113015 18013 -26399 -11461 85021 220575 -77639 -103583 -25198
484 -25198 25520 20143 229309 174974 70856 -73047 -63232 -113211 -147836 30910 107607 282905
472 282905 191106 17580 1939 71006 -64572 -33497 18560 -120559 -20665 -101859 58540
461 58540 -164990 -320453 -34612 -301125 -235790 8022 -106433 -221876 -279512 -221822 -89744
450 -89744 -19714 -50219 -115211 -80235 183631 171822 100298 110440 79249 -79225 -72284 -68667
438 -68667 -22938 348260 200626 112200 54390 -62342 -84009 -173421 -3478 -78174 -224581
427 -224581 70280 38894 -24644 82172 151132 194158 -90336 -48316 92873 374944 56700
416 56700 -88465 64497 191743 22801 -28086 -45467 -176878 -124754 -141535 -93918 175052
405 175052 264397 207687 471572 365794 252285 264497 46396 -107673 -151531 147923 131280
394 131280 98732 225385 183773 152223 191295 213786 69746 14502 135836 19562 39634
383 39634 347945 121792 245935 229975 82519 156078 -162770 80934 253782 -28355
373 -28355 -28999 60902 255729 90682 -37663 -104004 -96728 -8207 160791 130658 44409 -25930
361 -25930 196469 -8941 18857 55320 85352 65496 288939 376871 164564 34574 105856
350 105856 139201 88656 197764 302602 442693 246437 34829 236586 53596 14926
340 14926 169337 138752 41350 51869 -68891 -18093 79654 73334 90542 -107622 -64416 -131023
328 -131023 -108466 -107219 31458 61610 182677 202708 168082 95817 176881 235477 108535
317 108535 300232 65732 110471 -14002 -42947 76459 -5301 64477 54639 16332 172505
306 172505 240510 37111 233589 267829 7246 -198847 51771 281441 -62077 -121900
296 -121900 125686 252442 329721 379011 282929 68835 125847 -8513 40191 -12314 -21566
285 -21566 77301 169377 199724 146313 363809 426731 185452 -13819 278813 456349 161135
274 161135 84870 -51721 7441 288351 198497 -37626 -59621 115809 19113 109753 193283
263 193283 -49336 -156824 51217 123845 155008 198654 135522 159899 23336 64708 74540
252 74540 91507 -153164 12416 90623 68714 39152 345675 508160 418034 187054 74825
241 74825 179239 107256 280118 205795 294356 156363 190073 -4062 20449 -134826 -53709
230 -53709 -218816 -307334 123342 108753 177274 58166 146141 187874 349218 303184 291082
219 291082 100144 -31348 33135 201776 26296 125645 163629 124944 55270 126163 293395
208 293395 164318 117497 72853 105230 22509 91552 -27515 179200 224121 77945 110955
197 110955 54554 -7461 21554 246201 206266 171998 201810 125106 138601 257397 431111
186 431111 -60654 -95983 284328 173494 96873 -29152 -24231 4113 183464 149423 34424
175 34424 -155519 -167327 -129247 -79976 106255 75347 116302 60504 25030 166399 240168
164 240168 63453 -187443 -47395 111849 12852 70028 132063 156716 -58931 -69939 -41357
153 -41357 28363 80587 26394 -75040 -91326 -90586 -154083 198708 176206 125876 182440 186002
141 186002 232304 60113 187542 169504 131839 -46159 -116067 57450 13549 7544 50812
130 50812 4024 266372 349996 186414 170327 138404 76397 66965 -1828 177613 265035 141154
118 141154 1689 159816 245256 148941 148990 216444 150418 49623 72057 157632 111403 142949
106 142949 -37244 -55128 87653 92489 126854 309683 97945 136867 332167 207676 94739
95 94739 106754 258482 49955 290017 392336 320850 177716 146744 120267 121106 189313 137803
83 137803 130113 -42174 -137229 -47439 119104 200977 117166 167581 225568 117372 -21416
72 -21416 -59436 -116999 139902 -12309 11950 72448 191474 96709 -18606 74228 111793
61 111793 181948 45063 -4525 -48640 74787 10141 80288 176781 59696 91273 228546
50 228546 120176 21151 -43842 63823 58911 9052 48553 148515 93235 -36964 59328 209474
38 209474 45730 67908 187582 229973 188084 158898 183150 53981 218446 236695 65534
27 65534 -59982 115468 208013 89599 63191 330262 160148 -47273 -11342 29262 35739
16 35739 94744 120615 62461 246086 129150 -67207 -158722 55722 84831 -25980 54324
5 54324 134098 96790 135120 190380 233901
0 233901
$$ Imaginary data points
##PAGE= N=2
##DATA TABLE= (X++(I..I)), XYDATA
16383 -2249596 -2060959 -2088981 -1936937 -1699037 -1681424 -1844964 -1860770 -1846349 -1920095 -1992426
16373 -1992426 -1833307 -1690094 -1705586 -1710779 -1562788 -1471295 -1354230 -1561577 -1422085 -1351465
16363 -1351465 -1413501 -1472708 -1450826 -1307589 -1230490 -1321447 -1337297 -1286786 -1353483 -1306365 -1250818
16352 -1250818 -1220891 -1056518 -966404 -908434 -969650 -1149417 -987697 -888036 -906389 -902252 -789655
16341 -789655 -921825 -812788 -887609 -849569 -617177 -501729 -606239 -544488 -578344 -461942
16331 -461942 -400698 -453476 -383037 -342239 -264291 -228646 -190730 -214505 -410776 -451363 -278251
16320 -278251 -88036 -170330 -132505 -198961 -220373 -193925 -163489 -145156 -238987 -162395 -123615
16309 -123615 -47107 237107 246234 45324 300975 334067 76114 303207 374197 347286 127953
16298 127953 189056 442802 474423 444451 298536 368126 443145 492162 482651 505386 642910
16287 642910 567236 564782 678782 646785 654286 667304 782260 804501 685106 747344 701555
16276 701555 644243 641780 739559 816115 869127 968265 1046704 967385 703120 839356 989592
16265 989592 984841 990952 929156 1130161 1190396 1252286 954713 920112 1176441 1126015 1202169
16254 1202169 1237690 1202322 1294492 1393323 1290830 1295742 1167156 1205348 1314549 1198271 1306575
16243 1306575 1444815 1343534 1592631 1816559 1717992 1594455 1591625 1479210 1588722 1683179
16233 1683179 1609366 1468323 1449392 1557380 1458002 1342197 1673761 1935455 1870146 1796346
16223 1796346 1670876 1704374 1569587 1654006 1951854 1711514 1762777 1612069 1903034 1922092
16213 1922092 2020919 1983263 1720279 1589670 1586691 1954566 1999312 1810912 1789442 1947402
16203 1947402 2031721 1911992 2005192 1921727 1902560 1931312 1931818 1895333 1977973 1874732 1806120
16192 1806120 2046458 2134001 2113663 2179444 2186262 2029570 2180371 2322724 2309484 1956171
16182 1956171 2249525 2439470 2510764 2098269 2111634 2183784 1951275 1977122 2276361 2435053
16172 2435053 2321750 2149863 2404001 2348983 2307867 2203883 2039842 2014572 1996179 1937918
16162 1937918 1951110 2191700 1976250 2157188 2301753 2412481 2380537 2462694 2450307 2561000
16152 2561000 2550526 2545509 2283829 2264189 2162374 1947395 2224287 2224816 1996134 2241498 2562552
16141 2562552 2453219 2535640 2709665 2627812 2607829 2465187 2344090 2466306 2478198 2461184
16131 2461184 2252638 2434161 2387962 2347099 2521036 2441106 2538871 2536402 2429448 2269041
16121 2269041 2318859 2567945 2530858 2557176 2728617 2569178 2522424 2647631 2507720 2473704
16111 2473704 2404404 1955090 2301105 2407809 2255964 2264158 2374531 2694179 2481889 2557795
16101 2557795 2643764 2523194 2356040 2574211 2529085 2589591 2622239 2567357 2610481 2408734
16091 2408734 2539050 2703076 2588995 2524794 2502119 2510232 2632737 2579336 2565769 2646179 2448589
16080 2448589 2395987 2498993 2628948 2550429 2731707 2715870 2834627 2682461 2701464 2701154 2375229
16069 2375229 2521442 2625523 2541575 2685699 2642256 2307956 2465405 2839706 2686652 2466150
16059 2466150 2603866 2454645 2538629 2488772 2616646 2657908 2684408 2828219 2622162 2718591
16049 2718591 2483511 2492328 2609496 2792774 2635128 2612209 2902595 2749015 2647494 2549789
16039 2549789 2845878 2767180 2568446 2489069 2506370 2533451 2638922 2696006 2353583 2612639
16029 2612639 2537797 2571198 2459266 2329909 2208512 2203634 2403224 2525568 2388663 2589138
16019 2589138 2703636 2526373 2756693 2628041 2529390 2348160 2420154 2385886 2453235 2438815
16009 2438815 2506874 2519623 2766519 2531516 2726956 2740302 2608167 2558936 2647892 2568221
15999 2568221 2652295 2775287 2677646 2529069 2544430 2442417 2654706 2650275 2588519 2876558
15989 2876558 2508296 2558164 2406911 2426116 2542300 2587865 2588637 2410525 2337492 2362507 2458542
15978 2458542 2721885 3091125 2971280 2762541 2777241 2783238 2694780 2585546 2469648 2268188
15968 2268188 2501519 2491703 2430153 2459856 2570289 2587586 2487842 2467217 2497920 2496298 2605631
15957 2605631 2579177 2662187 2777642 2627205 2596845 2678461 2652844 2498063 2482396 2653956
15947 2653956 2722373 2741950 2681978 2578694 2508321 2556923 2739706 2599633 2740814 2611362
15937 2611362 2502660 2272920 2469052 2605780 2622343 2687932 2768871 2740931 2671858 2830306
15927 2830306 2911310 2822797 2802618 2697591 2826986 2727249 2544020 2515704 2363760 2441494
15917 2441494 2440527 2646389 2704485 2718276 2751338 2728856 2627737 2598809 2509752 2627357 2403062
15906 2403062 2449277 2391732 2572751 2570226 2603110 2670595 2666766 2645178 2627874 2638214 2612147
15895 2612147 2679523 2482988 2598938 2541382 2318294 2269527 2386392 2404770 2464293 2663039
15885 2663039 2601401 2562420 2421129 2608077 2537981 2489126 2745088 2807816 2787997 2595325
15875 2595325 2670193 2673681 2779017 2721600 2562959 2657412 2468645 2318544 2338835 2729027
15865 2729027 2890348 2534373 2630456 2748922 2636461 2422162 2409812 2845308 2902510 2601573
15855 2601573 2532222 2678603 2674291 2531803 2460456 2584124 2587224 2824202 3033467 2963272 2829061
15844 2829061 2658071 2654834 2799648 2890371 2631083 2641368 2812407 2663558 2637990 2573101
15834 2573101 2626780 2806406 2763662 2700869 2708758 2560868 2861874 2775305 2836268 2749759 2616069
15823 2616069 2654691 2452007 2588445 2656684 2766986 2667525 2507400 2431691 2622621 2557433
15813 2557433 2328785 2495703 2607622 2592508 2584075 2808034 2791618 2579789 2780618 2607530
15803 2607530 2568855 2458139 2638605 2770132 2765569 2763291 2868343 2786468 2844897 2731186 2570751
15792 2570751 2722122 2993155 2662040 2459500 2760775 2701916 2702286 2583671 2516381 2673284
15782 2673284 2924554 2646357 2630329 2620143 2505602 2627421 2642704 2571121 2482522 2813571
15772 2813571 2808183 2810552 2833088 2901464 2921421 2906528 2933994 2913282 2527076 2711164 2654332
15761 2654332 2606232 2554667 2462397 2717260 2709601 2719297 2592397 2676212 2579617 2860333 2842353
15750 2842353 2685965 2479486 2498728 2505475 2849554 2776725 2638265 2559438 2587705 2556690 2672492
15739 2672492 2859383 2533689 2632249 2641092 2709627 2566098 2528011 2875633 2759780 2333439
15729 2333439 2526598 2645201 2709625 2680331 2526713 2638897 2719139 2442118 2553726 2778373
15719 2778373 2809526 2920086 2749846 2516363 2638425 2718547 2526001 2603941 2602852 2641149
15709 2641149 2702107 2730293 2632877 2648198 2851863 2660508 2588262 2769285 2588797 2436317
15699 2436317 2424940 2340211 2420103 2443818 2446676 2663452 2646894 2496369 2675962 2677900 2621790
15688 2621790 2937800 2856342 2687226 2604850 2582483 2731075 2733249 2626551 2507093 2490838
15678 2490838 2771427 2818312 2652579 2438270 2755810 2675197 2579927 2708690 2722948 2934292
15668 2934292 2733436 2949672 2827698 2681298 2957799 2862862 2763111 2837241 2713099 2738425
15658 2738425 2855132 2814602 2785118 2772022 2754049 2794946 2666819 2708908 2610576 2646496 2598369
15647 2598369 2522247 2540179 2831210 3013767 2837087 2589938 2580246 2646623 2560066 2547772 2576842
15636 2576842 2720836 2561345 2551204 2637283 2619274 2622467 2687032 2688574 2444621 2356157 2652198
15625 2652198 2730400 2705913 2746078 2806704 2724282 2740439 2506237 2642846 2864820 2750702
15615 2750702 2555592 2705403 2863137 2731279 2827580 2624157 2580825 2407216 2224203 2345101
15605 2345101 2525210 2642506 2802918 2986370 2786374 2785779 2900305 2696674 2578795 2702560
15595 2702560 2728482 2609593 2416179 2562213 2710801 2933546 2693117 2629832 2614357 2526442
15585 2526442 2632997 2564777 2826119 2862282 2854655 2905735 2965414 2772085 2605253 2610473 2426483
15574 2426483 2644455 2705456 2888766 2741371 2721950 2685359 2751471 2841703 2859467 2756388
15564 2756388 2787084 2964246 2790114 2943198 2793943 2650785 2844661 2995692 2769021 2952613
15554 2952613 2735702 2527486 2513768 2756845 3009927 2912284 2814617 2748832 2845340 2951475
15544 2951475 2640065 2543208 2540036 2610436 2721167 2712065 2836139 2966643 2963579 2931063 2586998
15533 2586998 2626688 2684795 2559040 2629462 2686883 2648461 2582742 2649939 2772687 2711242 2577016
15522 2577016 2763490 2848444 2768501 2861465 2892778 2938466 2967226 2734467 2936283 2920601 2637765
15511 2637765 2531753 2560135 2641562 2724613 2566585 2542093 2636779 2705852 2799082 2703142 2512448
15500 2512448 2877756 2809360 2731789 2579778 2554198 2676321 2559789 2561969 2600718 2851482
15490 2851482 2644005 3006088 2957811 2677405 2664286 2529401 2496375 2594377 2808877 2643985
15480 2643985 2496897 2689382 2813220 2587183 2699456 2839457 2689700 2893645 2753096
15471 2753096 2554903 2452035 2762924 2865677 2944482 2819484 2766029 2729265 2750560 2890866
15461 2890866 2889265 2911754 2696925 2524422 2574041 2683102 2778719 2473785 2630782 2765485
15451 2765485 2815346 2929865 2615721 2702073 2741360 2600433 2713759 2725197 2599275 2663730
15441 2663730 2690915 2763355 2717023 2534559 2485233 2772022 2595982 2581546 2466705 2650512
15431 2650512 2694017 2647367 2729505 2715480 2697179 2771389 2666994 2775700 2737745 2667620 2787868
15420 2787868 2905446 2905094 2825540 2992309 2765381 2857963 3118873 3021840 2942754 2936845 2749390
15409 2749390 2789501 2794751 2822939 2899194 2756276 2786480 2859822 2934388 2831769 2978737 2695764
15398 2695764 2620979 2598981 2702717 2623154 2441486 2721555 2556692 2589015 2575015 2552889
15388 2552889 2804600 2810056 2697568 2769794 2900611 2833514 2718432 2706458 2956169 2810578
15378 2810578 2668097 2797673 2946606 2775594 2694780 2644486 2758338 2665705 2578748 2731329
15368 2731329 2717142 2794969 2753901 2770118 2751053 2784804 2697360 2815289 2785878 2658288 2879885
15357 2879885 2959157 2763499 2822145 2662774 2662213 2822421 2845963 2875635 2761619 2788105 2957567
15346 2957567 2955054 3031869 2846163 2939015 2847880 2876983 2818793 2626056 2713805 2663758 2612631
15335 2612631 2964639 2783431 2808816 2917170 2891431 2661694 2876707 2879643 2770835 2741103
15325 2741103 2768029 2923374 2819796 2850073 2667261 2647963 2650538 2671411 2545045 2628714 2580564
15314 2580564 2675589 2860136 2677975 2716615 2955132 2904882 2884036 2742154 2749319 2623845
15304 2623845 2738405 2764866 2561951 2620112 2739228 2489707 2711954 2813431 2708260 2471148
15294 2471148 2628851 2690889 2526500 2385649 2638328 2767857 2774276 2759146 2813415 2630570
15284 2630570 2643772 2780487 2740908 2612977 2964393 3026694 2876929 3001791 2733313 2826319
15274 2826319 2783931 2791595 2757034 2952105 2836565 2786415 2898522 2986944 2885332 2907408 2945394
15263 2945394 3082437 2856285 2767114 2842416 2768194 2713573 2659892 2577577 2769985 2674481 2743018
15252 2743018 2885961 2911194 2906193 2812808 2708662 2714837 2695749 2883299 2831888 3005171 2823595
15241 2823595 2734830 2785338 2566552 2629936 2662064 2661316 2816982 2784112 2860734 2961041 2939383
15230 2939383 2721515 2532110 2651767 2839253 2813523 2867325 2761677 2774242 2839971 2843075
15220 2843075 2900978 2898485 3128637 2935607 2828532 2922960 3181542 2912421 2801592 2915908
15210 2915908 2921233 2966068 3039494 3016259 3062660 3082062 2936617 2724515 2630759 2646908 2756727
15199 2756727 2881136 2987045 2914677 2632883 2499971 2539194 2910706 2777763 2766344 3008727
15189 3008727 2849205 2743420 2675515 2728144 2712155 2636400 2997637 3038502 2543807 2633439
15179 2633439 3008131 2972651 3024851 2805980 2650819 2949285 2829238 3164847 3074086 2930234
15169 2930234 2988849 2842802 2741289 2902890 2677920 2738629 2811573 3054389 2800769 2879706
15159 2879706 2967449 2990600 2939154 2785398 2709753 2948278 3021078 3086407 2885341 2746102
15149 2746102 2894846 3074451 2887646 2828297 2797874 2879088 3059076 2767145 3007499 2785227
15139 2785227 2799743 2896077 2880698 2872267 2937019 2934935 3031246 3009566 2708779 2679369 2806040
15128 2806040 2960301 2886137 2922198 2904004 2931921 3109586 2728533 2594304 2584305 2746924
15118 2746924 2573447 2745361 3007098 2994257 2862387 3078405 3176950 2887898 2832608 3116445
15108 3116445 3018401 2718276 3003002 2881832 2956508 3047044 2857986 3091189 3094737 2983125
15098 2983125 3085839 2899158 2894713 3075120 2910728 2821060 2637581 2762172 2891616 2766554
15088 2766554 2771524 2532504 2646356 2872362 2791137 2761650 2748892 2780063 2603910 2720834
15078 2720834 2858886 2710711 2815908 3059934 2893299 2815720 2902608 2900309 2991338 2874363
15068 2874363 2773652 2770854 2864296 2942300 2743979 2784578 2733247 2985146 2776598 2975129
15058 2975129 2877651 2874474 2899453 2814483 2901670 2948368 2869890 2803378 2804035 2620234 2865720
15047 2865720 3166347 3093306 2917147 2725849 2616719 2743353 2786253 2890872 3028844 2952665
15037 2952665 2836093 3148363 3214626 2992107 3035193 3134067 2943376 2893482 2779306 2678575
15027 2678575 3055296 3087734 2950783 2902294 3004539 2951093 3036190 2902819 2828381 2798511
15017 2798511 2875942 3077236 2859380 2949808 2749736 2665043 2914675 2961975 2968329 2773733
15007 2773733 2861615 2867448 2857333 2794953 2747766 2912469 2890036 2910641 2873628 2915817 2939813
14996 2939813 2869328 2930369 3233787 2967810 2974938 2839391 2916416 2778701 2907457 2902808 2917143
14985 2917143 2905272 2794917 2772128 2677052 2711922 2762060 2863305 3006090 3089490 3201495
14975 3201495 2999129 2976919 3046716 2873757 2721928 2746662 2894351 2977895 2919246 2844903
14965 2844903 2910710 3087775 3190416 3188193 3076867 3195056 3179424 3232124 3142368 3055887 3031054
14954 3031054 3054954 3207757 3108276 3092024 2870848 2881903 3003067 2838820 2647513 2836286
14944 2836286 3012829 2973029 2888398 2934610 2770341 2699561 2921353 2951466 3070147 2852520
14934 2852520 2828557 2845891 2711440 2884619 2933930 2856787 2774380 2722746 2739079 2798625 2905023
14923 2905023 2881824 2865329 2827477 2936050 2828315 3005201 2762652 2736304 2869025 2886723
14913 2886723 3026773 2790529 2829947 2980282 3025801 2859068 3114689 2947921 2843185 2611538
14903 2611538 2691680 2932633 2886757 2861206 2911457 2838776 2898501 2836883 2949935 2896631 2723492
14892 2723492 2819874 2908034 2975532 2987976 3082176 2977504 2752630 2751901 2803262 2809004 2822900
14881 2822900 2777504 2874892 2718301 2698893 3085469 2997843 2955204 2760197 2731293 3092552
14871 3092552 3198308 2982109 2881230 2911785 2821023 2775407 2898181 2900830 2882762 2928872 2994157
14860 2994157 2739989 2959048 3119934 2948744 2814065 2921043 2984071 2901143 2974352 2873518
14850 2873518 3033359 3020193 2950069 2842720 2849626 2869931 2873801 2904407 2934102 2978633 2818420
14839 2818420 3107904 3134046 2906780 2820857 2811200 2882620 2972334 2993304 2826603 2934081 2979337
14828 2979337 2718453 2793696 2979795 2879424 2870621 2911483 2714842 2769178 2759157 2733476 2793161
14817 2793161 2842957 2834574 2791250 2806915 2842382 2967327 2780048 2805975 2998964 2836522 2807432
14806 2807432 3026558 2943277 3047113 3175995 3198946 3131773 2947218 3019294 3066330 2921653
14796 2921653 3064792 2895827 2713134 2875667 2910769 2945176 2961113 2851598 3044476 3110255
14786 3110255 2755555 2983749 2915976 2788247 3067694 3135827 3138553 3109942 2934088 2841771
14776 2841771 2923013 2958002 3025430 2715699 2771320 2846782 2781539 2788487 3029627 3082146 2918414
14765 2918414 3046357 3127241 3098241 2872323 2830174 3025344 2989818 3048423 2984837 2980676 2804828
14754 2804828 2972139 3022346 2942323 2821589 2765085 2919713 2822119 2736745 2769274 2719052 2708357
14743 2708357 2848123 2943730 2895676 2918058 3202518 3025538 3053889 2988587 3040299 3072265 3143754
14732 3143754 3190930 3145095 2981753 2746613 2956379 3250820 3146172 2939294 2992655 2966052
14722 2966052 2958774 2918244 2996636 2915080 2930710 2980414 2874943 2886171 2951210 2984963 2970100
14711 2970100 2731072 3121410 3169396 3123209 3090893 2724209 2852127 3096209 3013476 2948867
14701 2948867 3048261 3225051 2953286 3109784 3276814 3225844 3129719 2954809 3032035 2972492
14691 2972492 3079269 2877011 3047996 3051042 3040044 3106989 2854314 2833688 2938984 2960475
14681 2960475 2946253 3029021 3085687 3033833 3164955 2857196 2686593 2827615 2980690 2782114
14671 2782114 2839977 3005439 2865880 2854531 2892950 2949696 2897805 2892059 2711559 2753743 3037774
14660 3037774 3060771 3062085 3179521 2928180 2870573 2961898 2742800 2684092 2677592 2636552 2649260
14649 2649260 2773761 2782643 2861928 2980355 2682662 2768986 2916885 2844793 2874880 2931269 2976551
14638 2976551 2852745 2957912 3075483 3253078 3300600 3165573 2929536 2991083 3098378 3008893
14628 3008893 2862039 2960460 2708078 2738164 3008248 2866986 2808481 2728904 2712909 2794853
14618 2794853 2756372 2963086 3104339 2941251 2895575 2923475 2891333 3132901 3309778 3193438
14608 3193438 3170628 3067998 3090151 3084691 3130600 3152479 3026762 3045908 2777399 3169117 3145747
14597 3145747 3034192 3126850 3203918 3303039 3006676 2822841 2745851 2984284 3049719 3227164
14587 3227164 3356263 3250627 3099917 3084429 2972806 3016841 3047397 3028426 3058386 3169621
14577 3169621 3136863 2896162 2806765 2759154 2789689 3002540 2827414 2678262 2835873 2779437
14567 2779437 3132264 3214968 3036811 3211057 3095373 2907524 2907885 2869264 2961006 2964979 3073528
14556 3073528 3317843 3361656 3252609 2961070 2783900 3040067 3058246 2764176 2904632 2956590
14546 2956590 2923245 2969793 3090661 3217206 2866385 2814582 3016206 3021564 2984985 3068632 3086538
14535 3086538 3153426 3274278 3230211 3141816 3037985 3078561 3065000 3247702 3067069 2958321
14525 2958321 2957930 3085163 2972574 2759035 2782857 2999859 2828794 2918673 3200474 3133989
14515 3133989 2992020 3087559 2837281 2794654 2911872 3273789 3247453 3220906 3137344 3069142
14505 3069142 3147237 3125472 3339116 3311713 3124134 3120382 3228018 3257958 3317909 3157656 3155878
14494 3155878 3207912 3217335 2945911 2835800 2922580 2998081 2918720 2847701 2910253 2883105 2892825
14483 2892825 3178460 3169517 3127879 2928107 3050538 3137485 2952142 3307905 3247685 3047363
14473 3047363 3035103 3193772 3271507 3313063 3182312 2997373 2810484 2799737 2933403 2998111
14463 2998111 3108026 2920598 3063343 3232919 3278939 3173186 3203331 3048235 2956479 3045453
14453 3045453 3073121 3087179 3072039 2861440 2721272 2949454 3487139 3451372 3138078 3214322
14443 3214322 3213787 3152364 3140791 2848013 2828055 2963654 3009841 3107525 3214196 3252755 3130797
14432 3130797 3186258 3114284 3070591 3098484 3158334 3152172 2905587 2881976 3239251 3180376 3164890
14421 3164890 3148380 2981135 3078248 2964128 3052988 2971358 3301059 3356620 3318727 3374380 3239425
14410 3239425 3079760 3160001 3098756 3013035 3096625 3290864 3398750 3275285 3236184 3005557
14400 3005557 3010896 3067039 3208460 3158600 3025754 3114919 3300137 3189025 3063281 3266122
$$ [...]
##END NTUPLES=NMR SPECTRUM
##END=
