##TITLE=1H_EC-3254(4-1)
 CDCl3, 8 sc, 
 1.07.2021
##JCAMPDX= 6.0         $$ Bruker NMR JCAMP-DX V2.0
##DATA TYPE= NMR SPECTRUM
##DATA CLASS= NTUPLES
##ORIGIN= UXNMR, Bruker Analytische Messtechnik GmbH
##OWNER= root
$$ XWIN-NMR		Version 3.5
$$ Fri Jul  2 10:09:23 2021 Russian Standard Time (UT+4h)  she@DPX200
##.OBSERVE FREQUENCY= 200.131506
##.OBSERVE NUCLEUS= ^1H
##.ACQUISITION MODE= SIMULTANEOUS
##.ACQUISITION SCHEME= undefined
##.AVERAGES= 8
##.DIGITISER RES= 18
##SPECTROMETER/DATA SYSTEM= spect
##.PULSE SEQUENCE= zg30
##.SOLVENT NAME= CDCl3
##.SHIFT REFERENCE= (INTERNAL, CDCl3, 0, 17.5289)
##AUDIT TRAIL= $$ (NUMBER, WHEN, WHO, WHERE, WHAT)
$$ ##TITLE= Audit trail, XWIN-NMR		Version 3.5
$$ ##JCAMPDX= 5.01
$$ ##ORIGIN= Bruker BioSpin GmbH
$$ ##OWNER= she
$$ F:/spectra/data/she/nmr/H-F/1/pdata/1/auditp.txt
$$ ##AUDIT TRAIL=  $$ (NUMBER, WHEN, WHO, WHERE, WHAT)
(   1,<2021-07-02 10:07:23.25 +0400>,<she>,<DPX200>,
      <created by zg, POWCHK disabled, PULCHK disabled
       configuration hash MD5:
       00 E9 B6 7A A2 85 ED C7 34 08 36 98 17 FE 4E 26
       data hash MD5: 16K
       BC 46 3E 96 78 D5 8C B5 1B 73 A6 6E C2 4C 2C 13>)
(   2,<2021-07-02 10:07:31.65 +0400>,<she>,<DPX200>,
      <Start of raw data processing
       efp BC_mod = 2 LB = 0.24 FT_mod = 6 PKNL = 1 PHC0 = -11914.4 PHC1 = 13.00099 SI = 16K 
       data hash MD5: 16K
       4E E2 26 47 28 99 CB 94 9F 42 90 30 60 65 23 AE>)
(   3,<2021-07-02 10:07:53.87 +0400>,<she>,<DPX200>,
      <pk PHC0 = 1.501547 PHC1 = -1.6 
       data hash MD5: 16K
       2C BE E5 F4 83 8D D3 7A 65 68 09 5A 16 27 2B FE>)
(   4,<2021-07-02 10:07:57.03 +0400>,<she>,<DPX200>,
      <abs ABSG = 5 
       data hash MD5: 16K
       E6 B8 EA 07 67 8D B7 4B 7E 10 88 ED 8B C5 D6 09>)
$$ ##END=
$$ 
$$ hash MD5
$$ 2D 99 A7 D6 9E 05 6D 52 0B 57 2E 34 CE 89 FA 57
##$RELAX= 
##$RELAX= 
##$RELAX= 
##$RELAX= 
##$RELAX= 
##$RELAX= 
$$ Bruker specific parameters
$$ --------------------------
##$DU= <F:/spectra>
##$EXPNO= 1
##$NAME= <H-F>
##$PROCNO= 1
##$TYPE= <nmr>
##$USER= <she>
##$AMP= (0..31)
100 100 100 100 100 100 100 100 100 100 100 100 100 100 100 100 100 100 
100 100 100 100 100 100 100 100 100 100 100 100 100 100 
##$AQSEQ= 0
##$AQ_mod= 1
##$AUNM= <au_zg>
##$AUTOPOS= <>
##$BF1= 200.13
##$BF2= 200.13
##$BF3= 200.13
##$BF4= 200.13
##$BF5= 200.13
##$BF6= 200.13
##$BF7= 200.13
##$BF8= 200.13
##$BYTORDA= 1
##$CFDGTYP= 0
##$CFRGTYP= 5
##$CHEMSTR= <none>
##$CNST= (0..31)
1 1 145 1 1 1 1 1 1 1 1 1 1 1 1 1 1 1 1 1 1 1 1 1 1 1 1 1 1 1 1 1 
##$CPDPRG= <>
##$CPDPRG1= <>
##$CPDPRG2= <>
##$CPDPRG3= <>
##$CPDPRG4= <mlev>
##$CPDPRG5= <mlev>
##$CPDPRG6= <mlev>
##$CPDPRG7= <mlev>
##$CPDPRG8= <mlev>
##$CPDPRGB= <>
##$CPDPRGT= <>
##$D= (0..31)
0 1.2 0 0 0 0 0 0 0 0.06 0 0.03 0 0 0 0 0.0002 0 0 0 0 0 0 0 0 0 0 0 0 
0 0 0 
##$DATE= 1625206042
##$DBL= (0..7)
120 120 120 120 120 120 120 120 
##$DBP= (0..7)
150 150 150 150 150 150 150 150 
##$DBP07= 0
##$DBPNAM0= <>
##$DBPNAM1= <>
##$DBPNAM2= <>
##$DBPNAM3= <>
##$DBPNAM4= <>
$$ [...]
##$SUBNAM3= <"">
##$SUBNAM4= <"">
##$SUBNAM5= <"">
##$SUBNAM6= <"">
##$SUBNAM7= <"">
##$SUBNAM8= <"">
##$SUBNAM9= <"">
##$SW= 20.0188882624521
##$SWIBOX= (0..15)
0 0 2 0 0 0 0 0 0 0 0 0 0 0 0 0 
##$SW_h= 4006.41025641026
##$TD= 16384
##$TD0= 1
##$TE= 0
##$TE2= 300
##$TE3= 300
##$TEG= 300
##$TL= (0..7)
0 120 120 120 120 120 120 120 
##$TP= (0..7)
150 150 150 150 150 150 150 150 
##$TP07= 0
##$TPNAME0= <>
##$TPNAME1= <>
##$TPNAME2= <>
##$TPNAME3= <>
##$TPNAME4= <>
##$TPNAME5= <>
##$TPNAME6= <>
##$TPNAME7= <>
##$TPOAL= (0..7)
0.5 0.5 0.5 0.5 0.5 0.5 0.5 0.5 
##$TPOFFS= (0..7)
0 0 0 0 0 0 0 0 
##$TUNHIN= 0
##$TUNHOUT= 0
##$TUNXOUT= 0
##$USERA1= <user>
##$USERA2= <user>
##$USERA3= <user>
##$USERA4= <user>
##$USERA5= <user>
##$V9= 5
##$VALIST= <valist>
##$VCLIST= <CCCCCCCCCCCCCCC>
##$VD= 0
##$VDLIST= <DDDDDDDDDDDDDDD>
##$VPLIST= <PPPPPPPPPPPPPPP>
##$VTLIST= <TTTTTTTTTTTTTTT>
##$WBST= 1024
##$WBSW= 4
##$XGAIN= (0..3)
0 0 0 0 
##$XL= 0
##$YL= 0
##$YMAX_a= 360669
##$YMIN_a= -710859
##$ZGOPTNS= <>
##$ZL1= 120
##$ZL2= 120
##$ZL3= 120
##$ZL4= 120
##$ABSF1= 17.50077
##$ABSF2= -2.518269
##$ABSG= 5
##$ABSL= 3
##$ALPHA= 0
##$AQORDER= 0
##$ASSFAC= 0
##$ASSFACI= 0
##$ASSFACX= 0
##$ASSWID= 0
##$AUNMP= <proc_1d>
##$AZFE= 0.1
##$AZFW= 0.1
##$BCFW= 0
##$BC_mod= 2
##$BYTORDP= 0
##$COROFFS= 0
##$CY= -3
##$DATMOD= 1
##$DC= 0
##$DFILT= <>
##$DTYPP= 0
##$F1P= 0
##$F2P= 0
##$FCOR= 1
##$FTSIZE= 16384
##$FT_mod= 6
##$GAMMA= 0
##$GB= 0
##$INTBC= 1
##$INTSCL= 1.334414e-10
##$ISEN= 128
##$LB= 0.24
##$LEV0= 0
##$LPBIN= 0
##$MAXI= 10000
##$MC2= 0
##$MEAN= 0
##$ME_mod= 0
##$MI= 1.114404
##$NCOEF= 0
##$NC_proc= -6
##$NLEV= 6
##$NOISF1= 3.799351
##$NOISF2= 2.8
##$NSP= 0
##$NTH_PI= 0
##$NZP= 0
##$OFFSET= 17.52888
##$PC= 1
##$PHC0= -11912.9
##$PHC1= 11.40099
##$PH_mod= 1
##$PKNL= yes
##$PPARMOD= 0
##$PSCAL= 0
##$PSIGN= 0
##$REVERSE= no
##$SF= 200.130001150432
##$SI= 16384
##$SIGF1= 3
##$SIGF2= 2
##$SINO= 5.538805
##$SIOLD= 16384
##$SREGLST= <1H.CDCl3>
##$SSB= 0
##$STSI= 16384
##$STSR= 0
##$SW_p= 4006.41025641026
##$SYMM= 0
##$S_DEV= 0
##$TDeff= 16384
##$TDoff= 0
##$TI= <>
##$TILT= no
##$TM1= 0
##$TM2= 0
##$TOPLEV= 0
##$USERP1= <user>
##$USERP2= <user>
##$USERP3= <user>
##$USERP4= <user>
##$USERP5= <user>
##$WDW= 1
##$XDIM= 16384
##$YMAX_p= 323003418
##$YMIN_p= -356653
$$ End of Bruker specific parameters
$$ ---------------------------------
##NTUPLES= NMR SPECTRUM
##VAR_NAME=  FREQUENCY,     SPECTRUM/REAL,   SPECTRUM/IMAG
##SYMBOL=    X,             R,               I
##VAR_TYPE=  INDEPENDENT,   DEPENDENT,       DEPENDENT
##VAR_FORM=  AFFN,          ASDF,            ASDF
##VAR_DIM=   16384,         16384,           16384
##UNITS=     HZ,            ARBITRARY UNITS, ARBITRARY UNITS
##FACTOR=    0.24454680195387, 1,            1
##FIRST=     3508.0546075872, 0,             0
##LAST=      -498.355648823059, 0,           0
##MIN=       -498.355648823059, -356653,     0
##MAX=       3508.0546075872, 323003418,     0
$$ Real data points
##PAGE= N=1
##DATA TABLE= (X++(R..R)), XYDATA
$$ [...]
6333C557450J61901J99135Q7809o2668M0774J57274P8703J31623O5947O7129J68428
6322D653505J47464J84703J83465P6627J65263J61034J96501J63252r909R1617
6312F013522M24352J38399m4762J56319K32151J01216J03494K72057J69846K55492
6302G822086J76765K51813K00510M33185L34205L41355M13071M40439N38116N83951
6292A1535496N64510O21556O41474N88014O15252P13557O99127Q26736O69768
6283A7475490N40398M80888N06271M84418M45786O54688N21910M34330O06618
6274B2150797P55703Q11614Q92320R00564J160743J368231J065556J277753J246183
6265C1629464J172251R29531O49977K85212n8341m00392p30952r94050j248145
$$ y = [3557450, 3719351, 3918486, 4006295, 3943627, 3984401, 4141675, 4220378, 4352001, 4417948, 4485077, 4653505, 4800969, 4985672, 5169137, 5245764, 5411027, 5572061, 5768562, 5931814, 5921905, 6013522, 6437874, 6576273, 6531511, 6687830, 6919981, 7021197, 7124691, 7396748, 7566594, 7822086, 7998851, 8250664, 8451174, 8884359, 9218564, 9559919, 9972990, 10413429, 10951545, 11535496, 12100006, 12721562, 13363036, 13951050, 14566302, 15279859, 15978986, 16805722, 17475490, 18015888, 18496776, 19003047, 19487465, 19933251, 20587939, 21109849, 21544179, 22150797, 22906500, 23718114, 24610434, 25510998, 26671741, 28039972, 29105528, 30383281, 31629464, 32801715, 33731246, 34381223, 34666435, 34608094, 34207702, 33476750, 32482700, 31234555]
6256C1234555j466071j539521j637832j581259j478736j474211j333613j394404
6248A9328908j157043j152411j130171q43499j060487q04091o52865n99794n20486
6239A1408061o82076m42584l85099n06229l30570k32322m33007m28557j47881
6230G819736k69016j69206l88926j14795j55236l39290k93742j26439k86249k34768
6220E442069j19419j46641r2230j71650j01365k15389j4344j24845k61856m2423
6210D151907o8113j76265j63326J5658o7530j49069J15031N826j01151j33567
6200C429401p4123q401l7581j23432J1747P3834j08834j40812O2960l6124j03430
6189B945205j16858N8292q3981o7267r1155j23402j41789j2718q0614j33251p5237
$$ y = [31234555, 29768484, 28228963, 26591131, 25009872, 23531136, 22056925, 20723312, 19328908, 18171865, 17019454, 15889283, 15045784, 13985297, 13181206, 12528341, 11928547, 11408061, 10725985, 10283401, 9898302, 9392073, 9061503, 8829181, 8396174, 7967617, 7819736, 7550720, 7381514, 6992588, 6877793, 6722557, 6383267, 6089525, 5963086, 5676837, 5442069, 5322650, 5176009, 5083779, 4912129, 4810764, 4595375, 4581031, 4456186, 4194330, 4151907, 4083794, 3907529, 3744203, 3759861, 3692331, 3543262, 3658293, 3664119, 3562968, 3429401, 3355278, 3346877, 3309296, 3185864, 3197611, 3271445, 3162611, 3021799, 3084759, 3048635, 2945205, 2828347, 2886639, 2802658, 2735391, 2644236, 2520834, 2379045, 2366327, 2285713, 2152462, 2077225]
6178B077225k871l2039l7667m8357n7529O0908N3089j25604o7338l9223k1838
6167A758756o2159K3480N8736l7797j30199j2879l5422J8720L1947j47877l8621
6156A426685J73159l5562j73982K5279j00212j09537M8046n1444N6768O8541l1165
6145A296576j34758o9097l4991J52188r86j18139r6029O0189J09976m608l3246
6134A127075o2639k0658M0222O9807j05703N421L4603q7981Q336N1356j7091L1945
6122A074693J788j71314k7916k9539p4817J15051m1481P9361J05520l0018Q6862
6111A088190k3561j17912o7735k4527n1406K5559j6710O0788R0737k9866l4724
6100H98833J4465j3501p0059J48374j5206m2107n9212K4022o5235j08947K23102
$$ y = [2077225, 2074354, 2042315, 2004648, 1956291, 1898762, 1959670, 2012759, 1887155, 1819817, 1780594, 1758756, 1696597, 1720077, 1778813, 1741016, 1610817, 1597938, 1562516, 1581236, 1613183, 1465306, 1426685, 1599844, 1564282, 1390300, 1415579, 1315367, 1205830, 1253876, 1202432, 1259200, 1327741, 1296576, 1161818, 1092721, 1057730, 1209918, 1208932, 1090793, 994764, 1054953, 1164929, 1160321, 1127075, 1064436, 1043778, 1084000, 1153807, 1048104, 1053525, 1088128, 1000147, 1008483, 1059839, 1042748, 1074693, 1076481, 905167, 877251, 847712, 772895, 887946, 846465, 925826, 1031346, 1001328, 1088190, 1064629, 946717, 878982, 854455, 803049, 828608, 811898, 872686, 963423, 933557, 898833, 913298, 899797, 829738, 978112, 962906, 920799, 861587, 885609, 820374, 711427, 934529]
6089I34529j3820Q433O5063r3449l1496n1360m3435Q6118M6621j40552P6537N5440
6077H98629r0177p4145r9489j414P8922l0443p3616j1085J97867j01867r1304
6066F01878l54P7979o4343J01334O4763j04331q2243L43K4466r315Q9162O1420
6054G60759r366m4985l2554O0680m295j52231j4846R6074L4914L4274n1937q1432
6042E95055J7702M7170P3796J0232j14945n5401J6311N2721K4242K3379j97705
6031D92557J4444L3450k5536P0267j3624k2597m5462R7875R7571k9094N89k302
6019F68138r0718J886O3216J3789o5002n1932L7981p0379O0177J5608J01943q924
6007F75783o3248J5766m0652o3965j23039J55743j6731K06825l7080r6882J08366
$$ y = [934529, 920709, 929142, 994205, 900756, 869260, 817900, 774465, 860583, 907204, 766652, 843189, 898629, 808452, 734307, 634818, 633404, 712326, 681883, 608267, 597182, 795049, 693182, 601878, 601524, 679503, 615160, 716494, 781257, 676926, 594683, 595026, 619492, 610177, 699339, 760759, 751393, 706408, 673854, 734534, 730239, 578008, 563162, 659236, 694150, 728424, 676487, 595055, 612757, 659927, 733723, 743955, 629010, 573609, 589920, 642641, 666883, 690262, 492557, 507001, 540451, 514915, 585182, 571558, 548961, 503499, 601374, 698945, 669851, 670440, 668138, 577420, 579306, 642522, 656311, 591309, 539377, 577358, 506979, 567156, 582764, 684707, 675783, 612535, 628301, 587649, 523684, 400645, 556388, 539657, 746482, 709402, 612520, 720886]
5996G20886r7294j73606L2084J40511K1835N7086m5065M5008J32417K6908o0641
5985H00129P614J32571n8185q7648J9827r787J1604l7259J14348k5650k4771M5469
5973H88262m7010Q8781J8837m4040r1153O2086j02761L1124J29738m5934j9515
5962H68415K6923k5626K7417j01192P3588l7675K4421O2567M5763q5233m0589
5951H38779P4963m6685N4761M6102k6137j1617K8388m9324K6929r535K9879R3936
5939A050439o1854r9785j38652M2413K5769J05762O1437r1532L9986q9384j02466
5928G42133Q2754K7664o3724p2407J05321l6192o4666n3311L5262Q4583j12941
5917F74476K13522P2289k7537j37045j09877J11250N4540j3775k8380K909L3270
$$ y = [720886, 623592, 449986, 482070, 622581, 644416, 701502, 656437, 701445, 833862, 860770, 800129, 807743, 940314, 882129, 794481, 814308, 804521, 816125, 778866, 893214, 867564, 842793, 888262, 841252, 930033, 948870, 904830, 813677, 875763, 773002, 804126, 933864, 887930, 868415, 895338, 869712, 897129, 795937, 869525, 831850, 856271, 918838, 964601, 879368, 838779, 913742, 867057, 921818, 967920, 941783, 930166, 958554, 909230, 936159, 926624, 956503, 1050439, 988585, 888800, 750148, 792561, 818330, 924092, 985529, 893997, 933983, 844599, 742133, 824887, 852551, 788827, 716420, 821741, 785549, 720883, 667572, 702834, 787417, 674476, 887998, 960287, 932750, 795705, 685828, 797078, 851618, 837843, 809463, 812372, 845642]
5906H45642m3023j5055m2945k9944J46438o8527q0994Q3171J00867j7592M9186
5895I27224P9933j29902N6578J3942K3809O4853K8856k096j13268P6687j47451
5884H79165r4633K21170n5689k4221J1002J0378o713j23442N1744J32145K4510
5873A025416j02586K2597L6726m6552J39965K4288k9225q6810R5630l5771J07961
5862A151639P3461n4619J1941l9448l5677m6250L4316L7228j8978m9528j1072
5851A053013M9863K8627j4092j04012R1404J08525O1944L9254J04865M584l2022
5840A391953P8004n878O6664m2173q454K2341M5578R3944N7354R8770j33767n3529
5828A610807m6059q0233m9225o0257K9971j931m7164L6282J00683j16297J02228
$$ y = [845642, 802619, 787564, 744619, 714675, 861113, 792586, 711592, 794763, 895630, 878038, 927224, 1007157, 877255, 933833, 947775, 971584, 1036437, 1065293, 1063197, 949929, 1026616, 879165, 784532, 1005702, 950013, 925792, 936794, 947172, 940459, 817017, 868761, 1000906, 1025416, 922830, 945427, 982153, 935601, 1075566, 1099854, 1070629, 983819, 1079449, 1043678, 1151639, 1225100, 1170481, 1182422, 1142974, 1107297, 1061047, 1095363, 1132591, 1113613, 1064085, 1053013, 1102876, 1131503, 1117411, 1013399, 1104803, 1213328, 1275272, 1314526, 1419391, 1423975, 1391953, 1469957, 1464079, 1530743, 1488570, 1480116, 1502457, 1548035, 1641979, 1699333, 1798103, 1664336, 1610807, 1564748, 1484515, 1435290, 1375033, 1405004, 1403073, 1355909, 1392191, 1492874, 1376577, 1478805]
5817A478805J12912j63051l747R1003q9838P8378J03748j06480j45547r904J3895
5806A360174O2145R718p1331r8347R6231J0463O5276K352j26724P5298J05150
5795A490405m8509q4953O9207o665p9092k5651J17986J66215K4666o9193N5087
5784A609503J25610J19102J17111Q8719q316O2596J33280j83625j89588m4769
5774A829623k7374j02858p1829K0129P1593l2608n1074J5379m3368n9441j6686
5763A531486n7019l1946M404L6056O3492J01077n8947r0666J08019N97n4920m6067
5751A505566R6903j24148K2802Q3766J20393M9963p3632O689n3049O4479J1233
5740A710965n025l8606R5767P8412m0582p912J42058J27023J2187m7646r0869
$$ y = [1478805, 1591717, 1428666, 1424919, 1515922, 1426084, 1504462, 1608210, 1501730, 1356183, 1346279, 1360174, 1422319, 1432037, 1360706, 1262359, 1358590, 1369053, 1434329, 1436681, 1309957, 1385255, 1490405, 1441896, 1356943, 1426150, 1419485, 1340393, 1314742, 1432728, 1598943, 1623609, 1554416, 1609503, 1735113, 1854215, 1971326, 2060045, 2051729, 2114325, 2247605, 2063980, 1874392, 1829623, 1802249, 1699391, 1627562, 1647691, 1719284, 1686676, 1635602, 1650981, 1607613, 1548172, 1531486, 1474467, 1442521, 1446925, 1482981, 1546473, 1647550, 1588603, 1497937, 1605956, 1606553, 1551633, 1505566, 1602469, 1478321, 1501123, 1584889, 1705282, 1755245, 1681613, 1688302, 1635253, 1699732, 1710965, 1705940, 1667334, 1763101, 1841513, 1800931, 1793019, 1935077, 2062100, 2074287, 2026641, 1935772]
5729A935772Q6323K06343K1660k687N3875j81614R3394J22498P8805P4882J25122
5718B614373o0746q1351K81531J23691J07350J02892O5571J35880J65689j7238
5708C437642K31573L59528K16874J05075K44157J79989m579J00397N2922p7800
5698D845778p2618j31853j07090P8478L1217K6908n6139J04116O5315O1030J25148
5687D970290J11589J96967Q4901R0366J74558M33804K00931L19714M63308L15771
5677G362199N36789L71455K52196K87414J15269j17413l05562l95078l49515k59222
5667G498532l20913l21366j3968m4543j64800j8295q1567j76199L3541M6075J27232
5656F563729J99663L11942K01835K29421M54395L54136N01074K79302L47406O17724
$$ y = [1935772, 2022095, 2228438, 2250098, 2247411, 2301286, 2119672, 2213066, 2335564, 2414369, 2489251, 2614373, 2553627, 2472276, 2753807, 2877498, 2984848, 3087740, 3153311, 3289191, 3454880, 3437642, 3669215, 4028743, 4245617, 4350692, 4594849, 4774838, 4770259, 4870656, 4923578, 4845778, 4773160, 4641307, 4534217, 4612695, 4643912, 4670820, 4614681, 4718797, 4784112, 4845142, 4970290, 5081879, 5278846, 5363747, 5454113, 5628671, 6062475, 6263406, 6583120, 7046428, 7362199, 7898988, 8270443, 8522639, 8810053, 8925322, 8807909, 8502347, 8107269, 7757754, 7498532, 7177619, 6856253, 6842285, 6797742, 6632942, 6614647, 6533080, 6356881, 6390422, 6436497, 6563729, 6763392, 7075334, 7277169, 7506590, 7960985, 8315121, 8816195, 9095497, 9442903, 10060627]
5646A0060627M86497L01507J75943J52162K55593K00565K36358J13968Q4034j41404
5636A1925850k99604j56952k83504m14242k68779k56561k59037k07473r7389Q6058
5626I768367J5153M0897P3268J33188L06251N38543L62262M15062N91863P27724
5616A2972578O05463Q10120P08419Q16839Q77145P27641M80587K98298K93944
5607A8591034k35406n83212m93447m15368l59718m10077m37847k18713l8188J65921
5597A5564979K27435L46952M73255O22595O67063P39519Q90812J196028J502649
5588B2231287J868814K141131K359750K461721K547551K303060J898558J148071
5580C8959943Q7323q37899j643238k097779k105063j768971j488554j148833p52431
$$ y = [10060627, 10547124, 10848631, 11024574, 11176736, 11432329, 11632894, 11869252, 11983220, 12067254, 11925850, 11626246, 11469294, 11185790, 10771548, 10502769, 10246208, 9987171, 9779698, 9682309, 9768367, 9783520, 9824417, 9897685, 10030873, 10337124, 10875667, 11237929, 11652991, 12244854, 12972578, 13578041, 14388161, 15096580, 15913419, 16790564, 17518205, 17998792, 18297090, 18591034, 18355628, 17772416, 17278969, 16863601, 16503883, 16093806, 15655959, 15437246, 15399058, 15564979, 15792414, 16139366, 16612621, 17235216, 17902279, 18641798, 19532610, 20728638, 22231287, 24100101, 26241232, 28600982, 31062703, 33610254, 35913314, 37811872, 38959943, 39047266, 38209367, 36566129, 34468350, 32363287, 30594316, 29105762, 27956929, 27204498]
5571B7204498o75785l81285Q4727J44100N24717P77690J071972J230389J545787
5562C1526810K066191K735457L240669L880350M366782M464402M167551L425630
5554E9873842K443822N26454j822920l949860m755367n060069m478503l852151
5546C8925248l114107k626565k247795j723584j441600j221351r11147n12269
5538B5126830l62944J6850K74890M95230O45572J008472J278891J466284J546914
5529C1496989J607346J304019Q86209M9994q48663j803110k455383k595173k481773
5520B5160455k355941j934631j707516j510662j413143j241470j002337q33292
5512A3161463p16276p38704o25096m53470l42192m59032m23524m06715l64889
$$ y = [27204498, 26528713, 26147428, 26232155, 26376255, 26900972, 27678662, 28750634, 29981023, 31526810, 33593001, 36328458, 39569127, 43449477, 47816259, 52280661, 56448212, 59873842, 62317664, 62844118, 61021198, 57071338, 52315971, 47255902, 42777399, 38925248, 35811141, 33184576, 30936781, 29213197, 27771597, 26550246, 25639099, 25126830, 24763886, 24780736, 25055626, 25550856, 26196428, 27204900, 28483791, 29950075, 31496989, 33104335, 34408354, 35294563, 35344557, 34495894, 32692784, 30237401, 27642228, 25160455, 22804514, 20869883, 19162367, 17651705, 16238562, 14997092, 13994755, 13161463, 12445187, 11706483, 11081387, 10627917, 10285725, 9826693, 9403169, 8996454, 8631565]
5503H631565m66015j71115k25388l44935k54482j65183k39036j60019j63010q4101
5493F358281q6647j47161j35109K1246k28898m7619r0529j13727n5051j28023
5483E346763j94447j27161o3604K6577j65112j9791L738j61301k5137o8300k4162
5472D528063j7909k7103n2031o923l5428J07768J02264N5159j03482J46115O3081
5461D759574n5753j01715M6060j40900l7033o1104j76373K273K1102k2929j06261
5450D126941k9156J259j21858L98j6456N696j4804k9301L3938n3913J2133p0555
5438C844322R720J47750m1002J1355j08303j35713m0143M9486j5590j3435N2068
5427C760515J568J873J2269j04377L5954M1971l0266o415j8574O4376j01832p537
$$ y = [8631565, 8165550, 7994435, 7769047, 7424112, 7169630, 7004447, 6765411, 6605392, 6442382, 6358281, 6271634, 6124473, 5989364, 6010610, 5781712, 5734093, 5643564, 5529837, 5474786, 5346763, 5152316, 5025155, 4961551, 4988128, 4823016, 4803225, 4806963, 4645662, 4620525, 4552225, 4528063, 4510154, 4483051, 4431020, 4424097, 4388669, 4496437, 4598701, 4653860, 4550378, 4696493, 4759574, 4703821, 4602106, 4648166, 4507266, 4470233, 4409129, 4232756, 4235029, 4256131, 4233202, 4126941, 4097785, 4099044, 3977186, 3977584, 3961128, 3966824, 3952020, 3922719, 3956657, 3902744, 3914877, 3844322, 3854042, 4001792, 3960790, 3972145, 3863842, 3728129, 3687986, 3737472, 3721882, 3708447, 3760515, 3762083, 3763956, 3776225, 3671848, 3707802, 3749773, 3719507, 3713092, 3694518, 3758894, 3657062, 3649525]
5415C649525L6745J09090m1947m1047J32212q5266j34799l892N5153l2694R210
5404C652290N1343M4086o6026m2558Q2344k6723J10224J2332j43336N3885J3437
5393C741298j80169p9026N4727Q5561n7086P781N9449J4912O4139Q8069o6278
5382C733377M4189n2501j69341j12700j28984r9814O3628N1032R9989j90545q8859
5371C149471n253J42030J8817j52847J67958N4011j08622j21770K8758m9436j2281
5360C110836k2204L2309M9457M6528J53981l952j47371P2700j49050m3860J5446
5349C114820Q518n8394R2630J06143j0170N9628J5835k1606r3762J0369m7191
5338C176820l2446M8352J787n2698M6789J20881j55349r8152J36244J00143L8277
$$ y = [3649525, 3686270, 3795360, 3753413, 3712366, 3844578, 3759312, 3624513, 3620621, 3675774, 3643080, 3652290, 3703633, 3747719, 3681693, 3639135, 3721479, 3694756, 3804980, 3817312, 3673976, 3727861, 3741298, 3561129, 3482103, 3536830, 3622391, 3565305, 3573086, 3632535, 3647447, 3711586, 3799655, 3733377, 3777566, 3725065, 3555724, 3443024, 3314040, 3214226, 3277854, 3328886, 3428875, 3238330, 3149471, 3144218, 3286248, 3305065, 3152218, 3320176, 3374187, 3265565, 3143795, 3172553, 3123117, 3110836, 3088632, 3120941, 3170398, 3216926, 3370907, 3366955, 3219584, 3292284, 3143234, 3099374, 3114820, 3123338, 3064944, 3157574, 3263717, 3253547, 3313175, 3329010, 3307404, 3213642, 3224011, 3176820, 3144374, 3192726, 3194513, 3141815, 3188604, 3309485, 3154136, 3055984, 3192228, 3292371, 3330648]
5327C330648l1017R1726L1601J00060Q4855M6213J17347O4358k8445R4697n1949
5316C850094K9830J5658j8269L1633k3798J67243N8808M8293j7917P7580n2017
5305D167138M5399J10536j01310n962M421J42467J10287o277k8065o8541N5472
5294D425565P7343O4150O0768l0532L6411J63849N8244p9654l0564j48427j45063
5283D452090k8135J18946l6344l601K4064Q1410L606Q087N715M6276K71632Q757
5271D952503L8186J33007R0559M750O1932l6638j7752N4137M1200N4206R2201
5260E468291q5450m387j9415k7607Q7252Q5469k5095j47730l4337N6970l6133
5249E317828M6758P8100q9006J25743j2446l0162J1355K9926l4885l9009J30631
$$ y = [3330648, 3299631, 3391357, 3422958, 3523018, 3607873, 3654086, 3771433, 3835791, 3807346, 3902043, 3850094, 3879924, 3895582, 3877313, 3908946, 3885148, 4052391, 4111199, 4159492, 4141575, 4219155, 4167138, 4212537, 4323073, 4221763, 4215801, 4220222, 4362689, 4472976, 4466699, 4438634, 4370093, 4425565, 4502908, 4567058, 4627826, 4597294, 4633705, 4797554, 4855798, 4776144, 4745580, 4597153, 4452090, 4423955, 4542901, 4506557, 4502956, 4527020, 4608430, 4612036, 4620123, 4625838, 4672114, 4943746, 4952503, 4990689, 5123696, 5214255, 5219005, 5280937, 5244299, 5226547, 5280684, 5321884, 5376090, 5468291, 5382841, 5378454, 5359039, 5331432, 5418684, 5504153, 5479058, 5331328, 5296991, 5353961, 5317828, 5364586, 5442686, 5353680, 5479423, 5466977, 5436815, 5448170, 5478096, 5443211, 5404202, 5534833]
5238E534833k8088n5663p5165K5058O2919M9916k6992j51710K8854P094j55453
5227E215603k9484M4743L9888q5406p3948Q310R514J53114J3760k4553q128R9949
5215E363362K1641R3679J20270j0441p5210q3704P4564L3317q8711J4511J75979
5204E639257n7268N133n568j9285L3532q881L2222J17599J23723r436M2113O2155
5192E955296o8690j5746J44374o819K62563J49698p4985O8826Q5247J16345J29240
5181F745349Q8328J34511J84482n8608J34394R2516M9122k5984P8466K93863O7702
5170G784141O8570J58620J57191J92979J49101J99716J85145R3607J01168J83882
5160I274120N9175J68284K10775J89838K11143J96378L66670K89793N5528K11160
$$ y = [5534833, 5506745, 5451082, 5375917, 5400975, 5463894, 5513810, 5486818, 5335108, 5363962, 5371056, 5215603, 5186119, 5230862, 5270750, 5185344, 5111396, 5119706, 5129220, 5282334, 5296094, 5271541, 5263413, 5363362, 5385003, 5478682, 5598952, 5588511, 5513301, 5429597, 5504161, 5537478, 5448767, 5463278, 5639257, 5581989, 5587122, 5581554, 5562269, 5595801, 5586920, 5619142, 5736741, 5860464, 5851028, 5893141, 5955296, 5886606, 5870860, 6015234, 6008415, 6270978, 6420676, 6345691, 6414517, 6499764, 6616109, 6745349, 6833677, 6968188, 7152670, 7094062, 7228456, 7320972, 7370094, 7344110, 7422576, 7716439, 7784141, 7852711, 8011331, 8168522, 8361501, 8510602, 8710318, 8895463, 8989070, 9090238, 9274120, 9333295, 9501579, 9712354, 9902192, 10113335, 10309713, 10676383, 10966176, 11021704, 11232864]
5150A1232864L06750K03354K63656K29049J74856M13680L78023M87799N53689
5141A4243720L58703M88546M54164M89690M37649M35637N86754P10151O30482
5132A8835496Q24486J011841O57574P40041R48676J103402J100513J480920J660539
5123B8363488J962945K338719K946800L265259L474850L944591L986637L904133
5115E4187422N878484L683805k080942q33803M4140j114514j105873k61658K39694
5106E8636755J228707K768586K744803P46504J352386K467672J799969K145695
5098G3891077M300870K891079K082757K489714L848115O146869P704850Q122742
5090A11478073O147030L864127O829232O526381o285698r629798o832675n849180
$$ y = [11232864, 11539614, 11742968, 12006624, 12235673, 12410529, 12824209, 13202232, 13690031, 14243720, 14602423, 15090969, 15545133, 16034823, 16472472, 16908109, 17494863, 18205014, 18835496, 19659982, 20671823, 21329397, 22069438, 23018114, 24121516, 25222029, 26702949, 28363488, 30326433, 32665152, 35611952, 38877211, 42352061, 46296652, 50283289, 54187422, 60065906, 63749711, 61668769, 60834966, 60879106, 59764592, 58658719, 58397061, 58636755, 59865462, 62634048, 65378851, 66125355, 67477741, 69945413, 71745382, 73891077, 78191947, 81083026, 83165783, 85655497, 89503612, 95650481, 103355331, 111478073, 117625103, 121489230, 128318462, 134844843, 128559145, 118929347, 112096672, 106247492]
5082A06247492n648530m835395m393241l680140j581535j304304l921709m249601
5074G6633037k434195k509541k342620p15880l51495j710413j418331l38681P31960
5065F5543841J768070K903115J607657r12361o13774J198215l708541o617871
5057F1168351n495482m811730l438615k747433k686267k920791k507205k292631
5049C4268197j558251j333640j081792j208717j285894o80574o45421q95517r63201
5040B4615190q03552m30865l68323k96002k62148j85631j64490O359k10189m5300
5030B1855049o1236k04805k34718k08924l94325k08915j78611k34772j28702k70172
5020A9729869k35192j92108j43644k21790j75183Q2441j19123j27413P9856J12473
$$ y = [106247492, 100598962, 95763567, 91370326, 87690186, 86108651, 84804347, 80882638, 76633037, 74198842, 71689301, 69346681, 68630801, 68279306, 66568893, 65150562, 64811881, 65543841, 67311911, 70215026, 71822683, 70910322, 70296548, 71494763, 67786222, 61168351, 55672869, 50861139, 47422524, 44675091, 41988824, 39068033, 36560828, 34268197, 32709946, 31376306, 30294514, 29085797, 27799903, 27119329, 26473908, 25578391, 24615190, 23811638, 23380773, 23012450, 22716448, 22454300, 22268669, 22104179, 22110538, 21900349, 21855049, 21793813, 21589008, 21354290, 21145366, 20751041, 20542126, 20363515, 20128743, 20000041, 19729869, 19494677, 19302569, 19158925, 18937135, 18761952, 18844393, 18725270, 18597857, 18677713, 18790186]
5010A8790186J27889N5636K0826Q9426J90442L82713N81318M95134N90350L83786
5000B1707706L17106N41971O36673P64608P81452J132472J287700J509050J814042
4991C0492780J873164K333085K758067L277946L645376M154380M899156N357947
4983E8791901N464175N891064O106310N740576N313795M582039L349017K159935
4975I7398812M84360j492895l326517m586018n172092n380462n622692n457086
4967F6845410n355929n283305m843591m345757l902216l450349l071574k624794
4959C3967895k369408k089879j749176j495126j304418j025089j071579r89998
4951B1873222q27385o44987p37932o11621o32199o22510m84968n86005m48287
$$ y = [18790186, 18918075, 18973711, 18994537, 19083963, 19274405, 19657118, 20238436, 20733570, 21323920, 21707706, 22024812, 22566783, 23203456, 23968064, 24749516, 25881988, 27169688, 28678738, 30492780, 32365944, 34699029, 37457096, 40735042, 44380418, 48534798, 53433954, 58791901, 64256076, 70147140, 76253450, 81994026, 87307821, 91889860, 95238877, 97398812, 97883172, 96390277, 93063760, 88477742, 83305650, 77925188, 72302496, 66845410, 61489481, 56206176, 51362585, 47016828, 43114612, 39664263, 36592689, 33967895, 31598487, 29508608, 27759432, 26264306, 24959888, 23934799, 22863220, 21873222, 21045837, 20400850, 19662918, 19051297, 18419098, 17796588, 17311620, 16725615, 16277328]
4942A6277328k78065l46795k48004k03328j30589K5309p626J51949K01703L92613
4932A5834495N49674O75677O24217N29413L75254J72082k97893n95002r10047
4923A6957870j010521r48583r46769q70997p41534n53284m88584l77546m58809
4914A0561243m20800k06736k92702j96714k03756j61630k36448k02995k41877
4905H397585j92443l8742j57360k43325j04208j42948j58006j47062r0653n2759
4895G070079j50457r2897j55080j75424p2309k05981j9756l6428p3090p2743m1791
4884E974123K6879J5549q2702l7175r2267m2824k2975l1846j9683K4204l633O8984
4872E776634N0055O976j16460j17546P5579O2091J23132n9974K3707N3236N4762
$$ y = [16277328, 15999263, 15652468, 15404464, 15201136, 15070547, 15095856, 15088230, 15240179, 15441882, 15834495, 16384169, 17059846, 17684063, 18213476, 18588730, 18760812, 18462919, 17867917, 16957870, 15947349, 14998766, 14051997, 13181000, 12439466, 11886182, 11397598, 11020052, 10561243, 10140443, 9933707, 9641005, 9444291, 9240535, 9078905, 8842457, 8639462, 8397585, 8205142, 8166400, 8009040, 7765715, 7661507, 7518559, 7360553, 7213491, 7122838, 7070079, 6919622, 6826725, 6671645, 6496221, 6423912, 6217931, 6198175, 6161747, 6088657, 6015914, 5974123, 6001002, 6016551, 5933849, 5896674, 5804407, 5761583, 5738608, 5706762, 5687079, 5711283, 5707650, 5776634, 5826689, 5833665, 5717205, 5599659, 5675238, 5737329, 5860461, 5800487, 5824194, 5877430, 5932192]
4861E932192N0842j5251j18026k5547j45254j02690p1498j30701J9795m4503j13907
4850E235452r5293j9010O1884m588j3148K6102J25331J73513Q2625L228J85300
4839E761396N9965K99853R6706P4861J60483N6900j32261j78473q8629n3949p3969
4828E982883L7997p2538J26865q5439R065R9843Q7469J68115K59589K79824K80272
4817G173945L40251L70961M40027K73458K43894M33299O00085P91037Q48996J202290
4807A2718243J681481K415306K832002K091962J667024K651379K318973k973907
4799B5402463m250717l375645k755609j706478j277334p92607p82220n76234n94546
4790I291073n47585l47521k80975q7741j35865k39999j06084k0973J05549k8174
$$ y = [5932192, 5983034, 5967783, 5849757, 5824210, 5678956, 5576266, 5504768, 5374067, 5393862, 5349359, 5235452, 5140159, 5121149, 5183033, 5178445, 5165297, 5191399, 5316730, 5490243, 5572868, 5576096, 5761396, 5821361, 6121214, 6217920, 6292781, 6453264, 6510164, 6377903, 6199430, 6110801, 6056852, 5982883, 6020880, 5948342, 6075207, 5989768, 5998833, 6098676, 6186145, 6354260, 6613849, 6893673, 7173945, 7514196, 7885157, 8325184, 8598642, 8842536, 9275835, 9875920, 10666957, 11515953, 12718243, 14399724, 16815030, 19647032, 21738994, 23406018, 26057397, 28376370, 25402463, 21151746, 17776101, 15020492, 13314014, 12036680, 11244073, 10461853, 9885619, 9291073, 8743488, 8395967, 8114992, 8027251, 7891386, 7651387, 7545303, 7524330, 7629879, 7601705]
4780G601705N4239J04152K16331M60080N77772P23263M48695K58176P11121M52023
4770A1607557o77933q70523q19900n78226m74671n50528m62934k41675k61022
4761F670145j18640j09448q2407j72361k07033J12324P602m9119J34507j934J3620
4750F197256J06219l4229J93444O3913m5227j23520j97361j28211j53146k70021
4740E609117k00500k32903j19318j20623k31795k27860j11765K031j07570r8210
4730D160604l1239r8959r2517j22718j20482n6996n8586k8159P3163k5613k5864
4719C572634l06n5743k6573R7170n774M537J17891J10864J0073J29137m3991J62090
4707D072009J87295k3304J52322K13793R4362L4176l960J86965K02313P3175J44253
$$ y = [7601705, 7655944, 7760096, 7976427, 8436507, 9014279, 9737542, 10186237, 10444413, 11155534, 11607557, 10929624, 10059101, 9239201, 8660975, 8186304, 7635776, 7172842, 6931167, 6670145, 6551505, 6442057, 6359650, 6187289, 5980256, 6092580, 6100182, 6051063, 6185570, 6183636, 6197256, 6303475, 6269246, 6462690, 6526603, 6481376, 6357856, 6160495, 6032284, 5879138, 5609117, 5408617, 5175714, 5056396, 4935773, 4703978, 4476118, 4364353, 4366384, 4258814, 4160604, 4129365, 4030406, 3937889, 3815171, 3694689, 3637693, 3579107, 3550948, 3624111, 3598498, 3572634, 3572328, 3516585, 3490012, 3587182, 3581408, 3585945, 3703836, 3814700, 3824773, 3953910, 3909919, 4072009, 4259304, 4236000, 4388322, 4602115, 4696477, 4730653, 4726693, 4913658, 5115971, 5189146, 5333399]
4696E333399J87038O131m9902m0299j28793k73441j11682j91281l57592l89292
4686C984286k41279j16594p5433j06801l4849m9557j53749L9819j63085j51011
4676B931747m7179L4896M5903k4088m4978j2692q0097r1066N6922O2647o0414
4665B771601K4885r818o0009M5718K3817k2467L9976L0596p3649K1729J0836q0166
4653B723049O133J85945Q663k0662l751M9283j20807k8689K9051q9662r0766O9768
4641B717555J79101n3990p8173n1116j9235j2242k86L6909L9175m5354L2786l3155
4629B711975k6330Q2135N985j1900L79L3004J28849n051j3407M6677J47328J4763
4617C114407M5915n7392M5077K4170m1490q7063j34225j37854k0947N8510J0408
$$ y = [5333399, 5520437, 5526568, 5476666, 5436367, 5307574, 5034133, 4922451, 4731170, 4373578, 3984286, 3743007, 3626413, 3550980, 3444179, 3409330, 3359773, 3206024, 3245843, 3082758, 2931747, 2884568, 2919464, 2965367, 2941279, 2896301, 2883609, 2803512, 2712446, 2769368, 2832015, 2771601, 2796486, 2786668, 2726659, 2772377, 2796194, 2773727, 2813703, 2844299, 2770650, 2792379, 2803215, 2723049, 2729182, 2915127, 2923790, 2903128, 2899377, 2948660, 2827853, 2799164, 2828215, 2738553, 2647787, 2717555, 2896656, 2842666, 2764493, 2713377, 2694142, 2681900, 2681614, 2718523, 2757698, 2712344, 2745130, 2711975, 2685645, 2767780, 2773765, 2761865, 2762244, 2795248, 2924097, 2919046, 2905639, 2952316, 3099644, 3114407, 3160322, 3102930, 3148007, 3172177, 3130687, 3043624, 2909399, 2771545, 2750598, 2809108, 2819516]
4606B819516j14532L9688J08413m8019J11660N6303j15570P8195j5184L524n0655
4595B873339j32783O876k633p0701M0147M8594j50667J8031Q2088k6139p8486
4584B607666p8755L204O6161L3395K5564R5391j02413P3526P9931r1836j18018
4573B593816o689J34315j4151j0729J82390l4068m5104q3962m525L0250O0408
4562B801951O1761j7121R2125N0094j1521J4075K1723j039Q2435N6182J0570Q739
4550C169974J62735J31534k6987J7646J36278n4227j2005Q4456l2400J08719j1267
4539C674456O2164n8667m8732L7591j6686J6299q9896J82720n0764J06432K1387
4528C836304J21278J18230l1320q560J15947k5695k2076j8680J51487J7162P1023
$$ y = [2819516, 2704984, 2744672, 2853085, 2805066, 2916726, 2973029, 2857459, 2935654, 2920470, 2923994, 2873339, 2740556, 2747432, 2744799, 2674098, 2714245, 2762839, 2612172, 2630203, 2712291, 2686152, 2607666, 2528911, 2532115, 2598276, 2631671, 2657235, 2752626, 2650213, 2723739, 2803670, 2711834, 2593816, 2587127, 2721442, 2707291, 2696562, 2878952, 2844884, 2799780, 2715818, 2711293, 2741543, 2801951, 2863712, 2846591, 2938716, 2988810, 2977289, 2991364, 3013087, 3012048, 3094483, 3150665, 3161235, 3169974, 3332709, 3464243, 3437256, 3454902, 3591180, 3536953, 3524948, 3609404, 3577004, 3685723, 3674456, 3736620, 3677953, 3629221, 3666812, 3650126, 3666425, 3576529, 3759249, 3708485, 3814917, 3836304, 3957582, 4075812, 4044492, 4035932, 4151879, 4126184, 4104108, 4085428, 4236915, 4254077, 4325100]
4517D325100L8055n820N5174N4578N1234J08837Q6617n2922j32201M5205J61610
4506D735467O8232L115L0697L0526N1340J98836j33590n6417K58381J32615M0465
4495E359667L035J49904O2577R5943J46844J63318J37422J85665K34077Q6538
4485F624990J81066K37793K61086K43747N31967K77117M87125L50623L24069M60139
4475I979722K15121J50302P1664J11585j9959j81345j36591k4722l6498o1966
4465A0067313J39736J43164L17234L38691L82731M11668L38599M27523K53078
4456A2819737K18648k5299j4612N7650O4054N2965J77499K95037K09884L12384
4446A4167947L60297J90955J19302J54248Q5742P1013j15893P9455M1778j01075
$$ y = [4325100, 4363155, 4357335, 4412509, 4467087, 4518321, 4627158, 4713775, 4660853, 4528652, 4573857, 4735467, 4803699, 4806814, 4837511, 4868037, 4919377, 5118213, 4984623, 4928206, 5186587, 5319202, 5359667, 5362702, 5512606, 5575183, 5671126, 5817970, 5981288, 6118710, 6304375, 6538452, 6624990, 6806056, 7043849, 7304935, 7548682, 8080649, 8357766, 8844891, 9195514, 9519583, 9979722, 10194843, 10345145, 10416809, 10528394, 10508435, 10327090, 10190499, 10165777, 10129279, 10067313, 10207049, 10350213, 10667447, 11006138, 11388869, 11800537, 12139136, 12566659, 12819737, 13038385, 13013086, 12998474, 13056124, 13120178, 13173143, 13350642, 13645679, 13855563, 14167947, 14528244, 14719199, 14838501, 14992749, 15078491, 15149504, 15033611, 15113066, 15154844, 15053769]
4436A5053769R6278J13761J71868K59475K70047L63440K87284K60348J86243J82687
4426A7245200J71170J36103M39460M37493M27873M14586M33584N80387M26513
4417B0712369O23535O44902Q17644R91686J083744J090120J061462J303295J117835
4408B9446592J022280Q18851N59385K79595J7622J6156r3360Q8795L07734N39761
4398C3003411O49220Q01536J223239J460149J480574J654408J842408J975740
4390D4090685K077649J958879K031960K049416J878563J635983J523995J242503
4382E8489633J114153R81354J153344J439497J595897J896372K135649J997958
4374G0803857K234829K233092K095943K009989J618008J477790J278447J113491
$$ y = [15053769, 15150047, 15263808, 15435676, 15695151, 15965198, 16328638, 16615922, 16876270, 17062513, 17245200, 17416370, 17552473, 17991933, 18429426, 18857299, 19271885, 19705469, 20285856, 20712369, 21335904, 21980806, 22798450, 23790136, 24873880, 25964000, 27025462, 28328757, 29446592, 30468872, 31287723, 31847108, 32126703, 32144325, 32160481, 32067121, 32155916, 32463650, 33003411, 33652631, 34454167, 35677406, 37137555, 38618129, 40272537, 42114945, 44090685, 46168334, 48127213, 50159173, 52208589, 54087152, 55723135, 57247130, 58489633, 59603786, 60585140, 61738484, 63177981, 64773878, 66670250, 68805899, 70803857, 73038686, 75271778, 77367721, 79377710, 80995718, 82473508, 83751955, 84865446]
4366H4865446Q78308J054226R63983R84434J217573J003471L38881j65262r23554
4357I0217506j761633k685287l505247m043355m098160l624400k958341k096871
4349F5444212j414015m64803J35680O35588P76379M12279k20781j397149k680997
4340F1226393l874191m361610l913730l570070l225158k667040k208973j941258
4332C5464363j728623j323633j345326q98688o53960n36527l83224m39903m10253
4323B7744226l58228o34360o39781p33868r86538r20552r13067q60441p08336
4314B0989055o40758p08414n69307n45541n00034m74081m86940n18494n96640
4305A5948846o45233n89856o52494l58417m13078l98596m26547m14195l82708
$$ y = [84865446, 85743754, 86797980, 87761963, 88746397, 89963970, 90967441, 91306322, 91141060, 90217506, 88455873, 85770586, 82265339, 78221984, 74123824, 70499424, 67541083, 65444212, 64030197, 63565394, 63701074, 64336662, 65113041, 65525320, 65304539, 63907390, 61226393, 57352202, 52990592, 49076862, 45506792, 42281634, 39614594, 37405621, 35464363, 33735740, 32412107, 31066781, 30168093, 29514133, 28977606, 28594382, 28154479, 27744226, 27385998, 26751638, 26111857, 25377989, 24391451, 23470899, 22557832, 21697391, 20989055, 20348297, 19639883, 19070576, 18525035, 18025001, 17550920, 17063980, 16545486, 15948846, 15303613, 14713757, 14061263, 13702846, 13289768, 12891172, 12464625, 12050430, 11667722]
4296A1667722m36057j98690k71679m04952j82078q3459k69430k08978K625m00613
4286I214411j96490N528r552p5984j22833j669n5181j20035q5801m7145j62254
4275H342995l15800j51198N981o1815j1923k6594l2754o5891m5293M8496L4304
4264G720508J02162Q6913j03092O0772j6803P1952P9314M4017J13189o633K16952
4253H369251J50971m6937j1547J1170m6935P3404r8918j62026j0168r6798p1648
4242H059819j37931r2378N4189p445m8653m3487J00735l8840k2941N8771L5210
4231G917049P8934Q562O2184M3300M4442P0831Q3996J46745J34180K36139K39566
4220I065928J82881M07576L40291M45378L49672J81474k19096l77099n20911m53803
$$ y = [11667722, 11231665, 11032975, 10761296, 10356344, 10174266, 10090807, 9821377, 9612399, 9615024, 9214411, 9017921, 9023449, 9013897, 8937913, 8815080, 8813411, 8758230, 8638195, 8552394, 8505249, 8342995, 8027195, 7875997, 7881978, 7820163, 7808240, 7781646, 7748892, 7683001, 7637708, 7686204, 7720508, 7822670, 7909583, 7806491, 7867263, 7850460, 7922412, 8001726, 8045743, 8158932, 8152299, 8369251, 8520222, 8473285, 8461738, 8472908, 8425973, 8499377, 8400459, 8238433, 8228265, 8131467, 8059819, 7921888, 7829510, 7883699, 7876254, 7827601, 7784114, 7884849, 7846009, 7823068, 7881839, 7917049, 7995983, 8004545, 8066729, 8110029, 8154471, 8225302, 8309298, 8456043, 8590223, 8826362, 9065928, 9248809, 9656385, 9996676, 10442054, 10791726, 10973200, 10754104, 10377005, 9856094, 9402291]
4210I402291j48784k96529k68059L4835j08305k77955L4284J4677J60147J32635
4200H679237k0330J78354L0898O1059k7670n6279P3300L3496O91l9642L6209J37603
4188I086926L0528K1866k5125k03429J12997J53434J0312o3245J56464J67326
4178I448054M2468L02521L1041J27705L66703L07887L69668L44750K71858J67096
4168A1779751J27632K45532Q6024R8517J99195K08169J22363K70830K68523K06192
4158A3612728K00681K99309L65461L31593L03632M67414L78568L52802L17066
4149A6629254L75464L94389L71141N56716N55090N31123P02257R69241R09177
4140B1993852J035346J153076J173121J297346J306036J471377J878214K107115
$$ y = [9402291, 9253507, 8956978, 8688919, 8723754, 8615449, 8337494, 8371778, 8386455, 8546602, 8679237, 8658907, 8837261, 8868159, 8929218, 8901548, 8845269, 8918569, 8952065, 8952756, 8913114, 8949323, 9086926, 9117454, 9139320, 9114195, 8910766, 9023763, 9177197, 9187509, 9124264, 9280728, 9448054, 9490522, 9793043, 9824084, 9951789, 10318492, 10626379, 10996047, 11340797, 11612655, 11779751, 11907383, 12152915, 12238939, 12337456, 12536651, 12744820, 12867183, 13138013, 13406536, 13612728, 13813409, 14112718, 14478179, 14809772, 15113404, 15580818, 15959386, 16312188, 16629254, 17004718, 17399107, 17770248, 18326964, 18882054, 19413177, 20115434, 21084675, 21993852, 23029198, 24182274, 25355395, 26652741, 27958777, 29430154, 31308368, 33415483]
4132C3415483K343502K608523K996739L437886L592270L924338M809734N512839
4124F2641314O924602Q564063J0292725J2510079J4924426J6872363J7872899
4117A50602471J6729429J4381059J1009019L549650q729055j7681617j9992240
4110A49868716j8562945j5598005j2889146j0516202r014286p741830o454760
4103F9091542n644889m865090m159903l281868k653211k044223j665416j521553
4095D3255389j285568p79905o52089n48131m39792m34925k87577k74673l00371
4086C8252358m58858m94242m09559n78101m67457m83730n13537l81638l56593
4077C4108643m2933N3567K15968J74527N44518O08530P75699P44016P53772P89588
$$ y = [33415483, 35758985, 38367508, 41364247, 44802133, 48394403, 52318741, 57128475, 62641314, 69565916, 78129979, 88422704, 100932783, 115857209, 132729572, 150602471, 167331900, 181712959, 192721978, 196271628, 187542573, 169860956, 149868716, 131305771, 115707766, 102818620, 92302418, 83288132, 75546302, 69091542, 63446653, 58581563, 54421660, 51139792, 48486581, 46442358, 44776942, 43255389, 41969821, 41189916, 40537827, 39989696, 39549904, 39114979, 38827402, 38552729, 38252358, 37793500, 37299258, 36889699, 36311598, 35844141, 35360411, 34846874, 34465236, 34108643, 34065710, 34119277, 34335245, 34509772, 35054290, 35662820, 36438519, 37182535, 37936307, 38725895]
4067C8725895R63795Q84477J231231J392824J720424J993079K424654K720129
4059E2056508K636453K519753J883192J120079R0122r71055j560479j990527j929683
4050E3854363j740955j430317q89070o77196m11562K87309L53640O55479J051876
4041E1053567J086121J155137J432530J595867J637688K483888L181480L909713
4033F7535991M451158M368104M026180L088942J415463j034120l745136n153015
4025G4953567n250019m997561m455428m036049l398128k704118k526346j967064
4017D5618854j486692j027796p24474m31789k50037k16543K23034L51847L44269
4008D2400673Q50389J004631J295493J287811J315086J085766N60435n40521j353665
$$ y = [38725895, 39689690, 40574167, 41805398, 43198222, 44918646, 46911725, 49336379, 52056508, 54692961, 57212714, 59095906, 60215985, 60306107, 59335052, 57774573, 55784046, 53854363, 52113408, 50683091, 49794021, 49116825, 48705263, 48992572, 49346212, 50001691, 51053567, 52139688, 53294825, 54727355, 56323222, 57960910, 60444798, 63626278, 67535991, 71987149, 76355253, 80381433, 83470375, 84885838, 83851718, 80106582, 74953567, 69703548, 64705987, 60250559, 56214510, 52816382, 50112264, 47585918, 45618854, 44132162, 43104366, 42379892, 41948103, 41698066, 41481523, 41704557, 42056404, 42400673, 43251062, 44255693, 45551186, 46838997, 48154083, 49239849, 49800284, 49259763, 47906098]
3999D7906098k156756k765943k806426k762669k530307k094844j964629j537776
3991B9286748j219765j071786j064263p64500m47359n25918l80488q6700j0597
3982B3715372j03744r0426P4359M6732J67757L24565L84362M29746O95336Q06451
3972B6450510P50946Q36999J025230J067401J145952J654099K337756L188669
3964C8457562L873670M883204N921517O331712N955128N336025M453106J500622
3956G6712546l459963o478902o678435n894297m781446l432537k536107j704663
3948D1746196j314091j087312p80778p14313p71950o52822q50510q09181p95713
3939C3969526o68043o86508o32447p84416p55063o85466n75141m68716l59950
$$ y = [47906098, 45749342, 42983399, 40176973, 37414304, 34883997, 32789153, 30824524, 29286748, 28066983, 26995197, 25930934, 25166434, 24719075, 24193157, 23812669, 23725969, 23715372, 23611628, 23521202, 23595561, 23642293, 23810050, 24134615, 24518977, 24948723, 25644059, 26450510, 27201456, 28038455, 29063685, 30131086, 31277038, 32931137, 35268893, 38457562, 42331232, 47214436, 53135953, 59467665, 65422793, 70758818, 75211924, 76712546, 73252583, 66773681, 60095246, 54200949, 49419503, 45986966, 43450859, 41746196, 40432105, 39344793, 38564015, 37849702, 37077752, 36424930, 35574420, 34765239, 33969526, 33301483, 32614975, 31982528, 31198112, 30443049, 29757583, 29182442, 28713726, 28353776]
3930B8353776n89116o48378n63162o92036m36886m97868l95469m13103m00737
3921B3717021k32190r3391k02706k17446J9926k02708j70007l57926k94383j54022
3911B1812168P2199Q6556M59734O21002Q30012J404336J407543J915510K148561
3902C0757621K293151K086326J752325J172899L93877q67606k091009k458205
3894C3039379k324910k031399j747869j440888j025199r00399p39664n08955l15104
3885B2004992j91864p4532j12230p6569R3492j53586k3576j35286l91277l45212
3875B0594352j34099j80207j82331J3315N3803J02933K09219L90917O33989Q04686
3865B2306577Q11649R85742J345226J322528J329201J209542R46423R30842K81793
$$ y = [28353776, 27764660, 27116282, 26553120, 25861084, 25424198, 24926330, 24530861, 24117758, 23717021, 23484831, 23391440, 23188734, 22971288, 22991214, 22788506, 22618499, 22260573, 21966190, 21812168, 21884367, 21970923, 22430657, 23051659, 23881671, 25286007, 26693550, 28609060, 30757621, 33050772, 35137098, 36889423, 38062322, 38456199, 37588593, 35497584, 33039379, 30714469, 28683070, 26935201, 25494313, 24469114, 23568715, 22829051, 22320096, 22004992, 21813128, 21738596, 21626366, 21549797, 21643289, 21489703, 21466127, 21330841, 20939564, 20594352, 20460253, 20280046, 20097715, 20111030, 20164833, 20267766, 20476985, 20867902, 21501891, 22306577, 23118226, 24103968, 25449194, 26771722, 28100923, 29310465, 30256888, 31187730, 31469523]
3856C1469523l26079p47408o96009o02059j76326K70533Q07911J392164J807228
3847C3199478K593605L493108L857717L646807L293876L009438J461378j775405
3839E2780002m348342m860685m398338l480763k781888k239216j826958j569818
3831B7273994j564828j243533j104208j076524q62440p26593n00343m15336o53299
3822A9126890m08646k38194k61810k52564j71219o4992k13200o7852j95272M5892
3812A7299033J48888P1359j18397N928J1256Q3416L4838K6847J84364J71711J72683
3801A8091926K39742L22233J93027L95525J99976j39873o8008j55409L9449k55805
3791A8862783k47350j74670l50784j93148q0063j07188P0315k3940j06765L7398
$$ y = [31469523, 31143444, 30396036, 29700027, 29097968, 28921642, 29192175, 30000086, 31392250, 33199478, 35793083, 39286191, 43143908, 46790715, 50084591, 53094029, 54555407, 52780002, 48431660, 43570975, 39172637, 35691874, 32909986, 30670770, 28843812, 27273994, 25709166, 24465633, 23361425, 22284901, 21422461, 20695868, 20195525, 19780189, 19126890, 18718244, 18480050, 18218240, 17965676, 17794457, 17729465, 17516265, 17448413, 17253141, 17299033, 17447921, 17519280, 17400883, 17406811, 17418067, 17501483, 17536321, 17563168, 17747532, 17919243, 18091926, 18331668, 18653901, 18846928, 19242453, 19442429, 19302556, 19234548, 19079139, 19118588, 18862783, 18615433, 18440763, 18089979, 17896831, 17816768, 17709580, 17779895, 17755955, 17649190, 17686588]
3781A7686588N1077K151O617k3236R5537J44778O1417J78599J89641J58316K09284
3770A8760769J75996K52112L65959M31006M31178M36947O74114N55648M24448
3761B2508177J97049o6848r8565Q2371J77413K25617L88658M69039L88828N23277
3751B4795016N63543N24583M68269O15263N67248Q03908O19418O52534Q93763
3742C0503545Q40212P95527P96465Q23630R74612J192910J202420J248767J210790
3733C9588878J269096J205923J174477Q04801N63310M25657N03456O05498P67137
3724D6908233Q95346R49737Q25038R42098R47256R71380J196022J164968J100210
3715E5900288J134508J240997J163711J348848J460735J559973J580933J823541
$$ y = [17686588, 17737665, 17739816, 17746433, 17723197, 17818734, 17963512, 18024929, 18203528, 18393169, 18551485, 18760769, 18936765, 19188877, 19554836, 19985842, 20417020, 20853967, 21528081, 22083729, 22508177, 22705226, 22638378, 22539813, 22622184, 22799597, 23025214, 23413872, 23882911, 24271739, 24795016, 25358559, 25883142, 26351411, 26966674, 27533922, 28337830, 28957248, 29609782, 30503545, 31343757, 32139284, 32935749, 33759379, 34733991, 35926901, 37129321, 38378088, 39588878, 40857974, 42063897, 43238374, 44043175, 44606485, 45032142, 45535598, 46141096, 46908233, 47803579, 48753316, 49578354, 50520452, 51467708, 52439088, 53635110, 54800078, 55900288, 57034796, 58275793, 59439504, 60788352, 62249087, 63809060, 65389993, 67213534]
3707F7213534J850327J810672K132375K151266K229093K148504K416553K481459
3699H4433783K286552K138244K333003K502449K406022K462285K597970K580999
3691A03741307K516904K489116K435912K528311K481659K541472K459106K435117
3683A23628904K521558K586834K718177K793417K842570K945723K792529K987585
3675A45817297K659276K344155K233122J511043J011630P07825J12023m30357
3667A55966014p00355p86037j093790j314947j505172j927539k276837k608477
3659A43752860l177964l952629m067945m335571m619603m723468m465011m363522
3651A10047147m551521m290421m061264l997067l767683l779426l728508l605650
$$ y = [67213534, 69063861, 70874533, 73006908, 75158174, 77387267, 79535771, 81952324, 84433783, 86720335, 88858579, 91191582, 93694031, 96100053, 98562338, 101160308, 103741307, 106258211, 108747327, 111183239, 113711550, 116193209, 118734681, 121193787, 123628904, 126150462, 128737296, 131455473, 134248890, 137091460, 140037183, 142829712, 145817297, 148476573, 150820728, 153053850, 154564893, 155576523, 156284348, 156396371, 155966014, 155265659, 154479622, 153385832, 152070885, 150565713, 148638174, 146361337, 143752860, 140574896, 136622267, 132554322, 128218751, 123599148, 118875680, 114410669, 110047147, 105495626, 101205205, 97143941, 93146874, 89379191, 85599765, 81871257, 78265607]
3643G8265607l479842l224015l073588k968041k587690k532703k276393j965127
3635E6158208j884388j650865j456357j143574j137697j065090q57546q91442
3627D6071249p95543p58768o27998o49493o25469l98645m12877n12819n00059
3618D0789578l99415k45266l58356m77330l68108n22997m00782m07748l89110
3609C7220466k99537k38604j64702K4102R7193J69730K83122N42865N79606N26237
3599C8740478M01797J66116O7955k15094n9632j41648p5556j21222Q5758K72149
3589C9121101L11740N07287O48168R32708J093973J267637J574489J809010J926436
3580D9192549K177593K448662K925510L018096L292557M089468M713268M316292
$$ y = [78265607, 74785765, 71561750, 68488162, 65520121, 62932431, 60399728, 58123335, 56158208, 54273820, 52622955, 51166598, 50023024, 48885327, 47820237, 46962691, 46071249, 45275706, 44516938, 43888940, 43239447, 42613978, 42215333, 41802456, 41289637, 40789578, 40390163, 40144897, 39786541, 39309211, 38941103, 38418106, 38017324, 37609576, 37220466, 36920929, 36682325, 36517623, 36541725, 36638918, 36808648, 37091770, 37634635, 38214241, 38740478, 39142275, 39308391, 39376346, 39161252, 39101620, 38959972, 38884416, 38763194, 38848952, 39121101, 39432841, 39940128, 40588296, 41521004, 42614977, 43882614, 45457103, 47266113, 49192549, 51370142, 53818804, 56744314, 59762410, 63054967, 67144435, 71857703, 76173995]
3572G6173995L941556O064372M146389j104163j367394j425960j375949j38476
3564H4914370J373469K819525M372287N799028M983517M234838N076434K281087
3556A15854555O32220J095056L64973R16670J996331L603408N442749O435670
3548A36341632R291441J2419192J1632397R904914J1901620J0719884l983683
3541A98227397j0103473p048789m148511l88920K788391O013826O383539N564008
3533A97287468O634324Q010183Q281654R136336R839152J0738352J0057581J1332967
3525B71318017J0942613J0809613J0475332Q787211O312430L780559N77643k798377
3517C20205041l598304k853410o233234q133516n903712n369775m780586n342031
$$ y = [76173995, 80115551, 86179923, 90326312, 89222149, 87854755, 86428795, 85052846, 84914370, 86287839, 89107364, 93479651, 99278679, 104262196, 108497034, 113573468, 115854555, 116486775, 117581831, 117946804, 118863474, 120859805, 124463213, 129905962, 136341632, 145633073, 158052265, 169684662, 179589576, 191491196, 202211080, 198227397, 188123924, 181075135, 176926624, 176537704, 179326095, 185339921, 191723460, 197287468, 203921792, 211931975, 220213629, 229349965, 239189117, 249927469, 259985050, 271318017, 282260630, 293070243, 303545575, 312332786, 318645216, 322425775, 323003418, 320205041, 316606737, 313753327, 307520093, 299386577, 293482865, 288113090, 283332504, 277990473]
3509B77990473o733101r256296j2194412j4305770j5491279j6172462j5477758
3502A88359395j4251507j2714288j1228353r740519q652086p490470o750460n726174
3494A11805538n186512m821022m530976m258319m042557l820557m058339l695777
3486G7391479l553760l509387l182111k824345k473116k308879j948315j799942
3478E5791624j874815j788174j424308j358683j267646j210565j201094j000861
3470D4665478j101390r88896r72034p40594o75893q50549p18011n02303m79253
3461C7636555n21673m95715l65931j22776j79066o9199k1256j08978j94695J2954
3451C5570220p0708r2003L4067R2726J40210L9728R9749J32363j7560L813J15399
$$ y = [277990473, 271257372, 262001076, 249806664, 235500894, 220009615, 203837153, 188359395, 174107888, 161393600, 150165247, 140424728, 131772642, 124282172, 117531712, 111805538, 106619026, 101798004, 97267028, 93008709, 88966152, 85145595, 81087256, 77391479, 73837719, 70328332, 67146221, 64321876, 61848760, 59539881, 57591566, 55791624, 53916809, 52128635, 50704327, 49345644, 48077998, 46867433, 45666339, 44665478, 43564088, 42575192, 41603158, 40862564, 40186671, 39336122, 38618111, 38115808, 37636555, 37114882, 36619167, 36253236, 36130460, 35951394, 35882195, 35860939, 35751961, 35557266, 35570220, 35499512, 35407509, 35441576, 35534302, 35674512, 35714240, 35813989, 35946352, 35928792, 35932605, 36048004]
3440C6048004J27576J80979J97927J63274L53950M45068M83579M65291O24652
3431C9090300O16914Q13414J020040J087900J084055J149731J410711J720632
3423D7993697J670276J910513K059739K069352K318353K583250K772665K807508
3415F6185353K986207L087615L091506L201076K969682K920498K680992K578910
3407H9701839K282838J927169K108112J915138J930046J938489J890854J678662
3399A05373147J471612J138527Q13834M47217j02316l66365m84313o38199n54250
3390A07098894l58416p8899K49368N75134Q15261J208380J584481J932690K544523
3381A15571416K803426L302894M240619M992582N836266O771118P421726Q420493
$$ y = [36048004, 36175580, 36356559, 36554486, 36717760, 37071710, 37516778, 38000357, 38465648, 39090300, 39707214, 40520628, 41540668, 42628568, 43712623, 44862354, 46273065, 47993697, 49663973, 51574486, 53634225, 55703577, 58021930, 60605180, 63377845, 66185353, 69171560, 72259175, 75350681, 78551757, 81521439, 84441937, 87122929, 89701839, 91984677, 93911846, 96019958, 97935096, 99865142, 101803631, 103694485, 105373147, 106844759, 107983286, 108797120, 109244337, 109142021, 108775656, 108291343, 107653144, 107098894, 106740478, 106661579, 106910947, 107486081, 108301342, 109509722, 111094203, 113026893, 115571416, 118374842, 121677736, 125918355, 130910937, 136747203, 143518321, 150940047, 159360540]
3373A59360540Q849366R620457R667348R738303R299119Q134484P138924O007671
3365B27816212N372640N489106N663232O090667O518234O329446N729366M639839
3357B73648742K991092O12273j701729m005947n954599p569362q038503q394544
3349B41587423q305587p837944p641506p384009p266854p739185q096029q617402
3341A78698907r203211r899425j0064423r967596r559805q891117q141437p222884
3333A05749009o414317n861579n327769m829027m486908l937134l652794l393272
3325F7846209k998374k844699k600707k399217k221597j931476j975847j811727
3317D9062565j794445j406427j455436j450258j196973j303276j264697j037567
$$ y = [159360540, 168209906, 177830363, 187497711, 197236014, 206535133, 214669617, 221808541, 227816212, 233188852, 238677958, 244341190, 250431857, 256950091, 263279537, 269008903, 273648742, 276639834, 277252107, 275550378, 271544431, 265589832, 258020470, 249981967, 241587423, 233281836, 225443892, 217802386, 210418377, 203151523, 195412338, 187316309, 178698907, 169495696, 159596271, 149531848, 139564252, 130004447, 121113330, 112971893, 105749009, 99334692, 93473113, 88145344, 83316317, 78829409, 74892275, 71239481, 67846209, 64847835, 62003136, 59402429, 57003212, 54781615, 52850139, 50874292, 49062565, 47268120, 45861693, 44406257, 42955999, 41759026, 40455750, 39191053, 38153486]
3309C8153486j125347j079784q67265r59684r71717q51074q35128q56663q52002
3300B9754822q08634p97832p29239p01423p21218o28777o41968n62621o41922
3291B3521188n39378n64387m39872n47870o66322m81643m71453l87091n19420
3282A8903752n11437m83027l83076m39497k78039l45750l54736l45938m17121
3273A5345131j79221k96976l02014k46129j82283k86956j62746k64567k58611
3264A3165628k69356k71732j29023j67472j53966j34509j76325q7875j91547j73545
3254A1410278n9204j94428j51252k96654k13260L5770k00157j74756m8516j13515
3244I994306j38388k10837k24446k40161k54752j04080j94904k92433l06699j10405
$$ y = [38153486, 37028139, 35948355, 35081090, 34121406, 33149689, 32298615, 31463487, 30606824, 29754822, 28946188, 28148356, 27419117, 26717694, 25996476, 25367699, 24725731, 24163110, 23521188, 22981810, 22417423, 21977551, 21429681, 20763359, 20281716, 19810263, 19423172, 18903752, 18392315, 17909288, 17526212, 17086715, 16808676, 16462926, 16108190, 15762252, 15345131, 15165910, 14868934, 14566920, 14320791, 14138508, 13851552, 13688806, 13424239, 13165628, 12896272, 12624540, 12495517, 12328045, 12174079, 12039570, 11863245, 11775370, 11583823, 11410278, 11351074, 11156646, 11005394, 10708740, 10495480, 10531250, 10331093, 10156337, 10107821, 9994306, 9855918, 9645081, 9420635, 9180474, 8925722, 8821642, 8626738, 8334305, 8027606, 7917201]
3234G917201k28450j09030j38617k42744j42522l43059j96169q6665p9805r1267
3224F258873k6832j76631J03835r5909j31548Q1675m5735j09317m1949K782r6355
3213E722889m6066L3896j0806q0563j83210o5634Q0219O3429K5748p7178R5045
3202E557769J9710L2579J05832N4750O7038R7637O2260K7896K33783L3018k03228
3191F089044j22653l2863k41294k56086j71880q2861j03368j27865j00208n8669
3181D791297p4384j10361L387j4250j53230j24322j41830p8002l0907p605k4959
3170D034834j15421L8027k4266k7614M4533m2738p9549J1447l0637K0468O050
3159C835134M1611m6739p2971r671J13817K8233o4238K4872p0090o5207J01291
$$ y = [7917201, 7688751, 7579721, 7441104, 7198360, 7055838, 6712779, 6516610, 6429945, 6350140, 6258873, 6232041, 6055410, 6159245, 6063336, 5931788, 6013463, 5967728, 5858411, 5816462, 5819244, 5722889, 5676823, 5710719, 5699913, 5619350, 5436140, 5370506, 5450725, 5514154, 5539902, 5462724, 5557769, 5577479, 5610058, 5715890, 5770640, 5837678, 5935315, 5997575, 6025471, 6259254, 6292272, 6089044, 5966391, 5933528, 5692234, 5436148, 5264268, 5181407, 5078039, 4950174, 4849966, 4791297, 4716913, 4606552, 4609939, 4595689, 4442459, 4318137, 4176307, 4098305, 4067398, 4059793, 4034834, 3919413, 3957440, 3933174, 3905560, 3950093, 3907355, 3827806, 3839253, 3808616, 3829084, 3835134, 3876745, 3830006, 3757035, 3747364, 3861181, 3889414, 3825176, 3850048, 3779958, 3714751, 3816042]
3148C816042p1550j07349n492J7979l9350J57331l1041n671N2059k4522p6756
3137C681680j12123J19648N6904k4342O0691p0860L811N7016l9054K01043R7793
3126D032207j1439M2464M5350N1050J23710J7407K22556P7913J0243j395P0723
3115D680789j06661K27585Q6453r2984R8669R2716M1118Q5337J73790L064k802
3104E287074J00979J83783O6056J16595J43699J66628P8842R2752M3742R0427
3094F370577j4100P2071J01158N1857J52720l7423J23632J19579Q4290K31184
3084G255545K19542K5695J16185J78831K34751K86149K21697K86595L13744M45892
3074I584626N04116M43854N70296N32489P04086O63982N13593M48841M29961J11438
$$ y = [3816042, 3744492, 3637143, 3631651, 3649630, 3610280, 3767611, 3736570, 3730899, 3782958, 3758436, 3681680, 3569557, 3689205, 3746109, 3721767, 3782458, 3711598, 3715409, 3772425, 3733371, 3934414, 4032207, 4020768, 4063232, 4108582, 4159632, 4283342, 4300749, 4523305, 4601218, 4611461, 4610066, 4680789, 4574128, 4801713, 4888166, 4795182, 4893851, 4986567, 5027685, 5113022, 5286812, 5289876, 5287074, 5388053, 5571836, 5637892, 5754487, 5898186, 6064814, 6143656, 6236408, 6280150, 6370577, 6356477, 6428548, 6529706, 6581563, 6734283, 6696860, 6820492, 6940071, 7024361, 7255545, 7475087, 7500782, 7616967, 7795798, 8030549, 8316698, 8538395, 8824990, 9138734, 9584626, 10088742, 10532596, 11102892, 11635381, 12339467, 13003449, 13517042, 13965883, 14395844, 14507282]
3064A4507282k97355n50268q26276r98075r09192o65849o69899n36395n12898
3055H541075l37475k72907k92138l54697r3002j58371n9885l4110j59268L7381
3045F816603k1422J66264j7511k6365j9177Q3982j7498l81385k03146l65721j90309
3034E824315k02613k13632k2076l9128j91335o5857k50586k15864r8099j05266
3024D419859m244q9793j74887K01328L8262O9664L5008K43118K22507K22916M13787
3013E597525K26316K12824K93850q0403n49664n07569n02728l33898k35846r6416
3003D023991k51695j60484k3409j25369j38598n5011r8016J55852l3322l4506
2993C259433m1015q1747p0566Q2728R1031J9051J10793J50038J35833j1107K30745
$$ y = [14507282, 14209927, 13659659, 12833383, 11835308, 10926116, 10260267, 9590368, 9053973, 8541075, 8203600, 7930693, 7638555, 7283858, 7190856, 7032485, 6972600, 6938490, 6779222, 6816603, 6795181, 6961445, 6943934, 6917569, 6898392, 6982374, 6964876, 6583491, 6380345, 6014624, 5824315, 5621702, 5408070, 5385994, 5346866, 5155531, 5089674, 4839088, 4623224, 4525125, 4419859, 4415615, 4325822, 4150935, 4352263, 4390525, 4460189, 4495197, 4738315, 4960822, 5183738, 5597525, 5823841, 6036665, 6330515, 6250112, 5700448, 5192879, 4690151, 4356253, 4120407, 4023991, 3772296, 3611812, 3588403, 3463034, 3324436, 3269425, 3171409, 3327261, 3293939, 3259433, 3218418, 3136671, 3066105, 3148833, 3239864, 3258915, 3369708, 3519746, 3655579, 3644472, 3875217]
2982C875217K59390k21366k19284j68234k26123j32734j20930j28851O7567o8769
2972B915883j16835p199l9301R1431J17204J1351k2295Q9674J27572J72488K34971
2961C574944J96564L58893M40562J79372K76686K75876M8300l50094m42321l73787
2951D184995l54926j26438k38378k05851n3621j12750N4704n7750K1059K8376
2941C139420M6147J07717N5734L9999N3017Q0947K07461K54896K80064K79287
2931D544689K51155N20779O89223O98992M55338M75136P99249j39009r17955j111056
2921F266541j013552m49227m63605l28466j88146j39750k45955j45926l1212r6780
2911C163922m2018K5158N168r040m2165P7217J8010N3210N0982O8535O8783J87671
$$ y = [3875217, 4134607, 3913241, 3693957, 3525723, 3299600, 3166866, 3045936, 2917085, 2984652, 2915883, 2799048, 2791849, 2752548, 2843979, 2961183, 2972534, 2950239, 3039913, 3167485, 3339973, 3574944, 3771508, 4130401, 4570963, 4750335, 5027021, 5302897, 5351197, 5001103, 4558782, 4184995, 3830069, 3703631, 3465253, 3259402, 3205781, 3093031, 3147735, 3089985, 3111044, 3139420, 3185567, 3293284, 3349018, 3389017, 3442034, 3522981, 3730442, 3985338, 4265402, 4544689, 4795844, 5316623, 6005846, 6704838, 7160176, 7635312, 8434561, 8295552, 7377597, 6266541, 5252989, 4803762, 4340157, 4011691, 3823545, 3683795, 3437840, 3291914, 3260702, 3163922, 3121904, 3147062, 3152230, 3143190, 3101025, 3178242, 3196252, 3249462, 3300444, 3368979, 3437762, 3625433]
2899C625433J60391J45892J03568K43358L52114K14315j20212l04465m44641m46653
2889C529100l81013l16305k02428k38911m7526k8627m5908j15248j8076o9316
2879B065742o5110n6965p4379K5031n5798l6159L9178j40825l1712j04635O7687
2868A632055J67859J3457N5454j06371O3120m882P7744K2915L8991O3167n5420
2857A968089J9960l548k6722N2581L1677o4727k2672J16803N7876l0284O6350
2846B165383q8326N9943p0862l8948M6787m7635p7044r4535P0735m457P5008N3401
2834B049450l2840M1368k7656M4947Q1372R5718N0763J98317R6862J23418J18212
2823B839931J07125J81206M6529Q8182J07253J32540k0230n7474j55064R2104
$$ y = [3625433, 3785824, 3931716, 4035284, 4278642, 4630756, 4845071, 4724859, 4420394, 3975753, 3529100, 3148087, 2831782, 2629354, 2390443, 2342917, 2314290, 2268382, 2153134, 2135058, 2065742, 2000632, 1943667, 1869288, 1894319, 1838521, 1802362, 1841540, 1700715, 1669003, 1564368, 1632055, 1799914, 1813371, 1868825, 1762454, 1825574, 1820692, 1898436, 1921351, 1960342, 2023509, 1968089, 1988049, 1984501, 1957779, 2010360, 2042037, 1977310, 1954638, 2071441, 2129317, 2099033, 2165383, 2077057, 2137000, 2066138, 2027190, 2073977, 2026342, 1949298, 1854763, 1925498, 1921041, 1996049, 2049450, 2016610, 2057978, 2030322, 2075269, 2156641, 2252359, 2303122, 2501439, 2598301, 2721719, 2839931, 2947056, 3128262, 3174791, 3262973, 3370226, 3502766, 3482536, 3425062, 3269998, 3362102]
2813C362102j7893K3253p5005r9541P7120J35788o6300j39958j22680j5270J63202
2802C224818o5811j81989p3704q235n3872N5289J18196Q477m0275J15098m5921
2791C052071K56165K11296J46253k0628K1386Q7814P8673P8762J71833J11490
2781D195115J95297K08691J99670J13733J82186j02835q2195j22554j55051j07436
2771D524621j21185j03520j43574J06963K79692K7713J63495L42938K64404L82439
2761E723986R6191m0916J07871J02826K2905P4982r0894k40007o6910J78487M9401
2750E917922J78447K77396K82369K61026J93649j53160j67415j33497j50207p7032
2740F429498n9161n8730o9013r0240r2310p3583J37532K46340J27757n3492j94022
$$ y = [3362102, 3344209, 3367462, 3292457, 3192916, 3270036, 3405824, 3339524, 3199566, 3076886, 3061616, 3224818, 3159007, 2977018, 2903314, 2895079, 2841207, 2896496, 3014692, 3023169, 2982894, 3097992, 3052071, 3308236, 3519532, 3665785, 3645157, 3666543, 3754357, 3833030, 3911792, 4083625, 4195115, 4390412, 4599103, 4798773, 4912506, 5094692, 4991857, 4909662, 4787108, 4632057, 4524621, 4403436, 4299916, 4156342, 4263305, 4542997, 4570710, 4734205, 5077143, 5341547, 5723986, 5820177, 5779261, 5887132, 5989958, 6012863, 6087845, 5996951, 5756944, 5690034, 5868521, 5917922, 6096369, 6373765, 6656134, 6917160, 7110809, 6957649, 6790234, 6656737, 6506530, 6429498, 6370337, 6311607, 6242594, 6152354, 6060044, 5986461, 6123993, 6370333, 6498090, 6444598, 6250576]
2729F250576k16963l62835k45179j55533l85115l13385k45350j28121k01157j66496
2719C830442N2787r3937p0449o5196n5563p9800j56253j48845j98839j57413j91695
2708B665239q6372p5947p9482r064j61772k58908j1319n4203k9799j5474k1788
2697A861111j33044q0858l7315l9046j7034o607Q0305O1362o1058j16355n3789
2686A457672n5401j05086J03846n3052p0319n9043j16461m0154O9897q7818Q6146
2675A130227p7421L7698j1627k8624J3172j02167j1945m2743R0067J1503J49182
2664A157322r1998q4927N0880n0958O8197K8050j13884J05943P7471j9228o3432
2653A063436k3385l4845n1349K9106J10864j29879q4174M7315m2895L246k714
$$ y = [6250576, 6033613, 5670778, 5425599, 5270066, 4884951, 4571566, 4326216, 4198095, 3996938, 3830442, 3883229, 3789292, 3718843, 3653647, 3598084, 3518284, 3362031, 3213186, 3014347, 2856934, 2665239, 2578867, 2502920, 2423438, 2414374, 2252602, 1993694, 1982375, 1928172, 1898373, 1882899, 1861111, 1728067, 1647209, 1609894, 1570848, 1553814, 1547207, 1627512, 1688874, 1627816, 1511461, 1457672, 1402271, 1297185, 1401031, 1347979, 1277660, 1218617, 1102156, 1062002, 1131899, 1044081, 1130227, 1052806, 1090504, 1078877, 1050253, 1063425, 961258, 949313, 906570, 996637, 1008140, 1157322, 1065324, 980397, 1031277, 980319, 1048516, 1076566, 962682, 1068625, 1146096, 1126868, 1063436, 1040051, 1005206, 953857, 982963, 1093827, 963948, 879774, 927089, 884194, 887440, 884726]
2642H84726r5948k1426o0775J40198J0424j22579r2504j8824Q813k0257P2119
2631F83967R0342k3884k2361N6341K9183q6906j31087M9803n7886m6472M4301
2620E85341P1787k8603j6537J03539P110n6889k1307M0413J8708j5646r9632Q1021
2608F69305l315k2388K0187j1765j26081l5994Q9098k6128Q5652M4880Q2033R5189
2596H60673n4004j0371j653N4781J34546J33561L0428O8724R2794J42850N0874
2585A503203P3926j16852p5749J1182O3391Q3686J69704R4891J83748R0174J84347
2574B265651L27348J11828N2366j69876j53294j35777o4558m0325Q5411J44425
2564B423199J11774J09805J63312O8917J4654K8131k9408K7476O185O9021M0144
$$ y = [884726, 788778, 767352, 706577, 846775, 857199, 734620, 642116, 623292, 632105, 611848, 683967, 774309, 750425, 728064, 784405, 813588, 726682, 595595, 645398, 587512, 541040, 585341, 657128, 628525, 611988, 715527, 722637, 665748, 644441, 684854, 703562, 687916, 588284, 669305, 665990, 643602, 663789, 652024, 525943, 489949, 579047, 552919, 638571, 683451, 765484, 860673, 806669, 796298, 794645, 849426, 983972, 1117533, 1147961, 1216685, 1309479, 1452329, 1503203, 1577129, 1460277, 1384528, 1395710, 1459101, 1542787, 1712491, 1807382, 1991130, 2081304, 2265651, 2592999, 2704827, 2757193, 2587317, 2434023, 2298246, 2233688, 2193363, 2278774, 2423199, 2534973, 2644778, 2808090, 2877007, 2891661, 2919792, 2890384, 2917860, 2924045, 2993066, 3033210]
2553C033210r9572k11759j12413m6909M6154P7014j9486P7721P7323J84647J34852
2542C140782K54332R7051l3733j25667j62897k38785k20151j68756n5717L4359
2532B520818m9806j0779P2432q4239p664J7430k2285j80120j26126k38529j14611
2521A776521j9014j14935q7318r4742p2840L2541J654r408K9403k468j2410j6261
2509A410723N0755j41038j69350K4129J10917o8417l2983j5044p6396j05404L026
2498I90918L2697p7992P4499N0061m2367Q0378j30200l3605K5551O23l4740k8141
2486I07682P7967K5772Q9963n7256n4319J46487M3059r8016j07339J7509L6776
2475A028285j09888l9474l4692J0474M2779p868N68j13902n188L8590r3542k09926
$$ y = [3033210, 2933638, 2721879, 2609466, 2562557, 2608711, 2685725, 2666239, 2743960, 2821283, 3005930, 3140782, 3395114, 3492165, 3458432, 3332765, 3169868, 2931083, 2710932, 2542176, 2486459, 2520818, 2471012, 2460233, 2532665, 2448426, 2440762, 2458192, 2435907, 2255787, 2129661, 1891132, 1776521, 1757507, 1642572, 1555254, 1460512, 1387672, 1420213, 1421867, 1412459, 1441862, 1439394, 1426984, 1410723, 1461478, 1320440, 1151090, 1175219, 1286136, 1217719, 1184736, 1169692, 1093296, 987892, 990918, 1023615, 945623, 1020122, 1070183, 1027816, 1108194, 977994, 944389, 969940, 970563, 935823, 907682, 985649, 1011421, 1101384, 1044128, 989809, 1136296, 1179355, 1081339, 974000, 991509, 1028285, 918397, 878923, 844231, 854705, 897484, 889616, 890184, 776282, 771094, 809684, 716142, 506216]
2463E06216J52831J26142l9481l7862J682R6799l0722n1290m5862J24728O136
2452H09317k2627l0397L025N4608J7727l8645l5880m9258J816l3145m4815q9259
2440E42467L0733L572P5436J287n6341l8375k8472L6128p1166N5271o5671l5673
2428D49196J0421l4776K5313q7047q8983K839J6375L334l7969O6039J1385j18833
2416B17294o3887m8753M1963L8179N5712N9346P4220q0620r0876J9867Q8271j1477
2404B99239m5954J2504q5117J50822l4497j7776k7424K6674p6629o2192O6202
2393B05852P1418l0322k3349o1463j04619o7288R1715M8219o1196J2208N4394
2382A35569n684r046J64594Q251l4517J2203j47677o8791J08276J1518j7998j09
$$ y = [506216, 659047, 785189, 745708, 707846, 709528, 806327, 775605, 724315, 678453, 803181, 809317, 786690, 756293, 759318, 813926, 831653, 793008, 757128, 707870, 709686, 676541, 631726, 542467, 573200, 576772, 652208, 653495, 597154, 558779, 530307, 566435, 495269, 550540, 484869, 449196, 459617, 424841, 450154, 363107, 274124, 276963, 293338, 296672, 258703, 324742, 336127, 217294, 153407, 104654, 146617, 184796, 240508, 299854, 374074, 293454, 202578, 222445, 310716, 299239, 253285, 265789, 180672, 331494, 296997, 279221, 251797, 278471, 201842, 139650, 205852, 277270, 246948, 223599, 162136, 57517, -9771, 81944, 130163, 68967, 81175, 135569, 129885, 120839, 285433, 293684, 259167, 271370, 123693, 54902, 163178, 174696, 156698, 156589]
2370A56589n6759j13257J4218p1129l7488M8771M0587N0787P9519J13874r9807
2359A25905q0052P4484J495l1824J2830K8832o048l4176O7247j17064q8970N3634
2347F293O5475M7028K486p3316j3215L5656k7420k675l6997K3744j02707o2632
2335a38280J43464J56357p5383q2792N2092j4676m4799P5444q854j2883M2606
2324I2296n609P1778o5157k653m0660M4730K5169n3087j11270k2039n1809K8271
2312i0040J4655R5223n9152r4973J54060N6813n1859M9719M7190k2851r0058l2211
2300b3484k4547n6067O3904O2808m333o0002M2335P3398l3412j286l8589m1915
2288d1190J50397M93K4959j27882J18693K3902K2740Q2704K4222m0416r1229R680
$$ y = [156589, 99830, -13427, 791, -70338, -107826, -59055, -18468, 32319, 111838, 225712, 125905, 45853, 120337, 121832, 90008, 102838, 131670, 125622, 91446, 158693, 41629, -47341, 6293, 71768, 118796, 121282, 47966, 34751, 70407, 42987, 40312, 3315, 27059, -75648, -138280, 5184, 161541, 86158, 3366, 55458, 40782, -4017, 71427, 62573, 49690, 92296, 86687, 158465, 93308, 90655, 49995, 94725, 119894, 66807, -44463, -66502, -118311, -90040, -75385, 19838, -39314, -134287, 19773, 76586, 24727, 74446, 121636, 98785, 8727, -23484, -48031, -104098, -40194, 22614, 18281, -41721, 614, 74012, 40600, 39314, 725, -41190, 109207, 109700, 134659, 6777, 125470, 149372, 172112, 254816, 279038, 238622, 147393, 157073]
2276A57073K203p8383j09965j09751K18951K6339m0234n6309m2591M9393J26975
2265A43701N0775r6453m5045M829M2162l0192p0682N8059K7260l2547j08837K3294
2253c3676O1321K8575r7780q7882P7627p296l6681K4736M3125j16577M823M2124
2241i7561P6134O112R4618J8827k2865j5538m9819J3927J3892l2532L1138n5724
2229a9391J0938L5213r3021Q673M0762J20596k7579n4404J35609n0961m0528j9712
2217D6195l9664O0743o2875Q276N867l7592j04589O2473J02764q4834K5883O5953
2205D8600K166j16961K7687o0369J4332J61830m4521n5209L4295K3189r9570N0714
2193a3817R0448q7179L6945J1133K2855k0853J3584P2096L3555R1798j08089l1706
$$ y = [157073, 159276, 80893, -29072, -138823, 80128, 106467, 66233, 9924, -32667, 16726, 143701, 194476, 98023, 52978, 57807, 99969, 69777, -905, 57154, 84414, 51867, -56970, -33676, 27645, 56220, -41560, -129442, -51815, -59111, -95792, -71056, -27931, -144508, -139685, -97561, -21427, -15315, 79303, 98130, 75265, 59727, 9908, 23835, 37727, 5195, 36333, -19391, -8453, 26760, -66261, -57588, -16826, 103770, 76191, 21787, 157396, 106435, 65907, 46195, 6531, 67274, 4399, 12675, 18542, -19050, -123639, -61166, 41598, -43236, -17353, 48600, 50766, -66195, -38508, -98877, -84545, 77285, 32764, -22445, 11850, 35039, -64531, -13817, 76631, -10548, 26397, 37530, 60385, 39532, 53116, 125212, 158767, 250565, 142476, 110770]
2181A10770k8532m6859j7199M4242O9783o1676n231J8734K0148M0552n0950l6231
2169E7551J45734q6794m8978o1296J04599o2190O0186j23313l0497J00383J7230
2158G2615p6884P5115q075j00684M3030l9635N1101j7434R8303l8984L3796J1552
2146A03816k7577N2869R7829n5288m6861k7492Q8229M4514r6040R8002J6469j63525
2134H4945j6489J25696l564l6401j2199n1881N9032O9584r3834o3273J04178L7816
2122B03610L3538o074o495k6918N0740k782R0355j3081n973j17877N7632q3646
2110A73029n6608L7830M2069K595O1822J08820M4895J4302K2654O2346m5949L1195
2098D99000m1232J20957j3642j17985O3436L6793n1368L7819p2835J6597O8283
$$ y = [110770, 82238, 35379, 18180, 62422, 132205, 70529, 65298, 84032, 104180, 144732, 93782, 57551, 203285, 116491, 67513, 6217, 110816, 48626, 108812, -14501, -44998, 55385, 72615, -4269, 70846, 62771, -37913, 5117, -34518, 16583, -851, 97452, 58468, 92264, 103816, 76239, 129108, 226937, 171649, 124788, 97296, 185525, 230039, 133999, 232001, 248470, 84945, 68456, 194152, 190588, 154187, 141988, 90107, 149139, 218723, 124889, 61616, 165794, 203610, 237148, 231074, 224579, 197661, 248401, 245619, 335974, 322893, 316920, 199043, 256675, 173029, 116421, 154251, 196320, 198915, 260737, 369557, 414452, 428754, 451408, 513754, 467805, 499000, 457768, 578725, 565083, 447098, 510534, 547327, 495959, 533778, 460943, 477540, 545823]
2087E45823P7607M1536Q4790m4210m7379O923l1957M2241J35479o5686L3639n5403
2075G23403R4978J4997M7132l4216n9467l8888Q8997M0890J20135L4653J27767
2064A160381R2160Q8801J49762k3838J39622K14683L2299J19096K74688J71789
2054B419443K02065L69776M07856L96403J21624L01393M97480R15602J025579
2045F657221J313429J955621K778558L153215K357846J578298L662413J902694
2037B5359295m627036m151970l403710k438863j818964j226221q55389p76489
2029F060653p47300n74140m43954l66395k96282k43266l94951k64390k03651j23469
2019B402855j33196k10846j89749r4875l4065j28091K95k870j3591l6331p7919
$$ y = [545823, 623430, 664966, 749756, 705546, 658167, 665090, 633133, 675374, 810853, 745167, 778806, 723403, 818381, 833378, 880510, 846294, 786827, 747939, 836936, 877826, 997961, 1032614, 1160381, 1252541, 1341342, 1491104, 1467266, 1606888, 1821571, 1853870, 1972966, 2247654, 2419443, 2621508, 2991284, 3399140, 3795543, 3917167, 4218560, 4716040, 5631642, 6657221, 7970650, 9926271, 12704829, 15858044, 18215890, 19794188, 23456601, 25359295, 20732259, 16580289, 13176579, 10737716, 8918752, 7692531, 6837142, 6060653, 5313353, 4739213, 4295259, 3928864, 3632582, 3389316, 2994365, 2729975, 2526324, 2402855, 2269659, 2058813, 1869064, 1774189, 1740124, 1612033, 1612328, 1609458, 1595867, 1559536, 1481617]
2008A481617k24565m3620K8022j41986j1099k993j42369N8847j02935J9573m6645
1997H71847q6309R343k6902r4997j6688q1894J59705j79101p8419L1426O2092
1986E70103o9754j14712m6059J48818Q8092r0792j41143P632J3380l2358J04834
1975D38041J26866k9022J1186o4944m6188r0532OR811k7457m8098K8265M6183
1963C54117P6068k09606j7686m0699Q5020Q6793r0114n9384j17590l8028J02939
1952A31830M8678j0341J15473J1949j10376n8010k5467P1962P7805j17818L8918
1941A74603M3225L4839N816O9438R289j19286j09614o0629J0858Q118m210J47896
1929B10343j0155k11J0635r7752K5524Q08o6812L5171P951k7756n3598j5324J7229
$$ y = [1481617, 1257052, 1213432, 1241454, 1099468, 1088369, 1085376, 943007, 1001854, 898919, 918492, 871847, 785538, 794881, 767979, 672982, 656294, 574400, 734105, 555004, 476585, 508011, 570103, 500349, 385637, 339578, 488396, 576488, 485696, 344553, 352185, 365565, 333207, 438041, 564907, 535885, 547071, 482127, 435939, 345407, 345413, 355224, 327767, 279669, 307934, 354117, 430185, 220579, 202893, 162194, 247214, 334007, 243893, 184509, 66919, 28891, 131830, 180508, 170167, 285640, 297589, 187213, 129203, 103736, 175698, 253503, 135685, 174603, 217828, 252667, 258483, 327921, 337210, 217924, 108310, 47681, 58539, 66657, 62447, 210343, 200188, 199977, 210612, 112860, 138384, 139192, 72380, 107551, 115502, 87746, 34148, 18824, 36053]
1916C6053p6427r2762P9281J33722L5955J4028R3662m4949n414p967j76047J01291
1904I0426L8654l953k5896p482K6521L515q8224O162L8735o3372m0704P5648L0684
1891H0714j75694k2196O432J01298Q5256m9019o6781K9965L2675k2978N2023P7310
1879A29005n2272j7787L5117J1717q2466K1219N0121q9622q2632P7528J3215R403
1867B2546r7196k2728J03834J1822k5695Q4922r1222l7719k3759J02004N4970
1856H1779Q8863n5879L9395J6601j55887L6859p373N3538j20010j9754J8531J10769
1844H7432m1310j5110P7432q5532k1366j33080J6478O0808M0009J12594j46513
1833d8158J7265J35200R033M9936o0295n8988m1068K8498r0720r4543J21292J17235
$$ y = [36053, -40374, -133136, -53855, 79867, 115822, 129850, 223512, 178563, 173149, 165182, -10865, 90426, 129080, 125127, 99231, 91749, 118270, 121785, 33561, 39723, 78458, 15086, -25618, 50030, 80714, -94980, -117176, -110744, -9446, 75810, 26791, -39990, -10025, 22650, -328, 51695, 129005, 76733, 58946, 94063, 105780, 23314, 44533, 94654, 5032, -77600, -72, 13143, 22546, -74650, -97378, 6456, 18278, -7417, 77505, -13717, -51436, -75195, 26809, 81779, 170642, 114763, 154158, 170759, 14872, 51731, 44358, 97896, -22114, -41868, -23337, 87432, 46122, 31012, 108444, 22912, 1546, -131534, -115056, -54248, -14239, 98355, -48158, -30893, 104307, 113340, 163276, 102981, 43993, 2925, 31423, -59297, -153840, -32548, 84687]
1821H4687k2123O8662j54905n0302N7709J8922J7389q4870R1804m6625L7023j8287
1809i16k4565q7134L289J52173L0316j01460L8134N7960J7762k3105R3121P6328
1797B31903p4773n3679M981j0122R150j1953n3641N3502n0334l3254l8868J15788
1785H8700K77l0231r1115K9971R2300o3429N944Q8662p893j2439j3832m5697P943
1772D9161M4391l9653n8130L803m2157J2703J4801O8255M8839N1642q0954K9806
1760A02507j42895r6467J2710N0903l0991J45755K4057j31260j5659J29598n46
1749D7712j17526j9478k4149J8520J00663j6369n0474M4392m9589J6919M1470
1738g909m02l0281O5246n0797m6158J20624P5678p5364m9865O109l7657k8476
$$ y = [84687, 62564, 131226, -23679, -73981, -16272, 2650, 20039, -64831, 26973, -19652, 17371, -916, -25481, -112615, -109326, 42847, 73163, -28297, 9837, 67797, 85559, 62454, 155575, 231903, 157130, 103451, 108432, 98310, 107460, 95507, 41866, 95368, 45034, 11780, -27088, 88700, 88977, 58746, -32369, -2398, 89902, 26473, 32417, 121079, 113186, 100747, 86915, 41218, 49161, 93552, 53899, -4231, -428, -42585, -29882, -15081, 53174, 102013, 153655, 72701, 102507, -40388, -136855, -124145, -73242, -104233, 41522, 65579, -65681, -81340, 48258, 47712, -69814, -89292, -113441, -94921, 5742, -10627, -61101, -16709, -66298, -49379, -7909, -8311, -38592, 26654, -24143, -70301, 50323, 126001, 50637, 772, 6881, -30776, -59252]
1726e9252P9461K4163k1529p0807j3679k7983j8514J25289k2784m3141o4915J59407
1714D5716J6059p4231p3274M54J93829k7256j41859M1134l4319p3897J34500M9729
1702E6585j1684q0116k1679m8554l4224Q9867Q3536K0804j12209m404O7250P1817
1690G6989m4870j28079O8412P4757O2182m6980j1755o0689k5138R4740J3016j6809
1678E5776k4232l4741Q6134J1303j30646K7226M7971O2206j0009q2218P501l0303
1666a4032N1124M2441q6737l5219L3624k1897R8408p7903M9191O5632n8511j02532
1654e6411n3795K2059J08601r076l0179P7784m8587J8965o4735r800R4540l8708
1642A0658m3780k6624m9514K12134J3848N6815m450p4206n8964R614p1352r0035
$$ y = [-59252, 20209, 44372, 22843, -47964, -61643, -89626, -108140, 17149, -5635, -48776, -113691, 45716, 61775, -12456, -85730, -85276, 108553, 81297, -60562, -19428, -53747, -127644, 6856, 56585, 44901, -35215, -56894, -105448, -139672, -49805, 33731, 54535, -57674, -62078, 5172, 76989, 32119, -95960, -27548, 47209, 109391, 62411, 50656, -10033, -35171, 59569, 72585, 55776, 31544, -3197, 82937, 94240, -36406, -9180, 38791, 100997, 90988, 8770, 16271, -14032, 37092, 79533, -7204, -42423, -8799, -30696, 67712, -10191, 39000, 104632, 46121, -56411, -110206, -88147, 20454, 11378, -18801, 58983, 10396, 29361, -35374, -45174, 49366, 10658, -33122, -59746, -109260, 102874, 116722, 173537, 169087, 94881, 35917, 45531, -25821, -115856]
1630a15856O155M8875O8909P9096j16459r2186l3987K2007R7504k7023p577n9744
1618a30286R8617O8485N482q930l8836p8336R6402j4513N9r6172J3795l8008M1398
1605h0843K7624O899K4885K8843k2145M7440j3598k1710k7632r259O9670L231
1593C3405J8258k6038j62439K0579Q0728k5598l2159R2143J47742q5902o8437
1582g718k3795L4366j7209L4477J8532K6583p7558Q5095j6839j23622N9807J70939
1570A63058k13737j1754J91114k3j14278l0132P4988n5585K3526K9698k116J9330
1558G4089L345q1117O2952J9344l5793j15075p9024M5023N9163R4630j01470l0784
1546h4717m0236N5630J6046p3346J09388k4822M112K5957k6476K3834o5362K1412
$$ y = [-115856, -109701, -60826, 8083, 87179, -29280, -121466, -155453, -133446, -35942, -62965, -70542, -130286, -31669, 36816, 42298, 33368, -5468, -83804, 12598, -1915, -1856, -98028, -84233, -122241, -80843, -53219, -46320, -21435, 7408, -14737, 32703, 19105, -2605, -30237, -39496, 30174, 33405, 51663, 25625, -136814, -116235, -35507, -61105, -93264, -1121, 146621, 60719, -7718, -31513, 2853, -14356, 20121, 38653, 65236, -12322, 72773, 55934, -67688, -7881, 163058, -50679, -62433, 128681, 128658, 14380, -15752, 59236, 3651, 27177, 56875, 54759, 74089, 77434, -3683, 59269, 78613, 42820, -72255, -151279, -106256, -47093, 47537, -53933, -84717, -124953, -69323, -53277, -126623, -17235, -42057, -37945, -11988, -38464, -14630, -79992, -58580]
1534e8580O1957O0128n5850l8845R5059j03589j01767J18781o1159m6517O491
1523a23891j2986K18190N8096J9782r8243r6355M3100N3067O032j0214q1854j07508
1511a32784N7122j2940o4939M1395M1072p580L5536N2639k7249R6847j16415m9605
1499h6901P2682n4450N4204L7721O5591m5001L4468n1348l217p4491O097M8426
1487C781K1677l3981K2033j4431Q245q9298N1194J7337r2508l5612Q0835K4578
1475c6150O4650J71053q5163j32749j8058L8677M518M2815j3412p2523J23389
1464H7047p044p3129j5404K0604k8162p2944L5476J47841J4160m7581R490o3459
1452F895K3282l9767k5895k3796R6298j12440n4977J52202K1454p3620L8270r716
$$ y = [-58580, 3377, 63505, 7655, -31190, 63869, -39720, -141487, -22706, -83865, -130382, -123891, -136877, 81313, 139409, 159191, 60948, -35407, 7693, 60760, 66792, 56578, -25276, -132784, -75662, -88602, -153541, -112146, -71074, -78654, -43118, 9521, -17728, 79119, -37296, -86901, -14219, -68669, -14465, 23256, 88847, 43846, 78314, 26966, 23749, -50742, -44645, 3781, 25458, -8523, 13510, -921, 7324, -81974, -30780, -13443, -105951, -141563, -60728, -36150, 28500, 199553, 114390, -18359, -36417, 2260, 6778, 49593, 36181, -36342, 87047, 80003, 6874, -8530, 12074, -16088, -89032, -53556, 94285, 108445, 60864, 70354, 6895, 30177, -9590, -35485, -59281, 37017, -75423, -130400, 21802, 43256, -30364, 7906, -1810]
1440a810K8428O5273o0656j75885K03333L0174j20445m5072M3597j2257N5828
1429A0508l6542p7584N512J23690J73874q3506j24264j6410L6878l3778j30340
1418a51962N606J25065J3595J0787p907l2325O9139r0476J46356J8018j8977o7358
1406A9561m4247J03391n0464j42323P042M3489j14125J12115Q5427J9574p119
1395C2321l4759j8838j13362P0618j4168j21371R8592N6270N6519R4858k296p3410
1383C0974j335j01498n7991Q1626M5947k1403J09939l6442r9931L2322O6073J2469
1371F0750p7763P901M8007j37219O7232M972j1503O5797j4204Q8985n8010n2427
1359g482L4682Q9185n2110L8374m7853m8946R2836n6137p9648Q4386m0823j2361
$$ y = [-1810, 26618, 91891, 31235, -144650, 58683, 88857, -31588, -76660, -33063, -45320, 10508, -26034, -103618, -98106, 25584, 199458, 115952, -8312, -24722, 12156, -21622, -151962, -146356, -21291, -7696, 3091, -4816, -37141, 31998, -58478, 87878, 105896, 86919, 19561, -24686, 78705, 28241, -114082, -107040, -63551, -177676, -65561, 19866, 39440, 32321, -2438, -21276, -134638, -64020, -78188, -199559, -100967, -44697, 11822, 106680, 104384, 30974, 29639, -71859, -129850, -48224, -2277, -23680, 86259, 49817, -50114, -17792, 48281, 60750, -17013, -9112, 38895, -98324, -31092, -26120, -37623, 28174, 13970, 102955, 44945, -7482, 27200, 116385, 64275, 102649, 54796, 5850, 98686, 42549, -37099, 47287, 6464, -5897]
1347e897P6228r5778K8231j7611J16184q135j8082j18223O4267r613J16196l397
1335A24370P250J6405j16755K6625p0019j5782J39362k0749l9732q5744m165J1782
1323b7152p9888n9963K03233J28509j62718o9579K743J17807O059p3089N230o9171
1311g7979k334J10790K0473M61j4056J1651q580J4988q2547P8417j9867j08735
1299g7318N882J22185J16513j43850n5348O647L7643m1181K5761j1948N2388J2550
1287D9924o5766P0712l9692m7009l8617p4j13372N5089n0599j4046J13246m307
1275h4511n593k381N1086K7052o2870M5628j5701O0509J9460M5006m672k6100
1263D6913J7527q7560m7848k0422o1268L0627P4211K0674Q2176M3198L37j98728
$$ y = [-5897, 70331, -25447, 2784, -14827, 101357, 93222, 75140, -43083, 21184, 11571, 127767, 124370, 131620, 148025, 31270, 57895, -12124, -27906, 111456, 90707, 50975, -34769, -38934, -27152, -107040, -167003, 36230, 164739, 2021, -67558, -64815, 52992, 59051, -14038, -8808, -77979, -80313, 30477, 50950, 51411, 37355, 49006, 40426, 55414, -27133, 51284, 31417, -77318, -71436, 50749, 167262, 23412, -31936, -25289, 12354, -28827, -3066, -15014, 37374, 49924, -15842, 54870, 15178, -31831, -70448, -70522, -183894, -128805, -179404, -193450, -80204, -84511, -90104, -92485, -41399, -14347, -77217, -31589, -47290, 13219, 32679, 77685, 73013, 46913, 64440, -23120, -70968, -91390, -152658, -122031, -47820, -27146, 55030, 98228, 98565, -100163]
1251a00163J2935J65274J048o5634q540N1048j68606N5362K6502M4319l3665m3280
1239f3400k7245Q8385Q2246m1513n0161n9838K3838j391l7752K5954N5911l5305
1227d0271Q7512J04604j12044l9304j4347k06110L1018M7407O9328N1727L1979
1216A1499Q7709o2533o05P9899L7324j7298r6490k1286j04495j580K2833L5285
1204b9738J4088n9887j6838k0691Q1313k2585J2687o2393l3550J7521O2568m5269
1192a02774L2213o9479M2930R2468N9419o8261o1482J5034P7651k5106j12340
1181a19727O9669O9247J8578k9409R6741j45868k761m9582R7452M8567k7008q5181
1169e9282N2253j1870r4655j2835j1706M2681J38428k8770M4454m7296M10J33444
$$ y = [-100163, -87228, 78046, 79094, 13460, 4920, 55968, -112638, -57276, -30774, 13545, -20120, -63400, -90645, -2260, 79986, 38473, -11688, -71526, -47688, -49079, -86831, -60877, -4966, -40271, 47241, 151845, 39801, 497, -13850, -219960, -188942, -141535, -72207, -20480, 11499, 99208, 36675, 36070, 115969, 153293, 135995, 39505, 18219, -86276, -87856, -65023, -29738, -15650, -75537, -92375, -113066, -31753, -54338, -41651, -104044, -137594, -120073, -57505, -102774, -70561, -140040, -97110, -4642, 54777, -13484, -74966, -59932, 17719, -7387, -119727, -50058, 19189, 37767, 8358, 105099, -40769, -43530, -93112, 4340, 52907, 25899, -59282, -7029, -18899, -113554, -126389, -138095, -95414, 43014, 14244, 58698, 11402, 11812, 145256]
1157A45256K0894r5978q8116N6680n8761M3232N7688q2783O6722O0327j14644
1146A0517r2657L3470J00260Q7972r2874k0651Q916p0159J40073k1841j9028m4545
1134A9453r6740n5963p7559K01586L7523J7010P6555L024o2740o5948j0882q353
1122b3034l1364l25K3970R610O1984l1650k1624j09880m1976Q990J18459J4899
1110b1941M4284n8325O2857p7595j31274M8159N7233Q7876n1149L9322N1838k9273
1098B2012J449n8050o6529Q4891K9074J2297r433j26979K8304J21123R1362j62537
1086c3016K4556L0847N8509l1620k5730P6165q0635m3295K2500j2537N9911M9193
1074I4848j19899K8163m5977l4082J02520R9630q5149j12535R8701M3316K2988
$$ y = [145256, 166150, 70172, -17944, 38736, -20025, 23207, 80895, -1888, 64834, 125161, 10517, -82140, -48670, 51590, 139562, 46688, 26037, 34953, -35206, 104867, 83026, 63998, 19453, -77287, -133250, -210809, -9223, 28300, 45310, 121865, 124889, 62149, -3799, -14681, -23034, -54398, -54723, -30753, -21143, 40841, 9191, -12433, -122313, -164289, -155299, -36840, -21941, 22343, -35982, 26875, -50720, -181994, -133835, -76602, 11274, -39875, -553, 51285, 22012, 23461, -34589, -101118, -16227, 12847, 25144, 15711, -111268, -82964, 38159, 129521, -33016, -8460, 22387, 80896, 49276, 23546, 99711, 19076, -24219, -1719, -14256, 45655, 94848, -25051, 3112, -42865, -76947, 25573, 125203, 40054, -72481, 26220, 69536, 92524]
1063I2524m7647q0732M2805k3011K9669L7871n7824L3713P0156m9070j5852p1466
1051c8864J00322Q0034j78640n2829P8824n9411o0994P4593Q9809O769N8887q6280
1039A2220k1050q9959M2795J0688R42k006M7447R4094j27246P8060J379o6569
1027a9205K1733K7124L7060j6951p3714k087k9072L0694j6023l1312P1033p3681
1015g4401L5705J02342k9153j22427p0289J45706J09258q0051m9093j5394R3357
1004D5560l2407j55442N6690R8047M698J2494K757j4219p6357j3591J52120m2057
992C8293j3416j4524m409P9356K3517p1740M117n3052J3537k2127j9300L1765
980g983l2736p109J4091M9905O8424o5334M2560l4880l5p4563J2509M3893r3576
$$ y = [92524, 44877, -35855, 6950, -16061, 13608, 51479, -6345, 27368, 97524, 48454, 32602, -38864, 61458, 141492, -37148, -89977, -11153, -70564, -131558, -56965, 32844, 39613, 98500, 12220, -8830, -98789, -55994, -45306, -44364, -46370, 1077, 95171, -32075, 45985, 47364, -19205, 2528, 29652, 66712, 49761, -23953, -26040, -55112, -24418, -40441, -71753, -720, -74401, -38696, 63646, 34493, -87934, -158223, -12517, 96741, 16690, -32403, -47797, 45560, 13153, -142289, -85599, 12448, 17146, 29640, 32397, 18178, -58179, -71770, 80350, 38293, 24877, 10353, 5944, 85300, 108817, 37077, 41194, -11858, 1679, -20448, -39748, -7983, -40719, -47828, -33737, 16168, 84592, 19258, 61818, 26938, 26903, -47660, -35151, 8742, -84834]
967h4834J06514j6891l831o4422O6688K0009k380m4042R1176j11295o2190M4887
955f0611K8735R5860p9236j41410k2908R7600J11545L4172n4884N6589m3267O4779
943H6964m625L4344m1483j1432l245J8525o4777r1807L9984l5826k7352K5218
931g5512J6754J00024n0890Q1176R9650r4037j40038n605P6696j17121L4535J14891
919D0523p653M5002l0119o1333N3037l4028O3703p9160r178O1786l4222J0330
907A8688r0494L1569K6777j8608N0449k1705L2571p441O6691r6868j08671j34153
895b51195J15293J13006j5529o4338Q6524N9699q5492j7456J6092q36j9853n4760
883a18845L5134K1674J6348L8247J4428r8981r8666J38188Q482Q9604J32148q8668
$$ y = [-84834, 21680, 4789, 958, -63464, 3224, 23233, 20853, -23189, 67987, -43308, -105498, -60611, -31876, 63984, -15252, -156662, -179570, -81970, 29575, 63747, 8863, 65452, 22185, 86964, 82339, 116683, 75200, 63768, 60523, 79048, 14271, -77536, -37552, -73378, -100730, -75512, -58758, 41266, -9624, 71552, 171202, 77165, -62873, -68478, 8218, -108903, -74368, 40523, 32870, 77872, 47753, -13580, 39457, 5429, 69132, -10028, -19206, 42580, 8358, 18688, -71806, -40237, -13460, -32068, 18381, -3324, 29247, 21806, 88497, -8371, -117042, -251195, -135902, -22896, -38425, -102763, -16239, 43460, -42032, -59488, -43396, -44232, -64085, -118845, -83711, -62037, -45689, -7442, 6986, -91995, -190661, -52473, -43991, 45613, 177761, 89093]
871H9093L7897r3361m4192j1759N85l5755J4734K5475o3473l4250q5281R3699
859a06588J01283o230m9306J6011N3642J6115P0061O319R341J54k3609L534j24221
846c3494J3648Q8884L1738p0537M3307p6177p8576j4978N5113K3773K016K8480
834A3197p7274l6939J03833j02949K19850q2865k9259P5420N8778j33426o4585
823e6219K7869j3131L0310m9762N551P3496n85j54219P0593R0994n1010q62O8561
810D1586Q2077n7877j43016N6598j1491q6286M9098k4699L6043n9460j4894J53305
798B0984N5011Q912l6747j20964K2905O0622o6818K4410M2060n9187j5995M0100
786b4707l2379M7091J501J00964l2893L6930o3980j9311p4255J4585r3042M0346
$$ y = [89093, 126990, 33629, -10563, -22322, -21737, -57492, -42758, -17283, -80756, -115006, -200287, -106588, -5305, -11535, -60841, -44830, 8812, 24927, 94988, 101307, 110648, 110802, 87193, 90727, -33494, -19846, 69038, 100776, 30239, 73546, -2631, -81207, -96185, -41072, -17299, -15283, 13197, -64077, -101016, 2817, -100132, 119718, 36853, 7594, 83014, 141792, 8366, -56219, -28350, -41481, -11171, -60933, -55382, 18114, 17529, -136690, -66097, 24897, -26113, -26975, 41586, 123663, 65786, -77230, -20632, -32123, -118409, -69311, -94010, -57967, -117427, -132321, 20984, 75995, 84907, 48160, -72804, -49899, 10723, -56095, -31685, 10375, -48812, -64807, -24707, -57086, -9995, -8494, 92470, 59577, 96507, 32527, 13216, -61039, -46454, -139496, -99150]
774i9150P1944q754o1575J32277l8625j2412L1790j2435K196L7125r8962m5169
762a01750K24724N866P67j05110j86230J18759j0991q52r571n6039M9012q4687
750a56102K3164J26624R832P861J656n1412j3352Q3366M8793q4954o3556l1144
738i9224J21224K5116M7448j09200Q6978j8177O5094M0923j08282q5865K9628
727d337N2664l4170K109L8183K696J6890o441l1817K7845p9471j02899j019J07641
714a2126O6903L0862j18739j6634J0361O4136R2669q5474q2922M8937L3926p7871
702d5972Q5549j30331K0388K09362J1568j55593L3167J7997Q329m1522o7331N5929
690A540m3863R046p4427L1977o224p922J44299n0342m4266J9648o4913o5247L760
$$ y = [-99150, -27206, -35960, -97535, 34742, -3883, -16295, 15495, 3060, 5256, 42381, -56581, -101750, 122974, 128840, 129607, 24497, -161733, -42974, -53965, -54817, -64388, -120427, -71415, -156102, -132938, -6314, 3518, 11379, 13035, -38377, -51729, 31637, 80430, -4524, -68080, -99224, 22000, 47116, 94564, -14636, 72342, 54165, 119259, 160182, 51900, -33965, -4337, 48327, 14157, 16266, 54449, 57145, 74035, 67594, 35777, 63622, -15849, -118748, -119767, -12126, 54777, 85639, -33100, -49734, -39373, 24763, 117432, 31958, -50964, -2027, 31899, -45972, 39577, -90754, -70366, 138996, 150564, -5029, 28138, 46135, 54464, 12942, -54389, 1540, -42323, -33277, -107704, -75727, -81951, -89873, 54426, 4084, -40182, -20534, -85447, -150694, -146934]
677a46934J02009L1984j1185j7926J46406k9702l5036q9037n3346J37517m3705
666h955l4945q971M5545l2797L4256o4363r2457O4129L0929p0902j0833J18914
654c0450O9215M3490j32782p8555R9952R4944M6847j9015j20588n465p0338P089
642i5656J77862j1898p411O4733j94978L4878O7428j00588j8715J09184K2375
631D7214j19989M9819M1603P8860R378l0379p2706q8020l0046l9437Q0170J29388
619E5855N4597n9533L2952k3579q3435R1151J1479l7625L6503N8934j4211p9737
607D3351M557j47835j43267J37550J50581j2240n5566M7812l6298K0175O4118
596G2938L6131j25559K6395k4558r464P3031o3410o5024J05356J9497m5635K0804
$$ y = [-146934, -44925, -12941, -24126, -42052, 104354, 74652, 39616, -49421, -102767, 34750, -8955, -43900, -52871, -7326, -40123, -5867, -70230, -162687, -98558, -67629, -138531, -149364, -30450, 38765, 82255, -50527, -129082, -29130, 65814, 112661, 93646, -26942, -32407, -102745, -95656, 82206, 70308, 62897, 127630, -67348, -32470, 34958, -65630, -84345, 24839, 47214, -72775, -22956, 18647, 97507, 106885, 76506, 3800, -84220, -114266, -153703, -73533, 55855, 110452, 50919, 83871, 60292, -23143, 68008, 79487, 41862, 78365, 137299, 123088, 43351, 47908, -99927, -243194, -105644, 44937, 32697, -22869, 24943, -11355, 8820, 72938, 109069, -16490, 9905, -14653, -24117, 48914, -14496, -79520, 25836, 45333, -302, 20502]
584B0502P3993j64259K8781O7384q2301m638J13760m7832j01277K4417p7709R3187
572e5992j08028K6852j3300J57690J91235r2576j02942J6110J0552J8226j5746
561C2081p8677M5195j1868o0321J31245J248j20876k517L8884K7348k1025n2891
549g2174P1435q6605Q8988O8413j01555R498k7217L9599m2372q251K2377N3004
537A5140k879j26586N1711N6009j3536J74424j1957m5701Q6813l1387j02548o2508
525a3005L4285l2028k8708R6371j232p9878o8341J03128J80526j9396q7183l1351
513E3188q8999K21728k5454k39719J55080M694l4340J2453R152l1377M8439N680
501I0525j3859r589n524j01625m5694l4027P2781M8318K1004L6666J06527j80871
$$ y = [20502, 94495, -69764, -40983, 26401, -55900, -60538, 53222, 5390, -95887, -71470, -149179, -55992, -164020, -137168, -150468, 7222, 198457, 105881, 2939, 19049, 29601, 47827, 32081, -46596, -1401, -13269, -73590, 57655, 58903, -61973, -64490, -25606, 1742, -19283, -72174, -739, -87344, 1644, 70057, -31498, -22000, -49217, -9618, -51990, -60241, -37864, 15140, 12261, -114325, -62614, -6605, -20141, 154283, 142326, 96625, 183438, 152051, 49503, -13005, 21280, -10748, -39456, 56915, 55683, -24195, -92536, 10592, 191118, 171722, 84539, 53188, -35811, 185917, 160463, -79256, 75824, 80518, 46178, 58631, 67783, 36406, 84845, 90525, 76666, 67077, 61553, -40072, -85766, -119793, -47012, 1306, 22310, 58976, 165503, -15368]
489a5368m0967J26215m1364o3972P4837J74054j01151r1965j33274L3272R5774
478A6091k8056j12217O1659J5494j3356k5355O2669O6112R3802q8662l1852J3234
466B9563j03150L7609R4109k9157n8035K4289J7979j9190L9506j03651q1271j33280
454b84679J71887K3448q9229O3902O873M7147O7103j3988k1517J07161K0715j27802
442b8979m0811J26356O890O7385l6512N0433p4212M4604o6088K2425n2247R493
430B8737M4504n2088m0009l0435N2888J5415J26444J910j11003q8646M5372K2738
418A5827p6821N0169o8121k1148K1312Q4428J39293n5809p2354M628j5586j48733
406a42915J15089J9990n4776Q17L4048o4130L4507J45153m1384q5546Q7942o8886
$$ y = [-15368, -56335, 69880, 28516, -35456, 39381, 213435, 112284, 20319, -112955, -79683, 16091, -11965, -124182, -62523, -47029, -60385, -85740, -23071, 43041, 136843, 48181, 16329, 29563, -73587, -35978, 58131, 28974, -29061, -4772, 13207, -5983, 33523, -70128, -151399, -284679, -112792, -89344, -178573, -114671, -107798, -60651, 6452, -7536, -29053, 78108, 98823, -28979, -69790, 56566, 63456, 130841, 94329, 144762, 70550, 115154, 49066, 71491, 19244, 28737, 73241, 21153, -18856, -49291, 3597, 19012, 145456, 147366, 36363, -52283, -6911, 15827, -60994, -10825, -78946, -100094, -78782, 5646, 144939, 89130, 16776, 21404, 5818, -142915, -27826, -7836, -62612, -61795, -27747, -91877, -57370, 87783, 46399, -39147, 48795, -20091]
394b0091R2089k3542k9428L8737j8796J889K8438k9320R208N237K6659J5413p7099
381A9394P0982p2865k6269m990N9176p2863J6528Q968l3752M4498k3188j13872
369a28253J66918l4733J4481L6150j8546k415m3002J5115p5110M0719J11491r853
357G2962m3755M6490j7094o1629J6414l0019j6708J43358m9135p8368l3811P4337
345B3042m2716q6527J04856l9953L5895K9898o4854o0551J18959m9646J06533
334G4936m9746l229n6497J6513J14297p4175J2789o4149j2380L1769J43540j395
322A32273j20528o3287P3826l5261J14311n1109j86668j9792J11671O1330Q7100
311A03866l5877K7849k3069m4079J02326M5077j39551j6486j9467j5644k5624
$$ y = [-20091, 71998, 48456, 19028, 57765, 38969, 40858, 69296, 39976, 49184, 54421, 81080, 96493, 19394, 90376, 17511, -8758, -13748, 45428, -27435, -10907, -1939, -35691, 8807, -14381, -128253, 38665, 3932, 18413, 54563, 36017, 33602, -9400, 5715, -69395, -28676, 82815, 72962, 29207, 75697, 58603, -3026, 13388, -16631, -33339, 110019, 60884, -17484, -51295, 23042, -19674, -106201, -1345, -41298, -5403, 24495, -40359, -100910, 18049, -31597, 74936, 25190, 21961, -34536, -18023, 96274, 22099, 34888, -29261, -41641, -9872, 133668, 132273, 11745, -51542, 22284, -12977, 101334, 50225, -136443, -156235, -44564, 16766, 103866, 67989, 95838, 72769, 28690, 131016, 176093, 36542, 20056, 589, -15055, -40679]
$$ [...]
##END NTUPLES=NMR SPECTRUM
##END=
