##TITLE=1H_EC-3254(3-4)
 CDCl3, 8 sc, 
 1.06.2021
##JCAMPDX= 6.0         $$ Bruker NMR JCAMP-DX V2.0
##DATA TYPE= NMR SPECTRUM
##DATA CLASS= NTUPLES
##ORIGIN= UXNMR, Bruker Analytische Messtechnik GmbH
##OWNER= root
$$ XWIN-NMR		Version 3.5
$$ Tue Jun  1 12:17:11 2021 Russian Standard Time (UT+4h)  she@DPX200
##.OBSERVE FREQUENCY= 200.131506
##.OBSERVE NUCLEUS= ^1H
##.ACQUISITION MODE= SIMULTANEOUS
##.ACQUISITION SCHEME= undefined
##.AVERAGES= 8
##.DIGITISER RES= 18
##SPECTROMETER/DATA SYSTEM= spect
##.PULSE SEQUENCE= zg30
##.SOLVENT NAME= CDCl3
##.SHIFT REFERENCE= (INTERNAL, CDCl3, 0, 15.9823)
##AUDIT TRAIL= $$ (NUMBER, WHEN, WHO, WHERE, WHAT)
$$ ##TITLE= Audit trail, XWIN-NMR		Version 3.5
$$ ##JCAMPDX= 5.01
$$ ##ORIGIN= Bruker BioSpin GmbH
$$ ##OWNER= she
$$ F:/spectra/data/she/nmr/H-F/1/pdata/1/auditp.txt
$$ ##AUDIT TRAIL=  $$ (NUMBER, WHEN, WHO, WHERE, WHAT)
(   1,<2021-06-01 12:14:18.84 +0400>,<she>,<DPX200>,
      <created by zg, POWCHK disabled, PULCHK disabled
       configuration hash MD5:
       00 E9 B6 7A A2 85 ED C7 34 08 36 98 17 FE 4E 26
       data hash MD5: 16K
       1C CF 3D 7E 2F 32 48 02 3A B5 8E 8E F1 64 D6 E0>)
(   2,<2021-06-01 12:14:21.57 +0400>,<she>,<DPX200>,
      <Start of raw data processing
       efp BC_mod = 2 LB = 0.24 FT_mod = 6 PKNL = 1 PHC0 = -11481.83 PHC1 = 15.00099 SI = 16K 
       data hash MD5: 16K
       B5 FD DC FA 39 67 10 FC D1 76 B4 CF 23 CF 37 73>)
(   3,<2021-06-01 12:14:40.82 +0400>,<she>,<DPX200>,
      <pk PHC0 = 1.18075 PHC1 = -1.8 
       data hash MD5: 16K
       10 54 35 41 47 98 B3 6C 86 B2 F6 7D 16 7E 8F 96>)
(   4,<2021-06-01 12:14:44.23 +0400>,<she>,<DPX200>,
      <abs ABSG = 5 
       data hash MD5: 16K
       23 8A 66 4F 3C 05 89 BB 48 5B 58 3E 85 E0 3C 44>)
$$ ##END=
$$ 
$$ hash MD5
$$ F6 1F 5C 3F F8 B7 18 E6 83 8B 61 B6 A3 38 AD 87
##$RELAX= 
##$RELAX= 
##$RELAX= 
##$RELAX= 
##$RELAX= 
##$RELAX= 
$$ Bruker specific parameters
$$ --------------------------
##$DU= <F:/spectra>
##$EXPNO= 1
##$NAME= <H-F>
##$PROCNO= 1
##$TYPE= <nmr>
##$USER= <she>
##$AMP= (0..31)
100 100 100 100 100 100 100 100 100 100 100 100 100 100 100 100 100 100 
100 100 100 100 100 100 100 100 100 100 100 100 100 100 
##$AQSEQ= 0
##$AQ_mod= 1
##$AUNM= <au_zg>
##$AUTOPOS= <>
##$BF1= 200.13
##$BF2= 200.13
##$BF3= 200.13
##$BF4= 200.13
##$BF5= 200.13
##$BF6= 200.13
##$BF7= 200.13
##$BF8= 200.13
##$BYTORDA= 1
##$CFDGTYP= 0
##$CFRGTYP= 5
##$CHEMSTR= <none>
##$CNST= (0..31)
1 1 145 1 1 1 1 1 1 1 1 1 1 1 1 1 1 1 1 1 1 1 1 1 1 1 1 1 1 1 1 1 
##$CPDPRG= <>
##$CPDPRG1= <>
##$CPDPRG2= <>
##$CPDPRG3= <>
##$CPDPRG4= <mlev>
##$CPDPRG5= <mlev>
##$CPDPRG6= <mlev>
##$CPDPRG7= <mlev>
##$CPDPRG8= <mlev>
##$CPDPRGB= <>
##$CPDPRGT= <>
##$D= (0..31)
0 1.2 0 0 0 0 0 0 0 0.06 0 0.03 0 0 0 0 0.0002 0 0 0 0 0 0 0 0 0 0 0 0 
0 0 0 
##$DATE= 1622535258
##$DBL= (0..7)
120 120 120 120 120 120 120 120 
##$DBP= (0..7)
150 150 150 150 150 150 150 150 
##$DBP07= 0
##$DBPNAM0= <>
##$DBPNAM1= <>
##$DBPNAM2= <>
##$DBPNAM3= <>
##$DBPNAM4= <>
$$ [...]
##$SUBNAM3= <"">
##$SUBNAM4= <"">
##$SUBNAM5= <"">
##$SUBNAM6= <"">
##$SUBNAM7= <"">
##$SUBNAM8= <"">
##$SUBNAM9= <"">
##$SW= 16.9725357007746
##$SWIBOX= (0..15)
0 0 2 0 0 0 0 0 0 0 0 0 0 0 0 0 
##$SW_h= 3396.73913043478
##$TD= 16384
##$TD0= 1
##$TE= 0
##$TE2= 300
##$TE3= 300
##$TEG= 300
##$TL= (0..7)
0 120 120 120 120 120 120 120 
##$TP= (0..7)
150 150 150 150 150 150 150 150 
##$TP07= 0
##$TPNAME0= <>
##$TPNAME1= <>
##$TPNAME2= <>
##$TPNAME3= <>
##$TPNAME4= <>
##$TPNAME5= <>
##$TPNAME6= <>
##$TPNAME7= <>
##$TPOAL= (0..7)
0.5 0.5 0.5 0.5 0.5 0.5 0.5 0.5 
##$TPOFFS= (0..7)
0 0 0 0 0 0 0 0 
##$TUNHIN= 0
##$TUNHOUT= 0
##$TUNXOUT= 0
##$USERA1= <user>
##$USERA2= <user>
##$USERA3= <user>
##$USERA4= <user>
##$USERA5= <user>
##$V9= 5
##$VALIST= <valist>
##$VCLIST= <CCCCCCCCCCCCCCC>
##$VD= 0
##$VDLIST= <DDDDDDDDDDDDDDD>
##$VPLIST= <PPPPPPPPPPPPPPP>
##$VTLIST= <TTTTTTTTTTTTTTT>
##$WBST= 1024
##$WBSW= 4
##$XGAIN= (0..3)
0 0 0 0 
##$XL= 0
##$YL= 0
##$YMAX_a= 518845
##$YMIN_a= -541841
##$ZGOPTNS= <>
##$ZL1= 120
##$ZL2= 120
##$ZL3= 120
##$ZL4= 120
##$ABSF1= 15.98853
##$ABSF2= -0.9841337
##$ABSG= 5
##$ABSL= 3
##$ALPHA= 0
##$AQORDER= 0
##$ASSFAC= 0
##$ASSFACI= 0
##$ASSFACX= 0
##$ASSWID= 0
##$AUNMP= <proc_1d>
##$AZFE= 0.1
##$AZFW= 0.1
##$BCFW= 0
##$BC_mod= 2
##$BYTORDP= 0
##$COROFFS= 0
##$CY= -3
##$DATMOD= 1
##$DC= 0
##$DFILT= <>
##$DTYPP= 0
##$F1P= 0
##$F2P= 0
##$FCOR= 1
##$FTSIZE= 16384
##$FT_mod= 6
##$GAMMA= 0
##$GB= 0
##$INTBC= 1
##$INTSCL= 1.334414e-10
##$ISEN= 128
##$LB= 0.24
##$LEV0= 0
##$LPBIN= 0
##$MAXI= 10000
##$MC2= 0
##$MEAN= 0
##$ME_mod= 0
##$MI= 1.114404
##$NCOEF= 0
##$NC_proc= -6
##$NLEV= 6
##$NOISF1= 3.799351
##$NOISF2= 2.8
##$NSP= 0
##$NTH_PI= 0
##$NZP= 0
##$OFFSET= 15.98232
##$PC= 1
##$PHC0= -11480.65
##$PHC1= 13.20099
##$PH_mod= 1
##$PKNL= yes
##$PPARMOD= 0
##$PSCAL= 0
##$PSIGN= 0
##$REVERSE= no
##$SF= 200.130005829713
##$SI= 16384
##$SIGF1= 3
##$SIGF2= 2
##$SINO= 5.538805
##$SIOLD= 16384
##$SREGLST= <1H.CDCl3>
##$SSB= 0
##$STSI= 16384
##$STSR= 0
##$SW_p= 3396.73913043479
##$SYMM= 0
##$S_DEV= 0
##$TDeff= 16384
##$TDoff= 0
##$TI= <>
##$TILT= no
##$TM1= 0
##$TM2= 0
##$TOPLEV= 0
##$USERP1= <user>
##$USERP2= <user>
##$USERP3= <user>
##$USERP4= <user>
##$USERP5= <user>
##$WDW= 1
##$XDIM= 16384
##$YMAX_p= 344426405
##$YMIN_p= -385161
$$ End of Bruker specific parameters
$$ ---------------------------------
##NTUPLES= NMR SPECTRUM
##VAR_NAME=  FREQUENCY,     SPECTRUM/REAL,   SPECTRUM/IMAG
##SYMBOL=    X,             R,               I
##VAR_TYPE=  INDEPENDENT,   DEPENDENT,       DEPENDENT
##VAR_FORM=  AFFN,          ASDF,            ASDF
##VAR_DIM=   16384,         16384,           16384
##UNITS=     HZ,            ARBITRARY UNITS, ARBITRARY UNITS
##FACTOR=    0.207333158178282, 1,           1
##FIRST=     3198.54176112011, 0,            0
##LAST=      -198.197369314683, 0,           0
##MIN=       -198.197369314683, -385161,     0
##MAX=       3198.54176112011, 344426405,    0
$$ Real data points
##PAGE= N=1
##DATA TABLE= (X++(R..R)), XYDATA
$$ [...]
5297D08312k4979K3535M3315M7507Q0158K2533r1045M1302m2547J0405n8213n6630
5285D03653J68571N036K016N0653N5594j16277K8442p352l4072N1005O9258l2642
5273F43885j29800p6705l1366M6605P6512M1549K3275P151j14071q3154J08954
5262E12835J25119m7046r3456M4418O8770m5285J1958N3214M8489N7032j36501
5251E99547j12803K3279Q3122O2734N2425J19215j258l8307k4981L3308P6196
5240H72477n2999R5278J46143M3205n5855k8526l1904Q07p454j00463j622N1867
5228I30954P8571j67932J01860J03481o8110j34606k1919R7065Q2899J7495j52749
5217H67009N8257M7139L3759N1427O818N7953P3158R1883J5212l3162N0677n9247
$$ y = [408312, 383333, 406868, 450183, 497690, 577848, 600381, 509336, 550638, 508091, 518496, 460283, 403653, 572224, 577260, 579276, 629929, 685523, 569246, 597688, 590336, 556264, 607269, 676527, 643885, 514085, 437380, 406014, 452619, 529131, 570680, 593955, 601106, 487035, 403881, 512835, 637954, 590908, 497452, 541870, 610640, 565355, 577313, 630527, 679016, 736048, 599547, 486744, 510023, 593145, 655879, 708304, 827519, 826261, 787954, 762973, 796281, 872477, 819478, 914756, 1060899, 1104104, 1048249, 1019723, 987819, 988626, 981172, 880709, 879087, 930954, 1009525, 841593, 943453, 1046934, 978824, 844218, 822299, 919364, 1002263, 1019758, 867009, 925266, 972405, 1006164, 1057591, 1064409, 1122362, 1195520, 1287403, 1302615, 1269453, 1320130, 1260883]
5205A260883N7543J193O6407O1084L8999M308j26408o4028J9544k3352n556l8122
5193A252495n4463R4882M0021j28706j18979K2326l2692o3586O5822L7683j17717
5182I97086M1431l2760m1102Q0840L8166N7103r881J44463q8426M7346J02395
5171A336661q0794K3148k0885q8146o8670R6762K9505J6044M7459o1380j22717
5160A106987m4290m634L0876J32921J28453j41182l4206L5501q8335Q846l2877
5149A098060q0147k8648J27618p3245n2255J74804j32896o1219o2951p4971m0859
5138G93291R0338J39462l3973Q3124m0624o5310M3570N1865R3986j7686J00725
5127A238768m9493j34915o5412L7586P7645j1825k5374r913J57276j09096j31144
$$ y = [1260883, 1318426, 1319619, 1386026, 1447110, 1486109, 1490417, 1364009, 1299981, 1319525, 1296173, 1290617, 1252495, 1198032, 1292914, 1332935, 1204229, 1085250, 1107576, 1074884, 1011298, 1077120, 1114803, 997086, 1038517, 1005757, 964655, 1045495, 1083661, 1140764, 1130883, 1275346, 1186920, 1234266, 1336661, 1255867, 1279015, 1258130, 1169984, 1101314, 1198076, 1227581, 1243625, 1291084, 1229704, 1106987, 1062697, 1058063, 1088939, 1221860, 1350313, 1209131, 1174925, 1210426, 1122091, 1130937, 1098060, 1017913, 989265, 1116883, 1043638, 991383, 1166187, 1033291, 972072, 909121, 834150, 793291, 883629, 1023091, 989118, 1072242, 1031618, 966308, 1009878, 1061743, 1155729, 1138043, 1238768, 1189275, 1054360, 988948, 1026534, 1104179, 1092354, 1066980, 1057067, 1214343, 1105247, 974103]
5116I74103O6346N8917k7848L6902R4553J4494M0684O1289J06721J5652n7898
5105A383915j59568l9361N6822P6943L4514J02287j57294o3600K6221R3310N7494
5094A411683M5225K3879j38705J34430O4793p5088M2394O6538r9462M6978K6719
5083A549384J15859Q2140O6745M6787j67672J8123O3659r3981K4484R6391m1735
5072A760184n951n603o7794n3652J80575L7754J17503k6777n0356J82316J9455
5061B087654q5367K8642M3656j3579k05Q3266J07362J8201R0746J08818P2023
5050B541217o8991J36181P5265q9483K14998J8755j7850L2037j56981J47942J52800
5039B985890N3215r6030Q6066n8307p131L4418Q2871k8804P9417K19868Q5209
$$ y = [974103, 1040449, 1099366, 1071518, 1108420, 1202973, 1217467, 1258151, 1319440, 1426161, 1441813, 1383915, 1224347, 1184986, 1241808, 1318751, 1353265, 1455552, 1298258, 1234658, 1260879, 1354189, 1411683, 1456908, 1480787, 1342082, 1476512, 1541305, 1466217, 1508611, 1575149, 1475687, 1522665, 1549384, 1665243, 1747383, 1814128, 1860915, 1693243, 1711366, 1775025, 1681044, 1705528, 1801919, 1760184, 1754233, 1748630, 1680836, 1627184, 1807759, 1845513, 1963016, 1936239, 1885883, 2068199, 2087654, 2002287, 2030929, 2074585, 2061006, 2060801, 2144067, 2251429, 2269630, 2360376, 2469194, 2541217, 2472226, 2608407, 2683672, 2594189, 2809187, 2827942, 2810092, 2842129, 2685148, 2833090, 2985890, 3039105, 2943075, 3029141, 2970834, 2963703, 2998121, 3080992, 3052188, 3131605, 3351473, 3436682]
5028C436682J25980J03420R9091K7455l5052J59342J15624J95175K25163J16690
5018D569570j201Q9492N8783J63519K33690J57830J88987K48486J89349J75330
5008F073835J03422J53981L06293M64097L40223K96396L79707L33587M50046M87158
4998I388745M53229L13388N56251L23399K25363M4405n5667j29301l01377l72675
4988A0445760m09696k47483k27527j77588r7485N3295M5550l5872o0489k2552
4978I265913K33689K16075K29258K00549K17255L61117M29569M14221M59298N76390
4968A2603334N56179N39881N47080M91886O42509N38229N02405L66732L28071
4959A7116306K65878K1904j85509k62092k54785k21544n49935n73401n16671l81399
$$ y = [3436682, 3562662, 3666082, 3765173, 3792628, 3757576, 3916918, 4032542, 4227717, 4452880, 4569570, 4568369, 4657861, 4716644, 4880163, 5113853, 5271683, 5460670, 5709156, 5898505, 6073835, 6177257, 6331238, 6637531, 7101628, 7441851, 7738247, 8117954, 8451541, 8901587, 9388745, 9841974, 10155362, 10711613, 11035012, 11260375, 11304780, 11249113, 11119812, 10818435, 10445760, 10036064, 9788581, 9561054, 9383466, 9285981, 9339276, 9384826, 9348954, 9288465, 9265913, 9499602, 9715677, 9944935, 10145484, 10362739, 10723856, 11153425, 11567646, 12026944, 12603334, 13159513, 13699394, 14246474, 14738360, 15380869, 15919098, 16421503, 16788235, 17116306, 17382184, 17404088, 17218579, 16956487, 16701702, 16480158, 15930223, 15356822, 14840151, 14458752]
4949A4458752m31293m82481n57402k95652k47058l33942l27826j52585N2416l7339
4939A1645590P8889m2397J66719J85016K20183K10201K14588L05604L49158L99297
4929A3732848K46173N15908P17218N28428L83720M03887O19894L80758K53338
4920A7782172R4952r2034J53059J53321J75869L78333N12185N36140O09912Q33493
4910B1137402P61893P71709Q25412N13652K00061m9790l52537o72597r45722j063991
4900B1125492r40491o09873p17503o35776l97242k90868j32321p251o1036J82521
4890A7515652J95355L21336M97286N18155O75494Q98639Q62597R87266J230455
4881B3702235J351519J524940J621373J670580J629812J573788J618882J352813
$$ y = [14458752, 14027459, 13544978, 12987576, 12691924, 12444866, 12110924, 11783098, 11630513, 11682929, 11645590, 11724479, 11682082, 11848801, 12033817, 12254000, 12464201, 12678789, 12984393, 13333551, 13732848, 13979021, 14494929, 15212147, 15740575, 16124295, 16528182, 17148076, 17528834, 17782172, 17877124, 17785090, 17938149, 18091470, 18267339, 18645672, 19157857, 19693997, 20303909, 21137402, 21899295, 22671004, 23496416, 24010068, 24210129, 24160339, 23807802, 23135205, 22189483, 21125492, 20185001, 19575128, 18857625, 18221849, 17824607, 17533739, 17401418, 17394167, 17333131, 17515652, 17711007, 18032343, 18529629, 19047784, 19723278, 20621917, 21484514, 22471780, 23702235, 25053754, 26578694, 28200067, 29870647, 31500459, 33074247, 34693129, 36045942]
4873C6045942J131233O08985j93403q46194j498579j831247k206423k113364k038034
4864B7058916j841708j765151j512985j168773r88958r56335p88150o12490m32415
4855A6991951l11198l30190j96332p4215M8859J33059L13377L48233L71515O16465
4845A7911524P00599N39993P38301P11201O23986P19766N33570K09727k79580
4836B2409087o06250r81673j342950j405001j421891j224129j208983j150043
4828A3068167r47826p78671o60555o26520n59570n28238m01751l70514l78405
4819G816117l03087k13413k00226k24484l49220l22143m3353j37528j42701k70288
4809E609674k14720p8071j12108j91114k08977l2544k5395j21803j58871j06614
$$ y = [36045942, 37177175, 37786160, 37592757, 36746563, 35247984, 33416737, 31210314, 29096950, 27058916, 25217208, 23452057, 21939072, 20770299, 19781341, 18825006, 18036856, 17424366, 16991951, 16680753, 16350563, 16154231, 16080016, 16128875, 16261934, 16575311, 16923544, 17295059, 17911524, 18612123, 19152116, 19890417, 20601618, 21225604, 21945370, 22478940, 22688667, 22409087, 21802837, 20821164, 19478214, 18073213, 16651322, 15427193, 14218210, 13068167, 12120341, 11341670, 10681115, 10054595, 9495025, 8966787, 8565036, 8194522, 7816117, 7513030, 7299617, 7099391, 6874907, 6525687, 6203544, 6160191, 6022663, 5879962, 5609674, 5394954, 5316883, 5204775, 5013661, 4804684, 4772140, 4746745, 4624942, 4466071, 4359457]
4799D359457l0989O5139q1717r5311j07472j22862j74455j21088j36863j80311
4789C373528l0040j422j58953p7981k5104k0278N212q6427o6024j04505P5035
4778B883041r7830n0461M3326K0684m0424j68528j13557N057O0017r7510l365
4767B440450r3253j6751N5713l7550j01619M5873r2834j47193P0456o9481K4223
4756B078034M3238j00459q6673k3209O671q015K2146j02514r0233J27216p2554
4745A793648j14403j3301J6472j2015P5543m0890j32154O9321q1149j44477N9182
4734A475777J18505K9214k1467j10413q650N1391n251j34055K7106P5399l9618
4723A457938p0864k7297L3934Q6257m9835p3644j10427R711O5776P8757P6378
$$ y = [4359457, 4328468, 4393607, 4311890, 4216579, 4109107, 3986245, 3811790, 3690702, 3553839, 3373528, 3343488, 3342066, 3183113, 3105132, 3080028, 3059750, 3064962, 2978535, 2912511, 2808006, 2883041, 2785211, 2734750, 2778076, 2798760, 2758336, 2589808, 2476251, 2481308, 2541325, 2443815, 2440450, 2347197, 2330446, 2386159, 2348609, 2246990, 2292863, 2200029, 2052836, 2123292, 2053811, 2078034, 2121272, 2020813, 1934140, 1910931, 1917602, 1909587, 1931733, 1829219, 1738986, 1866202, 1793648, 1679245, 1665944, 1682416, 1670401, 1745944, 1705054, 1572900, 1642221, 1561072, 1416595, 1475777, 1594282, 1623496, 1602029, 1491616, 1482966, 1534357, 1529106, 1395051, 1422157, 1497556, 1457938, 1387074, 1359777, 1393711, 1479968, 1430133, 1356489, 1246062, 1255773, 1321549, 1400306, 1476684]
4712A476684r4704Q60p9569M9099M2296l6759L5219j02889j19004o887k3783N2333
4700A192896M7187K0116L294M1435Q6508m7896l9822o5500J62673R4582q1764
4689A413709p6322j9271P7228J39665N57j18536k046n1162o2817j13190J08309
4678A296124M7108J9864k2433M0555m9080J0969J26830j92175L7175R8002j73874
4667A239065L2672j6346J3515J3115n4494r3862l1514J40456M3413K0535K4674
4656A331229L8347o8468j58191k6379R4844l3110L7706l2201j19709Q2838k642
4645A144264J4001Q4370M0697K0020K3014o2248j6478N5986Q170j14024J24674
4634A322446R9366j23441r9235J19417q481k6862J04917j02442J500Q8014L3494
$$ y = [1476684, 1381980, 1382840, 1303271, 1352370, 1394666, 1357907, 1393126, 1290237, 1171233, 1164346, 1140563, 1192896, 1240083, 1260199, 1263493, 1304928, 1391436, 1343540, 1303718, 1238218, 1400891, 1495473, 1413709, 1337387, 1318116, 1395344, 1535009, 1535566, 1417030, 1414984, 1363822, 1301005, 1187815, 1296124, 1343232, 1363096, 1340663, 1381218, 1332138, 1343107, 1469937, 1277762, 1314937, 1412939, 1239065, 1271737, 1255391, 1268906, 1282021, 1227527, 1133665, 1102151, 1242607, 1286020, 1306555, 1331229, 1369576, 1301108, 1142917, 1116538, 1211382, 1178272, 1215978, 1183777, 1064068, 1146906, 1144264, 1158265, 1242635, 1283332, 1303352, 1326366, 1264118, 1247640, 1303626, 1311796, 1197772, 1322446, 1421812, 1298371, 1199136, 1318553, 1310072, 1283210, 1388127, 1285685, 1287185, 1375199, 1408693]
4623A408693J9165k3689M193r242l5181M5740j6374J8899m9039J0826N7206J3703
4611A444900J25684K9707p109M1417m0331r364L6222M3466r0701J8413P4337k2072
4599A644569o0343o8458J9875J71804j18580l2914m5324q641J2116P2971J0612
4588A597687q9483J35861P0815q7133o3664N0067R8437J5990n7132J1595Q8762
4577A771802j7965m7974K1195L2087o7287J29032j3650j33136O5369P9042R8705
4566A917220O8263q8183p3964J0568L7786m7928Q1036R2612j28016L1314J45102
4555B045810O8920Q0995J2546j12943Q3293N9018J31805k6429J6039k637J17086
4544B473503m6612l2532J32788J28430N4522J13344l009j1598J80911J08894l2352
$$ y = [1408693, 1427858, 1404169, 1408362, 1399120, 1363939, 1409679, 1393305, 1412204, 1363165, 1373991, 1431197, 1444900, 1570584, 1600291, 1593182, 1634599, 1594268, 1584904, 1621126, 1664592, 1573891, 1592304, 1666641, 1644569, 1584226, 1515768, 1535643, 1707447, 1588867, 1555953, 1510629, 1501988, 1514104, 1587075, 1597687, 1508204, 1644065, 1714880, 1627747, 1564083, 1614150, 1712587, 1728577, 1671445, 1683040, 1771802, 1753837, 1705863, 1727058, 1759145, 1691858, 1820890, 1807240, 1674104, 1739473, 1818515, 1917220, 1985483, 1897300, 1823336, 1833904, 1871690, 1823762, 1904798, 1997410, 1869394, 1900708, 2045810, 2114730, 2195725, 2208271, 2095328, 2178621, 2237639, 2369444, 2343015, 2359054, 2356417, 2473503, 2426891, 2394359, 2527147, 2655577, 2710099, 2823443, 2820434, 2808836, 2989747, 3098641, 3066289]
4533C066289J30925O7608M22J4353j07279J4515J02900J0654N3498M6888n4014
4522C346759N2379J53511K1662m2707J23667P5955R4125J01565L2410L9574J03748
4511D102648J17220j5320J44705K13455m2720K31674K24485J52142J91475J13835
4501E433599J26430K92494K12496M3122j3261k5953k47517p7480j4548j22804
4491E606578Q8815J10230P3966L480J21405P5282J03326J89092J11150L11956
4481F795280L52411K39503K70382L36686L62772L61751M64398L74732M22685M52066
4471A0432666M34675N72351M49974M40114O23080N87895P48682Q19608O99370
4462A5808415P37917P46425O68098Q40689J209009J380248J453507J755901J871142
$$ y = [3066289, 3197214, 3264822, 3265244, 3279597, 3172318, 3186833, 3289733, 3300387, 3353885, 3400773, 3346759, 3399138, 3552649, 3574311, 3531604, 3655271, 3731226, 3825351, 3926916, 3959326, 3998900, 4102648, 4219868, 4204548, 4349253, 4562708, 4519988, 4751662, 4976147, 5128289, 5319764, 5433599, 5560029, 5852523, 6065019, 6108141, 6094880, 6068927, 5821410, 5743930, 5729382, 5606578, 5695393, 5805623, 5879589, 5883069, 6004474, 6079756, 6183082, 6372174, 6483324, 6795280, 7147691, 7387194, 7657576, 7994262, 8357034, 8718785, 9183183, 9557915, 9980600, 10432666, 10867341, 11439692, 11889666, 12329780, 12952860, 13540755, 14289437, 15109045, 15808415, 16546332, 17292757, 17960855, 18801544, 20010553, 21390801, 22844308, 24600209, 26471351]
4453B6471351K110775K383290K501355K657077K913558L142984L045781L069479
4445D8295650L017207K767501K481980J978928J292774Q68233l4367j023760j804002
4436E7840144k476327k838158l009616k986364k949584k921048k839686k928373
4428C4890988k944442k672739k312220j989370j752786j622851j356874j191023
4420A9048683j225217j052789q40305p27862n94671o40337o12871n04413m11121
4411A2439097m41373m37122l50693l11293k62577k54133j81657k59559j07173
4402I833517o9665k32293l40672k01234j90003J3938j24216j86129l06669k68041
4392G928533j19258k20872p7655k49291k19394k05007o7328k44794k81933j09244
$$ y = [26471351, 28582126, 30965416, 33466771, 36123848, 39037406, 42180390, 45226171, 48295650, 51312857, 54080358, 56562338, 58541266, 59834040, 60702273, 60667906, 59644146, 57840144, 55363817, 52525659, 49516043, 46529679, 43580095, 40659047, 37819361, 34890988, 31946546, 29273807, 26961587, 24972217, 23219431, 21596580, 20239706, 19048683, 17823466, 16770677, 15930372, 15202510, 14607839, 13967502, 13354631, 12850218, 12439097, 11997724, 11560602, 11209909, 10898616, 10636039, 10381906, 10200249, 9940690, 9833517, 9763852, 9531559, 9190887, 8989653, 8799650, 8813588, 8689372, 8503243, 8196574, 7928533, 7809275, 7588403, 7510748, 7261457, 7042063, 6837056, 6769728, 6524934, 6243001, 6133757]
4382F133757j62321p5399j03998j39947k06327j20466P371n1301o5945j35921
4372E079503r5421m9879J23802r3282j4605p8072j13354j05772J9556n4899r3797
4361D523780K3923r8182p4798k3902j3034J9682N1924j42203Q8882r9473l5602
4350D220997L495l1442P0978r6085q6891o854K7441j8326k8505J15393Q1128L8049
4338D289378l972j71305k5448R9816n0704J0484j2742j72466j58771o7162o2468
4327C674640q9825R924o4448j31693Q9713k6360n5401o55j7463q1386J9969P2219
4315C399234j39910Q8322l2207K8263K6142p2538j0850J34966J86093l621M7480
4304C651374q2783j9341j13504k14848j71190q3414J0569m933j70869j79204r9275
$$ y = [6133757, 5971436, 5896037, 5792039, 5652092, 5445765, 5325299, 5332670, 5281369, 5215424, 5079503, 4984082, 4934203, 5058005, 4964723, 4950118, 4872046, 4758692, 4652920, 4672476, 4617577, 4523780, 4547703, 4449521, 4374723, 4350821, 4337787, 4357469, 4409393, 4267190, 4356072, 4256599, 4220997, 4224492, 4193050, 4264028, 4167943, 4081052, 4074198, 4101639, 4083313, 4054808, 4170201, 4251329, 4289378, 4285406, 4114101, 4088653, 4188469, 4137765, 4148249, 4135507, 3963041, 3804270, 3737108, 3674640, 3584815, 3594739, 3530291, 3398598, 3488311, 3461951, 3406550, 3405895, 3388432, 3307046, 3327015, 3399234, 3259324, 3347646, 3315439, 3343702, 3369844, 3297306, 3286456, 3421422, 3607515, 3603894, 3651374, 3568591, 3549250, 3435746, 3220898, 3049708, 2966294, 2976863, 2971930, 2801061, 2621857, 2522582]
4293B522582l7127J0113j36335j63296J09127R456j2175o9928k1694J6777m4109
4282B183391j7221j91475j79054O5674M9344p9167N8045n8472k4059J60953o2511
4271A905448k0255J32648m5810j20225q1909J03766R9464L2676O6158p6497j01176
4260A894288J29645j12633n4903Q9761p2123l5734J8109Q6314o0800K6614O0640
4249A969178M2977P3203R278n0508O9528J6587M9851J32832R0733Q8253Q8906
4238B580818J32786J21771K60542K22819M10665K63736L85619M57311K99890L14035
4228E449992L30354j2831o09344p15587o56894n46952k24288k02546k34043j66909
4218B410952k13164j20034Q3226r5920p7635j6089p9050j03007K5559R6779r0624
$$ y = [2522582, 2485455, 2495568, 2359233, 2195937, 2305064, 2314520, 2302345, 2232417, 2210723, 2227500, 2183391, 2166170, 1974695, 1795641, 1861315, 1910659, 1831492, 1889537, 1831065, 1807006, 1967959, 1905448, 1885193, 2017841, 1972031, 1851806, 1769897, 1873663, 1973127, 2005803, 2071961, 1995464, 1894288, 2023933, 1911300, 1856397, 1946158, 1874035, 1838301, 1856410, 1942724, 1881924, 1908538, 1969178, 2012155, 2085358, 2094636, 2044128, 2113656, 2130243, 2180094, 2312926, 2403659, 2491912, 2580818, 2713604, 2835375, 3095917, 3318736, 3729401, 3993137, 4378756, 4836067, 5135957, 5449992, 5780346, 5767515, 5158171, 4442584, 3785690, 3238738, 3014450, 2811904, 2577861, 2410952, 2197788, 2077754, 2160980, 2065060, 1987425, 1971336, 1892286, 1789279, 1814838, 1911617, 1820993]
4207A820993r9363L42j9058k7293K5108L169Q0827K6067j76980o21N6140p1396
4195A617935j4645o5905l2659N9716k3019j02876M9210K2325q5536N3500k4874
4184A453172l4971j0451l0441r4599k0410K12922J03587r1065j94583Q2621P8009
4173A453791L1047j19336q0683l2758N8872K4424l9874K6800J43679n5795k02219
4162A207948J2760N8455R9528L0687m0676l0177L1055l8403o5291l8934n6211
4151A170741O4186J21616j71090p8359N2149J019p615J04641R653k8967R2332
4140A330306m1700k9612Q3237k2950m6996M5798n1486j38016J90215J31100k53865
4129A196031j8528J04319O5622n0684k7057l370P6617R2398k9847k3736J52966
$$ y = [1820993, 1721630, 1721972, 1702914, 1675621, 1700729, 1703898, 1784725, 1810792, 1633812, 1633191, 1689331, 1617935, 1603290, 1537385, 1504726, 1564442, 1541423, 1438547, 1487757, 1510082, 1424546, 1478046, 1453172, 1418201, 1407750, 1377309, 1282710, 1262300, 1475222, 1578809, 1487744, 1293161, 1375782, 1453791, 1484838, 1365502, 1284819, 1252061, 1310933, 1335357, 1295483, 1322283, 1465962, 1410167, 1207948, 1220708, 1279163, 1378691, 1409378, 1368702, 1338525, 1369580, 1331177, 1265886, 1226952, 1170741, 1234927, 1356543, 1185453, 1107094, 1159243, 1160262, 1152647, 1257288, 1266941, 1237974, 1330306, 1288606, 1258994, 1342231, 1319281, 1272285, 1318083, 1266597, 1128581, 1318796, 1449896, 1196031, 1177503, 1281822, 1347444, 1296760, 1269703, 1266333, 1342950, 1435348, 1405501, 1381765, 1534731]
4118A534731O344o8286q2178n8029J37659N8644n7451L669K0351L3829q7442j12319
4106A329522r3245N0498J79385o4720k7587n5355P1970O3536l9152k7651L4651
4095A421852j0417L3523K4376j09522M3255k6052q6554j02833O3306J36835k2121
4084A365648L2117q0134j11291R1940j9603k0005J54453J42925l6563L2224N0370
4073A602081r0534O9048l942M5544m6912J01573O8408k3836k5356k10644R8757
4062A584187R5606O5492l2714p4761k6207L9434J9824q0211N071O3190q7962p8564
4050A492385J57544O3512l8621n2393M311N157J11418K1567j37387N8254J59429
4039A845176N1489J315m6958K6155o2550N0141k752j11873n2721k5968l418Q7237
$$ y = [1534731, 1541075, 1472789, 1390611, 1332582, 1470241, 1528885, 1471434, 1475103, 1495454, 1529283, 1441841, 1329522, 1236277, 1286775, 1466160, 1401440, 1373853, 1318498, 1390468, 1454004, 1414852, 1387201, 1421852, 1411435, 1444958, 1469334, 1359812, 1403067, 1377015, 1290461, 1187628, 1250934, 1387769, 1365648, 1397765, 1317631, 1206340, 1298280, 1278677, 1258672, 1413125, 1556050, 1519487, 1551711, 1602081, 1511547, 1580595, 1576653, 1622197, 1575285, 1676858, 1745266, 1721430, 1696074, 1485430, 1584187, 1679793, 1745285, 1712571, 1637810, 1611603, 1651037, 1670861, 1590650, 1595721, 1658911, 1570949, 1492385, 1649929, 1713441, 1674820, 1622427, 1626738, 1631895, 1743313, 1764880, 1627493, 1685747, 1845176, 1896665, 1897980, 1851022, 1877177, 1814627, 1864768, 1862016, 1750143, 1697422, 1671454, 1668036, 1755273]
4027A755273P1375Q822M1143l0152p1489N0729J33221N370r3249p0249j25712
4016A675082P4906J81569Q0390o829k1434P2988J9384J1612j09001L5603J21442
4005B135712J38511j1675k08925J12245N1767K8643p4952j40779q4908o4147J39994
3994B021486J0829N2586L414n5490q6401r2670R8090R8038o1705p8159J5101K0801
3982A945920K3800M1551j09775j754L3050Q1789M3315o305k0029J6820K84J1909
3970B060575m2069J48772n4997p5011J26389K2797q6394m4577q2268j16526N4669
3959A911360M7103L7277J8012m3498j06094J9246Q9870q0038J9046J53734P4011
3948B140029l1094j40951n3003J35140P3338o8180J7782n9139J6987J01166k4973
$$ y = [1755273, 1826648, 1835470, 1876613, 1846461, 1774972, 1825701, 1958922, 1964292, 1871043, 1800794, 1675082, 1749988, 1931557, 2011947, 2005118, 1983684, 2056672, 2076056, 2087668, 1978667, 2014270, 2135712, 2274223, 2262548, 2053623, 2165868, 2217635, 2246278, 2171326, 2030547, 1945639, 1881492, 2021486, 2032315, 2084901, 2088315, 2032825, 1946424, 1853754, 1951844, 2049882, 1988177, 1910018, 1925119, 1945920, 1969720, 2011271, 1901496, 1899742, 1932792, 2014581, 2057896, 2051591, 2031562, 2048382, 2048666, 2060575, 2018506, 2167278, 2112281, 2037270, 2163659, 2186456, 2100062, 2055485, 1973217, 1856691, 1911360, 1958463, 1995740, 2013752, 1970254, 1864160, 1883406, 1973276, 1893238, 1912284, 2066018, 2140029, 2108935, 1967984, 1914981, 2050121, 2123459, 2055279, 2073061, 2013922, 2030909, 2132075, 2107102]
3937B107102O9661Q4288l4472L40o5102Q3642K23964L6890j64298j52786J15845
3926B305074J28757O1286n5452j97136L0948Q1250k1735n7131M4516N3180K1825
3915B395382j5205k6366K1904M456n093P3503M6874J29811k3730l7659j28119
3904B435758M8715M4349K8809O5638Q313k6311J9533K02226Q046N5600P8559n7955
3892B911280q533j7378J85206J26724J16203J6925K0103N9404J8076O8712m4595
3881C452127J37905J52874N7563n4356K3663K48146J03200L6295J9119q5110J61173
3870D252599P4718P6040K5953K69O8545J91066J00644o531J13442J05673J58886
3859E161304P6016R0911R6640J97809J81071J42466L31066L14026J89616J59980
$$ y = [2107102, 2176763, 2261051, 2226579, 2226919, 2161817, 2245459, 2469423, 2506313, 2342015, 2189229, 2305074, 2433831, 2495117, 2439665, 2242529, 2273477, 2354727, 2332992, 2275861, 2320377, 2373557, 2395382, 2380177, 2353811, 2375715, 2380171, 2375078, 2448581, 2495455, 2625266, 2601536, 2563877, 2435758, 2484473, 2528822, 2557631, 2623269, 2631582, 2605271, 2624804, 2827030, 2835076, 2890676, 2969235, 2911280, 2902747, 2885369, 3070575, 3197299, 3313502, 3330427, 3350530, 3409934, 3428010, 3496722, 3452127, 3590032, 3742906, 3800469, 3746113, 3769776, 4017922, 4121122, 4157417, 4176536, 4091426, 4252599, 4327317, 4403357, 4429310, 4429579, 4498124, 4689190, 4789834, 4783303, 4896745, 5002418, 5161304, 5237320, 5328231, 5424871, 5622680, 5803751, 5946217, 6277283, 6591309, 6780925, 6940905]
3849F940905K60170L58445M32621M08894L42141M18413M42968M56569M40751L57732
3839A0859609J21316R1827J19503j63445k16226k32520l16961j70617j97968j68153
3829I726365J6760o6263m8291O3377O8310J44764J17270J15986K73554K65991
3819A0677823L96127K37224K29598J20852L29217L24653K06000L07549K09608
3810A3038651L02723L54832L42169L22300L62174K86566P950J73546K49582Q6763
3800A5527256k9370J18860j2149r0662j03875k00842k46672j99594l6031r3250
3790A4633671M05n8990n4002L6615J89975K79016J45058K515j52036J2635J48613
3779A5183475R5090J3764K6283J61270j7476M0540K22015J12044J27520J95548
$$ y = [6940905, 7201075, 7559520, 7992141, 8401035, 8743176, 9161589, 9604557, 10061126, 10501877, 10859609, 10980925, 11072752, 11192255, 11028810, 10812584, 10580064, 10263103, 10092486, 9894518, 9726365, 9743125, 9676862, 9628571, 9691948, 9760258, 9905022, 10022292, 10138278, 10411832, 10677823, 11073950, 11311174, 11540772, 11661624, 11990841, 12315494, 12521494, 12829043, 13038651, 13341374, 13696206, 14038375, 14360675, 14722849, 15009415, 15017365, 15190911, 15440493, 15527256, 15497886, 15616746, 15604597, 15513935, 15410060, 15209218, 14962546, 14762952, 14726921, 14633671, 14634076, 14575086, 14521084, 14557699, 14747674, 15026690, 15171748, 15174263, 15022227, 15034862, 15183475, 15278565, 15292329, 15318612, 15479882, 15462406, 15502946, 15724961, 15837005, 15964525, 16160073]
3769A6160073K85291K46066M48900M82797M23602N23457O12709N73000N51201
3760B0307096O05435L75665L42039J72161j52921k69010j78709k99265l02953
3751B0599538k60594k32800j13163k34459j30561J20187J04106Q8631J52844K83597
3741B0377326K75049N37079L69788M16065M33712O00426P67975P18977Q10770
3732B5307167R13485R65236J002900J057068J271736J228819J405030J445872
3724C4597313J469072J582256J665248J587285J521465J576993J734965J818395
3716D7552992J808950J713776J728664J798142J876555J999493K174515K224266
3708F2877353K506598K549659K440694K509314K217746K257020J725965J347433
$$ y = [16160073, 16445364, 16691430, 17140330, 17623127, 18046729, 18570186, 19182895, 19755895, 20307096, 20912531, 21288196, 21630235, 21802396, 21649475, 21380465, 21201756, 20902491, 20599538, 20338944, 20106144, 19992981, 19758522, 19627961, 19748148, 19852254, 19940885, 20093729, 20377326, 20652375, 21189454, 21559242, 21975307, 22409019, 23009445, 23777420, 24496397, 25307167, 26220652, 27185888, 28188788, 29245856, 30517592, 31746411, 33151441, 34597313, 36066385, 37648641, 39313889, 40901174, 42422639, 43999632, 45734597, 47552992, 49361942, 51075718, 52804382, 54602524, 56479079, 58478572, 60653087, 62877353, 65383951, 67933610, 70374304, 72883618, 75101364, 77358384, 79084349, 80431782]
3700H0431782Q63532M77115j20225q82407j581642k208302k859796l412406l588964
3691F7118687l471680l069057k735129k242497j624687j267946r84639r52127
3683E0770925r60162j352901j782753k353233k653365k698156k719577k420337
3675C3830441j991668j668763j726793j341461j085241j033832q38341p28507
3667B3415835o78769n91813o11182n01059l48653k20214k42410k84934k45933
3658A9690868l97854k83143l50063m30784m63147m26208m79978m88180l30874
3649A6040637l73588l73899m70826m25935k41864k82938m36867k77723j75002
3640A2981995k95850l03765l53909k26430k28423k46050m21508k15119j14406
$$ y = [80431782, 81295314, 81772429, 81652204, 80769797, 79188155, 76979853, 74120057, 70707651, 67118687, 63647007, 60577950, 57842821, 55600324, 53975637, 52707691, 51723052, 50770925, 49810763, 48457862, 46675109, 44321876, 41668511, 38970355, 36250778, 33830441, 31838773, 30170010, 28443217, 27101756, 26016515, 24982683, 24144342, 23415835, 22737066, 22145253, 21534071, 21033012, 20684359, 20464145, 20221735, 19936801, 19690868, 19293014, 19009871, 18659808, 18229024, 17765877, 17339669, 16859691, 16371511, 16040637, 15667049, 15293150, 14822324, 14396389, 14154525, 13871587, 13434720, 13156997, 12981995, 12686145, 12382380, 12028471, 11802041, 11573618, 11327568, 10906060, 10690941, 10576535]
3631A0576535k38424k95088k87218j71836j68164k19578k17114M759k1282j52573
3621H810017n4852k4041j67395j41504q3592j7207n3159m0821p8911n1148j13063
3610G984324p174P99j09871Q001k2026j71489j03077n6693j14465L4760R3509
3599G536598L0608n4606j15653l4805K2669K10195P6317j98029N1736M3027l2612
3588G535445k5588J10219L045N1657m7932j27645m8921O6662k9176o7828r5151
3577G324787Q2123K17109k4503j9039j38678Q396j5571M2464m9554J14372J46381
3566G688287k2458J11795O9374j28564O3313J96826L4385J44705J01908O3822
3556H323393J17890J02616J46786J04396K39313J43606L14621J56545J36054K89180
$$ y = [10576535, 10338111, 10043023, 9755805, 9583969, 9415805, 9196227, 8979113, 8983872, 8962590, 8810017, 8755165, 8731124, 8563729, 8422225, 8338633, 8321426, 8268267, 8227446, 8148535, 8097387, 7984324, 7977150, 7977949, 7868078, 7876079, 7854053, 7682564, 7579487, 7522794, 7408329, 7443089, 7536598, 7567206, 7512600, 7396947, 7362142, 7384811, 7595006, 7671323, 7473294, 7525030, 7568057, 7535445, 7509857, 7620076, 7623121, 7674778, 7626846, 7499201, 7450280, 7516942, 7487766, 7419938, 7324787, 7406910, 7624019, 7599516, 7580477, 7441799, 7450195, 7434624, 7477088, 7427534, 7541906, 7688287, 7665829, 7777624, 7846998, 7718434, 7781747, 7978573, 8012958, 8157663, 8259571, 8323393, 8441283, 8543899, 8690685, 8795081, 9034394, 9178000, 9492621, 9649166, 9785220, 10074400]
3546A0074400J55117K30522L71864L93357K59005L60975L73981M84885M73114
3537A3177220M52046N70672O15479M26201N21063O89803M53246L74340L74310
3528A7654380P8579n6913J9484k28448l44698n9519j56151j92332M8604J38516
3518A6901502P2407J56853K86833K09667N35227O11922L67938N64054P88961P30567
3508B1225931P88482Q01373R00377J008668J267200J332559J452020J565369J552707
3499C1894686J699554J638264J581707J452457J081421P45770K98443j56401k90237
3490C9945664n25948q74555q99732j165115j313914j252697j014958r15084o66314
3481C1317347l75086l68975p5415P7507O2059K27169M02782L15523O03498R47334
$$ y = [10074400, 10229517, 10460039, 10831903, 11225260, 11484265, 11845240, 12219221, 12704106, 13177220, 13629266, 14199938, 14815417, 15241618, 15762681, 16452484, 16905730, 17280070, 17654380, 17732959, 17676046, 17695530, 17467082, 17122384, 17062865, 16906714, 16714382, 16762986, 16901502, 16973909, 17130762, 17417595, 17627262, 18162489, 18774411, 19142349, 19706403, 20495364, 21225931, 22014413, 22815786, 23716163, 24724831, 25992031, 27324590, 28776610, 30341979, 31894686, 33594240, 35232504, 36814211, 38266668, 39348089, 40093859, 40392302, 40235901, 39945664, 39419716, 38545161, 37645429, 36480314, 35166400, 33913703, 32898745, 31983661, 31317347, 30942261, 30573286, 30497871, 30575378, 30637437, 30864606, 31267388, 31582911, 32186409, 33133743]
3471C3133743Q05836R21940J342742J319851J527224J642187J635403J762598
3463D4091524J991916J714950J671651J848240J552097J207383Q44005J97143
3455E5118909n95030j386946k088483k415208k459745k139212j753907j401913
3447D0878465j030702o22160l71902l35469j15907M654J40027L33990M25555O25357
3437C9931908R88334J141115J362333J659385J887839K215850K741690L015784
3429E4944238L183637L789445M080499M211303M796383N144421N425087N890231
3421I1465244O341865O419858O847823P066366O616938N548063L616772J88234
3413A34111163m293849r151380j2077844j2199774j0840257r021339p331187o014445
$$ y = [33133743, 33939579, 34861519, 36204261, 37524112, 39051336, 40693523, 42328926, 44091524, 46083440, 47798390, 49470041, 51318281, 52870378, 54077761, 54921766, 55118909, 54523879, 53136933, 51048450, 48633242, 46173497, 44034285, 42280378, 40878465, 39847763, 39225603, 38853701, 38518232, 38402325, 38406979, 38547006, 38880996, 39306551, 39931908, 40920242, 42061357, 43423690, 45083075, 46970914, 49186764, 51928454, 54944238, 58127875, 61917320, 65997819, 70209122, 75005505, 80149926, 85575013, 91465244, 97807109, 104226967, 111074790, 118141156, 124758094, 130306157, 133922929, 134111163, 129817314, 120665934, 108588090, 96388316, 85548059, 76526720, 69195533, 63181088]
3405F3181088n055862l933882l433144k943260k390480k210291k064414j771671
3397C9378084j726344j563407j322694j264033j366778j117334q81997q67254
3389B9268243p40960p24620p17273m56288n06378n10180m03332l09644l49558
3380B4550010k36889k53081j82365o3879j13967k20391o9338j65635q7856l6013
3370B3120596j21978j33256m1353j51733k5789Q5753k1308N2609J87099K01381
3360B3152021L06929M79270K73253L13313M67133M01905K63914J20582k85130
3351B5493190l56510m50122n65538n91855m94006m23791m15476k19576k21795
3342B1754521j49048L9095L5805l5458N4913R6210m3965l5061p919j56495j44328
$$ y = [63181088, 58125226, 54191344, 50758200, 47814940, 45424460, 43214169, 41149755, 39378084, 37651740, 36088333, 34765639, 33501606, 32134828, 31017494, 30135497, 29268243, 28527283, 27802663, 27085390, 26629102, 26122724, 25612544, 25209212, 24899568, 24550010, 24313121, 24060040, 23877675, 23813796, 23699829, 23479438, 23410100, 23244465, 23156609, 23120596, 22998618, 22865362, 22824009, 22672276, 22646487, 22732240, 22710932, 22763541, 22950640, 23152021, 23458950, 23938220, 24211473, 24524786, 24991919, 25393824, 25657738, 25778320, 25493190, 25136680, 24686558, 24121020, 23529165, 23035159, 22611368, 22195892, 21976316, 21754521, 21605473, 21644568, 21680373, 21644915, 21699828, 21796038, 21752073, 21717012, 21709093, 21552598, 21408270]
3331B1408270l2463o376L7625L7069J21863L5230j60025n5293r4362j45313o4664
3320B1081561j19392p8943K61595L54903J02050K37137K16974J71837M1516N1524
3310B2320762p7527p9437Q0841j81769k90143j39495k11730k10939j92338l17272
3300B0700953l38549k37560k20052k95069m79869l12373k98797j01102l02918
3291A8114664k87249k28787l40745k12615j34860n4280m1888o6527n1894P312
3281A6703131K01964K95906J11955J55940L16997L45436L42397J56845l0123K5194
3271A8625642K6864j61699l52751l76021l40483k84950m01252k91848j97305j47387
3261A6098810k086K8748m1302l400k3777J28606J68386K75869L21954K24489K31764
$$ y = [21408270, 21375807, 21369431, 21407056, 21444125, 21565988, 21601218, 21441193, 21385900, 21291538, 21146225, 21081561, 20962169, 20883226, 21144821, 21499724, 21601774, 21838911, 22055885, 22227722, 22269238, 22320762, 22243235, 22163798, 22244639, 22062870, 21772727, 21633232, 21421502, 21210563, 21018225, 20700953, 20362404, 20124844, 19904792, 19609723, 19129854, 18817481, 18518684, 18417582, 18114664, 17827415, 17598628, 17257883, 17045268, 16910408, 16856128, 16814240, 16747713, 16695819, 16703131, 16905095, 17201001, 17312956, 17468896, 17785893, 18131329, 18473726, 18630571, 18600448, 18625642, 18652506, 18490807, 18138056, 17762035, 17421552, 17136602, 16735350, 16443502, 16246197, 16098810, 16096724, 16125472, 16084170, 16080770, 16056993, 16185599, 16353985, 16629854, 16951808, 17176297, 17408061]
3250A7408061K10679L53695N08240M38028M19804L41464M99610N93352O37694
3241B1410627O03724O44228O60403J025556J161480J241404J323008J485572J783534
3232C1339536K003619K148695K417227K624732K957001L297867L740417M442781
3224E4971875N086930N522412O202862O787443O825724O232426M997785L119496
3216I9746953N1144m045603p419481q657837q105138p013782n853156m717870
3208E3985230l870684k888495k223642j656137j388889q51097o71834n78965l49000
3199C9506487j29277j27100n5631k7277j43363j85770l03356k16330m85680m36738
3189C7395965n93466o64162o42554r69779j295422j411062j215593j283870j026390
$$ y = [17408061, 17618740, 17972435, 18480675, 18918703, 19338507, 19679971, 20179581, 20772933, 21410627, 22014351, 22658579, 23318982, 24344538, 25506018, 26747422, 28070430, 29556002, 31339536, 33343155, 35491850, 37909077, 40533809, 43490810, 46788677, 50529094, 54971875, 60058805, 65581217, 71784079, 78571522, 85397246, 91629672, 96627457, 99746953, 99798097, 95752494, 88333013, 79675176, 71570038, 64556256, 58703100, 53985230, 50114546, 47226051, 45002409, 43346272, 41957383, 41106286, 40434452, 39855487, 39506487, 39377210, 39250110, 39194479, 39167202, 39023839, 38838069, 38534713, 38318383, 37832703, 37395965, 36802499, 36138337, 35495783, 34526004, 33230582, 31819520, 30603927, 29320057, 28293667]
3180B8293667p19983n58913n92153n47511m53854l17014k20173k95651m42580
3171B4145835l86136j89638k32559j61722j67263k63139q9387R1930q0899p9522
3161B2587500J625J3683K9560O9587q7276j12251M3912j36108O6147J9800l4693
3150B2461486j12864n0250N5591K01469L15552K51705K74711M70654N70633P06536
3140B5145223M99710L99300N19553J24918j30927k58958l22213j76218l7785r4294
3130B5668309J00619L64333L08258K51073K86042K63857M11790O00700M09374
3121B8664355L77066N08482N08809M96474N47060O08065Q05851R21683R19260
3112C4357105J108216J243510J309501J330201J448602J612303J732634K169086
$$ y = [28293667, 27573684, 27014771, 26422618, 25875107, 25421253, 25104239, 24884066, 24588415, 24145835, 23759699, 23570061, 23337502, 23175780, 23008517, 22745378, 22655991, 22747921, 22667022, 22587500, 22589125, 22602808, 22632368, 22701955, 22614679, 22502428, 22546340, 22410232, 22476379, 22496179, 22461486, 22348622, 22298372, 22353963, 22555432, 22870984, 23122689, 23397400, 23868054, 24438687, 25145223, 25644933, 26044233, 26563786, 26688704, 26557777, 26298819, 25976606, 25800388, 25762603, 25668309, 25768928, 26133261, 26441519, 26692592, 26978634, 27242491, 27654281, 28254981, 28664355, 29041421, 29549903, 30058712, 30555186, 31102246, 31710311, 32516162, 33437845, 34357105, 35465321, 36708831, 38018332, 39348533, 40797135, 42409438, 44142072, 46311158]
3104D6311158K415504K843462L483226L934479M507260N006992N335133N352151
3096G9189365M816195L260733J605196K22026j354916m038852o709561q048676
3088F8941510p461282o280349n133539m085772l297678k581020k094840j719031
3080C6287999j446414j091537j047066q65256n78022n35149m35676k56496k36394
3071B9795989l90012l04878l79358n24333o03535n21624l96719m16573l90796
3062B5868161l99934j82938j68853j50889O3607Q8630K6832J93737K05341J64771
3052B5708465N49222O66363O32399P78626Q72983P57281R23133O78719J53163
3043C1720354k32614p67729j157387j078348j050068r72412n61398o14268n88128
$$ y = [46311158, 48726662, 51570124, 55053350, 58987829, 63495089, 68502081, 73837214, 79189365, 84005560, 87266293, 88871489, 89093515, 87738599, 83699747, 76990186, 68941510, 61480228, 55199879, 50066340, 45980568, 42682890, 40101870, 38007030, 36287999, 34841585, 33750048, 32702982, 31837726, 31259704, 30724555, 30288879, 30032383, 29795989, 29405977, 29101099, 28721741, 28197408, 27593873, 27072249, 26675530, 26258957, 25868161, 25468227, 25285289, 25116436, 24965547, 25029154, 25117784, 25144616, 25338353, 25543694, 25708465, 26257687, 26924050, 27556449, 28335075, 29208058, 29965339, 30888472, 31567191, 31720354, 31487740, 30720011, 29562624, 28484276, 27434208, 26461796, 25900398, 25286130, 24698002]
3034B4698002k86571k82269l32636k60149k92924k19884j08554j00735r4245p7846
3024B2642189n2741k5734L6308j4312n8826J27943p6409k8555O8123k28182N0526
3013B2440330Q5930K8639P1086J70245K14533N2077K47046N7347J57471L06686
3003B3831390J17264K29303K75290L02330L17015M29328L21601M62782O89468
2994B6975771N73115N12862M97678N65632O23898Q97458Q37036Q99184J100011
2985C3482645J065305J088431J294604J377241J470664J580134J526936J575259
2977D4461219J376134J045867R79941P73658P07232P44654Q40071Q41190J047314
2968E2817280J264805J341851J604161J709894J701269J910406J926085K029478
$$ y = [24698002, 24411431, 24129162, 23796526, 23536377, 23243453, 23023569, 22915015, 22814280, 22720035, 22642189, 22589448, 22563714, 22600022, 22585710, 22526884, 22654827, 22578418, 22549863, 22617986, 22389804, 22440330, 22526260, 22554899, 22625985, 22796230, 23010763, 23062840, 23309886, 23367233, 23524704, 23831390, 23948654, 24177957, 24453247, 24755577, 25072592, 25501920, 25823521, 26286303, 26975771, 27548886, 28061748, 28559426, 29125058, 29748956, 30646414, 31483450, 32382634, 33482645, 34547950, 35636381, 36930985, 38308226, 39778890, 41359024, 42885960, 44461219, 45837353, 46883220, 47863161, 48636819, 49344051, 50088705, 50928776, 51769966, 52817280, 54082085, 55423936, 57028097, 58737991, 60439260, 62349666, 64275751, 66305229]
2960F6305229K073689K226692K154793K141397K382814K269125K437296K299941
2952H4290976K391688K307589K392684K323738K299023K319900K242301K102591
2944A02670490K023369K063642J818468J721299J655045J578921J497821J360721
2936A16389776J081075R83574R45927P40680N63350L14507K43960J00526j92001
2927A21171374k25250m29709n93755q37241r83804j114105j232355j412115j527616
2918A12815424j675574j720502j821780j848506k043018j958287k062839k190736
2910I7494182k268037k421569k519246k467751k307814k403481k278577k339265
2902G8488442k233949k380687k157148k169226k053385j969725j997284j940942
$$ y = [66305229, 68378918, 70605610, 72760403, 74901800, 77284614, 79553739, 81991035, 84290976, 86682664, 88990253, 91382937, 93706675, 96005698, 98325598, 100567899, 102670490, 104693859, 106757501, 108575969, 110297268, 111952313, 113531234, 115029055, 116389776, 117470851, 118454425, 119400352, 120141032, 120704382, 121018889, 121262849, 121363375, 121171374, 120946124, 120516415, 119922660, 119085419, 118101615, 116987510, 115755155, 114343040, 112815424, 111139850, 109419348, 107597568, 105749062, 103706044, 101747757, 99684918, 97494182, 95226145, 92804576, 90285330, 87817579, 85509765, 83106284, 80827707, 78488442, 76254493, 73873806, 71716658, 69547432, 67494047, 65524322, 63527038, 61586096]
2894F1586096j956916j849487j825517j682683j787806j569461j466076j511849
2886D7936301j372065j354154j224442j101789j019762j109170q73228q69497
2878C9012194r77202q25069p34490o80263p02938n84352o42053m87759m48515
2869C2929553m60305l61429n96867n45666k08563j51216l00170l08139l32440
2860B9664758k87000k73688l32941k57503p054J759j37015j85799k79794l2687
2850B7873036k4517j65621j57055j9701J33497K7714n3518j11817R0480K74450
2840B7866948N9019q8740P4503L6269K18228K39829L0275N4773K86281R1518P8942
2829B8947845J11604K1368J42307O4167j045O0326M86144L49430J74146K33355
$$ y = [61586096, 59629180, 57779693, 55954176, 54271493, 52483687, 50914226, 49448150, 47936301, 46564236, 45210082, 43985640, 42883851, 41864089, 40754919, 39881691, 39012194, 38034992, 37209923, 36475433, 35795170, 35092232, 34507880, 33865827, 33378068, 32929553, 32469248, 32107819, 31510952, 30965286, 30756723, 30605507, 30305337, 29997198, 29664758, 29377758, 29104070, 28771129, 28513626, 28506572, 28508331, 28371316, 28185517, 27905723, 27873036, 27848519, 27682898, 27525843, 27506142, 27639639, 27667353, 27613835, 27502018, 27592498, 27866948, 27925967, 27837227, 27911730, 27947999, 28166227, 28406056, 28436331, 28491104, 28777385, 28868903, 28947845, 29059449, 29080817, 29223124, 29287291, 29286246, 29346572, 29832716, 30182146, 30356292, 30589647]
2819C0589647K47137L33337L36695o233K7736J99295J44780n086k0585o7738K10394
2808C1989379M03852J51471J55537M43726N44965M04622N39810L11942M74336
2799C5419640O21072K61408L41937L55176L82976M64861L92183K65456M69262
2790C8973971P12016O48834O79342P51112Q14790P42473M59228R0253J20523k01177
2780D3791365m35958m45165o07450o87971m67064m88886o11085k77215k3858k9255
2770C9717458R3182N2600J1045M23616M97614L2308K10300M69952L38845L06762
2760D2153682L15047K89920N32163O22129L56536N44868Q57158P70633P28948
2751D7171084O26772L65939K73805j67913o30647j031113j179796j292463j156686
$$ y = [30589647, 30836784, 31170121, 31506816, 31500583, 31528319, 31727614, 31872394, 31867308, 31846723, 31778985, 31989379, 32393231, 32544702, 32700239, 33143965, 33688930, 34093552, 34633362, 34945304, 35419640, 36040712, 36302120, 36644057, 36999233, 37382209, 37847070, 38239253, 38504709, 38973971, 39685987, 40334821, 41014163, 41765275, 42580065, 43322538, 43781766, 43872019, 43992542, 43791365, 43355407, 42910242, 42302792, 41614821, 41147757, 40658871, 40047786, 39770571, 39746713, 39717458, 39810640, 39863240, 39874285, 40297901, 40795515, 40827823, 41038123, 41508075, 41846920, 42153682, 42468729, 42758649, 43290812, 43912941, 44269477, 44814345, 45671503, 46442136, 47171084, 47797856, 48163795, 48437600, 48269687, 47639040, 46607927, 45428131, 44135668, 42978982]
2742D2978982j218567r84901q76778q25802o32377o27234m45462l30367j62321
2733C6875173j49241j47981Q5193K73596K38246K5646j10984j26426K49909J25191
2723C7338322Q475J07957J63068K93802K00485J48932J16834K01838j22984m21910
2713C8034819n18598p35061r55727j073977j190463j028643q37902q31828q74871
2704B9987749o96318o26922p14438m48914n80451n05508k75578l45460k56790
2695B5537370n8961k00751l39012j75899k13512k45561j94897o9882p3619m9915
2685B3915361n0630l5580L4430j03802m8529j46031k36025k35948l19857k46287
2675B2527102j78781k43105l05780j90193k24777k08976p5160J4394j96651j9737
$$ y = [42978982, 41760415, 40775514, 39898736, 39072934, 38440557, 37813323, 37367861, 37037494, 36875173, 36725932, 36577951, 36663144, 36936740, 37174986, 37200632, 37089648, 36963222, 37213131, 37338322, 37346797, 37454754, 37617822, 37911624, 38112109, 38261041, 38377875, 38579713, 38456729, 38034819, 37516221, 36781160, 35825433, 34751456, 33560993, 32532350, 31694448, 30862620, 29987749, 29291431, 28664509, 27950071, 27501157, 26920706, 26415198, 26139620, 25794160, 25537370, 25478409, 25277658, 24938646, 24762747, 24549235, 24303674, 24108777, 24038895, 23965276, 23915361, 23864731, 23829151, 23863581, 23759779, 23711250, 23565219, 23329194, 23093246, 22773389, 22527102, 22348321, 22105216, 21799436, 21609243, 21384466, 21175490, 21100330, 21114724, 20918073, 20898336]
2665B0898336l3742q7119j24659l7272p3557J9281K55303r3929Q7047J77589R9
2654B0987377J18673J70642O4208M2095J97303K04115K55042K76945J04748J10628
2644B2531776L27219J76289J30764M82772M48912M16913N79132L44016L38481
2635B5776274O50467O44714O53636O25601P21538O83773N97583N38016P29585
2626C1621187P85342P44264Q57433R58224J022790J065513J141964R95328J102435
2617D0294480J122707J046350J203163J122307R22395R85469J059387Q90747R30278
2608D9577283R05222Q99023J106334J014019J040545J073772J073840R69898Q68364
2599E8528300P53706O68182O75370L69492J75480M21041N39094L82230L78976
$$ y = [20898336, 20864594, 20777475, 20652816, 20615544, 20541987, 20561268, 20816571, 20722642, 20809689, 20987278, 20987377, 21106050, 21276692, 21340900, 21382995, 21580298, 21784413, 22039455, 22316400, 22421148, 22531776, 22858995, 23035284, 23166048, 23648820, 24097732, 24514645, 25093777, 25437793, 25776274, 26426741, 27071455, 27725091, 28350692, 29072230, 29756003, 30353586, 30891602, 31621187, 32406529, 33150793, 34008226, 34966450, 35989240, 37054753, 38196717, 39192045, 40294480, 41417187, 42463537, 43666700, 44789007, 45711402, 46696871, 47756258, 48647005, 49577283, 50482505, 51381528, 52487862, 53501881, 54542426, 55616198, 56690038, 57659936, 58528300, 59282006, 59950188, 60625558, 60995050, 61170530, 61591571, 62130665, 62512895, 62891871]
2590F2891871K86477L13314L99049M31184L07121K41743L47257K29807R7866J29422
2580F5675111P8340L41193L54523K41100N21396N17013O19837O67371P82836Q84113
2570G0682833J056888J205875J105769J324477J412108J439007J818788J876636
2562H1922381J835016K151626K513039K670370K714010L061291L442205L543111
2554A03853049L778003L825542M119618M501729M546432M596453M683026M867587
2546A38771439M948119M918942N088500N145217N341371N197295N263221N574688
2538A80248792N424326N523793N568241N597557N655831N850625N961795O175542
2530B26006502O104457O029326O116005O155350N953622N810975N694845N465218
$$ y = [62891871, 63178348, 63491662, 63890711, 64321895, 64629016, 64870759, 65218016, 65447823, 65545689, 65675111, 65753451, 66094644, 66449167, 66690267, 67211663, 67728676, 68348513, 69015884, 69798720, 70682833, 71739721, 72945596, 74051365, 75375842, 76787950, 78226957, 80045745, 81922381, 83757397, 85909023, 88422062, 91092432, 93806442, 96867733, 100309938, 103853049, 107631052, 111456594, 115576212, 120077941, 124624373, 129220826, 133903852, 138771439, 143719558, 148638500, 153727000, 158872217, 164213588, 169410883, 174674104, 180248792, 185673118, 191196911, 196765152, 202362709, 208018540, 213869165, 219830960, 226006502, 232110959, 238140285, 244256290, 250411640, 256365262, 262176237, 267871082, 273336300]
2522B73336300N300318M868372M402275L999163L525227L007739K681917K528033
2514C03649344K072661J800108J819976J615574J822994J967796J783624J883806
2506C18415883J988305K011869K176484K273277K106198K120509K385505K383737
2498C35861767K197412J982861J719512J325108Q98688M13310K7747j49415l29372
2489C43947618l61302l59894k30880m48523q02250j692059k452603l581513m756664
2480C29261930n875608p333764q286916r095994r464054r739885r696595r458433
2472B60310681r369613r214383q958620r027058r174701r437215r696105r709474
2464A85723512r528414r329253q782245q192865p698338o636169n865606n400792
$$ y = [273336300, 278636618, 283504990, 287907265, 291906428, 295431655, 298439394, 301121311, 303649344, 305722005, 307522113, 309342089, 310957663, 312780657, 314748453, 316532077, 318415883, 320404188, 322416057, 324592541, 326865818, 328972016, 331092525, 333478030, 335861767, 338059179, 340042040, 341761552, 343086660, 343985348, 344398658, 344426405, 344276990, 343947618, 343586316, 343226422, 342995542, 342547019, 341744769, 340052710, 337600107, 334018594, 329261930, 323386322, 316052558, 307765642, 298669648, 289205594, 279465709, 269769114, 260310681, 250941068, 241726685, 232768065, 223741007, 214566306, 205129091, 195432986, 185723512, 176195098, 166865845, 158083600, 149890735, 142192397, 135556228, 129690622, 124289830]
2456A24289830m864687m463464m079153l495050l199847l075138k828677k515415
2448I5768399k380610k211201k032288j938335j727016j807991j873819j760176
2440H0036963j741620j950497j675895j746538j933755j712185j769315j910376
2432F5596782j847575j652809j717701j668806j648288j777650j507763j512183
2424E2264007j518106j512275j488052j591142j381448j396615j437158j301154
2416D0638057j326866j224711j174473j082031j120600j112129j026314q37069
2408C1733864o68784p62734q53660p25610p31757o91731n83399n69805n76520
2399B5569864m41502m87762n44742m75393m55978m35476n28689l74136m11224
$$ y = [124289830, 119425143, 114961679, 110882526, 107387476, 104187629, 101112491, 98283814, 95768399, 93387789, 91176588, 89144300, 87205965, 85478949, 83670958, 81797139, 80036963, 78295343, 76344846, 74668951, 72922413, 70988658, 69276473, 67507158, 65596782, 63749207, 62096398, 60378697, 58709891, 57061603, 55283953, 53776190, 52264007, 50745901, 49233626, 47745574, 46154432, 44772984, 43376369, 41939211, 40638057, 39311191, 38086480, 36912007, 35829976, 34709376, 33597247, 32570933, 31733864, 31065080, 30302346, 29448686, 28723076, 27991319, 27299588, 26716189, 26146384, 25569864, 25128362, 24640600, 24095858, 23620465, 23164487, 22729011, 22200322, 21826186, 21414962]
2390B1414962l29888m05217n48949l77401l01952l23574l29332l01667m00540
2381A8096442k65930m18663l86530j88934k54399l67405k59594j49448k99389
2372A5506150l22047k72717m18215k01974j98816k48049j79934l06865l00947
2363A3056586j21640n8890k30023k12809k59992k59447k54993j44572j61590r4544
2353A1258086j61588j19617j28342l05848j08236o4564j15742r4099l2134j76270
2343I951646j41680j22402k03308j18774j0579j51849j15303L5206p8008j13813
2333H931136J1527j85939j27839J5964q9176j18647j6835p7340j49740j05185
2323H087926J6411j53853m3162p3221p9753L0780j827p3063j40794r0986r7516
$$ y = [21414962, 21085074, 20679857, 20130908, 19753507, 19451555, 19127981, 18798649, 18496982, 18096442, 17830512, 17411849, 17025319, 16836385, 16581986, 16214581, 15954987, 15805539, 15506150, 15184103, 14911386, 14493171, 14291197, 14092381, 13844332, 13664398, 13357533, 13056586, 12934946, 12876056, 12646033, 12433224, 12173232, 11913785, 11658792, 11514220, 11352630, 11258086, 11096498, 10976881, 10848539, 10542691, 10434455, 10369891, 10254149, 10160050, 10127916, 9951646, 9809966, 9687564, 9484256, 9365482, 9354903, 9203054, 9087751, 9122957, 9044949, 8931136, 8942663, 8756724, 8628885, 8644849, 8555673, 8437026, 8420191, 8342851, 8193111, 8087926, 8104337, 7950484, 7907322, 7834101, 7754348, 7785128, 7783301, 7710238, 7569444, 7478458, 7380942]
2312G380942l2427q1950q2392r9132n7228n5936j66512j26149j4713j51566r2987
2301F419950J4708q1855p7678j7454j854j36564j19787j0200j60503l9301m8307
2290E741155K1891Q3603m1706k58213n3351P8300p415m0433j3225j21119j18683
2279E270804P8848M250m2428j15832j48874q9276N0875l8331L903K7046j05371
2268D895614l4777n5554N0118P6245j15837p0806R8079l6867J0389p8583p8050
2257D659971m6210J5586K0192o0356L6446r486l2044O9304m011j71206Q8763K7860
2245D594809j27396m962n9292M5048K9036J6760J4947k4026j25943n583J97936
2234D551334M5286p2811l0101n3646m7352M3308o1581O7384J47968L3600j18770
$$ y = [7380942, 7348515, 7266565, 7184173, 7085041, 7027813, 6971877, 6805365, 6679216, 6664503, 6512937, 6419950, 6434658, 6352803, 6275125, 6257671, 6255817, 6119253, 5999466, 5989266, 5828763, 5789462, 5741155, 5763046, 5846649, 5804943, 5546730, 5493379, 5571679, 5564264, 5523831, 5510606, 5389487, 5270804, 5349652, 5353902, 5311474, 5195642, 5046768, 4957492, 5008367, 4970036, 4973939, 5000985, 4895614, 4860837, 4805283, 4855401, 4931646, 4815809, 4745003, 4843082, 4806215, 4816604, 4738021, 4659971, 4613761, 4629347, 4649539, 4589183, 4625629, 4616143, 4584099, 4653403, 4649392, 4478186, 4566949, 4594809, 4467413, 4462451, 4403159, 4448207, 4477243, 4494003, 4508950, 4484924, 4358981, 4353398, 4551334, 4596620, 4523809, 4493708, 4440062, 4392710, 4436018, 4374437, 4441821, 4589789, 4623389, 4504619]
2223D504619N0478M2678K298L1865m8937j7592n6592R8486o8953K0559j4423r2560
2211D451926J879M0530m7439K7861J04249o7068k8471m8147l002q6351l6682J01312
2199D410597J71088l3635p9486n3816P4630K9347J60227j0819n5223p4872J0718
2188D548756J34477Q0936O1686j1998J38920l3171L6502L5404k2412J02986J9698
2177E091784r4242j7216N4261k0138n6384R6169L9552j01179j13379j28093j08956
2166D642179J53832o3109j66706K196j02295j59960l8665M6403j19268j04894
2156D089713l3065k6671K7901O6085N2596P3259J23480Q6999M8647P0746p4099
2145D505591k01056k99414l16148k18041p9070j97724m0183l0009r303o5950o7046
$$ y = [4504619, 4555097, 4597775, 4600073, 4631938, 4583001, 4565409, 4508817, 4607303, 4538350, 4558909, 4544486, 4451926, 4453805, 4494335, 4446896, 4474757, 4579006, 4511938, 4483467, 4435320, 4432318, 4345967, 4309285, 4410597, 4581685, 4548050, 4468564, 4414748, 4489378, 4518725, 4678952, 4668133, 4612910, 4538038, 4548756, 4683233, 4764169, 4825855, 4813857, 4952777, 4919606, 4956108, 4991512, 4969100, 5072086, 5091784, 4997542, 4980326, 5034587, 5014449, 4958065, 5054234, 5093786, 4992607, 4879228, 4751135, 4642179, 4796011, 4732902, 4566196, 4568392, 4466097, 4306137, 4267472, 4313875, 4194607, 4089713, 4056648, 4029977, 4057878, 4123963, 4176559, 4249818, 4373298, 4460297, 4508944, 4579690, 4505591, 4304535, 4005121, 3688973, 3470932, 3391862, 3194138, 3153955, 3123946, 3114643, 3048693, 2981647]
2134B981647J14481k1537J368J818j4698k2471l4818J44216N1114J25835J49491
2123C476446j7148k054J27707J74008J71383K06162J71062K89969L26091K06731
2113E130357N3198o8051m59764n96836l44989l60489l00180m5992j74468k09762
2103B623024o1522j9175j31229P7649l607q3371J453m5178j26273j0642r180n2132
2091B159817J07352J01438P3833K4608J3754J1587J3636k9946J89054K99442O0468
2080C025043O1972l945n3028k88017k08285j84475j88685j8632j23079j67047
2070A851822N7572P4182l0399j72839j29119l5472R8241k8778r9582L3838K9983
2059A649449q1496r5995l1763p7563J42282K2058k2275j72853j7551j0224k6530
$$ y = [2981647, 3096128, 3074591, 3075959, 3077777, 3063079, 3040608, 3005790, 3150006, 3201120, 3326955, 3476446, 3459298, 3457244, 3584951, 3758959, 3930342, 4136504, 4307566, 4597535, 4923626, 5130357, 5183555, 5115504, 4655740, 4058904, 3713915, 3353426, 3053246, 3007254, 2832786, 2623024, 2561502, 2542327, 2411098, 2488747, 2485140, 2401769, 2403222, 2358044, 2231771, 2221129, 2211949, 2159817, 2267169, 2368607, 2442440, 2467048, 2480802, 2492389, 2506025, 2476079, 2665133, 2964575, 3025043, 3087015, 3083070, 3030042, 2742025, 2533740, 2349265, 2160580, 2141948, 2018869, 1851822, 1909394, 1983576, 1953177, 1780338, 1651219, 1615747, 1713988, 1685210, 1585628, 1619466, 1649449, 1567953, 1471958, 1440195, 1362632, 1504914, 1526972, 1504697, 1331844, 1314293, 1304069, 1277539]
2048A277539L1406M6993M4702L6916p9844r7286M8461N7707o3263o5420m1894
2037A196017K4096O0059o4775l5093o5402J05153L4554q4169o0441l4013P0700
2026A146686Q7952M8158j01794j68807J20488m6893p3831O2229J07329m1919j70130
2015I69468n4169K5571J20070j02738p8838Q592J28893R2062m6999r9641j35221
2004H27050K6689O7578q8724j5053Q9770N3702O1512N76o9254L3646j31420j22855
1992G33217M2603J04851Q2521p3570o2697M7204j484J22133q1656j23055J2705
1981H02772L1157M9924R1946q0547K023K347j4890j956j7801K3017j4456Q516
1969H82052j77573N1381O7803n5400m7546k5735M3270J42573l8615r7809O1441
$$ y = [1277539, 1308945, 1355938, 1400640, 1437556, 1357712, 1260426, 1308887, 1366594, 1303331, 1237911, 1196017, 1220113, 1280172, 1215397, 1180304, 1114902, 1220055, 1254609, 1170440, 1109999, 1075986, 1146686, 1234638, 1282796, 1181002, 1012195, 1132683, 1085790, 1011959, 1074188, 1181517, 1139598, 969468, 915299, 940870, 1060940, 958202, 879364, 887956, 1016849, 1108911, 1061912, 962271, 827050, 853739, 921317, 832593, 817540, 907310, 961012, 1022524, 1023100, 953846, 987492, 856072, 733217, 775820, 880671, 963192, 889622, 826925, 874129, 872645, 994778, 913122, 790067, 802772, 833929, 883853, 975799, 895252, 897275, 899622, 884732, 882776, 864975, 887992, 873536, 882052, 704479, 755860, 823663, 768263, 720717, 694982, 738252, 880825, 842210, 744401, 805842]
1958H05842p2414o5823J11889o3080l1316L1420P4220j30973j685n4539j80621
1947D22920J37124K58350P3509r9103j0500j12015N3641P6303r2241l8706L0933
1936G00215j9432J18087M7920q2231k0269m7093n3173M8970M5001o7362M8401
1925G19034j5339j4381j0677j3509K0020l9809K3770j8580J01706L1376j09709
1914F73902p0356P246j22328o1378L0254l370J80874q583o4571r1867M742q5576
1902C88989N4822o9490j5693R5602L589O4478r681N969N7222J434j70632m6193
1890C60416J63313N9059n7005p4479k8702J05108P9422m3444N726O8008M034P108
1878F48564J9015o0237p4061Q5380n3011L7586O3071K6312r6544L0316O0868q3718
$$ y = [805842, 733428, 667605, 779494, 716414, 685098, 716518, 790738, 659765, 658080, 603541, 422920, 560044, 818394, 891903, 792800, 782300, 670285, 723926, 800229, 707988, 669282, 700215, 680783, 798870, 846790, 764559, 744290, 697197, 644024, 692994, 737995, 670633, 719034, 703695, 689314, 678637, 665128, 685148, 645339, 669109, 650529, 752235, 783611, 673902, 603546, 610792, 488464, 427086, 457340, 453970, 634844, 626261, 561690, 469823, 474565, 388989, 443811, 374321, 358628, 454230, 457819, 522297, 512616, 518585, 575807, 577241, 406609, 360416, 523729, 582788, 525783, 451304, 422602, 527710, 607132, 563688, 569414, 637422, 641456, 648564, 667579, 607342, 533281, 618661, 565650, 603236, 666307, 692619, 596075, 626391, 687259, 603541]
1866F03541n5551L7354o2236P9229O3794Q8838P3926k68682k436j846K2519N965
1854E84415J1641K856p2403R9988o5305Q1195P1320o5359L4078P9223k749J4576
1842G73476L159j74365J39378L2589q2415L7525j9304j5714M6444M1446p5411
1831G06808l8620J6603N7534o1537l2594R5725n5833r3374N2308n7008k7870J4049
1819E76191j5429l2244J1641J33209l6562m9552p6711K3590O7486J66799r701
1808G58717j42066P2571Q6810m7751J05999j190k14902p1061K2081k671O9243
1797F35780o984j25113n4790J40694Q2044m8433l0070n6753J07447N4764p9417
1786F19169r3969m7873Q7184o5639j8931J53305J23313j02183p0254m5859m4250
$$ y = [603541, 547990, 585344, 523108, 602337, 666131, 754969, 828895, 560213, 557777, 555931, 578450, 584415, 596056, 598912, 526509, 626497, 561192, 642387, 713707, 648348, 682426, 761649, 758900, 773476, 776635, 602270, 741648, 774237, 691822, 729347, 710043, 694329, 740773, 782219, 706808, 668188, 684791, 742325, 680788, 648194, 743919, 688086, 594712, 647020, 590012, 562142, 576191, 560762, 528518, 540159, 673368, 636806, 587254, 510543, 534133, 601619, 768418, 758717, 616651, 689222, 776032, 728281, 834280, 833090, 618188, 547127, 569208, 566537, 635780, 628796, 503683, 448893, 589587, 671631, 623198, 593128, 536375, 643822, 698586, 619169, 525200, 477327, 564511, 498872, 479941, 633246, 756559, 654376, 584122, 538263, 494013]
1775D94013M0849K8753n2767n6067J67730m0856L7917k2267p0195J1668k6379
1764E12399j11019J5331K0612N7665J39739J2840j70823j71020J15111N4071j04486
1753C70420P2q1988J45764l1433o5113J2361Q4029J5969j72593J57638P6823n9910
1741D52039L4530j12006p0301M990J08486j4469k2414l4001k7549P9104o909m6599
1729C44901r6148M2502L7344P5461o1357M4751j546r3485M229n7672l3026P4087
1717B80041k7750N7076R1498r982j09830r3244l2668j9097P6511p744k8054J3569
1705A90326K06055j27899p4455M8696r4405O5216Q9300q9962l3479O2900o5242
1694A77051K3944N6875m0930q1083r144l4509J33809p805N0233j3887j06357p4550
$$ y = [494013, 534862, 563615, 510848, 454781, 622511, 581655, 619572, 597305, 527110, 538778, 512399, 401380, 416711, 437323, 494988, 634727, 647567, 476744, 305724, 420835, 474906, 370420, 370492, 288504, 434268, 402835, 337722, 350083, 434112, 450081, 277488, 435126, 511949, 452039, 486569, 374563, 304262, 309252, 417738, 403269, 380855, 346854, 319305, 398409, 391500, 344901, 248753, 291255, 328599, 404060, 342703, 387454, 385908, 292423, 296652, 238980, 205954, 280041, 252291, 309367, 400865, 390883, 281053, 187809, 155141, 136044, 212555, 204811, 176757, 190326, 396381, 268482, 194027, 242723, 148318, 213534, 302834, 212872, 179393, 242293, 177051, 200995, 257870, 216940, 135857, 126713, 92204, 226013, 218208, 268441, 254554, 148197, 73647]
1682G3647R59m1486J32818Q0230j60109q1250Q6151N9799j5848k1233p9856k9183
1670D639J48711J1566j13792m2536J25741q6022Q0933K29J2688J31228j34271
1659A39114L1586J06833k245j52542J579o2612l7652L0215O2634N4640j4356l6315
1647A20879N567P9916K5629o0721R8929K6379q0004j75596j4464k4977J12154
1636A13691J9641j7005k2811L161L8450L8162M1687K2639k0788p2612p5939Q0669
1624A48945J33470j07058r8177j02363M6453N3544K3577o9631K4517R4005J12121
1613B59403q8272l3420j7631K8917O8465m0401p0515r4005l6476J3598N779K3203
1601A8645K6723l6809P7547N0756p3558L5639M1360m5783L6872N8969o2947o1928
$$ y = [73647, 74606, 33120, 165938, 246168, 86059, 4809, 90960, 150759, 134911, 113678, 33822, 4639, 153350, 164916, 51124, 8588, 134329, 48307, 129240, 129469, 142157, 273385, 139114, 170700, 277533, 275288, 122746, 124325, 61713, 24061, 54276, 116910, 171550, 157194, 120879, 126446, 206362, 231991, 171270, 270199, 296578, 216574, 40978, 26514, 1537, 113691, 133332, 116327, 93516, 96677, 135127, 173289, 214976, 237615, 216827, 144215, 68276, 148945, 282415, 175357, 77180, -25183, 21270, 74814, 98391, 28760, 53277, 147282, 259403, 171131, 137711, 120080, 148997, 217462, 177061, 106546, 12541, -23935, -10337, -4558, 18645, 45368, 8559, 86106, 136862, 63304, 98943, 140303, 94520, 131392, 190361, 127414, 65486]
1589F5486O7155J3621N1261q8751j14578o8481J96080j3091k1705k8177J1652
1578G0472O0762P2927r7622L1129K6705q4936R5389k3919n2201L7947k4104p1812
1566D0737J33717J2182k3696j83651K1229n2815O9660L5135j1575J24010m3093
1555A21840q1292J35608O7917q5251j20766K8704O2738M2380m1797q4698L4390
1544G9773Q0931o497o7675k1356l9709O7392l6018j492p0120j227R2813L061j8448
1531F1428l1433N6151j412r6979Q7802m2066J0428L8998m8465O34r3670N3525
1519e059R4356o8827k8335k586J06591M4435j04217m7011M3231R8125p0309o3580
1507c186R2818n9798j31262R930J39218J22634l9833j44984k5302N0486N2590
$$ y = [65486, 132641, 146262, 197523, 108772, -5806, -74287, 121793, 108702, 86997, 58820, 70472, 131234, 204161, 106539, 137668, 164373, 79437, 174826, 150907, 98706, 136653, 112549, 40737, 174454, 186636, 162940, -20711, 518, -52297, 17363, 52498, 40923, 164933, 121840, 40548, 176156, 244073, 158822, 38056, 66760, 129498, 171878, 130081, 45383, 79773, 160704, 154207, 86532, 65176, 25467, 92859, 56841, 55349, -14771, -15998, 76815, 79876, 61428, 29995, 86146, 84734, -12245, 75557, 33491, 43919, 82917, 34452, 35086, -58584, -5059, 89297, 20470, -7865, -10451, 96140, 140575, 36358, -10653, 32578, 130703, 60394, -3186, 89632, 29834, -101428, -91498, 47720, 170354, 130521, -14463, -39765, 10721, 63311]
1496F3311l815p7721O3855Q4718k8138r8656o6161k2111J26877N785p3922L2073
1484F095K666m3349K8617Q0155P2755o9748L0674L7292Q345q801l5074L6095j32965
1471A2757l4765o228N5567M9859n9355o1050R7122N9454k1040M9222J0704K200
1459A54447M0317j28754j09841m1368j8478k2435K02844J96967r7036l2312j19993
1448B4358R561Q5236k4018m4544q1288N444N6427l7547J7247o1340K8682R87m1329
1435f2124J04227J11281p5977j4307o7175J15370N3151q9425Q1542K0765j13115
1424F4213n2370J9150l5579L7614O7924N7760m3863J4448m5921N258P2857o4226
1412I7265k3104L5585j29959n9501J4035r8444J26260J44703n5443n6731M7540
$$ y = [63311, 59496, -18225, 45630, 130348, 102210, 3554, -62607, -84718, 42159, 47944, -25978, 6095, 8761, -34588, -5971, 74184, 146939, 77191, 107865, 145157, 153502, 144701, 109627, 145722, 12757, -22008, -28236, 27331, 77190, 17835, -43215, 53907, 113361, 92321, 141543, 152247, 154447, 194764, 66010, -43831, -85199, -103677, -126112, 76732, 273699, 176663, 144351, 24358, 33919, 119155, 95137, 50593, -30695, -25251, 31176, -6371, 10876, -50464, -21782, -20795, -62124, 42103, 153384, 77407, 63100, -4075, 111295, 164446, 75021, 156563, 177328, 64213, 11843, 30993, -4586, 33028, 100952, 158712, 114849, 129297, 83376, 88634, 161491, 97265, 74161, 109746, -20213, -79714, -65679, -164123, -37863, 106840, 51397, -5334, 42206]
1401D2206p4825P6172J1149j17597O4725J30986Q2973o0941k842j2960j15970
1390B3076j3241L2936l6769n26m5627N9783R7421q3521j10596m5321k4328J48751
1378B038r569p4910J0221J094m942O9491L210L8812M6062L0966j86176P4880P2873
1365G4050j46837N2459K3489m6173N6269j7270q9031K2456J06629l7629q3505
1354h5093M0465j0648m1286Q4801R5874o4574R186o0155N6108P63L4176L7854
1342I7471p2238o1288J11746M0761j10802J4816m2473M788R6305N3754o9197l205
1330F0438K1478J994K0370J3996k8834R3448l0944k9873J64703n9690j42169j22646
1318c7729o9651K1658J80067P1970j96706K4347O6166o584j9461r4672j34621
$$ y = [42206, -32619, 43553, 54702, -62895, 1830, 132816, 215789, 154848, 152006, 139046, 23076, 9835, 42771, 6002, 5476, -40151, 19632, 117053, 33532, -77064, -122385, -146713, 2038, -7531, -82441, -72220, -71126, -76068, -6577, -3367, 35445, 81507, 112473, -73703, 1177, 74050, -72787, -20328, 3161, -43012, 13257, -4013, -93044, -70588, 36041, -1588, -85093, -44628, -55276, -96562, -11761, 84113, 19539, 28725, -31430, 24678, 25441, 59617, 97471, 25233, -36055, 75691, 116452, 5650, 20466, -22007, -17219, 79086, 132840, 63643, 60438, 81916, 83910, 104280, 118276, 89442, 182890, 151946, 122073, 286776, 227086, 84917, -37729, -107380, -85722, 94345, 166315, -30391, -6044, 60122, 53538, 34077, -60595, -195216]
1307a95216J12816Q9368o9303J44031L3562j52067N8902k754l4641K663j09892
1296a22531q7630O1827R6576n2433M3882K3781L1269O4528P5273q4563j27101
1285g7122q0217J37075J33638j33094l0674R3294l3485L303o189n8487L0334J5993
1273e631o3602P4029M2625j6509p1906O5706P4646J9998k3130q4757j023j5825
1261e379j02212J00477Q3055o4968l8561K7080K310J19957L0201m7307j4678R6
1249I0071K3829N8276O2770M3995K1946p2223k2231k3014M8374l2042k8894P2956
1237B43813o1509j36880o8199P4418Q3873K298M2071r4248n2789P638o484q5594
1225e1592r415O1180J3599j4432R6089K4823M190j1847l4861l3551K4674L0222
$$ y = [-195216, -82400, 6968, -62335, 81696, 115258, -36809, 22093, 19339, -15302, -12639, -122531, -210161, -148334, -51758, -104191, -60309, -36528, -5259, 59269, 134542, 49979, -77122, -157339, -20264, 113374, -19720, -50394, 42900, 9415, 12718, 6529, -51958, -21624, -5631, -69233, 4796, 47421, 30912, -40994, 24712, 99358, 119356, 96226, 11469, 10446, -5379, -107591, -7114, 75941, 10973, -27588, -508, 1802, 121759, 151960, 104653, 89975, 90071, 113900, 172176, 234946, 278941, 300887, 228664, 206433, 183419, 231793, 199751, 170857, 243813, 182304, 45424, -22775, 51643, 135516, 137814, 179885, 85637, 32848, 40486, 34002, -51592, -61007, 173, 13772, -660, 95429, 120252, 124442, 112595, 77734, 44183, 68857, 99079]
1213I9079j50467J2022P5926p3258J3871K430M459K9723R4843K7627l5876r0527
1201I852j32353P4221Q5920O9112j8118j3485J3240K2151J1267k3928k269K5602
1189A21212p2027r5457O5347R6404r8296o2113J21459m8994l5513m4956K4073
1178b8861q9621J04614j05639k735Q6139Q7938J5878o1984k640p0402j104j25394
1166a93811K1571J54467Q4011p3772m078l0299k4151N7207N790k7716k7666K9641
1154b8806K2949k7356m9713j16339J57172J07918Q7311K4404j54694o6201k8059
1143g1414j098j5389J5283P4144O9757o775Q8461P2576M6118j61131m2969J39729
1131B07292m3567N5290o3051n9732n6520Q6154p3885o3382Q3305O2507j8950K5647
$$ y = [99079, -51388, -39366, 36560, -36698, -22827, -20397, -15938, 13785, 108628, 136255, 100379, 9852, -122501, -48280, 37640, 106752, 88634, 75149, 88389, 110540, 121807, 97879, 95610, 121212, 49185, -46272, 19075, 115479, 17183, -44930, 76529, 27535, -7978, -52934, -28861, -118482, -13868, -119507, -122242, -36103, 51835, 67713, 5729, 3089, -67313, -68417, -193811, -172240, -17773, 66238, -7534, -11612, -41911, -66062, -8855, -3065, -30781, -58447, -28806, -5857, -33213, -82926, -199265, -42093, 65825, 153136, 177540, 22846, -43355, -71414, -72512, -87901, -72618, 1526, 71283, 64508, 152969, 225545, 271663, 110532, 67563, 207292, 163725, 219015, 155964, 96232, 39712, 125866, 51981, -11401, 71904, 134411, 115461, 141108]
1119A41108N3759N0581m4388r9103o4034K7221L5769l4328L5964r6170j4764J5720
1107G335N6310P7918o877j07213O8922O8854j7454j00246K3660l7362K6825J33432
1095A94104k02883m5803J56494N5021l7712p49r714n3711J1972m5978k4155L1826
1083B8712L5527R0532Q0930j11140K3967P4751j14337k5755N8310M9384K7279
1072B18160J68958j43514l9309N4315l2466j11661Q1650O5149N1852K0538j45262
1061A88410q732N8904L7078L763J16480q8658O9474P7073j52965K2530J18357
1050D41714Q7871J0054K2372q3073K5509O3966R733o277J3202J9064M4703J4024
1038F62862M9815p3189K7252O0528j57660j4801O9407L1677J292n082L9805R781
$$ y = [141108, 194867, 245448, 201060, 101957, 37923, 65144, 100913, 66585, 102549, 6379, -8385, 7335, 63645, 141563, 134686, 27473, 96395, 165249, 147795, 47549, 71209, 33847, 60672, 194104, -8779, -54582, 101912, 156933, 119221, 118472, 108758, 55047, 67019, 21041, -3114, 28712, 64239, 154771, 235701, 124561, 148528, 223279, 108942, 83187, 141497, 190881, 218160, 387118, 243604, 204295, 258610, 226144, 114483, 196133, 261282, 313134, 333672, 188410, 179678, 238582, 275660, 279423, 395903, 307245, 376719, 453792, 300827, 323357, 441714, 529585, 539639, 562011, 478938, 504447, 568413, 578146, 571869, 585071, 604135, 648838, 662862, 712677, 639488, 666740, 727268, 569608, 554807, 624214, 655891, 657183, 652101, 691906, 701687]
1026G01687m9173N0023M0808J2176J5619k8327j97865O1432K4170j20247j9616
1015D90687M7996Q4825N0569K8449j35120P269J40312l5113k5770R1715K4424
1004G70243k3435O3534l5130j5466J36792J24084o0614J0891P6027L3701P4140
993A154767o5793J29495K71912K3565K58000J06896j2111P1450J41730L2764J15383
982B228058J91666J29234J53029J05429J56749M48278K66899K77037L20041L52587
972D629007L75705M94006M14847M59091O16392P01182P83964R25348J214426J431225
962A2045193J714745K092781K100838K497538K191410J753121J863315q05174
954B5453767l887982m550748l445261k386911j469164j194929j107359p69557
$$ y = [701687, 652514, 702537, 743345, 755521, 771140, 742813, 544948, 606380, 630550, 510303, 490687, 538683, 623508, 674077, 702526, 567406, 574675, 714987, 679874, 654104, 745819, 770243, 746808, 810342, 775212, 759746, 896538, 1020622, 960008, 970899, 1046926, 1080627, 1154767, 1088974, 1218469, 1490381, 1513946, 1771946, 1878842, 1866731, 1938181, 2079911, 2112675, 2228058, 2419724, 2548958, 2701987, 2807416, 2964165, 3412443, 3679342, 3956379, 4276420, 4629007, 5004712, 5498718, 5913565, 6372656, 6989048, 7690230, 8474194, 9399542, 10613968, 12045193, 13759938, 15852719, 17953557, 20451095, 22642505, 24395626, 26258941, 25453767, 21565785, 17015037, 13569776, 11182865, 9713701, 8518772, 7411413, 6641856]
946F641856n56087o98382l47310k58027l01750k03986j52097k22457l32844l40910
936C228006m03283j51428j38521j57368m8647M119q8861k34532o8838k1328J9153
925A938472r3869j39006j26461j839O5953J2781P198p5695P157o7599r2196k323
913A432573q7824m2460n4744j51874l737Q5969m2664o2379q0198n0928l7208J753
901I06279m2241j33107P283J1259q062J8733K5114j01805j7430o2150m9627k9133
889E25113q1644O1715j878n1724J116M4552j20751K0284O0534n8643q1515o451
877C10708l4753j5782O9012o9567l434J7714N2316j305o6988r3407L7298Q0808
865B82620k7078o7096M0731k7857j8870R6608M8200Q8020K9146k6921j68378o94
$$ y = [6641856, 6085769, 5387387, 5040077, 4782050, 4480300, 4276314, 4124217, 3901760, 3568916, 3228006, 2824723, 2673295, 2534774, 2377406, 2328759, 2332878, 2244017, 2009485, 1940647, 1919319, 1938472, 1844603, 1705597, 1579136, 1577297, 1643250, 1656031, 1663229, 1587534, 1594691, 1527092, 1434896, 1432573, 1344749, 1302289, 1247545, 1095671, 1091934, 1177903, 1135239, 1072860, 992662, 941734, 904526, 906279, 864038, 730931, 738214, 749473, 741411, 760144, 785258, 683453, 666023, 603873, 554246, 525113, 443469, 505184, 503306, 451582, 452698, 497250, 376499, 396783, 457317, 398674, 317159, 310708, 275955, 260173, 329185, 259618, 256184, 273898, 326214, 324909, 257921, 164514, 201812, 282620, 255542, 188446, 229177, 201320, 182450, 279058, 327258, 415278, 444424, 417503, 249125, 248431]
853B48431k4847Q8140K7574l598M5663j00154j20576Q3908O1465n6728P0994r6673
841B23599j21631Q2750R8323j05329j5818L1391P1697l9765J6524j02419K5935
830A65257M6913j00613J5969j1584j4479M2587k0198N536O9367j5091j52058m3319
818a1713M2051R8786L6098o2758Q978o1284O1298r6290P330J14283n0266j03308
806a6795n5110M0106K8487M8351P6488J5404q6433l6295p2097Q8955k5162n1994
794d6095l3625j4968J4330M2845Q2425J5947k4199r3658j00183J7539J10380L2175
782B913j37225Q709J01308k0477q467J00445n6034n3380J90820l8280j3375l1411
770D5546q0060L3838L6701J9990K1191J0211m9302q3592J48209K4136j43964l2985
$$ y = [248431, 223584, 311724, 339298, 335700, 381363, 281209, 160633, 244541, 306006, 249278, 320272, 223599, 101968, 184718, 283041, 177712, 161894, 193285, 264982, 225217, 241741, 139322, 165257, 212170, 111557, 127526, 115942, 101463, 144050, 123852, 129388, 198755, 183664, 31606, -11713, 30338, 129124, 165222, 102464, 111442, 50158, 111456, 15166, 22496, 136779, 86513, -16795, -71905, -31799, -3312, 45039, 121527, 136931, 50498, 14203, -57894, 31061, 5899, -46095, -79720, -94688, -80358, -37513, 44912, 60859, 36660, -56998, -157181, -139642, -29262, 2913, -134312, -125603, -24295, -44772, -53239, 47206, -8828, -62208, 128612, 90332, 76957, 45546, -34514, -676, 36025, 56015, 77206, 87417, 38115, -45477, 102732, 126868, -17096, -50081]
758e0081N2812k8720J08548M4794q884l8706o1156n7955j68602Q2929J10987q4981
746i9015L0886Q0973J6165K8116n8595K981m758j7977l9702r7296k3865J01751
734h0336K8848J8901m7700N747M4568j5912n9393L6787L7141j5424l4149l1765
722a12687m0283J44070J23450j136j26p9143p305k9264J0979l3853L6707J47304
710A58713m8215j04753r8370j92J70921O3153j24351n6271J7772m4720m3905N8329
698e1889J03653M1589J1609o5216k9459j5379R521r0117q9367N9908q957k3664
686a47768N7537O5542K2516N0261j26692j30276J57455m399j7989j1069Q7312
675B430K834O4076k0373l755M9908P7433p4984j12939J659P1688p0173Q0482k1552
$$ y = [-50081, 2731, -25989, 82559, 127353, 118469, 79763, 18607, -39348, -207950, -125021, -14034, -99015, -68129, 12844, 29009, 57125, -1470, 1511, -3247, -21224, -60926, -158222, -182087, -80336, -51488, -32587, -80287, -74540, -29972, -45884, -105277, -68490, -31349, -46773, -80922, -112687, -152970, -8900, 114550, 113414, 113288, 34145, 26840, -2424, 8555, -25298, 11409, 158713, 110498, 5745, -92625, -92817, 78104, 141257, 16906, -39365, -21593, -66313, -110218, -51889, 51764, 93353, 104962, 39746, 10287, -5092, 4429, -85688, -175055, -115147, -124104, -147768, -90231, -24689, -2173, 48088, -78604, -208880, -51425, -55824, -73813, -84882, 2430, 5264, 69340, 48967, 45212, 95120, 172553, 97569, -15370, -13711, 57977, -12196, 68286, 46734]
662D6734j04050N2424K3944j39951j34671J03124O8632O0884N818O9636j33707
651h1183P0656M4862r411k2401j0689j04169p9534l9236r058J43997R3216o3926
639f6876p1690N7637Q0461N7690n3340j34073j13303P5706R8982l945P5018k4594
627b2327K2017j00189o8788l4564J0047P0800l7029Q0770L3254J32312m8916K566
615C9953L1553n3693m4946j2894p1495r9504J25956K1496j9982P0181P0040l4153
603B2512N4319m7441q7251O6694M6610n1083j11533M560L5489P9917k6945N20
591a3632L5646m2543j7415R729K9061r4086M4836j28621m028N1391L5148Q0668
579a3846K697m9481o9071N1880l103M45m782j1348M8895J8332m1101j16600P0960
$$ y = [46734, -57316, -4892, 19052, -120899, -255570, -152446, -83814, -22930, -17112, 52524, -81183, -10527, 34335, 24924, 2523, -8166, -112335, -191869, -231105, -240163, -96166, -2950, -66876, -138566, -80929, -468, 57222, 3882, -130191, -243494, -167788, -68806, -72751, 2267, -22327, -310, -100499, -169287, -203851, -193804, -123004, -160033, -79263, -46009, 86303, 37387, 39953, 71506, 17813, -27133, -40027, -111522, -211026, -85070, -63574, -83556, -13375, 56665, 22512, 76831, 29390, -57861, 8833, 55443, 4360, -107173, -102613, -67124, 12793, -14152, -13632, 22014, -20529, -37944, -28215, 846, -93240, -48404, -177025, -181053, -129662, -94514, -13846, -11149, -60630, -129701, -77821, -80924, -80479, -85261, -96609, -47714, -29382, -70483, -187083, -116123]
566a16123K8345p0520J10344j1286j3750O3549q0011p5703m0579R0301o4551O8713
554a11271K8053l1209J11498j76740L4899N1912L7831k5237L3476l2766l5053
543a14607K5609n3049n3609P4881J1678O5911K1041j16262J60156J03151n5990
532F8910p3139K6137J04509n0649j4035j11611J04968J12455N8948j01747k38904
521a14158K352J08371O0586o3196K657k5825M6326Q239l9115N4403J07692k1156
509A27176j49340m5869O2032o6264k2654q3190J03264o2839N7046k2460j10845
498b13943J12881l326n8133q4292l1792J22542M885l2323k861n015J4340p3521
486b50558n3047O4958M9572o27l6483j29545K14989q1171j03194K423o885K68827
$$ y = [-116123, -87778, -158298, -47954, -59240, -72990, -9441, -89452, -165155, -205734, -115433, -179984, -111271, -83218, -114427, -2929, -179669, -144770, -92858, -55027, -80264, -46788, -79554, -114607, -88998, -142047, -195656, -120775, -109097, -43186, -22145, -138407, 21749, 124900, 68910, -4229, 21908, 126417, 75768, 61733, -49878, 55090, 167545, 226493, 124746, -114158, -111806, -3435, 57151, -6045, -3388, -29213, 17113, 25352, -13763, 40640, 148332, 127176, -22164, -68033, -6001, -72265, -94919, -178109, -74845, -137684, -80638, -103098, -213943, -101062, -104388, -162521, -246813, -278605, -156063, -151178, -183501, -186362, -191377, -177037, -250558, -303605, -238647, -189075, -189702, -226185, -355730, -140741, -221912, -325106, -322683, -329568, -60741]
474f0741J1682j27494q0012J8042K1809L2059J20434n0146R1781l3100L2956N0781
462B8051k2477j99217k2501R5280M8953J04677m0867r590l194l1139P5961m6716
450b2779j21748O8842P5421J3821q1863r029J7011R1475j5919j49451O8251J72901
438A06933q8160p7096l8604K3621O3901M8485p3128r6932O7833L7441o5042l5733
426a26481l4510l1058O641M2439o050j909R379Q3740j2588o5150j7079j4079M8707
413a17998L7946M2251n5685Q1413j24318M1639J10823j32463j0765J0299O8992
402d7866J3345L6511o838r3192J2776J9348k673p5944J3007l7232R3140J4246
390f1372r0956O7545O2912j00777N9887m851l0037P692K8736m0859K7327N2626
$$ y = [-60741, -49059, -176553, -256565, -238523, -216714, -184655, -64221, -114367, -22586, -55686, -22730, 28051, 5574, -193643, -216144, -120864, -71911, 32766, -8101, -17691, -20885, -52024, 23937, -22779, -144527, -75685, -264, 13557, -68306, -77335, -60324, 31151, 15232, -134219, -65968, 106933, 18773, -58323, -96927, -73306, -9405, 39080, -34048, -130980, -63147, -25706, -90748, -126481, -160991, -192049, -185408, -142969, -149019, -150928, -141549, -57809, -70397, -135547, -152626, -166705, -117998, -80052, -37801, -93486, -12073, -136391, -94752, 16071, -116392, -127157, -116858, -47866, -34521, 1990, -4848, -98040, -85264, -65916, -68589, -144533, -131526, -168758, -75618, -61372, -152328, -84783, -21871, -122648, -62761, -67612, -97649, -89957, -61221, -102080, -74753, -22127]
378b2127j53820N7349J9131N8533J1929J4187m5151k4920J21788j08452j19541
367a91094L178R0633K0664j2043m2248l9001r8753P2573J21547n6621J0210N1488
355f9467j44185o9012N0955l2394J37600k5313O1790q8495K6495k0090m9087k2735
343b43938j342l8029J09666M8562j3535j1121j3855l9806L8591J05716k7441j7029
331a03561Q1897M9593r495O565q4444r4350N7659K7271R0398n7708K8421k2365
319c0119o3785J38413J01218K4615j87329j2669J304q3R616P1852j8253j14424
307g9644l3860Q8936N9675o4308m6359j29433j983P8755M6979q5803j9397J07905
295g8537Q3534j19448m0567j5664m4485J01303n123N87j12099n4381L4851R9579
$$ y = [-22127, -175947, -118598, -99467, -40934, -29005, -14818, -59969, -84889, 36899, -71553, -191094, -187916, -97283, -76619, -88662, -130910, -169911, -268664, -196091, -74544, -131165, -120955, -69467, -213652, -282664, -231709, -264103, -126503, -151816, -90026, -178521, -152026, -172116, -221203, -243938, -245280, -283309, -173643, -125081, -138616, -149737, -163592, -203398, -164807, -59091, -86532, -103561, -21664, 27929, 18434, 24999, -59445, -153795, -96136, -68865, 21533, -36175, -7754, -30119, -93904, 44509, 145727, 170342, -16987, -29656, -28352, -28435, -18819, 53033, 34780, -79644, -113504, -24568, 35107, -29201, -75560, -204993, -206976, -128221, -81242, -167045, -186442, -78537, 4997, -114451, -155018, -170682, -215167, -113864, -118987, -118400, -230499, -284880, -250029, -150450]
283a50450o685L3081N5562j49719p9062K0597k984j5744J04442J5624q9848L4595
271b30591o586Q5508L0595k8790j9376N2175m8648L7422p577j1046l2672N9517
259a20069l3326K3967N732j3375K7567m7979M6206r317N935m6144K9589Q4315
247d6899n5217r983j12842j5713Q3286J04687P0541p3957J0454j7226M421O1961
235C513P6340p646o1110p6611M0616L0517j11729M9145r5033m0862J05130n9452
223a47182r2307N3641Q6634L6958r3043O7712l2243j07487R3487j7704K869M4560
211a04105J0971r3634j16818L9555K5632J3614L9502k2052l0323J3964J05207
200a18487k3625r8317J8154N7549j0912q2912K4503L5907m6554j2921k3769P9962
$$ y = [-150450, -157135, -124054, -68492, -218211, -297273, -276676, -279660, -295404, -190962, -175338, -265186, -230591, -237177, -151669, -121074, -149864, -169240, -117065, -165713, -128291, -135868, -146914, -179586, -120069, -153395, -129428, -123696, -137071, -109504, -157483, -111277, -120594, -114659, -160803, -131214, -46899, -102116, -112099, -224941, -240654, -157368, -52681, 17860, -56097, -45643, -62869, -58448, 3513, 79853, 72207, 11097, -65514, -24898, 5619, -106110, -56965, -151998, -192860, -87730, -147182, -239489, -185848, -99214, -62256, -155299, -87587, -119830, -227317, -133830, -151534, -148665, -104105, -93134, -186768, -303586, -264031, -238399, -224785, -185283, -207335, -237658, -223694, -118487, -142112, -240429, -222275, -164726, -175638, -258550, -234047, -198140, -244694, -257615, -281384, -201422]
188b01422M7457N2176p0118J5274P7379J03739o7333j37842o058J9660L8477P8397
176e0214j04845m6013N8821M1593o3147J15188Q2581k2062j26836j54960K2599
165b47295K8766J31877l9299O519K399r1505o6442q147Q4075N2474M995j2082
153a53665m2329k6976N5711k7590j8687M7680r4829n2585R3108m9871l8736n696
141c14465K2287l4240K0750J08297O1895k3195l3386N8600P0900j2762o8357p9342
129b23018Q9535N9322P119J2217j12146M2151l1653K6872J2511N410j2075q813
117a32568r2055j8403Q6627M0717o7531l1733J4863L4626N6807n8223k344M0257
105a28960m0658M1703N5786r5137N8071K3011j06823o1759J1064M4534j3350L1865
$$ y = [-201422, -153965, -101789, -171907, -156633, -79254, 24485, -42848, -180690, -186748, -167088, -128611, -50214, -155059, -201072, -142251, -100658, -163805, -48617, 33964, 11902, -114934, -269894, -247295, -218529, -86652, -125951, -119432, -117033, -208538, -274980, -283127, -199052, -146578, -141583, -153665, -195994, -222970, -167259, -194849, -213536, -165856, -260685, -313270, -220162, -270033, -308769, -314465, -292178, -326418, -305668, -197371, -135476, -158671, -192057, -133457, -62557, -75319, -143676, -223018, -133483, -74161, -67042, -54825, -166971, -124820, -156473, -129601, -117090, -111680, -123755, -132568, -224623, -243026, -156399, -115682, -183213, -214946, -200083, -165457, -108650, -166873, -169217, -128960, -169618, -127915, -72129, -167266, -109195, -86184, -193007, -254766, -243702, -199168, -212518, -180653]
93a80653L5711N1286N5773L816q2836l4159K8767l907j4938j42015K2598J02715
81a57842K4527K1148k1803p8427Q7785k1463p0693j5083j2765j796p4375m2959
69c63746R8314N3782N882p5154J020L9174K1233k3979q9075J2682N7908O5146
57a96813n2114n229K9543N2648r535j8062p7458K8718k2872j7125n2302O3497
45b77104R8686L3521K3864j05617m4256J13768l6636N4784K1388l8955L1971l737
33a28323L9608j2810N1820o4723p413J723n4208j0390r2829j2461J00823Q2933
21a06250j9703j15085L4402J03681J5447j03962q2691P4510n6788j9923R036N0798
9b16528N7866o8923P376l9499j7294J3731J0889R145k167
$$ y = [-180653, -144942, -93656, -37883, -34067, -116903, -151062, -122295, -126202, -141140, -283155, -260557, -157842, -133315, -112167, -133970, -212397, -124612, -146075, -216768, -231851, -244616, -246412, -320787, -363746, -265432, -211650, -205768, -280922, -279902, -240728, -219495, -243474, -332549, -319867, -261959, -196813, -248927, -254156, -224613, -171965, -181500, -199562, -277020, -248302, -271174, -288299, -340601, -277104, -178418, -144897, -121033, -226650, -270906, -157138, -193774, -138990, -117602, -156557, -124586, -128323, -88715, -101525, -49705, -114428, -121841, -120118, -174326, -184716, -277545, -290006, -189183, -106250, -125953, -241038, -206636, -102955, -87508, -191470, -274161, -199651, -256439, -276362, -267326, -216528, -158662, -227585, -220209, -259708, -277002, -263271, -252382, -243237, -245404]
0b45404
$$ y = [-245404]
$$ Imaginary data points
##PAGE= N=2
##DATA TABLE= (X++(I..I)), XYDATA
16383c511724P0085M0102O129L5288Q286J08715j826M0123J22974L9438L5526
16372c006884m471k4077l5368J14018O6510K6515K7066l853k405M6848N9214J16988
16360b619899R5092M9493l1287k1756P6216J4421O9367M0883m586K2454P9699
16349b229903L2259O6719K7987p2233M4197R8362O3227L3950J03446P1393l0054
16338a790650M5071j3738k3881L9458M2553Q2013k0495J07715J9774l5019O6020
16327a481179J13399P7577m8107O7295k4712J23629j0170p0051O6968J16462L0564
16316a038325K527R3381m267n526J01086l4061l8412L1744O9806N136Q5225P8353
16304f53333P358R4113M737M8392P9J913Q1661P756M8015L937M3533Q1641M7670
$$ y = [-3511724, -3441639, -3401537, -3395408, -3360120, -3351834, -3243119, -3244945, -3204822, -3081848, -3042410, -3006884, -3011355, -3035432, -3070800, -2956782, -2890272, -2863757, -2836691, -2840544, -2842949, -2796101, -2736887, -2619899, -2524807, -2475314, -2506601, -2528357, -2452141, -2437720, -2368353, -2327470, -2332056, -2309602, -2229903, -2197644, -2130925, -2102938, -2175171, -2130974, -2032612, -1969385, -1935435, -1831989, -1760596, -1790650, -1745579, -1759317, -1783198, -1743740, -1701187, -1619174, -1639669, -1531954, -1512180, -1547199, -1481179, -1367780, -1290203, -1338310, -1271015, -1295727, -1172098, -1182268, -1252319, -1185351, -1068889, -1038325, -1035798, -942417, -946684, -952210, -851124, -885185, -923597, -891853, -822047, -816911, -731686, -653333, -645975, -551862, -547125, -498733, -498654, -496741, -415080, -407324, -359309, -355372, -311839, -230198, -182528]
16291a82528M1468l3920K0575n4976O6904P0301N3372M0522o258L3335L4427J07079
16279A90301j4055o0160l0128Q5801Q2310J6358Q6514J5981j4557n205K656O8059
16267D23875K4909m5277N8261L8884J1653L5011p505n5723M2839O684M7539J45129
16255G26279k8943j7307m570L7734O2414O9014n5414n7012P6235M9964M348Q1931
16243I44673K0781j1341P6572J06233o5618o4348Q0048l5769N0483j2403M2607
16232A131918K0966L3464L6481o4111R1758L9422m2155m8613Q3236L5171l3519
16221A284018P0750j8878J34639j2307l8347k5711J7597P8290L665M9094M1941
16210A584751P0152K1777o6933m7545j0227P9189k8941l0670J4792R4098L5750
$$ y = [-182528, -141060, -174980, -154405, -209381, -142477, -72176, -18804, 21718, 15460, 48795, 83222, 190301, 176246, 116086, 85958, 171759, 254069, 270427, 356941, 372922, 358365, 353160, 355816, 423875, 448784, 403507, 461768, 500652, 512305, 547316, 539811, 484088, 526927, 533611, 581150, 726279, 697336, 680029, 675459, 713193, 775607, 844621, 789207, 732195, 808430, 858394, 862742, 944673, 965454, 954113, 1030685, 1136918, 1071300, 1006952, 1087000, 1051231, 1101714, 1089311, 1131918, 1152884, 1186348, 1222829, 1158718, 1250476, 1289898, 1247743, 1199130, 1282366, 1317537, 1284018, 1354768, 1335890, 1470529, 1458222, 1419875, 1394164, 1411761, 1490051, 1493716, 1542810, 1584751, 1654903, 1676680, 1609747, 1562202, 1551975, 1631164, 1602223, 1571553, 1586345, 1680443, 1716193]
16199A716193k1590n4150m2860N3541R2656K5140K3607j2565K652L2897P8550
16188A894071Q726o672Q4367p8184j16932K7118l2010n838J8505J15707K8848
16177A937706j01857P5877J24169m6567n4611R5916J6759q4497K1812K3373K7546
16166B035626J9302m4253J3089J10444m5484n9356n0813M4490P1017J0939K5643
16155B130644k15431R3072P5052m0748P8969O3003M8426m2769p8772P8510n1641
16144B138315R5131n7853r7734J07003N7524L6252q0577m9186P1637J02432m1951
16133B280993L8412L9581k8064K6635j90483Q1273l560n4768Q5683j3756L8978
16122B300924L8750K9437o2223r3974l795P6235J68845q3831p3084o6335J62607
$$ y = [1716193, 1694603, 1640453, 1597593, 1651134, 1743790, 1768930, 1792537, 1779972, 1782624, 1815521, 1894071, 1902797, 1896125, 1980492, 1902308, 1785376, 1812494, 1780484, 1774646, 1793151, 1908858, 1937706, 1835849, 1911726, 2035895, 1989328, 1934717, 2030633, 2047392, 1962895, 1984707, 2008080, 2035626, 2054928, 2010675, 2023764, 2134208, 2088724, 2029368, 1978555, 2023045, 2094062, 2105001, 2130644, 1915213, 2008285, 2083337, 2042589, 2121558, 2184561, 2232987, 2190218, 2111446, 2189956, 2138315, 2233446, 2175593, 2077859, 2184862, 2242386, 2278638, 2198061, 2148875, 2220512, 2322944, 2280993, 2319405, 2358986, 2330922, 2357557, 2167074, 2248347, 2244787, 2190019, 2275702, 2261946, 2300924, 2339674, 2369111, 2306888, 2212914, 2209119, 2285354, 2454199, 2370368, 2297284, 2230949, 2393556]
16111B393556M2352j08243N5589q2569L80J12889j4534k9732p1419j0237k5652
16100B262380N387Q9015Q0529L6781r9385M6597K4372N937l8294l6951K8875n1437
16088B353806N3893O3481M8636k9710q8957R6742L0089k9474m3872r0835J5757
16077B379556K3679L890M0232R2485M6629q3474k260k0179n2500l8508m0393N736
16065B354893J06876P5165o0518L2184K7181L8889o1499p8736o3507R141M6165
16054B426234j2502p064K2162R5238K1861P4047k0435j59021L3406j51j6452O7362
16042B524685o565m4873m6480L6780k4376K2465R8932n4308j25903J41779n7216
16031B464920j2766M4504p1938L3979j4787o8041O9476o1427J6768M299k599M7929
$$ y = [2393556, 2435908, 2327665, 2383254, 2300685, 2301065, 2413954, 2399420, 2369688, 2298269, 2288032, 2262380, 2267767, 2356782, 2437311, 2474092, 2374707, 2421304, 2445676, 2451613, 2413319, 2376368, 2405243, 2353806, 2407699, 2471180, 2519816, 2490106, 2401149, 2497891, 2527980, 2498506, 2454634, 2363799, 2379556, 2403235, 2407125, 2447357, 2539842, 2586471, 2502997, 2500737, 2480558, 2428058, 2389550, 2349157, 2354893, 2461769, 2536934, 2476416, 2508600, 2535781, 2574670, 2513171, 2434435, 2370928, 2380069, 2426234, 2413732, 2406668, 2428830, 2524068, 2545929, 2619976, 2599541, 2440520, 2473926, 2473775, 2457323, 2524685, 2518120, 2473247, 2426767, 2463547, 2439171, 2461636, 2560568, 2506260, 2380357, 2522136, 2464920, 2452154, 2496658, 2424720, 2458699, 2443912, 2375871, 2445347, 2383920, 2400688, 2404987, 2402388, 2450317]
16019B450317l3559Q9688k8630p7862N4304n954L9655n8352J5512N053R8395n2522
16007B496045K4326l1441j8208Q7995L5965j07956m1172N1378P1603P5934J1299
15996B655768p9800j5060L7883k8766j4833l4017o5369K3015P1506p3230M712
15985B481809J05558o5353K4040O9480q487n556m0640K9879l2109K6370k0769
15974B564222j92464k487K29199O3025M2487k24153O5041J17145L8092k13165
15964B486942J4231J16995M0352n1789n4723l1657L9457O8261j92350j02135L5720
15953B369304Q7220l1086m7578R5732N4942Q5275l0030k8661N384n988j5151j7823
15941B521540J15759j18639k5171O4732r0642k2728r29k9100R141o2525K5930
$$ y = [2450317, 2416758, 2506446, 2477816, 2399954, 2454258, 2448304, 2487959, 2429607, 2445119, 2450172, 2548567, 2496045, 2520371, 2488930, 2470722, 2558717, 2594682, 2486726, 2445554, 2496932, 2568535, 2644469, 2655768, 2575968, 2560908, 2598791, 2570025, 2555192, 2521175, 2455806, 2478821, 2550327, 2477097, 2481809, 2587367, 2522014, 2546054, 2615534, 2607047, 2601491, 2560851, 2590730, 2558621, 2584991, 2564222, 2371758, 2369271, 2598470, 2661495, 2703982, 2479829, 2544870, 2662015, 2700107, 2486942, 2501173, 2618168, 2658520, 2606731, 2552008, 2520351, 2559808, 2628069, 2435719, 2333584, 2369304, 2456524, 2425438, 2377860, 2473592, 2528534, 2613809, 2583779, 2555118, 2560502, 2554514, 2539363, 2521540, 2637299, 2518660, 2493489, 2558221, 2467579, 2444851, 2443922, 2414822, 2423963, 2361438, 2387368]
15930B387368j3652L3584j0440l3351J11078J32978K1483j16578n6075M0042J28878
15919B625315l5692j08793p0849j9173L5578q520k138J5630Q5598Q9257j9480
15908B586733r0453O6556R3718j56839N3278J9014j57622O2286K6728l0629R600
15897B482370r368M2665j0890K1662l3237R6285J24490k4323j31496p9842M2358
15886B520674O5956J08098j48166n5769J7092N5953O8833l6044j4265o0041L2131
15875B554452R1015m0935k6233L8790j43061K9382k455l404J0186l1122J1342
15864B487957j5527J4048K7652l352k6130N4231p9492L3935R3176n8895L5630
15853B563233j8181q670P6927k4820m6847j8569Q2299n7574j18903J88892R0543
$$ y = [2387368, 2373716, 2407300, 2396860, 2363509, 2474587, 2607565, 2629048, 2512470, 2456395, 2496437, 2625315, 2589623, 2480830, 2409981, 2390808, 2426386, 2417866, 2415728, 2431358, 2516956, 2606213, 2586733, 2496280, 2562836, 2656554, 2499715, 2552993, 2572007, 2414385, 2476671, 2503399, 2472770, 2482370, 2473002, 2515667, 2504777, 2526439, 2493202, 2589487, 2713977, 2689654, 2558158, 2478316, 2520674, 2586630, 2694728, 2546562, 2490793, 2507885, 2563838, 2632671, 2596627, 2582362, 2522321, 2554452, 2645467, 2604532, 2578299, 2617089, 2474028, 2503410, 2500955, 2497551, 2507737, 2476615, 2487957, 2472430, 2486478, 2514130, 2510778, 2484648, 2538879, 2459387, 2493322, 2586498, 2527603, 2563233, 2545052, 2536382, 2613309, 2588489, 2541642, 2523073, 2605372, 2547798, 2428895, 2617787, 2708330]
15842B708330j01402m3235M2141m392P0915j27734k19234K10112J40150j27421
15832B548230r2233J27686Q5933j253m6439j50832O8312J24746j39575p0074O8136
15821B522637j6622N1245J08437j23026N0179j535J4223O7104j18633J2189M1488
15810B607686L8343n7644r0731N9485n3997k9889o3378O2941R5701N9151r6516
15799B531152o4534Q6106m9007n5100p0653q4568M7925J18407O5480j09565K2769
15788B438412R3203P1640j50633q2980Q0849j8560J3535j1935r564O1191M5339
15777B530497j03749M3492J63412k1795l1721J6914K4900n6956o904Q841m4188
15766B522743O2146M1452j13379M6093J54452j63125Q1280k6549j1378R2378P7015
$$ y = [2708330, 2606928, 2563693, 2605834, 2601442, 2672357, 2544623, 2325389, 2535501, 2675651, 2548230, 2455997, 2583683, 2669616, 2668363, 2621924, 2471092, 2539404, 2664150, 2524575, 2454501, 2522637, 2506015, 2557260, 2665697, 2542671, 2592850, 2591315, 2605538, 2672642, 2554009, 2566198, 2607686, 2646029, 2588385, 2497654, 2557139, 2503142, 2473253, 2409875, 2472816, 2568517, 2627668, 2531152, 2466618, 2552724, 2503717, 2448617, 2377964, 2293396, 2341321, 2459728, 2525208, 2415643, 2438412, 2531615, 2603255, 2452622, 2369642, 2450491, 2431931, 2445466, 2433531, 2423967, 2485158, 2530497, 2426748, 2470240, 2633652, 2611857, 2580136, 2597050, 2621950, 2564994, 2558090, 2566931, 2522743, 2584889, 2626341, 2512962, 2559055, 2713507, 2550382, 2631662, 2605113, 2593735, 2686113, 2763128]
15755B763128j21228p2623Q6002J5419j966l7385o5908q560O2817L7331N2291
15744B709318Q887j51360J8370l3170j19617M9349k2748Q2726j7234l8713L2493
15733B518301O4590j88306N7017P0626n9207J3648O6914q946r0742Q3837r9003
15722B428729l7369R0169m721k6027Q71m2490N6376J71677j86488p5920K35234
15711B610041j8025j13638O1993j14528m016J50878j00683m8019k727N8315J176
$$ y = [2763128, 2641900, 2569277, 2655279, 2670698, 2668732, 2631347, 2565439, 2556879, 2619696, 2657027, 2709318, 2718205, 2566845, 2585215, 2552045, 2432428, 2481777, 2459029, 2541755, 2524521, 2485808, 2518301, 2582891, 2394585, 2451602, 2522228, 2463021, 2476669, 2543583, 2534637, 2443895, 2527732, 2428729, 2391360, 2481529, 2476808, 2450781, 2451652, 2409162, 2465538, 2637215, 2450727, 2374807, 2610041, 2592016, 2478378, 2540371, 2425843, 2421827, 2572705, 2472022, 2424003, 2421276, 2479591, 2480767]
$$ [...]
##END NTUPLES=NMR SPECTRUM
##END=
