##TITLE=1H_EC-3254(3-3)
 CDCl3, 8 sc, 
 1.06.2021
##JCAMPDX= 6.0         $$ Bruker NMR JCAMP-DX V2.0
##DATA TYPE= NMR SPECTRUM
##DATA CLASS= NTUPLES
##ORIGIN= UXNMR, Bruker Analytische Messtechnik GmbH
##OWNER= root
$$ XWIN-NMR		Version 3.5
$$ Tue Jun  1 12:34:08 2021 Russian Standard Time (UT+4h)  she@DPX200
##.OBSERVE FREQUENCY= 200.131506
##.OBSERVE NUCLEUS= ^1H
##.ACQUISITION MODE= SIMULTANEOUS
##.ACQUISITION SCHEME= undefined
##.AVERAGES= 8
##.DIGITISER RES= 18
##SPECTROMETER/DATA SYSTEM= spect
##.PULSE SEQUENCE= zg30
##.SOLVENT NAME= CDCl3
##.SHIFT REFERENCE= (INTERNAL, CDCl3, 0, 15.9813)
##AUDIT TRAIL= $$ (NUMBER, WHEN, WHO, WHERE, WHAT)
$$ ##TITLE= Audit trail, XWIN-NMR		Version 3.5
$$ ##JCAMPDX= 5.01
$$ ##ORIGIN= Bruker BioSpin GmbH
$$ ##OWNER= she
$$ F:/spectra/data/she/nmr/H-F/1/pdata/1/auditp.txt
$$ ##AUDIT TRAIL=  $$ (NUMBER, WHEN, WHO, WHERE, WHAT)
(   1,<2021-06-01 12:32:59.48 +0400>,<she>,<DPX200>,
      <created by zg, POWCHK disabled, PULCHK disabled
       configuration hash MD5:
       00 E9 B6 7A A2 85 ED C7 34 08 36 98 17 FE 4E 26
       data hash MD5: 16K
       3C 88 5B 97 E8 C8 57 02 00 1D 2C 9B 70 FF 2D 16>)
(   2,<2021-06-01 12:33:03.89 +0400>,<she>,<DPX200>,
      <Start of raw data processing
       efp BC_mod = 2 LB = 0.24 FT_mod = 6 PKNL = 1 PHC0 = -11475.43 PHC1 = 7.80099 SI = 16K 
       data hash MD5: 16K
       CE FE 15 9F 45 B2 77 0E AC C6 D0 0C DE D0 60 70>)
(   3,<2021-06-01 12:33:18.87 +0400>,<she>,<DPX200>,
      <pk PHC0 = -6.070252 PHC1 = 7 
       data hash MD5: 16K
       BB 2A BB 22 CA DD 79 B4 50 0D 67 3F 3F AB F7 E2>)
(   4,<2021-06-01 12:33:22.10 +0400>,<she>,<DPX200>,
      <abs ABSG = 5 
       data hash MD5: 16K
       64 4B BC A1 86 11 4D 25 19 12 73 4D C7 F6 E2 48>)
$$ ##END=
$$ 
$$ hash MD5
$$ E8 D8 88 07 BF 88 9A 3B C3 46 F7 EE 27 CD 34 0F
##$RELAX= 
##$RELAX= 
##$RELAX= 
##$RELAX= 
##$RELAX= 
##$RELAX= 
$$ Bruker specific parameters
$$ --------------------------
##$DU= <F:/spectra>
##$EXPNO= 1
##$NAME= <H-F>
##$PROCNO= 1
##$TYPE= <nmr>
##$USER= <she>
##$AMP= (0..31)
100 100 100 100 100 100 100 100 100 100 100 100 100 100 100 100 100 100 
100 100 100 100 100 100 100 100 100 100 100 100 100 100 
##$AQSEQ= 0
##$AQ_mod= 1
##$AUNM= <au_zg>
##$AUTOPOS= <>
##$BF1= 200.13
##$BF2= 200.13
##$BF3= 200.13
##$BF4= 200.13
##$BF5= 200.13
##$BF6= 200.13
##$BF7= 200.13
##$BF8= 200.13
##$BYTORDA= 1
##$CFDGTYP= 0
##$CFRGTYP= 5
##$CHEMSTR= <none>
##$CNST= (0..31)
1 1 145 1 1 1 1 1 1 1 1 1 1 1 1 1 1 1 1 1 1 1 1 1 1 1 1 1 1 1 1 1 
##$CPDPRG= <>
##$CPDPRG1= <>
##$CPDPRG2= <>
##$CPDPRG3= <>
##$CPDPRG4= <mlev>
##$CPDPRG5= <mlev>
##$CPDPRG6= <mlev>
##$CPDPRG7= <mlev>
##$CPDPRG8= <mlev>
##$CPDPRGB= <>
##$CPDPRGT= <>
##$D= (0..31)
0 1.2 0 0 0 0 0 0 0 0.06 0 0.03 0 0 0 0 0.0002 0 0 0 0 0 0 0 0 0 0 0 0 
0 0 0 
##$DATE= 1622536379
##$DBL= (0..7)
120 120 120 120 120 120 120 120 
##$DBP= (0..7)
150 150 150 150 150 150 150 150 
##$DBP07= 0
##$DBPNAM0= <>
##$DBPNAM1= <>
##$DBPNAM2= <>
##$DBPNAM3= <>
##$DBPNAM4= <>
$$ [...]
##$SUBNAM3= <"">
##$SUBNAM4= <"">
##$SUBNAM5= <"">
##$SUBNAM6= <"">
##$SUBNAM7= <"">
##$SUBNAM8= <"">
##$SUBNAM9= <"">
##$SW= 16.9725357007746
##$SWIBOX= (0..15)
0 0 2 0 0 0 0 0 0 0 0 0 0 0 0 0 
##$SW_h= 3396.73913043478
##$TD= 16384
##$TD0= 1
##$TE= 0
##$TE2= 300
##$TE3= 300
##$TEG= 300
##$TL= (0..7)
0 120 120 120 120 120 120 120 
##$TP= (0..7)
150 150 150 150 150 150 150 150 
##$TP07= 0
##$TPNAME0= <>
##$TPNAME1= <>
##$TPNAME2= <>
##$TPNAME3= <>
##$TPNAME4= <>
##$TPNAME5= <>
##$TPNAME6= <>
##$TPNAME7= <>
##$TPOAL= (0..7)
0.5 0.5 0.5 0.5 0.5 0.5 0.5 0.5 
##$TPOFFS= (0..7)
0 0 0 0 0 0 0 0 
##$TUNHIN= 0
##$TUNHOUT= 0
##$TUNXOUT= 0
##$USERA1= <user>
##$USERA2= <user>
##$USERA3= <user>
##$USERA4= <user>
##$USERA5= <user>
##$V9= 5
##$VALIST= <valist>
##$VCLIST= <CCCCCCCCCCCCCCC>
##$VD= 0
##$VDLIST= <DDDDDDDDDDDDDDD>
##$VPLIST= <PPPPPPPPPPPPPPP>
##$VTLIST= <TTTTTTTTTTTTTTT>
##$WBST= 1024
##$WBSW= 4
##$XGAIN= (0..3)
0 0 0 0 
##$XL= 0
##$YL= 0
##$YMAX_a= 365678
##$YMIN_a= -380551
##$ZGOPTNS= <>
##$ZL1= 120
##$ZL2= 120
##$ZL3= 120
##$ZL4= 120
##$ABSF1= 15.98231
##$ABSF2= -0.9903536
##$ABSG= 5
##$ABSL= 3
##$ALPHA= 0
##$AQORDER= 0
##$ASSFAC= 0
##$ASSFACI= 0
##$ASSFACX= 0
##$ASSWID= 0
##$AUNMP= <proc_1d>
##$AZFE= 0.1
##$AZFW= 0.1
##$BCFW= 0
##$BC_mod= 2
##$BYTORDP= 0
##$COROFFS= 0
##$CY= -3
##$DATMOD= 1
##$DC= 0
##$DFILT= <>
##$DTYPP= 0
##$F1P= 0
##$F2P= 0
##$FCOR= 1
##$FTSIZE= 16384
##$FT_mod= 6
##$GAMMA= 0
##$GB= 0
##$INTBC= 1
##$INTSCL= 1.334414e-10
##$ISEN= 128
##$LB= 0.24
##$LEV0= 0
##$LPBIN= 0
##$MAXI= 10000
##$MC2= 0
##$MEAN= 0
##$ME_mod= 0
##$MI= 1.114404
##$NCOEF= 0
##$NC_proc= -7
##$NLEV= 6
##$NOISF1= 3.799351
##$NOISF2= 2.8
##$NSP= 0
##$NTH_PI= 0
##$NZP= 0
##$OFFSET= 15.98128
##$PC= 1
##$PHC0= -11481.5
##$PHC1= 14.80099
##$PH_mod= 1
##$PKNL= yes
##$PPARMOD= 0
##$PSCAL= 0
##$PSIGN= 0
##$REVERSE= no
##$SF= 200.130006036313
##$SI= 16384
##$SIGF1= 3
##$SIGF2= 2
##$SINO= 5.538805
##$SIOLD= 16384
##$SREGLST= <1H.CDCl3>
##$SSB= 0
##$STSI= 16384
##$STSR= 0
##$SW_p= 3396.73913043479
##$SYMM= 0
##$S_DEV= 0
##$TDeff= 16384
##$TDoff= 0
##$TI= <>
##$TILT= no
##$TM1= 0
##$TM2= 0
##$TOPLEV= 0
##$USERP1= <user>
##$USERP2= <user>
##$USERP3= <user>
##$USERP4= <user>
##$USERP5= <user>
##$WDW= 1
##$XDIM= 16384
##$YMAX_p= 519409753
##$YMIN_p= -645455
$$ End of Bruker specific parameters
$$ ---------------------------------
##NTUPLES= NMR SPECTRUM
##VAR_NAME=  FREQUENCY,     SPECTRUM/REAL,   SPECTRUM/IMAG
##SYMBOL=    X,             R,               I
##VAR_TYPE=  INDEPENDENT,   DEPENDENT,       DEPENDENT
##VAR_FORM=  AFFN,          ASDF,            ASDF
##VAR_DIM=   16384,         16384,           16384
##UNITS=     HZ,            ARBITRARY UNITS, ARBITRARY UNITS
##FACTOR=    0.207333158178282, 1,           1
##FIRST=     3198.33372827915, 0,            0
##LAST=      -198.405402155638, 0,           0
##MIN=       -198.405402155638, -645455,     0
##MAX=       3198.33372827915, 519409753,    0
$$ Real data points
##PAGE= N=1
##DATA TABLE= (X++(R..R)), XYDATA
$$ [...]
7550 17038903 17635141 18411702 19656359 20744100 21809827 22308279 22341323 21613964 20461166
7541 20461166 19421738 18882889 18253164 17744694 17884700 18161288 18597976 18893096 18819693
7532 18819693 18553469 17633835 16494518 15210707 13990522 13239971 12450401 11583616 11150298
7523 11150298 10526143 10153144 9722217 9259007 8546022 8224168 7845131 7369125 7138995
7514 7138995 7064252 6762742 6564694 6459033 6198653 6412106 6310615 6244444 6159559 6016554
7504 6016554 5908644 5968280 5819879 5873054 5879706 6087122 5990590 6265410 6061587 5975918 5809833
7493 5809833 5423737 5217484 4954736 4645941 4625732 4261882 4206801 4019860 3783790 3872454
7483 3872454 3997447 3740036 3748393 3667377 3592795 3653266 3410782 3350215 3342652 3057704 3208841
7472 3208841 3244869 3104655 3162772 2982429 3114174 3002902 2900715 2760185 2603896 2557398
7462 2557398 2736606 2496043 2731289 2655637 2630002 2592322 2755460 2705407 2873571 2753971
7452 2753971 3012808 2960050 3150012 3267894 3106336 3147799 3303852 3292298 3503706 3638540
7442 3638540 3848282 4058283 3748729 3679365 3642205 3469423 3156653 2855171 2601899 2524575
7432 2524575 2312066 2245929 1970420 1885598 2016887 1832335 1500908 1435760 1455363 1628689
7422 1628689 1465479 1119478 1182122 1385161 1388447 1481994 1327556 1275212 1243736 1260685 1248816
7411 1248816 1302111 1145153 1076520 871849 1088706 1382972 1310191 1167128 1065780 921363
7401 921363 1130858 1072782 904728 970705 1117227 960936 932306 889440 931670 1012300 720838
7390 720838 851714 912772 883029 959961 942799 803288 891083 828312 797448 576859 753494
7379 753494 854992 766353 706959 846683 892454 812681 843171 599474 553433 808101 830092
7368 830092 928434 647305 431553 551618 668087 817063 805391 811061 816111 711510 694755
7357 694755 615083 617355 787737 468398 684539 802077 578087 664422 645652 477677 453350
7346 453350 515186 474527 459774 347677 373075 492675 267899 476977 489552 386736 599975
7335 599975 382047 328779 637174 456544 327608 303811 172743 577972 408314 298906
7325 298906 533053 569202 598835 320772 317782 409760 241978 1329 8798 485700 491596
7314 491596 498493 420280 491788 594309 388667 200751 281239 596486 368782 60616 338450
7303 338450 297272 293962 292197 158261 449808 276754 276343 337560 79116 126540 97490 176207
7291 176207 78713 118807 -27808 -71430 171444 -41499 112999 -130561 -94361 191295
7281 191295 6388 17523 219937 63032 193101 134076 246843 323375 314010 195244 -20428
7270 -20428 133328 316747 152119 75554 143735 241609 222315 -15417 105845 342123 331024
7259 331024 22435 242541 305621 217533 -39162 -28726 74793 284936 -20733 -243909
7249 -243909 -155431 -29500 128930 26396 -31634 137629 32087 -21166 -25739 132552 274271
7238 274271 83408 -80888 -79172 32350 62171 78625 126948 308362 161358 363593 206788
7227 206788 32381 -82393 -58369 22708 46005 -21007 57145 36383 218093 196562 1304
7216 1304 65441 104755 44150 -21533 109830 119661 60208 33653 152536 395247 308483 95002
7204 95002 336434 199169 404215 311033 99216 343658 431196 419361 329755 249955 491395
7193 491395 537859 361916 570453 294460 429724 434027 500123 582681 403223 279697 252840
7182 252840 368305 220733 230258 318715 211279 200092 98808 -107093 126685 95626 166900
7171 166900 216252 259263 276532 238952 117754 287767 270600 18912 -1691 137502 201058
7160 201058 210802 63770 71585 181557 187984 85984 140218 302105 533238 655859 239194
7149 239194 386498 564631 250049 140876 136456 -1915 237075 -5908 107042 147332
7139 147332 277951 106130 -46758 233175 116750 114410 127354 -72191 18464 -26770 62625
7128 62625 -25031 60555 72724 -101990 -46462 -130012 -176964 -160370 -217714 -181321 -205635 -153649
7116 -153649 -88313 -168079 -96630 -369747 -36345 -199623 -196417 -200814 -119750 -249010 -155920
7105 -155920 -333861 -385703 -416143 -408882 -361870 -385942 -457321 -166312 -311186 -251074 -163299
7094 -163299 -173232 11245 -83900 -314893 -182234 -188109 -270326 -124676 -227478 74838 -173930
7083 -173930 -168350 -358252 -303613 -249500 -282420 -383542 -299958 -153884 -152757 -322894 -95531
7072 -95531 -124818 -67792 -264777 -232371 -151458 -219508 -62572 84784 -265002 -158732 -239260
7061 -239260 -264493 -106379 -234842 -279742 -590587 -336278 -281953 -254895 -149969 -220016 -266456
7050 -266456 -241565 -521995 -453500 -203691 -225292 -132726 -100115 -254152 2884 -220410 -79247
7039 -79247 -3154 -349759 -277148 -81785 -219418 60200 -145523 -128628 34397 -69683
7029 -69683 3615 -281618 -389563 -167563 -95652 -239316 -233944 -393226 -504703 -551352 -409289
7018 -409289 -285930 24226 -290649 -268781 -414545 -405062 -413312 -270335 -231970 -55480 28359
7007 28359 -299708 -276429 -125395 -172004 -80515 -285742 -386972 -120539 -330469 -180633
6997 -180633 -94150 30619 -322516 -210562 -294942 -351706 -391386 -401097 -138915 -142604 -238648
6986 -238648 142472 -307120 -168915 -103959 -362222 -45767 -203730 -82265 -109914 -94027
6976 -94027 -9146 -198801 -178786 -223080 -149019 -101486 -645455 -346554 -218226 -249511 -263343
6965 -263343 -477635 -125567 -52218 -230575 -23064 -97425 64133 -184168 -435733 -411058
6955 -411058 -130425 -316647 -611522 -115771 -173183 -160895 -215731 -540505 -110815 -109234 -192837
6944 -192837 -187455 -266796 -205034 -270976 -300328 -256676 -126886 -35547 -318161 -210497 -347974
6933 -347974 -375654 -397907 -237317 25759 -153569 -405942 -310447 -236843 -131208 -366495
6923 -366495 -481787 -272162 -341992 -436260 -381866 81096 -104871 -346389 -401896 -221788
6913 -221788 -348151 -150102 -111753 -50158 49511 125933 -287547 -35696 -39100 41602 -145724
6902 -145724 -370172 -212281 -152108 -108999 -220611 -449407 -152423 -97006 -262589 -220661
6892 -220661 -358874 -270492 -379732 -409258 -266033 -78545 -229316 -64195 -169705 -84772
6882 -84772 -29353 -179282 -398098 -273201 -426569 -337645 -141037 -60537 -76796 -88794 71459
6871 71459 -10306 -228789 -88368 -192870 -131432 -63297 -328676 -77763 -195377 -286463 -272002
6860 -272002 -140863 -312738 -354398 -472278 -330028 -201745 -222164 -216071 -237564 -481126 -288130
6849 -288130 -268703 -66846 -118207 -69137 -45006 -80425 -130588 -229358 -158235 71305 -240496
6838 -240496 -263764 -169498 -250907 -16736 -352362 -218861 -274525 -345376 -267291 19596 -365104
6827 -365104 -157166 -68636 -49808 -286060 -254001 -144276 77180 -55059 39943 135879 17594
6816 17594 -81835 -246936 -46614 -19351 -39401 241378 -74006 -147584 -130852 -42409 133974
6805 133974 -28879 37437 -45259 -186784 -61802 -10700 -56845 -142780 -184503 -104278 -91290
6794 -91290 -23322 61284 55153 -231793 1470 -53416 -128791 -23961 -129241 124098 121292
6783 121292 -158405 86445 4666 165270 135332 -93307 -31195 78361 54082 -48088
6773 -48088 -15323 53214 178951 9108 15675 16210 -13366 50597 -123564 -12486 155408
6762 155408 -57182 -110066 61913 297284 361005 -158831 -117337 -21865 -120326 -149467 -83529
6751 -83529 -230875 -109549 -93137 78823 47641 -323637 -67307 -43823 65843 89879 -128702
6740 -128702 108499 65671 50647 81995 93310 328843 253389 285741 295239 374733 449870
6729 449870 590867 382576 223704 618343 555894 513822 623790 643712 840117 604366
6719 604366 647809 787202 857462 1023587 992414 922754 1105331 1156455 1089416 1071470 1103397
6708 1103397 1190491 1309334 1477401 1525501 1788468 1965843 1957603 2062830 2379010 2665349
6698 2665349 2858917 3121258 3080938 2891574 2463472 2514529 2822433 2515078 2640046 2478190
6688 2478190 2359900 2231573 1846235 1648102 1519525 1186006 1144607 1042265 1017418 951040
6678 951040 724381 930539 1095538 859487 583248 576310 477079 652997 603908 562314 702027
6667 702027 358121 303637 316505 345955 386963 459753 600756 477279 262439 343518 339375
6656 339375 329245 365320 300772 255608 196817 318672 469853 494605 212878 350780 453832
6645 453832 438285 459247 600960 563324 690200 451963 347899 452348 602641 518486
6635 518486 482699 479984 570855 594037 658844 608053 788782 1037177 722555 825284 996850
6624 996850 1272506 1260834 1259955 1335279 1469975 1546850 1389231 1572450 1945467 2122812 2602339
6613 2602339 2341620 2434894 2439722 2266797 2548531 2099188 2120668 2304076 2043550 2463546
6603 2463546 2295222 1918386 2038081 1603492 1431417 1330693 1067377 925399 730148 643300
6593 643300 649289 778531 669365 592350 320838 467641 632049 278281 265286 252711 313484
6582 313484 354050 215482 360221 526792 387689 327622 6992 71596 122203 164599 232260
6571 232260 202994 242169 323430 106678 94048 407566 159041 50585 -12429 -130035 86262
6560 86262 123892 -39612 71597 -144461 -90495 -19122 -117522 155525 10864 138967 226629
6549 226629 -122152 -263759 56881 -71847 120804 60291 193565 82084 34322 -50006
6539 -50006 101852 202544 -16541 42152 4236 9553 185817 73977 132761 182474 128203
6528 128203 172757 -2179 344735 -8785 180816 176119 182743 111709 115326 211724 200328
6517 200328 53891 222743 -67492 102004 72702 -48477 96416 42783 105336 -46739
6507 -46739 -2814 112110 107379 216444 417764 16023 102084 43143 4075 -18325 -83295
6496 -83295 161341 345059 -28095 -142690 -142655 -42774 -2280 -93510 25395 266745 252694
6485 252694 12825 -124632 -44454 167856 -53076 80475 -143795 -67230 -139891 -166704
6475 -166704 -68944 68669 206177 85684 74759 316110 234392 -7472 72121 168942 48765
6464 48765 -1074 -50131 -106574 -71677 -96708 59795 271427 -30761 -14205 -158161 -39133
6453 -39133 135358 -37057 46585 -1936 -128786 -37058 231936 274830 302613 184233 120011
6442 120011 108201 224696 29822 176066 205981 201419 130936 445230 348556 351469 277744
6431 277744 279738 272922 443868 455398 593084 406910 423783 543761 269123 563818 715801
6420 715801 519520 443371 644675 812668 1071225 781829 895689 1150150 1422516 1518878
6410 1518878 1463476 1531510 1978576 1789556 1911761 2302540 2597814 2834537 2645153 2791718
6400 2791718 2964440 2843028 2637135 2521266 2480206 2717401 2744205 2591275 2321442 2318435
6390 2318435 2039325 1754445 1598083 1510508 1532363 1159843 1106484 1421135 1306421 966416
6380 966416 1037423 1100441 1150663 1035436 960802 1084927 1019441 951585 1169210 1143416 1013496
6369 1013496 1089425 1097532 1137475 1235125 1327005 1118579 1413196 1381358 1359238 1361873 1342430
6358 1342430 1593369 1467829 1312199 1445601 1602245 1885832 2038771 2067109 2092508 2133178
6348 2133178 2431296 2654085 3079019 3178957 3017988 2858560 2978244 2669609 2551669 2747384
6338 2747384 2756155 2833441 2707896 2555559 2407206 1917084 1757047 1494054 1399841 1515685
6328 1515685 935508 1031658 907875 1034909 895586 596199 713020 784871 602088 479231
6318 479231 392165 469042 583015 655106 493117 690840 731791 501986 646533 782135
6308 782135 973088 669837 366714 492416 614099 549234 736457 490626 692018 431834
6298 431834 268959 274465 234716 452372 573500 268626 411766 337907 365262 428399 460613
6287 460613 426478 462098 282040 391882 454903 444240 451765 444830 464149 286648 91809
6276 91809 291078 459477 158248 -41418 -210610 79096 113614 48318 -210683 -130402
6266 -130402 74685 220229 -322535 6008 76756 -7352 -84922 -192543 -32205 52970
6256 52970 -45568 -74171 112438 69432 149710 287145 244109 101900 52706 149248 253679
6245 253679 -30343 133565 38805 54201 -104271 -350680 73842 304957 212843 19737
6235 19737 -154716 123892 28721 -187132 -16436 108600 41314 -114157 -283907 -13094
6225 -13094 21302 -28496 31942 41802 32325 118500 -308095 -350070 -39773 -25554 -4779 -191397
6213 -191397 -89434 -20262 -50883 -195584 -107461 22009 197803 -175735 -220439 -279970 -130121
6202 -130121 -182630 -281168 -397384 -213799 -215726 -75580 -21137 50382 128748 -11228 -238307
6191 -238307 -278862 -298727 -281260 -262688 -105174 11703 -207418 -170534 122295 127025 -151855
6180 -151855 -21854 -98923 265977 114259 26156 40615 -14357 -276176 -320157 -409438 -358647
6169 -358647 -385263 -472019 -344400 -197360 -89705 -229016 -288216 -163260 -125900 -42149 -7302
6158 -7302 -130505 -249737 -183732 -242520 -84771 -75741 -195884 -62934 -357761 -331411 -317494
6147 -317494 -174315 -61673 -229723 -116745 -261415 -261571 -24701 -195697 30834 109389
6137 109389 -93312 -214261 -59301 -73508 -66131 -251530 -228833 -211587 -95736 -259379 -60881
6126 -60881 -200957 -66043 -64687 -146668 173726 148399 204412 -44585 -174287 -17814 -116952
6115 -116952 -240362 -30917 17743 116829 -102518 18390 -99233 -277585 -46034 109535
6105 109535 20505 232357 -189688 -394967 -405839 -242652 -106007 -92686 -204216 91709
6095 91709 -38868 -245341 5252 -129876 2296 -2227 -428318 -120947 -24265 -89698 -38157
6084 -38157 -346776 -198576 9852 -219816 -85628 118400 168857 -49661 -178693 -54296
6074 -54296 -37367 -72647 -203766 -122556 117239 63597 -80530 -58399 -255227 -239278 -130186
6063 -130186 63761 37880 104309 -682 97442 -9133 2786 22341 -56235 -135960 -379601
6052 -379601 -437278 -311165 -84977 -316392 -374251 -308660 -464423 -115718 106215 57997
6042 57997 158720 31034 69890 37051 -157012 -128602 -54918 -293292 61306 94783 -32279
6031 -32279 186527 -39849 -194791 -130927 -354616 -134209 -82074 -112416 17445 -364988
6021 -364988 -224040 -62066 -211327 99787 141329 -4898 157571 137286 247693 127730
6011 127730 77881 90168 113645 -52607 -72889 67132 192746 24509 -64028 -118011 -105828
6000 -105828 -115517 7427 -471794 -187276 33095 -48389 109080 -344697 -135070 99740
5990 99740 -113175 109481 -12902 27466 88864 -503025 -343245 -152718 -10687 -74283
5980 -74283 -298859 -160870 24847 19672 -101142 -22994 81888 70762 152579 -62137 -21483
5969 -21483 -59538 -193226 5693 45506 5091 59282 68874 52941 -89368 -193241 4534
5958 4534 -137711 -114894 -206667 310088 257548 -90985 98142 -58974 112914 40832 -160951
5947 -160951 -61806 -20446 36225 -146805 -164766 13325 115485 185049 -265219 64158 183967
5936 183967 -69548 169570 163392 99349 111421 -48491 -123661 -122301 -152784 -213701 -61552
5925 -61552 52175 101695 -21042 85774 231274 133817 134202 128507 131719 88342 -146142 -14506
5913 -14506 12215 38460 219577 -69039 95831 219451 -156373 85363 132917 175682 129672
5902 129672 54695 -61385 -128053 -121824 -102956 53682 -31769 235227 52613 153397 335718
5891 335718 40318 20535 -43760 -108850 78727 -217181 101873 113767 -147970 111305
5881 111305 59911 230110 12838 146887 155238 -56162 -102427 32508 -108342 -89424 -117711
5870 -117711 206752 100757 241612 168568 155968 288336 -89762 12563 -28717 -51479
5860 -51479 306728 232018 246350 307238 178151 492895 107463 236061 324769 199750 342661
5849 342661 367335 434705 695979 664865 754628 790631 637862 386980 297976 235276 338211
5838 338211 486712 367039 248739 37672 85507 223421 154903 321735 230248 152609
5828 152609 175858 -67968 110885 110832 108606 362992 167138 166594 -20593 -20817 168478 82635
5816 82635 87318 272170 217678 251447 172114 -100779 197617 365948 -41697 43566 220322
5805 220322 123952 333279 94219 232146 318354 51076 261490 184339 343936 547727
5795 547727 176281 315202 409776 354224 51000 -66028 138552 216650 58505 -2865
5785 -2865 77878 5061 113383 -17821 196096 257105 353582 328633 154088 113913 254926
5774 254926 108626 167213 197649 284222 84851 28995 -89561 60371 109500 155287 213802
5763 213802 22586 256796 220691 241261 308079 89519 116488 127396 -34417 -39122 -55255
5752 -55255 33150 137753 331710 209610 148509 107204 345157 328402 221108 141132 100688
5741 100688 45274 142668 78621 194382 220954 -88062 -122606 -190730 -27168 99480 138011
5730 138011 15937 -96984 74372 25888 252724 60470 44151 -1383 31252 80369 -1030
5719 -1030 -46225 164699 112997 306040 243389 246315 221882 127155 139261 261231 450086
5708 450086 416364 237937 359320 328724 240047 154652 233702 333874 196951 213643 156718
5697 156718 287996 286134 341276 343030 570623 342959 287881 53810 468138 500726 288100
5686 288100 267547 543837 729047 731072 449170 508768 659551 594792 409637 243288 460962
5675 460962 421134 310942 193435 193478 180989 394140 278731 153052 365423 485994 6788
5664 6788 -134299 -47779 229568 196854 -44721 46229 113981 135389 162430 -117546 71629
5653 71629 175511 89657 56817 -108181 249608 203927 44175 144442 107807 250281 148115
5642 148115 42892 106229 135964 149937 -37410 -125465 171480 206588 18138 -97792 -51562
5631 -51562 59993 31675 53864 -79383 62464 31325 -33532 23510 81374 58175 154451
5620 154451 39301 161421 -26325 78148 180725 158027 227276 2973 -20144 165544
5610 165544 -78168 -114248 62128 94895 112987 -83263 191945 241985 264262 366205 76930
5599 76930 32715 228325 -86383 6868 53451 146515 66929 -2609 233046 86994 102656
5588 102656 142538 88595 211424 109849 358900 279819 287552 290455 312507 633209 108202
5577 108202 128945 104697 325869 352148 267039 205269 155116 106381 284876 -102375 208581
5566 208581 319176 140660 72812 -117966 13332 91937 32645 -52381 53107 318130
5556 318130 207190 139453 204409 206824 228577 136509 454907 357214 380133 57601 -54628
5545 -54628 361959 314140 115027 -2407 -199989 210782 288810 390170 124894 182197
5535 182197 385354 147113 104213 202329 50143 369213 91969 182318 2540 131428
5525 131428 90069 3435 225329 428766 289724 287589 177392 145819 361 -46096 240629
5514 240629 92765 175627 187177 333367 40390 121950 48156 141870 302193 323866 37228
5503 37228 282093 348607 501775 197301 188685 473544 362938 215634 128744 326568 438049
5492 438049 118357 201064 301522 228745 144592 73803 283918 465545 546062 449587 363266
5481 363266 340906 302936 202944 -59881 83741 273976 32010 -9634 91086 328462
5471 328462 309698 286218 301719 388328 263048 249952 102659 175332 370790 345156 164963
5460 164963 203080 128965 300066 214996 96389 207850 193725 189088 226420 193209 155641
5449 155641 262143 392402 638339 343896 68251 216787 128539 306482 359911 24786
5439 24786 456428 179482 117924 92550 305974 533980 239115 260597 452100 380631 416822
5428 416822 315801 419552 590042 314452 447594 320275 332943 255635 161824 181825
5418 181825 341028 464406 342436 395781 575238 337134 314742 467447 510293 685263
5408 685263 382420 343703 380870 389384 294800 211431 458783 553477 252839 499629 393407
5397 393407 503354 657394 436166 534088 608029 453857 355162 278105 452927 615925
5387 615925 353183 281272 450590 624537 392038 381132 628687 609169 550518 407949
5377 407949 368164 285339 542811 659467 505650 758540 734899 559630 530464 475722 656208
5366 656208 618309 498702 480108 429003 437227 249609 369509 471046 651195 491980 453508
5355 453508 520361 770074 543438 473526 484042 453314 549017 731046 748111 722348 509626
5344 509626 481744 568843 507942 773550 561974 482030 503670 553527 727470 597705 573306
5333 573306 748521 573188 486913 583182 536978 596893 714715 840314 686791 598089 519131
5322 519131 744741 817884 831361 944569 848908 909792 947312 789194 953212 983886 935609
5311 935609 940597 725387 859792 774043 896838 837923 771109 877045 677725 608241 969228
5300 969228 798764 945751 1090353 914072 1340671 1204921 876659 1200024 976770 1012319
5290 1012319 1009177 892434 1439463 1220872 1295049 1360418 1135345 1297197 1086020 1021796
5280 1021796 1267342 1257913 1225199 1247345 1056165 864025 1019264 1048091 1259368 1323588 1226241
5269 1226241 1411242 1102689 1278275 1295788 934347 1146052 1068326 1004174 1193086 872751
5259 872751 1106197 1135131 1109858 1246324 1187091 1145590 1275166 1107644 1219897 1304526 1079663
5248 1079663 1162184 1063477 1258323 1223299 1377450 1352720 1415667 1324469 1294510 1287484 1381805
5237 1381805 1390577 1501619 1305926 1330592 1511039 1485448 1465755 1411389 1500826 1454770 1770380
5226 1770380 1536884 1632672 1837919 1752059 1784420 1717644 1604159 1593609 1349164 1553695
5216 1553695 1573777 1801649 1716389 1580692 1667547 1881035 1850895 1679944 1880430 1778541
5206 1778541 1771206 1766088 1909261 1922898 2023755 1794237 1788566 1744701 1864806 2160673 2214482
5195 2214482 2305154 2263680 2240980 2271301 2199421 2234543 2224721 2233707 2059630 1876940 2135418
5184 2135418 2319630 2421534 2572385 2318609 2203071 2164179 2106759 2176118 2307986 2114549
5174 2114549 2242918 2164867 2388982 2511769 2299691 2337704 2327413 2377995 2434337 2247598
5164 2247598 2137195 2169003 2137724 2170965 2169810 2213451 2198983 2410957 2259993 2266094 1979171
5153 1979171 2138002 2252234 2278260 2220589 2158344 2233055 2407000 2250097 2164432 1975390
5143 1975390 2102278 2338454 2334060 2039274 2142089 2078688 2147740 2170110 2044075 2216316
5133 2216316 1996378 2153570 2194203 2064086 2151515 1909889 1859996 2012473 1905133 2063629
5123 2063629 1877063 2149065 1913229 2110510 2109860 2034182 2172603 2432115 2244614 2193410
5113 2193410 2143052 2132490 2027876 2133615 2177309 2360917 2457581 2276305 2437332 2281640
5103 2281640 2448519 2570753 2413377 2366866 2180384 2458304 2677099 2274761 2485977 2353726
5093 2353726 2523210 2415942 2385085 2599924 2598852 2781196 2688663 2670930 3016006 2959474 3059809
5082 3059809 3105380 2946617 3035466 3084770 3096119 3214826 3170987 3102565 3143097 3070875 3220461
5071 3220461 3631806 3318945 3598460 3457172 3435811 3676498 3224799 3472620 3663453 3523730
5061 3523730 3517330 3562807 3601229 3858027 3632197 3895297 3998455 3963807 4033149 4015505 4224280
5050 4224280 4471997 4497146 4546012 4607784 4620787 4603678 4688314 4936343 4893557 4914721 5310631
5039 5310631 5209875 5295228 5827049 5621280 5765951 6122563 6231673 6384860 6567949 6841730
5029 6841730 7139825 6966734 7342424 7574680 7562315 7737593 7536662 7735575 7751543 7455665
5019 7455665 7567505 7305416 7162541 7242306 6754267 6804112 6910972 6862122 7244621 7324340
5009 7324340 7510911 7556990 7715477 7962320 7742554 8028151 8123560 8277049 8501505 8865577
4999 8865577 8899412 9058819 9288513 9752205 10193714 10478871 10679745 10912261 11067161 11196428
4989 11196428 11055844 10822476 10700318 10437573 10098930 9868564 9474830 9154570 9120752 8614996
4979 8614996 8746277 8637969 8674288 8292999 8085386 8052734 8085025 8079465 8081276 8124276 8369205
4968 8369205 8247738 8519827 8680901 8578588 9119542 9118224 9364825 9331137 9560244 9742684
4958 9742684 9959975 10064626 10073294 10001305 9938301 9871368 9878191 9724662 9823525 9964914 9813817
4947 9813817 9983223 9671006 10098300 10144066 9970982 10015360 9982644 10096044 10259749 10045651
4937 10045651 10016615 10038149 10110464 10087080 10045349 10399659 10434274 10448343 10202451 10401488 10638651
4926 10638651 10849034 11171277 11104010 11245688 11496065 11574217 11892815 12139069 12584284 12709941
4916 12709941 12971667 13542248 13620008 13812417 14003136 14275053 14726839 15119835 15539350 16237485
4906 16237485 16555013 17111765 17319974 17927864 18721775 19290644 19893824 20325341 20961378
4897 20961378 21837846 22846424 23428069 24620649 25587727 26784656 27997663 29455001 30841085
4888 30841085 32372523 33975270 36108706 38018588 39930593 41923527 43491454 45079508
4880 45079508 46130436 46698945 46613032 46102998 45485087 44340663 43171891 42127122 40876792
4871 40876792 40045591 39099033 38608424 38632592 38453881 38608095 39012659 39599551 40441742 41144043
4861 41144043 42119890 43394354 45094930 46850414 48674813 50903440 53192782 56006943
4853 56006943 58823881 61512276 64884479 67903628 70498234 72948110 74440221 75408409
4845 75408409 75737799 74939547 73306983 70869235 68230070 64982937 61842641 58702498
4837 58702498 55737345 52999798 50567046 48415401 46467133 44530272 43101904 41689667
4829 41689667 40700686 40080457 39253357 38896722 38520331 38664838 38871892 39176857 39541364
4820 39541364 40108364 40990625 41765832 42594939 43963761 44932127 46280846 46819779 47196153
4811 47196153 47083955 46361784 45467214 43954947 41978029 40333064 38621062 36876697 35225084
4802 35225084 33496361 31951705 30093193 28589938 26997885 25591238 24264381 23259223
4794 23259223 22167803 21416258 20708815 20120534 19502920 18858532 18468480 18002976 17343471
4785 17343471 17294478 16712653 16513639 16333381 15852592 15967388 15924696 15642612 15411829 14905871
4775 14905871 15054135 14605335 14400331 14509166 14435116 14349665 14038248 13941935 14246165 14289288
4765 14289288 14125453 14196975 14137639 14155289 13889215 13750197 13755750 13810499 13592396 13608967 13607780
4754 13607780 13837981 13640086 13746138 13832895 13838565 14004078 13925263 13643168 13986728 14002649
4744 14002649 13985330 14090368 13968072 14190351 14130508 13774453 14005361 14053302 13918277 14007183
4734 14007183 13804828 14172074 14162528 13915702 14233491 14251300 14417288 14699657 14429440 14682409
4724 14682409 14828380 14736263 14734753 14755292 15171976 15310988 15189764 15578080 15754096 15968237
4714 15968237 15830192 15607039 16094719 16064150 16062012 16311289 16355445 16553759 16583621 16434182
4704 16434182 16825848 16957687 16981328 17049655 17301595 17607948 17832931 17819165 18002886 18136548
4694 18136548 18650817 18603319 18763627 18870824 18919150 19087419 19361999 19402094 19590617 19936370
4684 19936370 19842547 20140028 20568950 20677762 20706419 20974788 21146442 21350968 21361161 21748017
4674 21748017 21950105 22032956 21816565 22280766 22722887 22705416 23024678 23162986 23469877 23722507
4664 23722507 23601798 23978228 24078822 24410365 24453827 24697710 25082143 25136020 25045563 25441773
4654 25441773 25847330 25983916 26068225 25869377 26198963 26866840 26845442 26826550 27265268 27380370
4644 27380370 27827308 27858208 27769967 28218712 28456260 28546805 28517633 28707453 29005548 28835243
4634 28835243 28903423 29110673 29278124 29494376 29429254 29757358 30016510 29839946 30291803 30229343
4624 30229343 30447345 30465980 30339406 30589042 30752131 30558809 30744925 30754611 30668800 30970401
4614 30970401 30959786 31053663 31032123 30933938 30929156 30952531 30805505 30918359 30788877 30790878 30595189
4603 30595189 30826388 30785722 30519980 30408495 30430713 30426717 30281303 29818018 29779438 29717377
4593 29717377 29618745 29556993 29298248 29252502 29148441 29100047 29049648 28831907 28793789 28708125 28573049
4582 28573049 28417503 28118600 28108139 27810440 27673839 27433883 27422074 27460124 26969875 26932985
4572 26932985 26753783 26393987 26398769 26167993 25964267 25800822 25540357 25540081 25293209 25082542
4562 25082542 24835044 24579046 24537802 24379527 24314971 24126240 24055316 23997670 23759591 23860551
4552 23860551 23696122 23384594 23442974 23136685 23190447 23043453 22762308 22780493 22694831 22285246
4542 22285246 22202700 22248444 22226719 21937364 21905213 21755901 21562155 21368322 21275638 21039085
4532 21039085 20998191 20769920 20677140 20405682 20385267 20497969 20089793 20046725 20009092 19741147
4522 19741147 19759611 19664630 19708970 19990315 19842368 19665832 19631565 19895730 19968358 19896166
4512 19896166 19599144 19700434 19778323 19916560 19937303 20203503 20438852 20501305 20393229 20468286
4502 20468286 20638911 20517429 20368132 20089451 20090941 20295460 20280864 19926349 20098789 20328276
4492 20328276 20480309 20486094 20599190 20808818 21031859 21153435 21006711 21415758 21713666 21956731
4482 21956731 22362839 22460349 22728185 22970043 23141769 23706314 23891430 24552137 25059750 25462503
4472 25462503 26195079 26784844 27359296 27901234 28328084 28914130 29331308 29951296 30790660
4463 30790660 31682605 32410498 33657921 35003629 36240591 37776045 39360451 41034222
4455 41034222 42695708 44577120 46659391 48792884 50936691 52929004 55065074 57289922
4447 57289922 59235603 61060058 62579738 64202036 66222444 67897839 69672105 71894679
4439 71894679 74292243 77215419 80323506 83803610 87634565 91902175 96096875 100937359
4431 100937359 105538921 109719831 113957043 117313686 119375758 120537707 119816540 117750050
4423 117750050 114327713 109740737 104397618 98658562 93037165 87575443 81761473 75868832
4415 75868832 70462377 65758139 61220043 56883739 52976585 49541140 46672063 43674130
4407 43674130 41165237 39106782 37207852 35392303 33905535 32447417 31128114 29915170
4399 29915170 28676946 27596667 27013804 26208996 25775115 24958078 24280165 23751268 22932461
4390 22932461 22478095 22173116 21659062 21314441 20662294 20126463 19794433 19327478 18776200
4381 18776200 18317429 17979065 17604679 16914708 16446029 16250711 15995313 15359108 14964441
4372 14964441 15027641 14963934 14520335 14281533 14061898 13929810 13992170 13460683 13214575 13108682
4362 13108682 13034608 12942533 12752669 12617195 12883856 12493085 12506551 12510946 12495369 12549638 12381621
4351 12381621 12464706 12559973 12598902 12786184 12755035 12817541 12965157 13128794 13076005 13432198
4341 13432198 13726022 13731498 14166785 14582578 15037066 15354560 15792445 16718868 17449751 18332744
4331 18332744 18792605 19190362 19146971 18421162 17476990 16326820 15271378 14425545 13416714
4322 13416714 12803726 12095740 11329594 10923194 10324882 10076087 9542909 9344088 8902945
4313 8902945 8946895 8729900 8581992 8492406 8220464 7939289 8087540 7894722 7855790 7687078
4303 7687078 7406089 7221166 7333962 7274715 7237947 7155558 6659269 6788426 6342025 6171830
4293 6171830 6356619 6212874 6011199 5863078 5672501 5845433 5685740 5612085 5432072 5484549
4283 5484549 5576217 5403853 5307381 5295597 5349572 5419699 5137907 5040119 5215997 4908655 4873119
4272 4873119 4867963 4863698 4941598 4796433 4689858 4797630 4717650 4500152 4365933 4490555 4612210
4261 4612210 4304759 4166662 4490806 4703521 4518749 4462959 4445010 4583747 4543221 4428919
4251 4428919 4307110 4600385 4535687 4539302 4490260 4656308 4922289 4796266 4913014 4852213
4241 4852213 4998479 4939509 5242947 5523873 5784492 6089557 6242166 6503740 7097517 7293747
4231 7293747 7519037 7664469 7781220 7531668 6615980 5974761 5532013 5171937 4839972 4537877
4221 4537877 4323285 4297235 4233885 4133017 3998409 3904431 3824773 3712469 3629363 3616794 3468159
4210 3468159 3512256 3425053 3385033 3530185 3361554 3394352 3536886 3317536 3320135 3308867 3165548
4199 3165548 3285569 3244105 3179640 3178628 3057082 3017248 2906793 2916677 3143420 2992782 2907358
4188 2907358 2997919 3097865 3081103 2969980 2986020 2903354 2710467 2632257 2798339 2725753 2856308
4177 2856308 2979042 2968981 3006146 2719550 2978058 3249197 3140063 2977321 2922962 3022366
4167 3022366 3180451 2745712 2933231 3132132 3070486 3263593 2756001 2559756 2637517 2389980
4157 2389980 2469729 2669269 2625951 2646353 2548417 2568302 2541607 2589142 2575383 2523918 2406750
4146 2406750 2524914 2481613 2593292 2482838 2380480 2619159 2305000 2051582 2189167 2213341
4136 2213341 2378868 2348657 2268834 2361381 2137158 2236783 2204862 2022087 2264443 2279186 2173498
4125 2173498 2205602 2066384 2158430 2308400 1995574 2206628 2359697 2148707 2281851 2267804
4115 2267804 2454115 2455325 2388103 2402412 2423626 2392477 2611396 2390260 2624180 2542208 2626848
4104 2626848 2729625 2563208 2531049 2742930 2521652 2478687 2354912 2535321 2594324 2656356
4094 2656356 2584638 2504029 2447332 2293239 2301617 2386870 2395441 1923191 2145809 2072456 1835613
4083 1835613 1930858 2206678 1997666 2004636 1789019 2168564 2170391 2199537 2048722 2007185 1725734
4072 1725734 1981504 1987245 1695527 1641027 2110157 1951567 1973665 1838630 1810406 2116070
4062 2116070 2030013 1907912 2066848 2119122 2004692 1889903 1769411 2132348 2062211 1867592
4052 1867592 1743236 2121395 2177689 2048650 2024823 2259112 2449948 2470203 2228854 2110966
4042 2110966 2222153 2355755 2047138 2028245 2101623 2207361 2213996 2202002 2342474 2473407
4032 2473407 2428542 2442949 2081131 2298827 2523087 2337308 2524160 2476176 2634982 2809886
4022 2809886 2500900 2402959 2484185 2611815 2533092 2419072 2517823 2464525 2399417 2252986 2516663
4011 2516663 2661261 2867792 2859387 2700141 2592326 2578307 2734055 2643938 2656770 2895495
4001 2895495 2734546 2672123 2587317 2428520 2531286 2401279 2631374 2635487 2716064 2990968
3991 2990968 2858276 2506137 2477876 2547274 2461488 2350460 2429989 2377647 2523478 2510853 2560288
3980 2560288 2458409 2341153 2489519 2254703 2292313 2223555 2097635 2305974 2345363 2510166
3970 2510166 2441731 2241754 2196651 2390040 2493556 2434259 2393715 2459467 2368207 2318562 2627081
3959 2627081 2444794 2244435 2135123 2258396 2391270 2221256 2210888 2370809 2440936 2390642
3949 2390642 2311261 2232052 2247692 2295065 2209553 2585904 2481582 2517251 2632657 2568027 2732673
3938 2732673 2932373 2763775 2804556 2739013 2771230 2821877 2662617 2904494 2774506 2771964 2910661
3927 2910661 2814886 2867049 2855683 2938593 2942249 3107844 3319780 3172568 3260134 3126040 3335746
3916 3335746 3108346 2876209 3036692 2920042 3133745 3096649 2866871 3260760 3234145 3672201
3906 3672201 3459134 3303383 3401659 3422210 3647903 3474902 3343523 3572361 3434314 3583876
3896 3583876 3577619 3585315 3643354 3617849 3747364 3859434 3989443 4117630 4203794 3982165 4071983
3885 4071983 3953239 3934453 3903281 3952956 4013959 4098532 3899990 4196959 4067666 4164835 4205695
3874 4205695 4370570 4376562 4418193 4327842 4416398 4513444 4807523 4876560 4683734 4662630 4893876
3863 4893876 4857617 5100774 5035972 5069930 5331818 4925667 5149750 5203909 5366879 5529277
3853 5529277 5181228 5259921 5403586 5334650 5690533 5460694 5737435 5852420 5836805 5776987
3843 5776987 5872957 5756406 5912256 5717236 6031524 6432924 6330014 6509303 6570423 6735797
3833 6735797 6764434 6459411 6634434 6900007 6840184 7234888 7255723 7511675 7615919 7503469
3823 7503469 7558205 7855143 7786949 8012263 7902673 8117948 8272445 8243844 8099909 8090765
3813 8090765 8006536 7943096 7882410 7904609 8034566 8129647 8407231 8389718 8451256 8554590 8573487
3802 8573487 8608018 8949408 9258293 9283800 9459907 9523526 9804702 10081081 10021668 10563083
3792 10563083 10630651 10675045 10740783 10972562 11534532 11518092 11668273 11871167 11960981 12274846
3782 12274846 12279833 12471005 12649574 13089496 13031587 13193475 13592307 13675995 13800725 13755690
3772 13755690 13917021 14415290 14245715 14827452 15281052 15795043 16070075 16110908 16525494 16856741
3762 16856741 17042821 17363472 17564891 18411365 18745653 18992198 19465566 20019854 20491190
3753 20491190 20874573 21309530 21899538 22866978 23348994 23987401 24861709 25711312 26405679
3744 26405679 26962485 27675463 28838704 29177780 30036906 30474481 31484600 32367932 32614195
3735 32614195 33417473 34325127 35237398 35945402 36601602 38132475 39609479 40846761 42135635
3726 42135635 43437158 45330271 47088502 48424726 50068016 52212953 54196846 56648820
3718 56648820 58737251 61214786 64179916 66931896 70169087 73682051 77245509 81540124
3710 81540124 86030556 90543756 95311892 99791414 104532193 109226497 113919756 118433066
3702 118433066 123007274 127116898 131304435 134922747 138370019 142001993 146031799 150389695
3694 150389695 155035130 159940281 165046645 170012072 174617873 178406320 181224038 183104517
3686 183104517 183157920 181541162 178650209 174005716 168064873 161088850 153723609 146611112
3678 146611112 139630564 133338648 127482987 121798150 116873105 111676304 106261994 100707626
3670 100707626 94392069 88447448 82610819 77269295 72575953 68206034 64062878 60764004
3662 60764004 57735648 54745981 52427426 50285390 48421338 46709246 44948044 44099313
3654 44099313 42710800 41336329 40407159 39275599 38361845 37154417 36019623 35447637 34161024
3645 34161024 33124925 32042110 31012560 30607853 29683513 28859456 28296337 27714551 27156999
3636 27156999 26535128 25793105 25532075 25137220 24538495 23885202 23662956 23535252 23109432
3627 23109432 22348520 22037519 21707100 21241464 21013942 20499595 20219999 19892816 19527392
3618 19527392 19219285 18851220 18720965 18529107 18103064 18012437 17780836 17486672 17425899 17186898
3608 17186898 16868420 16897432 16587041 16816897 16775036 16582856 16720029 16615197 16373465 16493243
3598 16493243 16167124 16261835 16339888 16239214 16491711 16262966 16250561 16301183 15936703 16115384
3588 16115384 16116677 15910238 16170194 15717652 16060761 16081489 15964491 16168239 16226197 16270160
3578 16270160 16526787 16436827 17005203 17229718 17480161 17730943 17806793 18085993 18384481 18545797
3568 18545797 19107209 19678563 20072864 20846041 21450760 22206833 22832272 23606490 24512697
3559 24512697 25549588 26637072 27974181 28904469 30012088 31570092 33012902 34399539
3551 34399539 36044697 37412957 39146012 40323437 41073851 41356908 41245126 40733621 40085457
3542 40085457 38885361 37881868 37197328 36357190 35546460 34828052 34685546 34623646 34725745
3533 34725745 34812650 35166981 35879717 36618433 37494403 38555085 39674529 41121667 42534557
3524 42534557 44203851 45757511 47572738 49762373 52040477 54523082 57096878 59749409
3516 59749409 62625337 65201294 67600577 69627760 70588510 70719601 69714465 68104098
3508 68104098 66022289 63394668 60678237 57806875 54883843 52429787 50052834 48254746
3500 48254746 46755885 45259799 44230073 43093407 42199889 42043814 41467041 41224326 41351911
3491 41351911 41381989 41958343 42411149 42844729 43747168 44738687 45868059 47300375 48327799
3482 48327799 49934609 51305260 52943427 54450236 55564951 56264211 56404238 55533147 54519069
3473 54519069 52870737 50709056 49013409 47106556 45161296 43245605 41598436 40077315
3465 40077315 38637148 37481392 36519813 35577416 35065616 34549401 34101730 33514412 33475230
3456 33475230 33297054 33129596 33059565 33155008 33385654 33173484 33650489 34194279 34518055 35029805
3446 35029805 35299903 35903104 36818568 37291619 38341388 39264816 40288057 41741972 42731490
3437 42731490 43967547 45802901 47386862 49084784 51022359 53134125 55419254 57960440
3429 57960440 60880483 64273700 67740054 72012622 77069572 82295002 88603590 95682052
3421 95682052 103158028 111423917 120298144 129008725 136640120 142842377 148550975 153667116
3413 153667116 159725188 167176445 176711799 188288588 201841413 215510041 227149642
3406 227149642 233287354 232023828 222897359 207435735 188679878 169564817 151896623
3399 151896623 136616027 123375377 112522331 103607842 95993378 89825886 83901395 79017005
3391 79017005 75167494 71847892 68568027 65616203 62955328 61093237 58916468 56680481
3383 56680481 54658982 53023827 51466452 50034151 48439725 47380150 46513446 45563330
3375 45563330 44973744 44307752 43941055 43528995 43018976 42735837 42274044 41659699 41031957
3366 41031957 40271837 39685338 38661587 37862249 37153623 36446403 36174676 35934313 35780047
3357 35780047 35740197 35884662 35777982 35923637 35696752 35389006 34948907 34534415 33878475 33200855
3347 33200855 32572022 31975334 30952417 30362170 29781544 29031759 28549007 27928941 27647244
3338 27647244 27041128 26786595 26385852 26270790 25794533 25368276 25123822 25181838 25006631 24905950
3328 24905950 24689966 24450708 24630394 24468829 24380980 24532787 24418221 24368655 24273673 24020904
3318 24020904 24132232 23779946 23047826 22325317 21702006 21090393 20210414 19385106 18789207
3309 18789207 18541084 18123691 17545246 17063245 16757304 16283910 16040884 15534860 15222131
3300 15222131 15151406 15098060 14724351 14537786 14619435 14480035 14453476 14160569 13975433 14185055
3290 14185055 13959265 13991249 13947597 13647338 13765402 13443630 13420187 13142396 13013079 12936577
3280 12936577 12681003 12490471 12262510 12003832 12250404 11983374 11891576 11810112 11729118 11759418
3270 11759418 11677741 11618608 11558862 11541682 11615018 11479026 11539859 11593545 11668140 11776543 11566989
3259 11566989 11965782 11988559 11930538 12040428 11883831 12136662 12300279 12160094 12362798 12427419
3249 12427419 12846612 12906348 12995560 13375583 13586339 13911905 14194512 14661800 15290018 15882097
3239 15882097 16420031 17031000 17928468 18637711 19389816 20269762 21024187 21719446 22516145
3230 22516145 23732222 24808850 26115915 27842693 29890239 31983741 33695650 34143680
3222 34143680 33744766 32369479 30231267 27907524 25784129 24282025 22889701 21625293
3214 21625293 20738822 20120449 19544891 19137625 18759608 18589243 18317159 18013454 18058745 17957943
3204 17957943 17839859 18069016 18037592 18053177 18347898 18134247 17938022 17770386 17501920 17597393
3194 17597393 17421771 17300490 17234948 16967912 17204747 16982188 17013138 16792469 16515237 16481363
3184 16481363 16091119 16072994 15787154 15474074 15504053 15507699 15247637 14945391 14848539 15088385
3174 15088385 14939793 15190981 15201520 15329074 15529359 15309626 15312615 15443965 15494638 15474587
3164 15474587 15215335 15553756 15747027 15645660 15943904 16093220 16506907 16804589 16682855
3155 16682855 17034158 17329086 17513108 17936357 18570341 18960920 19490853 20223404 20521180
3146 20521180 21367367 21960062 22987785 23928976 24662036 25899668 26542900 27126559 28065196
3137 28065196 28586824 29539024 30617973 31643191 33312692 34593926 36401926 38473959
3129 38473959 40415055 42719378 44850866 46292529 47195560 46887434 45693877 43976887
3121 43976887 41910392 40160414 38524949 37141773 36622365 36294273 35903495 36003470 36077740
3112 36077740 37009354 37725057 38561883 39277311 40512636 42053824 44062385 45780698 47983691
3103 47983691 50543145 52882375 55347220 57012645 58174109 58171376 57042688 55528274 53711762
3094 53711762 51933062 50916707 50202912 50502209 51139043 52284236 54251802 56567143 59448719
3085 59448719 62355000 64558594 65897799 65242813 62963065 59459931 55268090 51125643
3077 51125643 47168270 43724785 40837367 38439926 36412919 34572829 33190491 32137823
3069 32137823 31112934 30263980 29669788 29267086 28822791 28172145 27862972 27432388 26842735
3060 26842735 26148327 25524280 25019217 24958239 24452370 24167710 23980411 23527450 23512334 23187355
3050 23187355 22896581 23246102 23221446 23324130 23189011 22774588 22779301 22183487 21958017 21913344
3040 21913344 21625930 21520508 21497168 21241457 21290411 21092939 21106526 21226276 21229559 20999676
3030 20999676 21175578 21135249 21245056 21250475 21185115 21451599 21407829 21535412 21502251 21229648
3020 21229648 21839221 21863711 21863222 21963228 21879757 22450481 22614274 22667969 23238087 23498447
3010 23498447 23791105 24026241 24330171 24777792 25277529 25800145 26256389 26839724 27197611
3001 27197611 28015435 28385222 28926854 29694249 30288211 31158102 31860458 32633703 33554716
2992 33554716 34243593 35462515 36337019 37380078 38438677 39571356 40888488 42059562
2984 42059562 43477708 44934986 46485439 48049891 49467276 51184371 52817564 54405365
2976 54405365 56227708 58048783 60226809 62128395 64217569 66600205 68933954 71193961
2968 71193961 73472310 76230668 79092333 81812695 84685192 87872381 91010098 94401607
2960 94401607 97631238 100985535 104364309 108133272 111704765 115106619 118968430 122806506
2952 122806506 126673093 130075675 133686784 137347705 140674608 143900023 147224344 150328895
2944 150328895 153257376 156030938 158900441 161866116 164424311 166688369 169002987 171578209
2936 171578209 173908027 175617109 177560657 179683317 181322820 182929014 184330769 185698682
2928 185698682 187000159 187978641 188603045 188945564 189391268 189687912 189185861 188820103 188690007
2919 188690007 188031175 187122085 185504812 184072525 182183112 179475716 176475313 173094505
2911 173094505 169306859 165476097 161314452 156716041 152511903 148195170 143863747 139914121
2903 139914121 135839332 131885074 128485318 124957324 121935451 118809822 115831626 113179823
2895 113179823 110630552 108415169 106199563 104277074 102729836 101134990 99688738 98723956
2887 98723956 98000857 97083613 96216725 95496591 94651930 93901835 92531954 90985963 89445331
2878 89445331 87587160 85152083 82341717 79570876 77178432 74582950 71898914 69397725
2870 69397725 67455050 65401927 63365248 61600341 60093237 59219015 57563672 56330275
2862 56330275 55554111 54815740 54499333 53934261 53606819 53269864 53280475 53344435 53191532 53661626
2852 53661626 53573332 53844561 54296837 54189014 54417155 54007204 53719597 53411519 52239216
2843 52239216 51274381 49986753 48398725 46983128 45311627 43849141 42295129 40899971
2835 40899971 39626397 38398906 37297182 36319468 35341701 34602532 33937501 33322524 32500031
2826 32500031 31789535 31484677 31301089 30932300 30596657 30225573 30068305 30020166 29697369 29511170
2816 29511170 29540947 29490630 29375455 29214204 29183968 29287476 28805476 28586343 28371607 27651092
2806 27651092 27243008 26855000 26097067 26055465 25387837 24949441 24605610 24105416 23921532 23491159
2796 23491159 22933945 22863752 22660182 22228439 21953032 21399900 21279688 21022335 20761505 20818411
2786 20818411 20708068 20428157 20222001 20074115 20194173 20384504 20552959 20402229 20755782
2777 20755782 20875554 20828162 21057337 21526541 21696668 21929867 22186355 22452868 22781151 22593983
2767 22593983 22922834 23143180 23161077 23262402 23351820 23336736 23532811 23117463 22981045 22969839
2757 22969839 22850073 22776298 22500833 22219427 22161850 22135257 22142866 22052601 22201272 22309239
2747 22309239 22437439 22428907 22643088 22799598 23114566 23411118 23890740 23892659 24207373 24544777
2737 24544777 24683104 25075024 25453436 25335365 25611111 25821639 25885507 26313590 25896874 25907254
2727 25907254 26013298 25745249 25397083 25291145 25055195 25366406 24838197 24485461 24473313 24085005
2717 24085005 23881518 23726206 23433213 23603670 23251757 23212848 23335208 23265718 23361028 23574627
2707 23574627 23664981 23831352 23943409 24118528 24137279 24359992 24744306 24939819 25009916 25341941
2697 25341941 25642969 25932883 26167347 26170254 26650194 26496667 26586121 26564311 26549190 27072476
2687 27072476 27080385 27090393 27602934 27626086 27759464 27799564 27712675 27943877 28005597 28278127 28718517
2676 28718517 28961619 29309871 29622035 29941582 30386588 30682666 31033463 31357474 31913234
2667 31913234 32373395 32771797 33330962 33873624 34357956 34572958 34920923 35766692 36225202
2658 36225202 36499968 36790376 37004336 37406911 37808577 38159526 38595957 39086482 39713600
2649 39713600 39964344 40168306 40772240 41415950 41841213 42383411 42903123 43428631 44125886
2640 44125886 44523047 45254428 45940757 46453021 47264902 47788925 48601650 49554501 50366678
2631 50366678 51383878 52468099 53407000 54365736 55217401 56556745 57788616 58698166 59711168
2622 59711168 60953046 62232833 63451751 64759028 66343970 67761568 69326550 71137615
2614 71137615 72739448 74694298 76326862 77984168 80228150 82266157 84411568 87053994
2606 87053994 89048097 91855547 94747322 97510227 100477794 103515450 106789917 110424436
2598 110424436 113737036 117546892 121232596 125104372 129552954 133892132 138569262 143649825
2590 143649825 148620341 154556909 160440305 167025723 174036209 181271371 189581552 198263163
2582 198263163 207285537 217173749 227784428 239252980 251383549 264407363 278423520
2575 278423520 293319666 309110060 325871977 343505646 361637042 380104538 398422901
2568 398422901 416820290 433961573 449871245 464276363 476636404 486859153 495422071
2561 495422071 501991104 507431118 511389652 514206014 516306358 517833926 518840306 519409753
2553 519409753 518864085 517276122 514719590 511052524 505883540 499375395 491371406 482746823
2545 482746823 473720290 464114088 454469779 445097861 436103234 427718977 419823097 412583943
2537 412583943 406433971 400472143 395614348 391435131 387937499 385278021 383454093 382131584
2529 382131584 381704709 381375036 381109126 381400852 381478558 381246064 380753069 379955774 379185050
2520 379185050 377466261 375292786 372954907 370144168 367399473 364045717 360905406 357907079
2512 357907079 354381904 350917929 347304294 343272454 339767696 335759094 331814676 326977803
2504 326977803 322127019 317679568 312463734 307078680 301417119 295127814 289018319 282308372
2496 282308372 275482314 268655223 261565986 254396090 247170525 239798981 232495526 225809777
2488 225809777 218816060 212215808 205712210 199312537 192866846 186322295 179872400 173754612
2480 173754612 167380440 161359441 155198817 148995497 143114617 137377310 132232003 127205382
2472 127205382 122595856 118523597 114540703 111079636 107921025 105058978 102463241 99839016
2464 99839016 97821084 95953256 94135595 92588921 91542212 90149190 89117872 88004304
2456 88004304 87066309 85991374 84970310 84260081 83283469 82207127 81334151 80593453 80002596
2447 80002596 79067028 78391490 77789245 76974796 76364329 75578763 74991909 73984966 72974130
2438 72974130 71897510 70884468 69604363 68281432 66730478 65344663 63715865 62304657
2430 62304657 60914753 59360268 58120077 56653915 55091451 53896057 52646538 51121815
2422 51121815 49420584 48004903 46808888 45376878 43832874 42449849 40975744 39607062
2414 39607062 38258205 37248052 36083256 35021466 34063282 33087690 32268753 31416017 30567462
2405 30567462 29604079 28954041 28426780 27912837 27245231 26249250 25712209 25381298 24960885
2396 24960885 24495199 23864433 23439326 23062980 22543109 21952049 21540582 21340605 21179280
2387 21179280 20681668 20239069 19875570 19472423 19315818 19123418 18646419 18382364 18227944
2378 18227944 17812970 17646502 17193269 17058315 16637674 16382678 16398019 16053347 15927950 15821832
2368 15821832 15496871 15296405 14987890 14743126 14737740 14574599 14641199 14388409 14143203 14117108
2358 14117108 13825082 13532167 13539991 13413503 13396217 13103679 13009198 12639902 12559131 12346596
2348 12346596 12292428 12244970 12136938 11964815 11838253 11749805 11715362 11632813 11587299 11418252
2338 11418252 11456821 11197191 10781531 10830231 10954824 10788476 10577092 10578316 10471293 10411267
2328 10411267 10369672 10191571 10001793 10091844 10275511 10190186 9989673 10207551 10097116 10107656
2318 10107656 9847713 9630347 9651432 9632337 9624658 9508243 9434568 9556499 9616853 9630235 9520940
2307 9520940 9683280 9673040 9692841 9413953 9385637 9881199 10002231 9978276 9866731 10038372
2297 10038372 10324073 10440241 10457514 10618771 10511722 10425053 10305666 10157448 9872295 9616654
2287 9616654 9481382 9211659 9098277 8906180 8772694 8778766 8727892 8690252 8613841 8419494
2277 8419494 8398036 8197550 8284291 8381475 8291784 8164041 8336509 8189420 8128383 8156108 7859060
2266 7859060 8092836 8148753 7934465 7923385 7873375 7993351 8158099 8135620 8250227 8019124
2256 8019124 7971147 8076757 8034525 7938287 8095468 8067132 8016528 7977781 7879906 7946880 7834840
2245 7834840 7647228 7802155 7814036 7711569 7525411 7405353 7309359 6976917 7118020 7084342
2235 7084342 7027842 7103196 6903836 6935099 6924323 6733499 6723039 6457101 6454562 6378131 6328808
2224 6328808 6456561 6449425 6144539 6282202 6413629 6495049 6482363 6387197 6446001 6487716 6393153
2213 6393153 6081974 6302284 6278711 6069096 5820425 5834747 6152076 6108575 6111618 6106250 5931719
2202 5931719 6035812 6157838 6163774 6009072 6070012 6087857 5923514 5865723 5793020 5909150 5997336
2191 5997336 6125411 6289620 6058938 6062993 6046940 6224285 6135200 6073433 6268267 6202320 6283189
2180 6283189 6436944 6335051 6412541 6321589 6440328 6506699 6490049 6708824 6672463 6654222 6968979
2169 6968979 6949036 6942005 6974151 6869382 6753656 6757727 6755299 6577549 6414705 6090502 6079737
2158 6079737 5947420 5797488 5809124 5929886 5980026 5839277 5737867 5857933 5677146 5841496
2148 5841496 5575230 5602281 5483025 5235155 4901760 4579713 4207258 4306083 4323406 4190170
2138 4190170 4302915 4267763 4178110 4246327 4123358 3903036 3978005 3788401 3799253 3780893 3852260
2127 3852260 4035860 4052681 3936315 4276391 4369688 4364925 4190956 4360344 4678322 4950168
2117 4950168 4907077 5169687 5112442 5286238 5370498 4864765 4625101 4265570 4042980 3934957
2107 3934957 3671752 3630966 3470833 3214900 3201957 2922485 2865609 3025048 3119491 3299617
2097 3299617 3103882 2849930 2980552 3067538 3081979 2849079 2819422 2968028 2910942 3004682
2087 3004682 3121581 3160788 3447604 3350075 3513107 3558423 3609334 3616620 3536982 3200713 3125824
2076 3125824 3111239 2774319 2672058 2489148 2437491 2384548 2427940 2383158 2283387 2440090 2243928
2065 2243928 2278642 2381927 2323783 2425573 2151144 1985259 2070862 2011436 2043788 2016253 2062212
2054 2062212 2254627 2167342 2039150 2036828 2059012 1816504 1660549 1563509 1649897 1788430 1629217
2043 1629217 1364108 1776178 1776500 1728882 1593190 1639951 1729388 1543468 1548231 1681892 1579328
2032 1579328 1547518 1445283 1602196 1678097 1567536 1643989 1534009 1624984 1314433 1511279
2022 1511279 1739954 1853640 1578327 1362925 1375434 1481683 1407435 1373312 1485111 1574083
2012 1574083 1431643 1314686 1334589 1214753 1213537 1330346 1419172 1225046 1217787 1063349 1149477
2001 1149477 1250965 1345115 1465035 1373448 1360927 1194404 1174272 1412215 1394447 1303089 1313220
1990 1313220 1140736 1241492 1094133 1116038 1077622 1008270 1025268 1085533 1032038 1251920 1351160
1979 1351160 1250819 1306376 1157564 1276461 1315727 1238958 1291636 1468850 1288675 1447353
1969 1447353 1481026 1392483 1295861 1386106 1182961 1396287 1234727 1190051 1349979 1167029
1959 1167029 1412892 1273171 1107316 1111751 917394 900289 988020 1123396 1181954 1014911
1949 1014911 1047264 1022859 1082870 890842 1069563 1248502 1152447 1265016 1150658 1268572
1939 1268572 1345210 969011 1058702 1122534 808220 839239 650427 621262 846482 894183 930737
1928 930737 771388 606130 759851 882732 886603 1035196 1058701 1210515 1104454 1010167
1918 1010167 1019405 932854 867129 775764 762827 1067184 904406 1037355 1074859 844560 903030
1907 903030 910368 809643 1040552 853669 869603 975886 784508 1107441 870375 932624
1897 932624 993785 770892 874668 954289 632923 641954 817685 850701 803071 756426 673256
1886 673256 1004730 962207 715686 750296 752847 957452 945505 753537 843882 988130 1101294
1875 1101294 863395 674332 851546 838681 771886 610410 956488 1065805 992184 980086
1865 980086 783050 747605 844200 587041 804483 815268 819398 825831 831788 895934 1108885
1854 1108885 1010813 1047436 1107602 919720 859517 988957 876922 886079 1064140 997452 1250286
1843 1250286 1165345 1097561 1102401 1185344 1008736 1020759 726061 888071 983779 1011656 801602
1832 801602 907676 921227 1000096 926546 854132 1067847 1355056 1211383 1136513 993381 983826
1821 983826 1085939 884859 943876 1060386 1002343 1105454 1218472 972719 1328174 1193951
1811 1193951 1044698 1241024 1233969 1267072 1672360 1433305 1201768 1409628 1322006 1269648
1801 1269648 1272873 1141245 1249693 1122003 916682 977459 728143 1060099 1207887 833744
1791 833744 1266573 1275081 1146654 1288049 809955 930942 1125563 818335 1188844 1031839
1781 1031839 1110508 1221869 892423 1056080 1049462 1120659 1157171 1048081 1150153 1075367 849691
1770 849691 896167 1196227 1242498 1414383 1152039 936544 1000471 753737 1008208 930083
1760 930083 814003 1279453 931144 1092160 1120492 857931 1046867 755065 822423 1053805
1750 1053805 863916 1055407 826868 748262 1030433 586149 700454 749860 664762 553202
1740 553202 625586 719914 846181 709803 724392 763222 890064 898914 697087 739473 744017
1729 744017 707214 570665 477491 525541 828524 541853 395602 459326 481521 396249 258514
1718 258514 277531 465866 235519 82507 294224 412944 548315 217865 383257 436659
1708 436659 405937 418630 260175 586087 791786 445452 332782 154937 296350 393474
1698 393474 384410 511989 345385 354294 400947 391979 137795 269165 476769 449241 310333
1687 310333 272195 276182 308215 151657 235889 433290 488932 512242 333685 264845 -58652
1676 -58652 78100 366055 119819 237102 332153 337943 360781 194615 158637 309305 61968
1665 61968 180346 313839 309600 240741 273398 280200 455049 560533 345399 483392 482928
1654 482928 374450 349472 193033 248012 384961 255333 498210 467452 535375 292311
1644 292311 233321 249795 356461 31500 227156 297960 247218 280730 272622 281291 475531
1633 475531 402967 228752 293936 174656 379487 169093 162218 316503 269047 153147 33499
1622 33499 -36351 233857 159605 109237 57917 232422 229549 108213 -11361 -8320 304056
1611 304056 197115 58243 -25790 -8994 -125809 -120980 231760 290392 404548 280213 3754
1600 3754 420650 494967 304784 521176 212501 232819 288180 244912 271375 130648 147258
1589 147258 300433 128639 220889 92328 339964 258200 242345 407664 181233 227356
1579 227356 80139 36619 338392 382502 340883 146548 -57041 112687 213136 21898
1569 21898 4642 124131 145968 203696 71676 106828 65707 114391 -15278 56850 135554
1558 135554 292583 229943 148203 -52726 31684 139053 156123 393805 442110 293953 317372
1547 317372 251032 320285 300152 256620 372630 419101 339291 258353 187207 84905 241863
1536 241863 298517 267556 316862 239325 374080 406318 351103 271443 -100524 74704 66192
1525 66192 221007 419125 180363 308544 307651 216284 166493 123990 184968 118855 -72454
1514 -72454 201020 94746 251318 171126 -84527 74869 -51742 109527 85446 134571
1504 134571 193517 49238 57838 224481 155510 155824 175137 215267 143916 200539 114025 152476
1492 152476 223142 408036 398892 198304 -67677 21246 292482 136898 -79931 268181
1482 268181 436856 349475 276192 248335 272870 299534 267017 272666 121928 83983 157529
1471 157529 -54296 -31603 39065 243677 248621 25349 -50073 130267 267571 112927 -22827
1460 -22827 238634 331182 255116 77987 43488 160911 203628 31547 65102 30459 332502
1449 332502 284111 145004 38058 267779 72474 10573 -190318 -7555 143433 3528
1439 3528 55593 273210 274679 146053 117359 -78003 161651 214724 149007 123449 196602
1428 196602 232675 210470 20360 77305 -61768 217025 277763 52528 15676 -90609 53547
1417 53547 -8654 -127643 186855 -4657 164704 230160 35111 88284 37097 75184 156501
1406 156501 -22453 239530 -85927 72357 193949 -20191 -22939 -74293 -55757 164226
1396 164226 206191 332850 101518 -14076 -53262 -52032 110325 183910 242085 50727 98660
1385 98660 -36095 -284185 -249635 -81957 -94693 99500 132535 291075 38543 -108048
1375 -108048 16616 -96940 13824 -103648 -138239 33921 -85624 154397 272200 223551
1365 223551 94754 30387 76172 18025 13216 134423 30084 151382 133384 156680 46822
1354 46822 -24106 -140009 -105705 -7344 -6352 166318 102491 -91604 225657 187092 69083
1343 69083 51121 44271 -59428 -118403 -177406 -145940 183255 280207 147313 18620 147167
1332 147167 241431 40722 -94251 133512 -40160 302400 153962 -116919 221603 33993
1322 33993 -166523 -93868 -1650 194784 -89005 -158007 127366 -1403 -98225 -113608 175765
1311 175765 169737 20397 120904 145762 224254 342107 120809 103688 141159 -245438 -7029
1300 -7029 -107268 -31383 -46085 -132563 32423 81059 249305 170384 -35845 115604 102386
1289 102386 -12623 -265190 -147948 64626 119530 393652 -34593 -28926 4839 -244945
1279 -244945 72920 -126684 -43913 158067 -196178 8754 -55041 -85213 -102822 -126900 -150430
1268 -150430 -69923 75536 116651 38231 -115580 -84706 153316 -55059 -124457 3241 -58522
1257 -58522 20922 -222574 -117844 90789 -109990 -371484 -412263 -85183 140667 -175557
1247 -175557 -399115 -39989 248632 194860 88429 61800 351359 368901 67730 177257
1237 177257 128094 263533 -58415 -80576 159824 -50786 -15177 64632 -43710 155451
1227 155451 163104 209003 16236 77015 197827 -3810 33652 -103987 -127094 74550 15392
1216 15392 36999 -166525 -178200 143285 11503 145255 -29493 112687 124110 95180 -15671
1205 -15671 -116414 -68542 83133 -26300 180443 3780 -45677 -58435 -58629 83875 236030
1194 236030 -111942 -177576 -30255 -110412 -5448 -194367 -339257 66145 -72291 -173738
1184 -173738 -100409 -256120 42909 -171029 -109395 -34186 -170978 -31445 -46412 -138795 -89709
1173 -89709 -112515 -202655 -50941 127619 -6569 294487 121271 -821 62520 40435 280727
1162 280727 172471 -58243 -106390 -81258 166801 -128594 -73802 -12169 2839 143105 -164028
1151 -164028 43538 122537 -37509 66654 -76310 -71304 141606 32301 -20377 31884 -51786
1140 -51786 34275 -13177 -147526 340019 165899 -103868 11726 -5988 68816 101199 -21589
1129 -21589 91912 122468 163949 129124 254715 152431 90230 5250 -12223 142592 116556
1118 116556 114705 11086 137099 36914 165541 -1297 52321 109738 -32046 -44771 -43713
1107 -43713 -75681 233975 243514 281261 145662 206746 210381 301737 -25541 -11904 211721
1096 211721 317509 370234 328898 199802 294985 170341 235943 178515 56116 226651 160115
1085 160115 289128 311199 264690 156901 318151 210906 431202 291732 361917 338879
1075 338879 576172 240727 343523 224847 173131 34887 371461 261843 369411 673333
1065 673333 528874 601244 597179 509500 501464 427021 454304 352176 360754 648461 457561
1054 457561 611279 545164 687547 689457 716262 698362 696478 706138 725274 569830 855191
1043 855191 762778 955833 1074484 1208314 973530 1259244 1173941 1152212 1155274 1164669 1257799
1032 1257799 882832 913672 1038594 957498 1515319 1380624 1130074 1386126 1323625 1609760
1022 1609760 1229146 1129317 1389690 1468289 1287360 1326767 1345414 1692235 1516048 1423148
1012 1423148 1422074 1654447 1709631 1823135 1743456 1791791 2204435 2067365 2077782 2234086 2277730
1001 2277730 2304707 2085786 2297784 2345887 2563660 2769343 2548401 2850464 2901028 3047329
991 3047329 2973640 3077453 3228163 3358062 3479324 3773874 4162320 4176696 4460042 4846086
981 4846086 5333699 5728746 5854968 6257486 6985939 7531747 8231985 9097596 10064278 10975592
971 10975592 11909843 12951561 13809797 14790500 16063091 17572239 19473566 21472205 24219062
962 24219062 27444530 31578055 36887253 43519854 50929036 56125090 55304369 50429276
954 50429276 43521634 35391387 29111126 23981098 20540200 18031769 15752515 14108993
946 14108993 12793011 11734334 10910776 10276369 9723520 9222332 8614962 8024612 7289731
937 7289731 7028739 6464843 5940944 5496597 5195841 5051557 4657545 4854654 4556700 4385865
927 4385865 4416840 3918574 3614025 3499256 3476433 3701400 3165771 3030121 2959769 2822060
917 2822060 2738685 2677900 2736452 2406590 2221554 2266620 2014844 1983178 1756211 1858858 1965445
906 1965445 1898960 1841115 1689405 1677341 1660421 1491692 1459026 1523956 1600797 1412558 1450921
895 1450921 1608370 1567184 1459991 1258205 1193667 1264958 1292781 1108279 1449403 1267693
885 1267693 1125297 983102 995504 1047878 1072686 1103964 1044076 1102165 1254596 1083129 1020515
874 1020515 902676 999738 1082688 902943 950484 905123 932013 925742 891852 724562 539350
863 539350 622362 713066 632065 783877 791843 550362 551377 497688 431607 699118 520786
852 520786 485781 482268 472025 848463 577672 312586 366390 555862 602352 434051 449729
841 449729 456594 325379 248669 324091 231544 362924 370707 58578 174330 305894 310385
830 310385 348145 515064 327578 243383 284932 432032 479796 555078 444223 224302 74770
819 74770 249102 248873 254513 159574 107867 164692 51392 -69907 155990 -39713 -3862 91276
807 91276 208742 501006 137415 144740 46096 159690 237412 42597 -28935 115319 -10397
796 -10397 249505 52990 69535 112605 250085 132741 240094 159288 -75353 -81707 -28090
785 -28090 -223645 -239648 -195148 240772 -24882 -149360 55086 199688 202677 40807 10651
774 10651 68023 73575 -47759 70242 53326 43630 -62025 -81121 -141978 -14604 -137914
763 -137914 48439 32874 -8308 120800 -39066 -106939 87642 -60135 164163 -70743
753 -70743 42328 -26830 -163524 -19559 -13535 -111918 24301 -144994 64173 8351 57712
742 57712 214789 230817 -40986 54589 66215 -101582 87011 -18227 -91747 -167844 -40200
731 -40200 88005 54495 -58857 144778 21484 86702 -88546 -164925 -46465 -176681 -84493
720 -84493 78089 29748 27612 -12257 200095 70345 -37097 -23739 -80629 -76940 2057 -225342
708 -225342 -71249 -23658 62615 28800 -109731 47250 166337 231616 269854 208926 246549
697 246549 106097 -16434 43204 93003 145982 112642 -183542 -84757 225171 76480 222830
686 222830 125374 263631 335416 173116 64627 86055 249816 182230 -155765 -105244 -52457
675 -52457 168969 233562 107446 37386 437907 263213 319660 212895 70752 168614 46511
664 46511 -81412 -34636 -78547 48278 54216 66462 150179 -140623 -22974 140253 102101
653 102101 -130492 -81375 -116627 30915 -95451 48689 68574 15378 -139404 124028 97000
642 97000 118733 -85592 -73186 11013 -108678 -40960 -143028 -156896 35820 -252427 -113265
631 -113265 185201 -130657 -10882 -297686 -480336 -298158 1700 -2275 -68178 7138 52171
620 52171 -110996 -225769 -180390 -86840 -170258 -151600 -228481 -28737 93398 -61378 -105914
609 -105914 31437 6156 -28076 -203613 -201069 -53580 -119341 4108 -22201 -102194 -256356
598 -256356 -395863 -229302 -147860 -176947 -97537 -317639 -170196 -160452 -197188 33924 -75
587 -75 -279705 49513 -204048 -183009 -87229 -361499 -98695 -99860 -296411 -59250 -14143
576 -14143 176961 19411 -260707 54882 47725 163024 -196762 -302794 -277296 -60070 -85736
565 -85736 -249030 -316466 -214526 -56983 -207600 -421028 -172553 34297 -217345 -205178
555 -205178 -54148 -7711 -136433 12932 103265 168367 29499 -161621 -238648 -107526 -171554
544 -171554 -105203 -247985 -325317 -32699 -161168 -164024 -251066 -148354 -18346 -152194 -262545
533 -262545 -309321 -498740 -244623 -299642 -348225 -322517 -42445 65863 -271381 -211304 -256889
522 -256889 -168514 -89254 -173590 -79238 59514 -55907 45512 -175715 -6244 25305 24513
511 24513 -183690 -217761 -241229 -118711 -228984 -242551 -177846 -150673 -144481 -248841 -252053 -371683
499 -371683 -54281 -148145 -147096 -124937 -186602 -294789 25521 -214443 1594 -309130 -171347
488 -171347 -172487 -230009 -104470 -138682 -207169 -214316 -315901 -3559 -21761 -60167 -316545
477 -316545 -358336 -204713 -304931 -247078 -425316 -123352 -153438 -237425 -106139 -143010 -116141
466 -116141 42274 -115699 25791 -54714 159070 -46082 16661 -31733 -168866 -43172
456 -43172 -295284 -247000 -325108 -622772 -362495 -301898 -35863 -71678 -207361 -215728 -227130
445 -227130 -14786 -210153 -312468 -120267 -347061 -274826 -213550 -177988 -50263 -146565 19276
434 19276 -28739 -115523 -285097 -278021 33976 -214478 -174376 -15868 -41489 -33495 -397651
423 -397651 -215535 -93247 -263552 -411778 -514894 -314250 -206164 -150981 -202815 -163338
413 -163338 -205276 -150426 -299178 -230096 -232307 -177055 -312912 -348505 -412024 -271305 -242697
402 -242697 -321118 -191788 -164934 16919 -121972 -44796 40667 -203691 -330256 31008 -205036
391 -205036 -103460 -319529 -255639 -154722 -209236 -211458 -227219 -108023 -273950 -296130 -293354
380 -293354 -159964 -15343 -247504 -274901 -126309 -226134 -131330 -227201 -118286 -251865 -233654
369 -233654 -371949 -455935 -221385 -191688 -171890 -245294 -407384 -293010 -494732 -444767 -305525
358 -305525 -353150 -123333 -219090 -351542 -224161 -182776 -151168 -278659 -346939 -348632 -314118
347 -314118 -366251 -354783 -97023 -229240 -298776 -394587 -298303 -200052 -225604 -332051 -353080
336 -353080 -262482 -254322 -356705 -140207 -337186 -128346 -283480 -375218 -330526 -298420 -171323
325 -171323 -114774 -259510 -269082 -209138 -190477 -202318 -153458 -146635 -105881 -68458 -396467 -189520
313 -189520 -370974 -229672 -467442 -580803 -211072 -133431 -288038 -204912 -330265 -224324
303 -224324 -308760 -318560 -394421 -369312 -242365 -280321 -228109 -281657 -336079 -391843 -395777 -307080
291 -307080 -238607 -407667 -522710 -399234 -545029 -489897 -145031 -508319 -153868 -258614
281 -258614 -304181 -194565 -215320 -180631 -196347 -465665 -253454 -214400 -239939 -182834 -187306
270 -187306 -376102 -219299 -211623 -341116 -287251 -554253 -375655 -284082 -277369 -219819 -327441
259 -327441 -347423 -76040 -540529 -470108 -206265 -264481 -361525 -194321 -59606 -14066 -263510
248 -263510 -388898 -551507 -461920 -200240 -345755 -379521 -185422 -130640 -159552 -204317 -338736
237 -338736 -508793 -495642 -488725 -582253 -391094 -403370 -341476 -452081 -338532 -299937 -247225
226 -247225 -375078 -429335 -310157 -277426 -258351 -298332 -284759 -171006 -257505 -314119 -310893
215 -310893 -250578 -337594 -589338 -369707 -320172 -304690 -244862 -377042 -358743 -280706 -356219
204 -356219 -351843 -503874 -333762 -389573 -459076 -352816 -167985 -122402 30260 98102 -317614
193 -317614 -431131 -397530 -361370 -339024 -486529 -282646 -393761 -491582 -356697 -555243 -385509
182 -385509 -476314 -550418 -387631 -442717 -480186 -564074 -590325 -399116 -436539 -529386 -366285
171 -366285 -480349 -442558 -466691 -499269 -520099 -405494 -332786 -400819 -595947 -489078 -213452
160 -213452 -513672 -490667 -501212 -565084 -420938 -444917 -355859 -438785 -575662 -427788 -575249
149 -575249 -234566 -286566 -415500 -50836 -34372 -438542 -480805 -381608 -340564 -307863 -488093
138 -488093 -271456 -298129 -187814 -302200 -397237 -346985 -270764 -352051 -308483 -255561 -327962
127 -327962 -531834 -559867 -448912 -320183 -421854 -509614 -528276 -544919 -447253 -510806 -504821
116 -504821 -504399 -464982 -383786 -558367 -641311 -369002 -503007 -319083 -332742 -579729 -535410
105 -535410 -290107 -309197 -406953 -620310 -522365 -474994 -342189 -282509 -411606 -199672 -202485
94 -202485 -361129 -410883 -386735 -364330 -186747 -496408 -679224 -573402 -556982 -496031 -532074
83 -532074 -403594 -547890 -561894 -427836 -370303 -399644 -480269 -401854 -456982 -438823 -451674
72 -451674 -562264 -455930 -536247 -407074 -545201 -485999 -325617 -519590 -473715 -531744 -461774
61 -461774 -350200 -487593 -348572 -368135 -580067 -589063 -664774 -454365 -326326 -391896 -512436
50 -512436 -392725 -290105 -417604 -463468 -567349 -514810 -474858 -610082 -515817 -382378 -266425
39 -266425 -375112 -682874 -536273 -495891 -427963 -483130 -608609 -497019 -566014 -623928 -577158
28 -577158 -617065 -533908 -595934 -578285 -497116 -374931 -388845 -510750 -385019 -538800 -401495
17 -401495 -419192 -620791 -505932 -556305 -455197 -490204 -467405 -367603 -432263 -368890 -587236
6 -587236 -703836 -613269 -519552 -534102 -486899 -506061
0 -506061
$$ Imaginary data points
##PAGE= N=2
##DATA TABLE= (X++(I..I)), XYDATA
16383 -5144760 -5160508 -4957264 -5028671 -4853137 -4816600 -4780796 -4780284 -4811677 -4650125 -4586095 -4577278
16372 -4577278 -4529846 -4464680 -4272000 -4270912 -4174230 -4180629 -4180651 -4072075 -4073731 -3806265 -3830827 -3778342
16360 -3778342 -3774118 -3764678 -3658555 -3666254 -3782439 -3635906 -3615429 -3278218 -3233925 -3346380 -3178391
16349 -3178391 -3115616 -3047013 -3034827 -3015365 -2805110 -2762508 -2921903 -2848223 -2803336 -2634603 -2574664
16338 -2574664 -2580746 -2485063 -2489862 -2265934 -2281705 -2346952 -2262921 -2397104 -2100912 -2210747 -2112892
16327 -2112892 -1929296 -2006340 -1949961 -1780016 -1794111 -1694744 -1778766 -1674333 -1590018 -1581076 -1563955
16316 -1563955 -1484745 -1493349 -1572692 -1425392 -1393691 -1342239 -1062391 -1160092 -1142897 -1081140 -1062454
16305 -1062454 -833306 -756245 -795028 -910581 -721156 -699908 -657245 -575620 -633215 -429544
16295 -429544 -436752 -292155 -165344 -336265 -116824 -160635 -154518 10686 -74413 -26555 -140665
16284 -140665 -91205 32548 -45398 16932 57852 184847 216675 286236 360197 399828 575555
16273 575555 619143 612644 684846 684591 773562 463792 721289 789195 623420 841719 825512
16262 825512 983425 960333 940591 941331 850522 1050598 1256616 998950 1091817 1094663 1160493
16251 1160493 1234756 1078167 1260863 1513943 1345162 1422614 1456903 1521658 1397222 1588267
16241 1588267 1560927 1536152 1834688 1872792 1937980 1837302 1960453 1822146 1865755 1845601
16231 1845601 1984345 2139619 1966230 1913768 2128116 1979669 2200516 1960795 2135607 2166091
16221 2166091 2077835 2191172 2169968 2136368 2281877 2331782 2068968 2464355 2516404 2408057
16211 2408057 2421907 2382575 2513591 2688970 2487527 2915434 2566572 2503239 2375003 2316650
16201 2316650 2677010 2613563 2617645 2563812 2521958 2829686 2763856 2662713 2781724 2773862 2933249
16190 2933249 2818003 2752583 2791563 2854950 2892033 2840460 2881826 3032327 3256508 3131840
16180 3131840 2982470 2985292 3028542 3100851 2833102 2963625 3051285 2890069 3024456 3189384
16170 3189384 3106997 3163804 3112374 3197404 3124264 3396574 3128528 3282481 3184864 3235726 3383620
16159 3383620 3236705 3211132 3171707 3437112 3407685 3374138 3143401 3269472 3299517 3343127
16149 3343127 3357470 3398419 3200709 3376488 3486419 3474428 3390968 3311891 3328245 3383518 3368032
16138 3368032 3327462 3352506 3248099 3388581 3500859 3448386 3404615 3522331 3625481 3690200
16128 3690200 3596681 3740100 3496405 3496043 3426755 3532472 3455647 3411465 3457540 3487219 3366003
16117 3366003 3479777 3554468 3505135 3645760 3498709 3518260 3557626 3566064 3696771 3789142 3593305
16106 3593305 3584414 3729659 3888722 3780872 3732328 4018611 3960941 3745650 3888832 3835538
16096 3835538 4229825 4133667 3776022 3768588 3758700 3821819 3871211 3715302 3701453 3664916 3755685
16085 3755685 3831737 3582707 3816089 3704061 3439595 3629995 3664676 3759380 3729392 3633935
16075 3633935 3686713 3718679 3699898 3596110 3651182 3621921 3758049 3628502 3624556 3706175 3422860
16064 3422860 3721609 3675288 3831933 3924958 3867446 3880439 4016405 3813067 3930397 3828252
16054 3828252 3773086 3746727 3944936 4107179 3996284 3904911 3766937 3969179 3854226 3850034
16044 3850034 3824254 3863998 3989737 3961002 4000219 4112815 3854202 3948005 3843326 3953181
16034 3953181 3660365 3720362 3790475 3690751 3749044 3726032 3776421 3646369 3592117 3485675 3591044
16023 3591044 3934769 4000942 3823112 3978086 3775741 3915249 3785629 3897333 3934516 3985328
16013 3985328 3963580 3986708 3888393 3973146 3849267 3803214 3713968 3847526 4014667 4085222 3922211
16002 3922211 3653716 3955207 3832803 3845280 3741819 3569565 3762879 4044218 3907862 3685957
15992 3685957 3557883 3947315 3884608 3893241 3782989 3983561 4069897 4062149 3889624 4086971
15982 4086971 4051810 4076913 3583215 3686879 3845000 3937561 4104376 3839480 3803111 4011857
15972 4011857 3920406 3898128 3793335 3803562 3880068 3743929 3722855 3560933 3986008 3855393
15962 3855393 3846114 3943047 3919139 3766805 3716902 3519617 4046660 3990377 3863292 3879743 3806512
15951 3806512 3774658 3784558 3780513 3757141 3740154 3692497 3948168 4188522 4091924 3941180 3953860
15940 3953860 4008551 4056296 3996830 3725939 3879880 3970692 3952673 3933637 4049196 4218208
15930 4218208 3777808 3672961 3804245 3957232 3971080 3910676 3986843 3934035 3900489 4036050
15920 4036050 3558469 3771115 3974300 3804467 3882403 3634854 3964616 4056726 3535965 3800322
15910 3800322 3746435 3779544 3972911 3837876 3967104 3986222 3919611 3861230 3844116 4159413
15900 4159413 4206156 3957109 4104094 4063433 3905925 3845150 3929136 4083995 4148356 4032953
15890 4032953 3931217 3855277 3746779 3925991 3845489 3902639 3820337 3661535 3724976 3765306
15880 3765306 3609512 3676082 3689312 3856716 4055203 3862750 3736235 3879680 3962689 3973267
15870 3973267 3966358 4005770 3952969 3817889 3639862 3827049 3934448 3835295 3983017 3754595
15860 3754595 3865346 3990714 3867392 3765615 3869480 4015662 4028789 3734056 4000408 3849533
15850 3849533 3935167 3969536 3916110 4031017 3844792 3822331 3894834 3984517 3937610 4026547 4059592
15839 4059592 3850600 3952125 3492076 3465576 3837948 3696280 4061342 3788284 3758026 4073564
15829 4073564 3752515 3837489 3988938 3798551 3960712 3802998 3750784 4019508 3816133 3673439
15819 3673439 3895470 3937010 4143323 4041176 3902487 3924198 4143047 4004472 3945153 3804541
15809 3804541 3734653 4024549 3807430 3971579 3795402 4000655 4186526 3988298 3851247 3805701
15799 3805701 3597600 3965077 3825060 3874757 3909982 3988274 4142831 4005604 3773842 3854978
15789 3854978 3980547 3967637 3970767 3768574 3918265 3936144 3771024 4031074 4106581 4090702
15779 4090702 4068888 3573434 3906532 3990309 3890265 4014048 4028965 3918211 3979953 3699353
15769 3699353 3560618 3667819 3864160 3916669 3808428 3810624 3811707 3746555 3771917 3892766 3925803
15758 3925803 3877011 3960180 3866565 3872582 4119273 4239884 4015762 3690571 3808786 3973842
15748 3973842 3881635 3756363 3725806 3956533 3940736 3941918 3766787 3715638 3835965 3780591 3801434
15737 3801434 3748816 3916330 3947847 3937571 3764109 3831932 4147561 3966801 3929183 3925055 3814310
15726 3814310 3860202 4028160 4057952 3897605 3759202 3978552 4104718 3936820 3703224 3963315
15716 3963315 4123519 4037496 3859710 3731214 3993084 4149245 4030870 3983688 4045576 4189927
15706 4189927 4119888 3847027 3803700 4214347 4211303 3906407 3774177 3986791 3991675 4063745 3975662
15695 3975662 4041546 4148954 3914909 4006726 3942850 3905196 3870287 3721877 3931507 4199570
15685 4199570 4199112 4190633 3786269 3975077 4115978 3903429 3859982 3777519 4053952 4163907 4032019
15674 4032019 3843687 3695625 3897995 3790692 3712774 3836909 4026090 3875482 3934627 4034463
15664 4034463 4070539 4128174 4262867 3790037 3850718 3697713 4045985 4225261 3980016 4035409
15654 4035409 4008821 4129201 4111540 4037596 4033980 3924770 4076590 4151081 3817660 3920087
15644 3920087 3959023 4000350 3757823 3780253 3835835 3854436 3809373 3903360 3950086 4029369 3742215
15633 3742215 3615270 3827982 4019429 3858531 3796020 4155675 4213722 4176274 3876765 4023968
15623 4023968 4006596 3842649 3973612 3806681 3860452 3870951 3870512 3936572 4057577 4389829 4209720
15612 4209720 3908633 4145269 4082000 4032893 3979231 3999262 3996369 3847056 3549030 3764130
15602 3764130 4058723 3967518 3915689 3955210 4052480 4134920 3951517 3869322 3986893 3884715
15592 3884715 3952044 3778875 3942927 4085507 3935977 3863042 3826894 3954811 4026871 4004444
15582 4004444 4019272 4060670 3959054 4128803 4171067 4155251 4272688 4025172 4028749 4099176 4119236
15571 4119236 4056074 3932937 4021122 4213876 4080231 4193435 4178881 4099436 3948292 3758082
15561 3758082 3935088 4103061 3937054 4222883 4077844 4003747 3851319 3722047 4157773 3950242
15551 3950242 3986331 4114342 4065144 4128474 3945164 3848006 3748280 3776456 3953752 3866734 4079982
15540 4079982 4003908 3870173 3983294 3846379 4108329 3950780 3966797 4112254 4048320 4016013
15530 4016013 4040661 4117535 4109893 3962731 3805645 3737615 3900271 4110604 3888776 4053016
15520 4053016 3997830 4261863 4119282 3793263 3971877 3992791 3982677 3978586 3741284 4059527
15510 4059527 3942834 3952208 3848385 3732127 4038216 4215276 4003044 3909023 4055218 4089780
15500 4089780 3927787 3758586 4030032 4083729 3899274 3990191 3991400 4112996 4206429 4052743
15490 4052743 4094139 3997503 4130452 3911562 3586627 3731380 3879081 3894596 4079375 3971854
15480 3971854 4146979 4011800 3912810 4005842 3951997 4163246 4182993 4243703 4060471 4124967
15470 4124967 4135817 3932221 4062985 3992545 3839980 4118321 3877105 4168384 4186131 4331935
15460 4331935 4172028 4046407 4077154 3986859 3792499 4022930 3865443 3738865 3702434 3769828
15450 3769828 4046715 3873974 3931776 3556422 3897096 3929259 3987664 3908036 3925473 3989100
15440 3989100 3875839 3782174 4266279 4169035 4235095 4169487 4100483 4319777 4191656 4222355
15430 4222355 4299301 4069709 4125251 3965589 3885988 4203212 4300862 4361784 4061510 3893901
15420 3893901 4056483 3967320 3839431 3994594 4054789 3923570 3909080 4209960 4368878 4040092
15410 4040092 4049022 4096879 3999433 4167112 4035788 4020911 4237553 4019982 3890344 3978938
15400 3978938 4013368 3972960 3945421 4187692 4371377 4302595 4031959 3763008 3815894 4155032
15390 4155032 4104268 3795256 3764475 4018888 3829096 3883235 4034343 4293796 3977044 3964591
15380 3964591 4121327 4113966 4093583 3951936 4008997 4080469 3977993 3968967 3926906 3742938 4139898
15369 4139898 4096683 4092933 4384388 4226369 4258252 4140663 3885310 4269426 4038769 4096569
15359 4096569 4148985 4153884 3972937 3809858 3815069 4158414 4004456 4038518 4133480 4245526 4385459
15348 4385459 4111950 3920803 3929869 3863368 4046046 4176915 4210080 4396348 4102669 4007395
15338 4007395 4023273 4146070 4061687 4025506 3869436 4056626 4251746 3924812 3877486 4113994
15328 4113994 4049570 4248692 4257975 3960751 4010937 4061479 4116464 4169335 4330808 4360682 3981854
15317 3981854 4065082 4194029 4130963 4041362 4089523 4173399 4083597 3908387 4016742 4073381 4129088
15306 4129088 4052516 4011818 3904435 3965269 4005540 4044547 4220052 4008728 3961804 4302931
15296 4302931 4090281 4385740 4185794 3879873 4094282 4001190 4147788 4275557 4239717 4200941
15286 4200941 4090951 4037207 4230613 4034526 4083982 4089935 4260304 4332227 4329277 4187805 4150995
15275 4150995 4135170 4074706 3937586 4001841 4090836 4140728 4226897 4077573 4060477 4204849 4223791
15264 4223791 4041515 4336098 4229865 4264210 4165345 4118299 4001826 3956114 4011790 4134091
15254 4134091 4057977 4088066 4075546 4151450 4048683 3892839 4191870 4269619 4010313 4066680
15244 4066680 4072510 3939684 3871655 3847930 3976340 3740519 4049423 4162813 3903672 3937782
15234 3937782 3816462 4068199 4157801 3974855 4116284 4275590 4185142 4075608 4060983 4048641
15224 4048641 3996026 3858421 3983250 4188983 4282797 4231626 4225873 4062055 4356554 4197873
15214 4197873 4022259 4049497 4114342 4002602 4281067 4022356 4035014 4050923 4112799 4082474
15204 4082474 3882186 3910984 4157109 3986185 3888970 4117864 4215003 4122685 3940574 3863678
15194 3863678 4268718 4509487 4337255 4285942 4059488 4383705 4061546 3917167 3920746 4209914
15184 4209914 4393339 4010000 4034466 4214389 4187503 4234604 4133817 4091929 4216927 4078526
15174 4078526 3904777 3925797 4062014 4130563 4201596 3984257 3976016 4017261 3904740 4134171
15164 4134171 3893292 4000901 4405410 3988673 4113127 4074778 3968567 4089294 3987250 4162531
15154 4162531 4244195 4249609 4069547 4113144 4163820 4042404 4120633 4063325 4190831 4068321 4008997
15143 4008997 4267670 4115401 4239039 4211402 3961333 4371667 4379375 4181330 4103238 4084058
15133 4084058 4079269 3870450 4243718 4283011 4440157 4339302 4170700 4365482 4262927 4031778
15123 4031778 4055243 3864080 4148834 4132289 4147158 4062803 3995121 4082744 4164212 4173623 3840422
15112 3840422 3915469 4164198 3867948 3986118 3999503 3997148 4122265 3889745 3945640 4014682
15102 4014682 4072057 4206551 4150659 4061688 4122354 4160504 3980057 4049229 4145453 4035666 4074306
15091 4074306 3953783 4004277 4225396 4232590 4255289 4445029 4327712 4190000 4057602 3918430
15081 3918430 3994501 4179896 4164687 4144517 3973684 4235019 4317413 4078159 4044722 4223065
15071 4223065 4060427 4203800 3931440 4173513 4060600 4040163 4076595 4068318 4236761 4102123
15061 4102123 3985224 4129454 3937942 4131189 4146225 4151711 4426869 4190938 4299358 3990469
15051 3990469 4199357 4076621 4152208 4194355 4147300 4157574 4145912 3971543 4181207 4015831
15041 4015831 4239979 4038129 4244948 4217745 4027722 4230630 4070883 4267611 4244002 3999552
15031 3999552 4123569 4249971 4259580 4151001 4070256 4091462 3979647 4360682 3972253 3987945
15021 3987945 4083266 4065250 4135602 4121259 4115890 4365126 4133563 4439146 4445643 4266297 4182418
15010 4182418 4378079 4460286 4143696 3913678 3994049 4115575 4136378 4163980 4127182 4259470
15000 4259470 4264107 4205915 3895874 3940215 4203900 4233772 4048410 4295339 4257143 4386291
14990 4386291 4561136 4335647 4108277 4184614 4102019 4133778 3964017 4048125 4078244 4119319
14980 4119319 4230856 4287527 4241138 4399525 4257334 4064443 4191280 4321906 4437645 4221926
14970 4221926 4210119 4229016 4186468 3979348 4017097 4097468 4201650 4268061 4307525 4355218 4360292
14959 4360292 4244308 4270774 4111302 4221898 4356271 4170633 4273683 4159732 4251884 4215540
14949 4215540 4043463 4325461 4199860 4072401 4053037 3878219 3919767 4131735 4316716 4267127
14939 4267127 4084152 4227669 4321045 4314511 4237934 4133315 4071401 4122484 4083881 4262252 4467234
14928 4467234 4492003 4518323 4275177 4117196 4187053 4293476 4331850 4245392 4100177 3942936
14918 3942936 4031740 4215112 3987920 4166324 4163755 3927975 4175082 4333533 4247854 4163261
14908 4163261 4084556 4322062 4340986 4480155 4251814 4062935 4180287 4177641 4324731 4248397
14898 4248397 4156921 4287539 4251242 4343229 4226931 4278556 4293980 4265463 4405487 4107246
14888 4107246 4167084 4117561 4114791 4212567 4092080 4108877 4273867 4252165 4217499 3958305 4316437
14877 4316437 4504799 4225838 4215072 4363385 4173474 4224452 4044243 3968057 4265396 4227913
14867 4227913 4252048 4372788 4365351 4564575 4440865 4120901 4426303 4358671 4332704 4167734
14857 4167734 4123147 4056047 3881983 4077329 4202443 4084103 4158831 4243517 4291258 4151261
14847 4151261 4203960 4408677 4361353 4431327 4408381 4455690 4486647 4367592 4345505 4235366 4322400
14836 4322400 4433447 4163943 4383591 4155752 4257564 4526645 4132756 4105689 4112884 4134628
14826 4134628 4318771 4154202 4403334 4407225 4076426 4275231 4458941 4447525 4404334 4256142
14816 4256142 4299953 4451102 4362028 4236631 4264268 4275794 4246424 4132620 3981357 4509856
14806 4509856 4310515 4419645 4386239 4365768 4246960 4146722 4337834 4382775 4183438 4083939
14796 4083939 4196375 4197087 4336558 4250204 4305254 4406193 4297177 4166324 4341061 4334470 4476445
14785 4476445 4344930 4192288 4317600 4411680 4319745 4141044 4181439 4378837 4306054 4097093
14775 4097093 3889945 3908487 4108819 4175064 4203111 4248817 4461465 4282998 4121463 4413399
14765 4413399 4697974 4430949 4254379 4205794 4360529 4262498 3972847 4034026 4204854 4279927
14755 4279927 4361376 4198083 4217226 4316798 4371524 4160346 3889565 4361089 4391921 4006865
14745 4006865 4257207 4291910 4228541 4413093 4189938 4370172 4222130 4119623 4176448 4182528
14735 4182528 4289825 4415834 4124848 4192524 4128885 4168140 4364487 4204974 4154178 4216859
14725 4216859 4286656 4366188 4293544 4168861 4376664 4349691 4459344 4188483 4245132 4399688
14715 4399688 4409251 4402595 4379703 4339358 4271034 4461981 4195521 4347134 4636476 4295008 4322889
14704 4322889 4357841 4369185 4503467 4226327 4413798 4215914 4150564 4424491 4154244 4301479
14694 4301479 4366740 4383380 4412814 4282689 4463289 4249794 4340105 4531065 4504103 4484271
14684 4484271 4281376 4377793 4290939 4275095 4282668 4096390 4301192 4294918 4429399 4428209 4438729
14673 4438729 4510920 4445573 4307539 4202797 4203821 4339370 4193100 4278541 4294691 4225091 4359513
14662 4359513 4112489 4292231 4400768 4405211 4289221 4229809 4304633 4338247 4142598 4324999
14652 4324999 4354370 4399380 4362952 4419294 4418681 4405239 4383696 4063062 4306651 4520567 4379263
14641 4379263 4351125 4339157 4519396 4440076 4394145 4452305 4348770 4713170 4459872 4413037
14631 4413037 4446569 4332532 4343690 4181451 4101197 4226615 4235200 4237518 4007675 4090135 4476133
14620 4476133 4458113 4465896 4331234 4260763 4130892 4243172 4208478 4430632 4371283 4117385
14610 4117385 4265403 4560477 4261048 4246848 4317871 4438303 4401423 4412487 4195149 4284180
14600 4284180 4335428 4357498 4503089 4440331 4467132 4425718 4393754 4413470 4377175 4424869 4505993
14589 4505993 4241548 4402459 4275835 4321949 4332403 4394789 4207913 4286014 4383201 4247333
14579 4247333 4131959 4267085 4192639 4428131 4201310 4353059 4258463 4372972 4447585 4305678
14569 4305678 4511877 4229039 4200549 4308143 4025858 4307769 4161703 4007647 4266123 4111666
14559 4111666 4611247 4686326 4275352 4595115 4559630 4297885 4535234 4445278 4533711 4398711
14549 4398711 4351326 4447985 4675646 4324471 4329855 4313482 4507092 4472792 4608617 4500215
14539 4500215 4586221 4412293 4430651 4310810 4209852 4252850 4465257 4443853 4366247 4394330
14529 4394330 4450019 4282335 4391994 4456974 3988373 4350478 4414925 4688971 4562551 4423332
14519 4423332 4438293 4480206 4478813 4632255 4345095 4367623 4421471 4352212 4405770 4340209 4272317
14508 4272317 4319400 4224998 4248555 4402713 4476212 4300252 4308360 4102144 4221610 4210740 4252810
14497 4252810 4142858 4423445 4499039 4416773 4470781 4494297 4381132 4330582 4308921 4365234 4511895
14486 4511895 4489768 4456651 4141763 4302163 4540275 4247798 3951112 4237528 4319551 4380134
14476 4380134 4323241 4324391 4511693 4416154 4200010 4321118 4487559 4503850 4420014 4427381 4345740
14465 4345740 4559753 4398788 4177168 4311678 4063139 4203794 4241155 4334672 4600698 4640054
14455 4640054 4694458 4616528 4477611 4479287 4413532 4263516 4261093 4255040 4566526 4369684 4449897
14444 4449897 4373971 4296230 4364947 4480129 4416093 4304393 4232135 4223230 4377697 4392149 4381072
14433 4381072 4291741 4389150 4571997 4379299 4273772 4350098 4150851 4303253 4507554 4327473
14423 4327473 4355863 4330590 4481904 4480953 4292546 4249780 4316095 4211966 4308386 4365261 4112381
14412 4112381 4171693 4557226 4466340 4626818 4577353 4395597 4349686 4261877 4284507 4312980 4478780
14401 4478780 4446547 4534945 4603251 4424166 4278166 4525383 4366406 4417417 4283230 4449551
14391 4449551 4691291 4676402 4657698 4442403 4392736 4671758 4402457 4452209 4478964 4630301
14381 4630301 4617347 4190102 4347929 4705682 4412589 4359793 4388052 4435364 4600855 4443898
14371 4443898 4412648 4612540 4735308 4299397 4078620 4422642 4769310 4585720 4379635 4393855
14361 4393855 4437934 4471914 4375108 4232234 4504245 4631778 4398271 4235644 4306249 4376515
14351 4376515 4451743 4215286 4306038 4641380 4425212 4200603 4432968 4609813 4668915 4568196
14341 4568196 4465931 4524792 4662949 4705511 4610431 4598392 4515048 4439415 4219340 4375964
14331 4375964 4471911 4580304 4467604 4588921 4513090 4314904 4528113 4444198 4394174 4518372
14321 4518372 4592839 4691919 4826454 4595074 4554697 4481852 4506859 4292519 4401488 4550571
14311 4550571 4637717 4284662 4226049 4392138 4482468 4450336 4245624 4159258 4462627 4530440
14301 4530440 4395105 4439757 4387800 4693025 4608516 4260526 4297307 4316812 4263653 4393214
14291 4393214 4515664 4611545 4408989 4534138 4580383 4674858 4632949 4687343 4579056 4579499 4495194
14280 4495194 4746486 4689510 4562351 4633571 4477851 4300936 4687351 4477597 4489963 4523351
14270 4523351 4377923 4627414 4460875 4331342 4485213 4443897 4531605 4426096 4207279 4450138
14260 4450138 4484284 4303086 4290155 4210753 4236674 4479333 4421325 4617913 4532173 4672434
14250 4672434 4555422 4516946 4502663 4549820 4401729 4579358 4543891 4614423 4543324 4480941 4970518
14239 4970518 4957217 4574178 4572577 4476215 4435780 4398245 4180672 4400671 4568409 4785488
14229 4785488 4698184 4457208 4708209 4603092 4364193 4544927 4605007 4443809 4440927 4407946
14219 4407946 4623391 4735795 4556364 4466076 4591127 4330280 4516692 4359510 4486392 4606772
14209 4606772 4233983 4313208 4477320 4573604 4523198 4301224 4229023 4426796 4528691 4461823
14199 4461823 4468645 4556593 4495606 4523158 4509375 4731670 4555121 4666654 4639643 4521775 4673799
14188 4673799 4367957 4366800 4688933 4360258 4408625 4512143 4438813 4553128 4453518 4445700 4833194
14177 4833194 4580994 4287369 4454832 4509810 4660007 4769904 4612243 4761706 4707710 4682479
14167 4682479 4773131 4453176 4481190 4332882 4400679 4392815 4248923 4493094 4512076 4501518 4517130
14156 4517130 4544658 4554446 4415739 4485580 4543857 4705526 4666247 4514661 4547375 4418818 4509145
14145 4509145 4471775 4688510 4541466 4410182 4433012 4354173 4345357 4444296 4635753 4737402
14135 4737402 4572202 4511015 4512275 4454300 4497611 4499419 4585145 4514368 4417072 4294499 4243792
14124 4243792 4905242 4725666 4542435 4607166 4528542 4928272 4796738 4794891 4655691 4376938
14114 4376938 4517487 4431984 4624202 4811958 4616947 4572089 4701970 4505219 4516660 4484228
14104 4484228 4558650 4533449 4550395 4446516 4527422 4424784 4566482 4640629 4613974 4718288
14094 4718288 4492663 4519883 4541331 4495606 4483799 4454961 4456735 4705766 4339515 4465676 4613915
14083 4613915 4722823 4727901 4772645 4472422 4752335 4565978 4559331 4737902 4639748 4574474 4791672
14072 4791672 4548924 4889899 4758031 4693335 4741347 4585466 4820195 4601505 4584647 4755431
14062 4755431 4806112 4772620 4682567 4525048 4715843 4454060 4533310 4587440 4697642 4777042
14052 4777042 4619195 4384369 4462377 4469923 4421747 4393731 4378740 4465730 4575940 4557191 4807377
14041 4807377 4620964 4451466 4592270 4587944 4669470 4583403 4590544 4689028 4629768 4918617 4902137
14030 4902137 4847526 4942691 4700174 4672757 4701347 4609013 4591769 4733401 4499767 4733283
14020 4733283 4782568 4586820 4425017 4536088 4636877 4751387 4440717 4531399 4712977 4632444
14010 4632444 4622287 4419334 4627354 4760988 4653053 4737505 4536238 4482634 4535119 4664277
14000 4664277 4724348 4757479 4887695 4658006 4594666 4511401 4731120 4633008 4566731 4461332
13990 4461332 4413573 4513072 4639339 4394395 4621010 4444031 4469295 4711064 4454753 4675818
13980 4675818 4708103 4638466 4704056 4548742 4511936 4656063 4549629 4515244 4444878 4503529 4718460
13969 4718460 4500737 4363747 4685692 4799158 4867911 4655278 4339659 4726953 4623413 4290052
13959 4290052 4539619 4801015 4632810 4528995 4472571 4785916 4563230 4539961 4678099 4776666
13949 4776666 4837422 4623186 4467081 4525668 4805722 4785663 5027163 4757696 4611475 5055370
13939 5055370 4897712 4745135 4718341 4534823 4697612 4497757 4675099 4906823 4788381 4724754
13929 4724754 4552018 4608040 4728004 4898304 4797915 4829956 4817061 4705088 4580604 4610360
13919 4610360 4812102 4758131 4558901 4598580 4671707 4650363 4416943 4608700 4855379 4754567
13909 4754567 4543051 4527426 4628840 4767375 4889173 4631721 4751008 4750101 4660759 4520253
13899 4520253 4480843 4505564 4798658 4587589 4526022 4689983 4610769 4577371 4558719 4559578 4971759
13888 4971759 4655788 4519094 4845678 4770456 4783194 4692278 4682139 4994231 5002801 4957713 4712193
13877 4712193 4692004 4871827 4677412 4626669 4539459 4885632 4741718 4609361 4752847 4845421
13867 4845421 4742448 4465227 4660568 4686287 4658910 4833075 4569327 4715050 4658536 4701903
13857 4701903 4851480 4529224 4702988 4571534 4604353 4757604 4568931 4719490 4881640 4673511
13847 4673511 4748288 4697593 4852882 4566864 4509247 4541684 4655152 4656520 4791343 4794892 4690797
13836 4690797 4755744 4494530 4544466 4572747 4604377 4769281 4633583 4499840 4728280 4724588
13826 4724588 4755921 4704921 4724701 4826517 4746213 4656476 4603241 4878212 5053840 4710140
13816 4710140 4737748 4805662 5166156 4966241 4790750 4728565 4698665 4546043 4460468 4633014
13806 4633014 4828127 4985848 4891430 4750302 4933269 4771172 4769825 4848429 4880001 4887457 4731686
13795 4731686 4843047 4910977 4735192 4688230 4907763 4869031 4944557 4942355 4764011 4882394
13785 4882394 4800291 4601543 4626425 4784175 5013426 4978253 4939285 4825702 4705245 4772173
13775 4772173 4819899 4536361 4920363 4892397 4569312 4747936 4886684 4873179 4652659 4680006
13765 4680006 4787177 4862762 4750554 4641986 4671394 4872809 4757649 4695734 4736646 4820920
$$ [...]
##END NTUPLES=NMR SPECTRUM
##END=
