##TITLE=1H_EC-3254(3-2)
 CDCl3, 8 sc, 
 1.06.2021
##JCAMPDX= 6.0         $$ Bruker NMR JCAMP-DX V2.0
##DATA TYPE= NMR SPECTRUM
##DATA CLASS= NTUPLES
##ORIGIN= UXNMR, Bruker Analytische Messtechnik GmbH
##OWNER= root
$$ XWIN-NMR		Version 3.5
$$ Tue Jun  1 12:22:23 2021 Russian Standard Time (UT+4h)  she@DPX200
##.OBSERVE FREQUENCY= 200.131506
##.OBSERVE NUCLEUS= ^1H
##.ACQUISITION MODE= SIMULTANEOUS
##.ACQUISITION SCHEME= undefined
##.AVERAGES= 8
##.DIGITISER RES= 18
##SPECTROMETER/DATA SYSTEM= spect
##.PULSE SEQUENCE= zg30
##.SOLVENT NAME= CDCl3
##.SHIFT REFERENCE= (INTERNAL, CDCl3, 0, 15.9823)
##AUDIT TRAIL= $$ (NUMBER, WHEN, WHO, WHERE, WHAT)
$$ ##TITLE= Audit trail, XWIN-NMR		Version 3.5
$$ ##JCAMPDX= 5.01
$$ ##ORIGIN= Bruker BioSpin GmbH
$$ ##OWNER= she
$$ F:/spectra/data/she/nmr/H-F/1/pdata/1/auditp.txt
$$ ##AUDIT TRAIL=  $$ (NUMBER, WHEN, WHO, WHERE, WHAT)
(   1,<2021-06-01 12:21:09.57 +0400>,<she>,<DPX200>,
      <created by zg, POWCHK disabled, PULCHK disabled
       configuration hash MD5:
       00 E9 B6 7A A2 85 ED C7 34 08 36 98 17 FE 4E 26
       data hash MD5: 16K
       93 07 59 CE 07 44 73 0B 40 DB 02 31 B5 32 D3 E2>)
(   2,<2021-06-01 12:21:11.96 +0400>,<she>,<DPX200>,
      <Start of raw data processing
       efp BC_mod = 2 LB = 0.24 FT_mod = 6 PKNL = 1 PHC0 = -11480.65 PHC1 = 13.20099 SI = 16K 
       data hash MD5: 16K
       E1 96 E7 32 06 3C AF BB 2B 11 A1 0D 9C EE 18 F7>)
(   3,<2021-06-01 12:21:34.40 +0400>,<she>,<DPX200>,
      <pk PHC0 = 4.618872 PHC1 = -4.4 
       data hash MD5: 16K
       C7 F2 5E 53 A7 43 CF 71 46 C1 7A 90 A0 5E 55 5E>)
(   4,<2021-06-01 12:21:37.92 +0400>,<she>,<DPX200>,
      <abs ABSG = 5 
       data hash MD5: 16K
       EA 3B 45 91 34 7C 09 CC D1 66 64 82 E1 7B 90 7F>)
$$ ##END=
$$ 
$$ hash MD5
$$ BD E5 1A 00 55 67 9C 35 E5 8C 1A 07 3A 5A AD 6D
##$RELAX= 
##$RELAX= 
##$RELAX= 
##$RELAX= 
##$RELAX= 
##$RELAX= 
$$ Bruker specific parameters
$$ --------------------------
##$DU= <F:/spectra>
##$EXPNO= 1
##$NAME= <H-F>
##$PROCNO= 1
##$TYPE= <nmr>
##$USER= <she>
##$AMP= (0..31)
100 100 100 100 100 100 100 100 100 100 100 100 100 100 100 100 100 100 
100 100 100 100 100 100 100 100 100 100 100 100 100 100 
##$AQSEQ= 0
##$AQ_mod= 1
##$AUNM= <au_zg>
##$AUTOPOS= <>
##$BF1= 200.13
##$BF2= 200.13
##$BF3= 200.13
##$BF4= 200.13
##$BF5= 200.13
##$BF6= 200.13
##$BF7= 200.13
##$BF8= 200.13
##$BYTORDA= 1
##$CFDGTYP= 0
##$CFRGTYP= 5
##$CHEMSTR= <none>
##$CNST= (0..31)
1 1 145 1 1 1 1 1 1 1 1 1 1 1 1 1 1 1 1 1 1 1 1 1 1 1 1 1 1 1 1 1 
##$CPDPRG= <>
##$CPDPRG1= <>
##$CPDPRG2= <>
##$CPDPRG3= <>
##$CPDPRG4= <mlev>
##$CPDPRG5= <mlev>
##$CPDPRG6= <mlev>
##$CPDPRG7= <mlev>
##$CPDPRG8= <mlev>
##$CPDPRGB= <>
##$CPDPRGT= <>
##$D= (0..31)
0 1.2 0 0 0 0 0 0 0 0.06 0 0.03 0 0 0 0 0.0002 0 0 0 0 0 0 0 0 0 0 0 0 
0 0 0 
##$DATE= 1622535669
##$DBL= (0..7)
120 120 120 120 120 120 120 120 
##$DBP= (0..7)
150 150 150 150 150 150 150 150 
##$DBP07= 0
##$DBPNAM0= <>
##$DBPNAM1= <>
##$DBPNAM2= <>
##$DBPNAM3= <>
##$DBPNAM4= <>
$$ [...]
##$SUBNAM3= <"">
##$SUBNAM4= <"">
##$SUBNAM5= <"">
##$SUBNAM6= <"">
##$SUBNAM7= <"">
##$SUBNAM8= <"">
##$SUBNAM9= <"">
##$SW= 16.9725357007746
##$SWIBOX= (0..15)
0 0 2 0 0 0 0 0 0 0 0 0 0 0 0 0 
##$SW_h= 3396.73913043478
##$TD= 16384
##$TD0= 1
##$TE= 0
##$TE2= 300
##$TE3= 300
##$TEG= 300
##$TL= (0..7)
0 120 120 120 120 120 120 120 
##$TP= (0..7)
150 150 150 150 150 150 150 150 
##$TP07= 0
##$TPNAME0= <>
##$TPNAME1= <>
##$TPNAME2= <>
##$TPNAME3= <>
##$TPNAME4= <>
##$TPNAME5= <>
##$TPNAME6= <>
##$TPNAME7= <>
##$TPOAL= (0..7)
0.5 0.5 0.5 0.5 0.5 0.5 0.5 0.5 
##$TPOFFS= (0..7)
0 0 0 0 0 0 0 0 
##$TUNHIN= 0
##$TUNHOUT= 0
##$TUNXOUT= 0
##$USERA1= <user>
##$USERA2= <user>
##$USERA3= <user>
##$USERA4= <user>
##$USERA5= <user>
##$V9= 5
##$VALIST= <valist>
##$VCLIST= <CCCCCCCCCCCCCCC>
##$VD= 0
##$VDLIST= <DDDDDDDDDDDDDDD>
##$VPLIST= <PPPPPPPPPPPPPPP>
##$VTLIST= <TTTTTTTTTTTTTTT>
##$WBST= 1024
##$WBSW= 4
##$XGAIN= (0..3)
0 0 0 0 
##$XL= 0
##$YL= 0
##$YMAX_a= 194328
##$YMIN_a= -180751
##$ZGOPTNS= <>
##$ZL1= 120
##$ZL2= 120
##$ZL3= 120
##$ZL4= 120
##$ABSF1= 15.98231
##$ABSF2= -0.9903536
##$ABSG= 5
##$ABSL= 3
##$ALPHA= 0
##$AQORDER= 0
##$ASSFAC= 0
##$ASSFACI= 0
##$ASSFACX= 0
##$ASSWID= 0
##$AUNMP= <proc_1d>
##$AZFE= 0.1
##$AZFW= 0.1
##$BCFW= 0
##$BC_mod= 2
##$BYTORDP= 0
##$COROFFS= 0
##$CY= -3
##$DATMOD= 1
##$DC= 0
##$DFILT= <>
##$DTYPP= 0
##$F1P= 0
##$F2P= 0
##$FCOR= 1
##$FTSIZE= 16384
##$FT_mod= 6
##$GAMMA= 0
##$GB= 0
##$INTBC= 1
##$INTSCL= 1.334414e-10
##$ISEN= 128
##$LB= 0.24
##$LEV0= 0
##$LPBIN= 0
##$MAXI= 10000
##$MC2= 0
##$MEAN= 0
##$ME_mod= 0
##$MI= 1.114404
##$NCOEF= 0
##$NC_proc= -9
##$NLEV= 6
##$NOISF1= 3.799351
##$NOISF2= 2.8
##$NSP= 0
##$NTH_PI= 0
##$NZP= 0
##$OFFSET= 15.98232
##$PC= 1
##$PHC0= -11476.03
##$PHC1= 8.800989
##$PH_mod= 1
##$PKNL= yes
##$PPARMOD= 0
##$PSCAL= 0
##$PSIGN= 0
##$REVERSE= no
##$SF= 200.130005828837
##$SI= 16384
##$SIGF1= 3
##$SIGF2= 2
##$SINO= 5.538805
##$SIOLD= 16384
##$SREGLST= <1H.CDCl3>
##$SSB= 0
##$STSI= 16384
##$STSR= 0
##$SW_p= 3396.73913043479
##$SYMM= 0
##$S_DEV= 0
##$TDeff= 16384
##$TDoff= 0
##$TI= <>
##$TILT= no
##$TM1= 0
##$TM2= 0
##$TOPLEV= 0
##$USERP1= <user>
##$USERP2= <user>
##$USERP3= <user>
##$USERP4= <user>
##$USERP5= <user>
##$WDW= 1
##$XDIM= 16384
##$YMAX_p= 502522554
##$YMIN_p= -4059303
$$ End of Bruker specific parameters
$$ ---------------------------------
##NTUPLES= NMR SPECTRUM
##VAR_NAME=  FREQUENCY,     SPECTRUM/REAL,   SPECTRUM/IMAG
##SYMBOL=    X,             R,               I
##VAR_TYPE=  INDEPENDENT,   DEPENDENT,       DEPENDENT
##VAR_FORM=  AFFN,          ASDF,            ASDF
##VAR_DIM=   16384,         16384,           16384
##UNITS=     HZ,            ARBITRARY UNITS, ARBITRARY UNITS
##FACTOR=    0.207333158178282, 1,           1
##FIRST=     3198.54176110611, 0,            0
##LAST=      -198.197369328684, 0,           0
##MIN=       -198.197369328684, -4059303,    0
##MAX=       3198.54176110611, 502522554,    0
$$ Real data points
##PAGE= N=1
##DATA TABLE= (X++(R..R)), XYDATA
$$ [...]
5090D2742409k198211j784623j739590j046623r06189j200779o74233j218181
5082C1973980j047918j120900o61247p94538k26105j63972l53287L19659k48373
5073B7677299k22823m84177q80759l19700o61227K23555l95054J34391j54170
5064B4917335l59673k41863J59687J32968k82634p95479j062744M01445j88765
5055B2680277J393533K41776r89582J92945N21358K93690j011920Q19658M5947
5046B4187682l31510O3815J317487p82099p02686m63137k9230J07482m77567L87474
5036B3277711l69502Q9869J9748q54646J45458K50554k16667N15325k53849L08742
5026B2912743l608M77911n88452n90555m5452K78475K4425K44915L54221N3171
$$ plain form
5090 42742409 40544198 38759575 37019985 35973362 35067173 33866394 33192161 31973980
5082 31973980 30926062 29805162 29143915 28349377 28123272 27959300 27606013 27925672 27677299
5073 27677299 27454476 26970299 26089540 25769840 25108613 25332168 24937114 25071505 24917335
5064 24917335 24557662 24315799 24475486 24608454 24325820 23530341 22467597 22869042 22680277
5055 22680277 24073810 24315586 23326004 23518949 24040307 24333997 23322077 24141735 24187682
5046 24187682 23856172 23919987 25237474 24455375 23752689 23289552 23260322 23367804 22890237 23277711
5036 23277711 22908209 22998078 23017826 22163180 22308638 22559192 22342525 22857850 22604001 22912743
5026 22912743 22909135 23387046 22798594 22208039 22162587 22441062 22465487 22710402 23064623 23117794
5016B3117794P39563o56628Q51271n75318P29308R02780j97873L00556n26440
5007B4685013K58014J14153J54596j317651O93673p51528o85184Q81288j25996
4998B3906378m8009n25576p5384n51733L68730L18612l10168L09739m86066L99122
4988B3305645M12349k07281j226557L76521P73212K01980N92947P62215n44263
4979B4446768K9966L25401K86305n50308j015931l3917P13671L33224j84099m10931
4969B3940149o06859J079556M57294L74757r35160p80879O5715M94754j01010
4960B3988317K29373l34493J98539N27717J55218N99374L0854J216343q9968O3033
4950B6584307K68538R0753p11461k30476K67763j042569O54395k10446J378431
$$ plain form
5016 23117794 23857357 23200729 24052000 23476682 24205990 25108770 24910897 25211453 24685013
5007 24685013 24943027 25057180 25211776 23894125 24587798 23836270 23151086 24032374 23906378
4998 23906378 23858369 23332793 23257409 22705676 23074406 23393018 23082850 23392589 22906523 23305645
4988 23305645 23717994 23510713 22284156 22660677 23433889 23635869 24228816 24991031 24446768
4979 24446768 24476734 24802135 25088440 24538132 23522201 23488284 24201955 24535179 24351080 23940149
4969 23940149 23333290 24412846 24870140 25244897 24309737 23528858 23594573 24089327 23988317
4960 23988317 24217690 23883197 24081736 24609453 24764671 25364045 25394899 26611242 26521274 26584307
4950 26584307 26852845 26943598 26232137 26001661 26269424 25226855 25881250 25670804 27049235
4941B7049235l92988k55279o81055M47727K74477O79751m14910p74083J019312
4932B6952187q4919L8786J14692K87656N24098Q82463O30722m94403q29516J386342
4922B9408108Q09483J166686J37399l66886l65403L57415l07627n58370m19777
4913B9861028l87950P0261o20724J41001m79229P14635L10726p0222R7006p48184
4903B8888348l43710j167719J677633n96289q2402L38334P12538o56467K13428
4894B8983694k97188k84144k56306p06160N5141n32394j06492l01677o35172P82588
4884B6701890m11968j123576n74428o26087P46310k66050N8440o43155N01892
4875B4363268m23862L09246L40290m16831p01301n1121J46540k56832J58647j081927
$$ plain form
4941 27049235 26656247 26400968 25719913 26167640 26442117 27121868 26706958 25932875 26952187
4932 26952187 26867268 26906054 27020746 27308402 27832500 28714963 29345685 28851282 28021766 29408108
4922 29408108 30217591 31384277 31521676 31154790 30789387 31146802 30839175 30280805 29861028
4913 29861028 29473078 29543339 28922615 29063616 28584387 29299022 29609748 29539526 29636532 28888348
4903 28888348 28544638 27376919 29054552 28458263 28375861 28714195 29426733 28770266 28983694
4894 28983694 28686506 28402362 28146056 27439896 27495037 26962643 26856151 26554474 25919302 26701890
4884 26701890 26289922 25166346 24591918 23965831 24712141 24446091 24504531 23861376 24363268
4875 24363268 23939406 24248652 24588942 24172111 23470810 23419689 23566229 23309397 23468044 22386117
4865B2386117j72123N14486K92573j93538j426940J448003J84727r23164K50134
4856B2360275j540153o27926l81293K27121R43653l87211m35698M02698O56372
4847B1217838q74343O55421p61991L08133l17152P15303l17911o07115p3063N97340
4837B0542460N79323k65710K10955p88252j20120K59794L14679r51984l88166
4828A9392979J136777K59967k43464Q00648l77314k19801m21150n18o2954O61754
4818B0926924j54530J285941O25731n50965o04111j056285K41410o95320K57872
4809B0276667J780482p58614K78963J231079o71831l41964L22936o26147L90526
4800B1882097j72443M79525J291519l91982m28469L09095j897950L3646N67467
$$ plain form
4865 22386117 22213994 22728480 23021053 22827515 21400575 22848578 23033305 22110141 22360275
4856 22360275 20820122 20192196 19810903 20038024 20981677 20594466 20158768 20561466 21217838
4847 21217838 20343495 20998916 20236925 20545058 20227906 20943209 20625298 20018183 19945120 20542460
4837 20542460 21121783 20856073 21067028 20278776 20158656 20418450 20733129 19781145 19392979
4828 19392979 20529756 20789723 20546259 21346907 20969593 20749792 20328642 20328124 20265170 20926924
4818 20926924 20772394 22058335 22684066 22133101 21528990 20472705 20714115 20018795 20276667
4809 20276667 22057149 21298535 21577498 22808577 22136746 21794782 22117718 21491571 21882097
4800 21882097 21709654 22189179 23480698 23088716 22660247 22969342 21071392 21105038 21672505
4791B1672505j39310L22932J94833O48352J348406p98452l79739r10266r00506
4782B1058755K80914J54242J93618P27081P6164m62050j98143J39340N80691k062456
4772B0488156N18165n81569N15212M61507J162245j88931N95443q91702K5804
4763B2104330o01261n64808J178878n76431p10113O73764L29856l22267r3396
4754B1418552j883231O92289Q79956j59661j23186R4521P25146j34835M00651
4745B1910202o62504N44654K01068L82376m65261p46423Q36203J39953M13937
4736B2554205k79399j91448L16809M31732j15401o43183o50493O73551L80378
4727B2476751k55837o60129j95216L06402N70784q69284J262116m40652Q1509
$$ plain form
4791 21672505 21533195 21856127 22050960 22699312 24047718 23249266 22869527 21959261 21058755
4782 21058755 21339669 21493911 21687529 22414610 22490774 22028724 21830581 21969921 22550612 20488156
4772 20488156 21006321 20424752 20939964 21401471 22563716 22374785 22970228 22078526 22104330
4763 22104330 21503069 20938261 22117139 21540708 20830595 21504359 21834215 21511948 21418552
4754 21418552 19535321 20227610 21107566 20947905 20824719 20919240 21644386 21509551 21910202
4745 21910202 21247698 21792352 21993420 22375796 21910535 21164112 22000315 22140268 22554205
4736 22554205 22274806 22083358 22400167 22831899 22716498 22073315 21422822 22096373 22476751
4727 22476751 22220914 21560785 21365569 21671971 22242755 21373471 22635587 22194935 22276444
4718B2276444m60712N38211p72594m00981N56073j15446o24133K97315K92940
4709B1587117P33002l91248k81648O44622M74570K96015m09588k60470Q01388
4700B3193760Q55993j003020J761915j076365L05927J15856k07794O87842P53695
4691B5387809q23043O64504M12053n83746N50261j070847Q00083O04466j81354
4682B5760186Q0155K03822J61059k2763k47192N9018J13352o18651R79756O14692
4672B7083434K054447l46385o75635l5286J150474j725366J81690Q06068J354445
4663B9847886J845091j16399J118221L94877J41130n53068k27742r94180L08689
4654C1764505k92500O60733j10559N33518n85877j466530p84920O04968k09966
$$ plain form
4718 22276444 21815732 22353943 21581349 21180368 21736441 21620995 20996862 21294177 21587117
4709 21587117 22320119 21928871 21647223 22291845 22766415 23062430 22652842 22392372 23193760
4700 23193760 24049753 23046733 24808648 23732283 24038210 24154066 23946272 24634114 25387809
4691 25387809 24564766 25229270 25641323 25057577 25607838 24536991 25337074 25941540 25760186
4682 25760186 25840341 26044163 26205222 26182459 25935267 25994285 26107637 25488986 26468742 27083434
4672 27083434 29137881 28791496 28115861 28080575 29231049 27505683 27687373 28493441 29847886
4663 29847886 31692977 31576578 32694799 33089676 33230806 32677738 32449996 31455816 31764505
4654 31764505 31472005 32132738 32022179 32555697 31969820 30503290 29718370 30323338 30113372
4645C0113372j8135J333748j34909n60L8577J244445N39682k96638O40810J82030
4635C3642422J669159J039468q35M17860P33733Q8009o93854j021476k10192m89930
4625C5174364Q0289l83329j86164j46008p49941m29728L95902K80640l20344o51021
4615C3064660K58168N73648Q56570j51770L15512N61750P00136N38362l63268
4606C6353768L14056J70627K10324j5607n26336J51093P02535r54350j399412
4597C5006698r08133R45079l51362k51251J96762L33179J94045P74693O32836
4588C6572546M63816J10056j024359O20318J648279r73914N38681R12324R23142
4579C9790889P85699L65389O55354m9870K19362o52427N73628K61626m77547J32601
$$ plain form
4645 30113372 30095237 31428985 31294076 31293516 31332093 32576538 33116220 32819582 33460392 33642422
4635 33642422 35311581 36351049 36350214 36768074 37501807 37589816 36895962 35874486 35664294 35174364
4625 35174364 35254653 34871324 34685160 34539152 33789211 33359483 33755385 34036025 33715681 33064660
4615 33064660 33322828 33896476 34753046 34601276 34916788 35478538 36178674 36717036 36353768
4606 36353768 36667824 36838451 37048775 37033168 36506832 36657925 37360460 36406110 35006698
4597 35006698 34098565 35043644 34692282 34441031 34637793 34970972 35165017 35939710 36572546
4588 36572546 37036362 37146418 36122059 36742377 38390656 37416742 37955423 38867747 39790889
4579 39790889 40576588 40941977 41597331 41547461 41766823 41114396 41688024 41949650 41472103 41604704
4569D1604704J950971L24841j060362N81106l22204J154962J171734j337274L53272
4560D4421750J819912O62239J370481J174975j253634Q19852k54850L69284J142704
4551E0272713p54935J501961L16235J800183m6054J409077J665700R35893J254944
4542E8355717j29523K93672r11180J22903n56970J286248j109925m98515J770188
4533E8622615O36465P43940k01155R10068J519578J963127K62713r77041N59870
4524F4040180J416859J818563P90042L59113J063153P06325K070064K285043J918596
4515G6467938Q36576K307694K471199L250223K266409J590318K809810L248445
4507I5248612J467126n29440J366032R07852J657766K076134K569330L047216
$$ plain form
4569 41604704 43555675 43880516 42820154 43401260 43079056 44234018 45405752 44068478 44421750
4560 44421750 46241662 46903901 48274382 49449357 48195723 49015575 48760725 49130009 50272713
4551 50272713 49517778 51019739 51335974 53136157 53090103 54499180 56164880 57100773 58355717
4542 58355717 58226194 58519866 57608686 57731589 57174619 58460867 57350942 56852427 58622615
4533 58622615 59259080 60003020 59801865 60711933 62231511 64194638 64457351 63480310 64040180
4524 64040180 65457039 67275602 68065644 68424757 69487910 70194235 72264299 74549342 76467938
4515 76467938 77304514 79612208 82083407 85333630 87600039 89190357 92000167 95248612
4507 95248612 96715738 96186298 97552330 98460182 100117948 102194082 104763412 107810628
4499A07810628K643672M064076N226402O773420M772472O109823P935098Q077596
4491A53413187Q000902N556020N440792L299833K261039N85188Q13817K62267
4483A79633045J083420K931116L351462M282137M792472N033022N681884O258788
4475B13047346O001562N873015N886340N410048O990102N113564O464328Q632012
4467B63418317R726945J1403418J3445835J3206206J2459742Q591434L609123
4460C35861020l42532n196112q176066j0917957j0224246r925149q887139o473401
4452B75718418n629405n926491n364529o372402o516583o191893o759791p033153
4444B25924171p149443p585439o607667o316394o048154m970942l397361k963552
$$ plain form
4499 107810628 110454300 114518376 119744778 126518198 131290670 137400493 145335591 153413187
4491 153413187 161414089 166970109 172410901 175710734 177971773 178556961 179370778 179633045
4483 179633045 180716465 183647581 186999043 191281180 196073652 201106674 206788558 213047346
4475 213047346 219048908 224921923 230808263 236218311 243208413 248321977 254786305 263418317
4467 263418317 273145262 284548680 297994515 311200721 323660463 332251897 335861020
4460 335861020 335518488 330322376 322146310 311228353 301004107 291078958 282191819 275718418
4452 275718418 270089013 264162522 258797993 252425591 245909008 239717115 232957324 225924171
4444 225924171 218774728 211189289 204581622 198265228 192217074 187246132 183848771 180885219
4436A80885219k213679l398348m377849o237626p887843q314001j0032407q976014
4428A29447452q334008o780093n729008m642163l825124l356532l680239k764741
4420I0335544r74523l033009j740673k153472j334218o12259j938658p11028k358788
4411G5478916k726052k636780p55250j422131j673225j180069K60879o17019j475098
4402F3254171j159782k040311L62945l94374k271773o60409J06241q45117k67477
4393E6084114n24969l80887r61239q74605K57280m60803j066872P58587q26423
4384E2004183j756615l94726j256243n65377j399851l22011j093722r47271q48088
4375D3420279o98266r22580j089764p45977j091429J47944q81409P46309r08196
$$ plain form
4436 180885219 178671540 175273192 170895343 164657717 156769874 148455873 138423466 129447452
4428 129447452 121113444 114333351 108604343 103962180 100137056 96780524 93100285 90335544
4420 90335544 89361021 86328012 84587339 82433867 81099649 80487390 78548732 77837704 75478916
4411 75478916 72752864 70116084 69360834 67938703 66265478 65085409 65346288 64729269 63254171
4402 63254171 62094389 60054078 60417023 60022649 57750876 57090467 57196708 56351591 56084114
4393 56084114 55559145 55178258 54217019 53342414 53599694 53138891 52072019 52830606 52004183
4384 52004183 50247568 49852842 48596599 48031222 46631371 46309360 45215638 44268367 43420279
4375 43420279 42722013 41799433 40709669 39963692 38872263 39020207 38138798 38885107 37976911
4366C7976911p91035m00574o1230j509638l97350m7041K70201m67235j119662
4357C3453347P70314l03619K97739q08952j63661n75504j10908m87755L47975
4348C2418976M89702K46600l02269J155028Q90856j845600p93236m5560L36048
4339C2550545j01774p41977j359684Q08843m89637M47080N32769m81529k4180
4330C1140456j268213r7028j3374q96683k81640m9544Q14122J713840j238479
4321B9823457q66381j93193K44643N40403R9319M29682p05883J43419J201694
4312C0717160J698279j080174j382104O60675R80296o13295L55498Q5271K88479
4303C1710085n67124L09906J107130l74877q20180m64648J631340J936072N42040
$$ plain form
4366 37976911 37185876 36785302 36724072 35214434 34817084 34770043 35040244 34573009 33453347
4357 33453347 34223661 33920042 34217781 33408829 33245168 32669664 32558756 32071001 32418976
4348 32418976 32908678 33155278 32853009 34008037 34898893 33053293 32260057 32214497 32550545
4339 32550545 32448771 31706794 30347110 31155953 30666316 31113396 31646165 31164636 31140456
4330 31140456 29872243 29775215 29761841 28865158 28583518 28533974 29348096 31061936 29823457
4321 29823457 28957076 28763883 29008526 29548929 29648248 30077930 29372047 29515466 30717160
4312 30717160 32415439 31335265 29953161 30613836 31594132 30980837 31336335 31421606 31710085
4303 31710085 31142961 31452867 32559997 32185120 31364940 30900292 32531632 34467704 35009744
4294C5009744J087517R08829J096648K860768J981828J641587K150348O33454
4286D7370723k35025j871636k922833l544824k908488k892458j783218j488639
4278B9723602k430624P48223l89832m9361j89112o2622N39090j208631r61975
4269B5718758n69764j68854n44357q10062O27288N11189J52675O719O18197j333773
4259B4208016m74937r59825J25075Q54485q63160m0542P91404l6607R8972j09431
4249B3593450j192335j154401K8113O02028O7083j528401Q01992Q79319Q31390
4240B2928238k72276j436566n13599P44741R89593l16185n08923j52903O62503
4231B2124623J20831m22225M03913n11174L03594p17553K96032O53121k54554
$$ plain form
4294 35009744 36097261 37006090 38102738 40963506 42945334 44586921 46737269 47370723
4286 47370723 47135698 45264062 42341229 38796405 35887917 32995459 31212241 29723602
4278 29723602 27292978 28041201 27651369 27602008 27412896 27350274 27889364 26680733 25718758
4269 25718758 25148994 24980140 24435783 23625721 24253009 24764198 24916873 24923592 25541789 24208016
4259 24208016 23733079 22773254 22898329 23752814 22889654 22849112 23640516 23603909 23702881 23593450
4249 23593450 22401115 21246714 21274827 21876855 21943938 20415537 21217529 22096848 22928238
4240 22928238 22655962 21219396 20705797 21450538 22440131 22123946 21615023 21462120 22124623
4231 22124623 22245454 21823229 22227142 21715968 22019562 21302009 21598041 22251162 21996608
4222B1996608k7896j068296Q20369l1425j225937k72535J283685n89341M5477
4213B0930709k20836J94331j80417j65698M3726p32580O95963P67298O41208J62874
4203B2136578N62007q26963O04265j322091j068385K76560L97218J54843M4240
4194B0958272O46536J3481O59641j050689n14421j038014K60500O66371O50100
4185B1251777O21749q67133j052401K60162J52334M35238o4816m23726L69873
4176B0683057n29602j537448J141312K04298J80542p00721K07318J987187K97197
4167B1933140M18759l65183K55981l39534p12876m69714l65838M1898q0666J564031
4157B1879998k83367R32196r62016o40585J546540o88966p66320J85755J45469
$$ plain form
4222 21996608 21968712 20900416 21720785 21689360 20463423 20190888 21474573 20885232 20930709
4213 20930709 20709873 20904204 20723787 20558089 20601815 19869235 20565198 21332496 21973704 22136578
4203 22136578 22698585 21871622 22475887 21153796 20085411 20361971 20759189 20914032 20958272
4194 20958272 21604808 21618289 22277930 21227241 20712820 19674806 19935306 20601677 21251777
4185 21251777 21873526 21006393 19953992 20214154 20366488 20801726 20736910 20313184 20683057
4176 20683057 20153455 18616007 19757319 19961617 20142159 19441438 19648756 21635943 21933140
4167 21933140 22351899 21986716 22242697 21903163 21190287 20720573 20354735 20396633 20315967 21879998
4157 21879998 21596631 22528827 21566811 20926226 22472766 21783800 21017480 21203235 21348704
4148B1348704Q30646N00076n67924j034169N38923m29519l3798k020991n17341
4139A8614607Q0436p61453O78956J66258l05439p99891K89114L29527O7778r65256
4129A7394637P62579m49114N42498p1487j62489R16063l23706j344518m09167
4120A6855296J215895k76793O2438j31208j15815O95583K50953m83724k1064P80673
4110A8832234j89362M18537o10473k70139Q60077L17599j013703l61935J04342
4101A8087177q78422o0409O16236K63980J237l62992L98753q06586m95527j023406
4091A5740041J154587l06291O54255O61756l58346L542o00150m39041k29860J199250
4081A7479743l97935j013426j215738q00259J417058n86563l56734p09109P9108
$$ plain form
4148 21348704 22179350 22679426 22111502 21077333 21616256 21186737 21152939 19131948 18614607
4139 18614607 18695043 17933590 18612546 18778804 18473365 17673474 17962588 18292115 18359893 17394637
4129 17394637 18157216 17708102 18250600 18179113 18016624 18932687 18608981 17264463 16855296
4120 16855296 18071191 17794398 17856836 17725628 17609813 18305396 18556349 18072625 18051561 18832234
4110 18832234 18642872 19061409 18450936 18180797 19040874 19358473 18344770 17982835 18087177
4101 18087177 17208755 17148346 17764582 18028562 18029799 17666807 18065560 17258974 16763447 15740041
4091 15740041 16894628 16588337 17242592 17904348 17546002 17549544 16949394 16510353 16280493 17479743
4081 17479743 17081808 16068382 14852644 14052385 15469443 14882880 14526146 13817037 13896145
4072A3896145O07385q59897k89700J19873J60190r14586K48259j74451n21584
4063A2271634n24878o8010J048985L21538M96973r88989l10591q07124M70691
4054A1910229O28342L14726n17545j053288J558514r39581L71266j21253L92002
4045A2543412p5776K92414p88701j399191Q93844p83571J148438J51830J6328
4036A1999027L57501n26849M84451k81938j048341n21897J081921j25783J205425
4027A2623517k73114p48907K45656J52292p04878l89889J148798N42154k07934
4018A2387695n19202m63291L90089J047516J267555L43401j066424l58851j90817
4009A2837671m27110J58951q2060q6331Q84459L88383J748239m59860o61379n13477
$$ plain form
4072 13896145 14503530 13643633 13353933 13473806 13633996 12719410 12967669 12793218 12271634
4063 12271634 11746756 11678746 12727731 13049269 13546242 12557253 12246662 11439538 11910229
4054 11910229 12538571 12853297 12335752 11282464 12840978 11901397 12272663 12151410 12543412
4045 12543412 12467636 12760050 11971349 10572158 11466002 10682431 11830869 11982699 11999027
4036 11999027 12356528 11829679 12314130 12032192 10983851 10461954 11543875 11418092 12623517
4027 12623517 12350403 11601496 11847152 11999444 11294566 10904677 12053475 12595629 12387695
4018 12387695 11868493 11405202 11795291 12842807 14110362 14453763 13387339 13028488 12837671
4009 12837671 12410561 12569512 12487452 12401121 13285580 13673963 15422202 14962342 14300963 13787486
3999A3787486k030102J210113K71020J8832r65301M35460P96861J340293j381012
3990A3483650k129109R29289P75892N99641q56325N5099j0189K76546k87725n40674
3980A2296095o09958J72144J804322n43820J03494r46230k17579N81619Q71882
3971A3511969p71028K05582j06708K8285J126520r67499P64632j437408L76786
3962A2731131J066205m43182m78647j7874O18346L35079M13316q18367O52836
3953A4058843P31197J567877l47572j412617K60359M12616P78756l64051m93570
3944A5191838K41958j19898L89044R38641P8221p43074m26134L13204L31696N63840
3934A6759336L83789P90316k03943M0675j209483p98018j93685l04463K6268J034652
$$ plain form
3999 13787486 11757384 12967497 13238517 13257349 12292048 12727508 13524369 14864662 13483650
3990 13483650 11354541 12283830 13059722 13659363 12803038 12858137 12847948 13124494 12836769 12296095
3980 12296095 11686137 11858281 13662603 13118783 13222277 12276047 12058468 12640087 13511969
3971 13511969 12740941 12946523 12839815 12868100 13994620 13027121 13791753 12354345 12731131
3962 12731131 13797336 13354154 12875507 12857633 13475979 13811058 14224374 13406007 14058843
3953 14058843 14790040 16357917 16010345 14597728 14858087 15270703 16049459 15685408 15191838
3944 15191838 15433796 15313898 15702942 16641583 16719804 15976730 15550596 15863800 16195496 16759336
3934 16759336 17143125 17933441 17729498 17770173 16560690 15762672 15568987 15264524 15290792 16325444
3924A6325444J385384Q9317n40523q70293L25272j45767M36586N90985J04518
3915A7700923J219308q96617J035472Q9995R98700N5079n99781l41507Q5283M53443
3905A9800298M29808K21845n18460o39765l33519P25674J321448m65414M7157
3896B0589072P32529Q6294l65621Q76690J45240K27952R36239m69131J244725
3887B4003989m71791l15367J09727N99806R56414L94345p5566J99377O4772m99479
3877B4966227L50525J43145R62409M48873R98311P41O30037l32737L01562N6912
3867B8526005r53281M12604N66257J976120M48074M56709M49759O61115J30679
3858C2674041J80916n36402O52229J300438J18184o08414P19961k01231Q77129
$$ plain form
3924 16325444 17710828 17800145 17259622 16389329 16714601 16568834 17005420 17596405 17700923
3915 17700923 18920231 18023614 19059086 19149081 20147781 20202860 19603079 19261572 19346855 19800298
3905 19800298 20230106 20451951 19933491 19293726 18960207 19685881 21007329 20541915 20589072
3896 20589072 21321601 21407895 21042274 21918964 22064204 22292156 23228395 22759264 24003989
3887 24003989 23532198 23216831 23326558 23926364 24882778 25277123 25201557 25400934 25465706 24966227
3877 24966227 25316752 25459897 26422306 26871179 27869490 27870231 28500268 28167531 28469093 28526005
3867 28526005 27572724 27985328 28551585 30527705 30975779 31432488 31882247 32543362 32674041
3858 32674041 32854957 32318555 32970784 34271222 34389406 33780992 34500953 34299722 35176851
3849C5176851l91573n4710K9750m58490R94813P72815p33988J052924J462212
3840C7850604J062410J026963m80409o74905J070393K042075k43007O34246J271550
3831D3559920J603290J853600q3400j87616J00767M48080K76870J008546J582811
3822E0162868P10869j7173k41085K53565m68041l12524J083051J201689J416077
3813E3789296R09489J893896M25041O88342J157832J404649J686432J449321J006104
3804F4410402J334698K902635P41110K865237J498660J245217J703508J197623
3796G7899090L2781L98571R78877q26930j61950k93227J045141J72326n23240
3787G8721439R34810O5551J47769N14743O37198J484784J401833J286698J444777
$$ plain form
3849 35176851 34785278 34730568 34760318 34301828 35296641 36069456 35335468 36388392 37850604
3840 37850604 38913014 39939977 39459568 38784663 39855056 41897131 41654124 42288370 43559920
3831 43559920 45163210 47016810 46933410 46745794 46846561 47294641 47571511 48580057 50162868
3822 50162868 50873737 50856564 50615479 50869044 50401003 50088479 51171530 52373219 53789296
3813 53789296 54698785 56592681 57017722 57706064 58863896 60268545 61954977 63404298 64410402
3804 64410402 65745100 68647735 69388845 72254082 73752742 74997959 76701467 77899090
3796 77899090 77931871 78330442 79309319 78482389 78320439 78027212 79072353 79244679 78721439
3787 78721439 79656249 79721800 79869569 80384312 81021510 82506294 83908127 85194825 86639602
3778H6639602J947784P09747J964830J028882J402120J528557J514049L889746
3770A00625317L016322L012310L064851K825735K331808L385316K891336K376723
3762A23529718J940229J245965J295132P17711L76233J21396K06744J921084J867935
3753A33222147J610196J941918K263500L145055L393855L249858L671366K204068
3745A54701963M042273M684191N037234M019098M979926N115018M870887O256475
3737A93707065N094121M799822N291775M374984M463262M244256K318205J043400
3729B25336890R89857j671488k900528m102125p145108o974912p746784q039897
3721A87745905q860088p230499o068168o564128m382064m114880l735213k542930
$$ plain form
3778 86639602 88587386 89297133 91261963 92290845 93692965 95221522 96735571 100625317
3770 100625317 103641639 106653949 109718800 112544535 114876343 118261659 121152995 123529718
3762 123529718 125469947 126715912 128011044 128728755 129104988 129226384 129433128 131354212 133222147
3753 133222147 134832343 136774261 139037761 142182816 145576671 148826529 152497895 154701963
3745 154701963 158744236 163428427 168465661 172484759 177464685 182579703 187450590 193707065
3737 193707065 198801186 203601008 208892783 213267767 217731029 221975285 224293490 225336890
3729 225336890 226326747 224655259 221754731 217652606 210507498 203532586 195785802 187745905
3721 187745905 178885817 171655318 165587150 159023022 154640958 150526078 146790865 144247935
3713A44247935l966543o049515m425100o037803n284484m026600n349805n102358
3705A04005727m058595l224579k980326l923581m025374q19792k027814j581564
3697H1364102k167244j461462n26798n56075k295265m28774q73845j386754j610794
3688G0057091k102286n20108m05034q27057o52881q67386k722506j101133j036452
3679E9822248j9867N0932j805939j298358j50124l2493j127536n55653j484352
3670E3398858r33657j394451j30473j212359j822487p13782m39861O16414O48769
3661D8016971k123887j132229M50532m34487J48793q29694o42467M3106o65693
3652D2830945n40629M84043j619054n36567j40925O9497r14379q23211n91677
$$ plain form
3713 144247935 140281392 134231877 129806777 123768974 118484490 114457890 109108085 104005727
3705 104005727 99947132 96722553 93742227 89818646 85793272 84973480 82945666 81364102
3697 81364102 79196858 77735396 77208598 76652523 74357258 73928484 73054639 71667885 70057091
3688 70057091 67954805 67434697 67029663 66202606 65549725 64682339 61959833 60858700 59822248
3679 59822248 59802381 59853313 58047374 56749016 56598892 56566399 55438863 54883210 53398858
3670 53398858 52465201 51070750 50940277 49727918 47905431 47191649 46751788 47368202 48016971
3661 48016971 45893084 44760855 45211387 44776900 44925693 44095999 43453532 43496638 42830945
3652 42830945 42290316 42774359 41155305 40618738 40477813 40547310 39632931 38809720 38218043
3643C8218043K96142O13327l85968P18629O59932r56198m73530j282314J97165
3634C7605228p19191p45863j35166J158322J65515N2362j176027p67676j77555
3625C5259949q64600J638659k72853k64326J48190O69988p20683k76955j081412
3616C4235957K61509k20250J01465J34487l6527Q1101K8027k70043K70692Q56426
3606C5442844p52188L55936r58301M12342Q28385k81293n1634m08046m76042j49037
3596C3962966N91563o30917P43817m59272J54376Q54437n01833m57207L15332
3587C4573262L43525L78652j26525n48755m38756K19698O48211o54118N28897
3578C4924091Q08386L03568k99648R01381m19995k7786J56756J276509K34336
$$ plain form
3643 38218043 38514185 39127512 38741544 39460173 40120105 39163907 38690377 37408063 37605228
3634 37605228 36886037 36140174 36005008 37163330 37328845 37381207 36205180 35437504 35259949
3625 35259949 34395349 36034008 35761155 35496829 35645019 36315007 35594324 35317369 34235957
3616 34235957 34497466 34277216 34378681 34513168 34476641 34557742 34585769 34315726 34586418 35442844
3606 35442844 34690656 35046592 34088291 34500633 35329018 35047725 34996091 34588045 34112003 33962966
3596 33962966 34554529 33923612 34667429 34208157 34362533 35216970 34715137 34257930 34573262
3587 34573262 34916787 35295439 35168914 34620159 34181403 34401101 35049312 34395194 34924091
3578 34924091 35732477 36036045 35736397 36637778 36217783 36189997 36346753 37623262 37857598
3569C7857598k99170L29361q59903m6011j241097p48894p71323j85628N15049
3560C4549982J28208P06888r45619M93727J3412N79438o32459q89618K82507k82273
3550C4004193L33989j483285q3849N69679J484546j756313m00414O32182j69237
3541C3131491p90035q2652O64695o8460L02278J298009R1746k11324l18511O33867
3531C4651104J308070r34507l9852K17256J613135m51734K47899o2297J000564
3522C7549638l81311l19650L68849k87086J388589m18404P40267k08354J563010
3513C9995548n32016q6520R06266J256267m06113N62688Q60870j09104M17250
3504D2865136k08371J177933O82029N63240l403J311995P88363J485275N82145
$$ plain form
3569 37857598 37558428 37887789 37027886 36981875 35740778 34991884 34220561 34034933 34549982
3560 34549982 34678190 35385078 34439459 34933186 34946598 35526036 34893577 34003959 34286466 34004193
3550 34004193 34338182 32854897 32771048 33340727 34825273 33068960 32668546 33300728 33131491
3541 33131491 32341456 32258804 32923499 32855039 33157317 34455326 34547072 34335748 34017237 34651104
3531 34651104 35959174 35024667 34984815 35202071 36815206 36363472 36611371 36549074 37549638
3522 37549638 37168327 36848677 37217526 36930440 38319029 37900625 38640892 38432538 39995548
3513 39995548 39463532 39377012 40283278 41539545 41133432 41696120 42556990 42447886 42865136
3504 42865136 42656765 43834698 44516727 45079967 45076564 46388559 47176922 48662197 49244342
3495D9244342Q16263o0343N82406J614471J399884J084074Q21691J263571J558090
3486E8324449P62262L31529n3059O39457n05066j82666J90155J007902l30341
3477F0184622j32124P82015M1714p29638N89276J346918J209782J188882N77392
3468F5058839J321524K320160K53652J564481K229085J220765J621504J638587
3460G7228597J483204K259532J608448J283482L519239K087260L504736L214614
3452I6189112K632428M226890N124497M647680N404789O165866N456404N769531
3444A35617197O754183P800884R365825R384867J0196989R500162J0289071R501798
3436B08410976J1499199J1097345J1723820J3549091J5340597J5116971J2416213
$$ plain form
3495 49244342 50060605 50000262 50582668 52197139 53597023 54681097 55502788 56766359 58324449
3486 58324449 59086711 59418240 59365181 60004638 59499572 59316906 59507061 60514963 60184622
3477 60184622 60052498 60834513 60876227 60146589 60735865 62082783 63292565 64481447 65058839
3468 65058839 66380363 68700523 68954175 70518656 72747741 73968506 75590010 77228597
3460 77228597 78711801 80971333 82579781 83863263 87382502 89469762 92974498 96189112
3452 96189112 98821540 103048430 108172927 112820607 118225396 124391262 129847666 135617197
3444 135617197 142371380 150172264 159538089 168922956 179119945 188620107 198909178 208410976
3436 208410976 219910175 231007520 242731340 256280431 271621028 286737999 299154212
3429B99154212R868049L685440n233087j1299186j6501405j9783701k1656522
3422B38233800k2362562j8929604j4437298j2312348j0371735p303645o816813
3415A45699795m071476m625534m651151l538240l123290l169487l258749k766668
3407A16495200l803963k094081m205345j391857k720845j706313p70228k384752
3399I7417816q31177p53115j216937j625127r40799j524964J529479r37290l04119
3390I0813767K93751P79247n86689J378804n18689K13569q53477K54072J25053
3381I1899408k12223P12244r88167l17706o20157k66903j301063J416535q40524
3372H9481444j31129p62436Q43014J416228j247222J70062L01443K29821j329128
$$ plain form
3429 299154212 309022261 312707701 307474614 296175428 279674023 259890322 238233800
3422 238233800 215871238 196941634 182504336 170191988 159820253 152516608 145699795
3415 145699795 141628319 137002785 132351634 128813394 125690104 122520617 119261868 116495200
3407 116495200 112691237 110597156 106391811 104999954 102279109 100572796 99802568 97417816
3399 97417816 96586639 95833524 94616587 92991460 92050661 90525697 92055176 91117886 90813767
3390 90813767 91107518 91886765 91300076 92678880 92160191 92373760 91520283 91774355 91899408
3381 91899408 91687185 92399429 91411262 91093556 90473399 90206496 88905433 90321968 89481444
3372 89481444 89350315 88587879 89430893 90847121 89599899 89769961 90071404 90301225 88972097
3363H8972097J06761k51082L86776M27680k23081J367267J078159P38294m01636
3354I2201235J200544J81312K29759k23453m53314M13862L66296j864852j304659
3345I0746730j224495q64309j101668j026923L77400P71505R07407O36170J262420
3336I0484237O78571j09162o5540l01391n33320j42939N34956P07434J636516
3327I2889362Q34941J284722K415278J437653J144468K688009K579685J327307
3319A06601425P52661r55850j383313k382537k830958l863862k792214l074952
3311I0070400k078432j717549m84173j492838j076043K93464m7543o81134J66263
3302H2952415o07310j40610N38607p91181J582222J020970N20826Q07239J154796
$$ plain form
3363 88972097 89078858 88827776 89214552 89642232 89419151 90786418 91864577 92602871 92201235
3354 92201235 93401779 93583091 93812850 93589397 93136083 93549945 93916241 92051389 90746730
3345 90746730 89522235 88657926 87556258 86529335 86906735 87678240 88585647 89221817 90484237
3336 90484237 91162808 91053646 90988106 90686715 90153395 90010456 90545412 91252846 92889362
3327 92889362 93724303 95009025 97424303 98861956 100006424 102694433 105274118 106601425
3319 106601425 107354086 106398236 105014923 102632386 99801428 95937566 93145352 90070400
3311 90070400 87991968 86274419 85790246 84297408 83221365 83514829 83467286 82786152 82952415
3302 82952415 82345105 82204495 82743102 81951921 83534143 84555113 85075939 85883178 87037974
3293H7037974J550308P48978p98862J007825L03429k69999O22513q99922p30563
3284H8571681j460372j816639j679883j71527K33333n74027r19868o54182K88631
3275H1817147n64347N94303M73310K57563K233933J102520K211276J624146J496226
3266I1246077J461035J769358K262408J933555L432522M421487M420752M255318
3258A15202512N126449M531673N317141L338999J309437J12556j086502l275866
3250A30576399n020200n139736m696050m435805k633197q09120M85842m03611
3242A07924522R0621m73543m0451p70968q15223k74992j311732o0670L52805J48186
3232A04768555j151501m84431K46594K343263L85054j09474K092285J391589J772767
$$ plain form
3293 87037974 88588282 89337260 88538398 89546223 89849652 89579653 90202166 89302244 88571681
3284 88571681 87111309 85294670 83614787 83443260 83676593 83102566 82182698 81528516 81817147
3275 81817147 81252800 81847103 82320413 82577976 84811909 85914429 88125705 89749851 91246077
3266 91246077 92707112 94476470 96738878 98672433 102104955 106526442 110947194 115202512
3258 115202512 120328961 124860634 130177775 133516774 134826211 134938767 133852265 130576399
3250 130576399 125556199 120416463 115720413 111284608 108651411 107842291 108328133 107924522
3242 107924522 108015143 107541600 107501149 106730181 105914958 105639966 104328234 104267564 104620369 104768555
3232 104768555 103617054 103132623 103379217 105722480 106107534 105998060 108090345 109481934 111254701
3223A11254701J373660m61143j80321l79995j494408k348155k307777k051462
3215A03405100k087972o21706J362387l80984r54730j23684n87435n94313r97986
3206I8418677j520557M20566n09600Q65732J107133Q51815L67699Q72341L13463
3197A01187269J370981n1419j00612L35152J074118J656186p03697q5135k27102
3188A04455741M30444q38251n31768n25308J333802r43889j000237O19219Q23346
3179A03823099P44049K08333M84246J880381J892114K411345K299980K439796
3171A16183343K984982J983042L536883M375816L793336M880474N842129P196879
3163A50776884P953754O343521N229491L541408k14797l999884o918296p985470
$$ plain form
3223 111254701 112628361 112167218 111986897 111606902 110112494 107764339 105456562 103405100
3215 103405100 101317128 100695422 102057809 101676825 100722095 100598411 100010976 99416663 98418677
3206 98418677 96898120 97318686 96809086 97674818 98781951 99633766 100001465 100873806 101187269
3197 101187269 102558250 102506831 102406219 102741371 103815489 105471675 104767978 104682843 104455741
3188 104455741 104886185 104047934 103516166 102990858 104324660 103380771 102380534 102999753 103823099
3179 103823099 104567148 104775481 105259727 107140108 109032222 111443567 113743547 116183343
3171 116183343 119168325 121151367 124688250 129064066 132857402 137737876 143580005 150776884
3163 150776884 158730638 165074159 170303650 173845058 173630261 169630377 162712081 154726611
3155A54726611q540933q531800p341251m625232m669430m220551m171621k378392
3147A10247401k475158k962329j570954j3700o67090n49588n69024k15447J06103
3138A01330214n77332J186274L70655n83412J164615k46013J635800K194266P43201
3129A07218268P31589J419669J108349J424432J974780K038248L551406K330832
3121A21797573L567271J228989J442573L46008J46857j029157k726594l932322
3113A20841198l063840l068937j054116j571820j445875r10998j04229J072373
3105A10693756J574952K22856J723269K755121M65769L218868K368926K637906
3097A25661423M113883M966467M624532O401249N329860M570570L176226J90400
$$ plain form
3155 154726611 146185678 137653878 130312627 125687395 121017965 116797414 112625793 110247401
3147 110247401 107772243 104809914 103238960 103225260 102558170 102008582 101439558 101224111 101330214
3138 101330214 100752882 101939156 102309811 101726399 102891014 102645001 104280801 106475067 107218268
3129 107218268 107949857 109369526 110477875 111902307 113877087 115915335 119466741 121797573
3121 121797573 125364844 126593833 128036406 128382414 128529271 127500114 124773520 120841198
3113 120841198 117777358 114708421 113654305 112082485 110636610 109725612 109621383 110693756
3105 110693756 112268708 112491564 114214833 116969954 117435723 120654591 123023517 125661423
3097 125661423 129775306 134741773 139366305 145767554 151097414 155667984 158844210 159034610
3089A59034610k350010m975770o292538p646296p609233p745473o008722n130318
3081A11276250k984453l704122l980595k742939l113248j654284j951410j905516
3073H9239683j480223n30753j537671P52840j669730k52541j371416k52133p4408
3064H2823648K29554K68287K36170m7572n58719J266772j411725j77686j717208
3055H0911521j671341m07793k38900j296305o32225p78188p07121j518972M09301
3046G4069977o2020q67006j07183M94268m60425q59134J037557j57844q42703
3037G2245487N55560N97574J006014j35713p18911L6367R29124K69006K08742
3028G4993250o13883J63820Q21011M30203p0393P80244O23503M73972M82470j04085
$$ plain form
3089 159034610 156684600 151708830 145416292 137769996 130160763 122415290 116406568 111276250
3081 111276250 108291797 104587675 100607080 97864141 94750893 93096609 91145199 89239683
3073 89239683 87759460 87228707 85691036 86443876 84774146 84521605 83150189 82898056 82823648
3064 82823648 83053202 83321489 83557659 83510087 82951368 84218140 82806415 82628729 80911521
3055 80911521 79240180 78832387 78593487 77297182 76664957 75886769 75179648 73660676 74069977
3046 74069977 74007957 73140951 73033768 73528036 73067611 72208477 73246034 73088190 72245487
3037 72245487 72801047 73398621 74404635 74268922 73550011 73586378 74515502 74784508 74993250
3028 74993250 74379367 74543187 75364198 75794401 75724008 76504252 77127755 77601727 78084197 77980112
3018G7980112l81463M84574o4359J151671K47499J429127J064161K69873R53712
3009H3134907R1654J400302J910578R82711O88311P58479J880990K181657J061072
3000I4090661O72067J140825J980745Q81437J923372K612986K374423J352271
2992A07028787K512283K816609L093191K849315L291164L083208L279787Q19160
2984A28773504O31409N09064o1469j806837k210917j823006N68312j520753m52671
2975A22606636o03242k15980M63718o55885m05262M09261O01392N60231J570397
2966A24331266l38335R30594O97852P8769O78039N93684Q7536J039261J410700
2957A29509366P18776R86627L42759O27489L10028l05452J496255J457553R16073
$$ plain form
3018 77980112 77598649 78083223 78018864 79170535 79418034 80847161 81911322 82181195 83134907
3009 83134907 83226561 84626863 86537441 87520152 88208463 88966942 90847932 93029589 94090661
3000 94090661 94762728 95903553 97884298 98765735 100689107 103302093 105676516 107028787
2992 107028787 109541070 112357679 115450870 118300185 121591349 124674557 127954344 128773504
2984 128773504 129404913 129913977 129852508 128045671 125834754 124011748 124580060 123059307 122606636
2975 122606636 122003394 121787414 122251132 121595247 121189985 121599246 122200638 122760869 124331266
2966 124331266 123992931 124923525 125621377 125700146 126378185 126971869 127059405 128098666 129509366
2957 129509366 130228142 131214769 131557528 132185017 132495045 132189593 133685848 135143401 136059474
2948A36059474Q43111M48808J245513J374649J544571Q26595O20395J899980J829742
2939A46692838J723786J539308J453776J214513K145817P66530J522284J868767
2931A58927619J617313J783269K885752J056050K242782K456465L35305J371647
2923A72676202K44968m661J211196J090681O47244J754062j00558J025632K456789
2914A81001555J398138r215J31613J108941R92757J004115J008620J514978J674957
2905A89826459J154623J073848R35397N97340p20018O16043K042190N44953J013480
2896A97084315J905144J717580K152803N59040O39229Q49881j4210L49594J250037
2887B06493413M62842M93586L79557L10080P9115o48116q66078M12236P4096M69344
$$ plain form
2948 136059474 136902585 137351393 138596906 139971555 141516126 142342721 142963116 144863096 146692838
2939 146692838 148416624 149955932 151409708 152624221 154770038 155536568 157058852 158927619
2931 158927619 160544932 162328201 165213953 166270003 168512785 170969250 171304555 172676202
2923 172676202 172921170 172916509 174127705 175218386 175865630 177619692 177519134 178544766 181001555
2914 181001555 182399693 182390478 182522091 183631032 184623789 185627904 186636524 188151502 189826459
2905 189826459 190981082 192054930 192990327 193587667 192867649 193483692 195525882 196070835 197084315
2896 197084315 198989459 200707039 202859842 203418882 204058111 204907992 204893782 205243376 206493413
2887 206493413 206956255 207449841 207829398 208139478 208218593 207570477 206704399 207116635 207190731 207660075
2877B07660075J174603L76330R16126N00046J379985j122639p66189K47375j74396
2868B10191316j956160p93914j724037k426462k356271k061963l555543l622756
2860A91694210k296867j573929j465426k336126j440246k101843k361854k014421
2852A76103498k978577l808484k103150k453725k037452k486763k262212j615704
2844A56357431j756475j278881j568347o5789p12204r85305j27848L41841R8854
2835A50303277o09988o17981P23638M47670p18672n62737J42450K98127O5417
2826A49471201N71122m87901P32347P26172L81389J209176N73462m2180Q40121
2817A53974909K33428r04510k94967k418088j646201L2433j060151k342949k092623
$$ plain form
2877 207660075 208834678 209211008 210127134 210627180 212007165 210884526 210118337 210365712 210191316
2868 210191316 208235156 207441242 205717205 203290743 200934472 198872509 195316966 191694210
2860 191694210 189397343 187823414 186357988 184021862 182581616 180479773 178117919 176103498
2852 176103498 173124921 169316437 167213287 164759562 162722110 160235347 157973135 156357431
2844 156357431 154600956 153322075 151753728 151687939 150975735 149990430 149862582 150204423 150303277
2835 150303277 149693289 149075308 149798946 150246616 149527944 148965207 149107657 149405784 149471201
2826 149471201 150042323 149554422 150286769 151012941 151394330 152603506 153176968 153134788 153974909
2817 153974909 154208337 153303827 153008860 150590772 148944571 148977004 147916853 145573904 143481281
2808A43481281j742070q50184j543965k331069k52118k044814j837763j067539
2800A31811759j651297k351998j786727j588871j911034j941434l399862k170319
2792A15010217j988914j635051k135662j077447o64076o42530j717555j404145
2784A03744837r10088j218366j511159j131531J314230n25159m95126P16863k64537
2775I9719964p48968N36673o04651l92671m96397O30683R18603Q91570j37200
2766A00317606L35022j07062j81484M8177k8226J629963J190741L72049n46968
2757A03029818J139225K12085M05180K04930K64335O17679O90726K627729J597908
2748A10789615M11977n32884J744493J330808Q88404J050093R82458K989122K482296
$$ plain form
2808 143481281 141739211 140889027 139345062 137013993 136761875 134717061 132879298 131811759
2800 131811759 130160462 127808464 126021737 124432866 122521832 120580398 117180536 115010217
2792 115010217 113021303 111386252 109250590 108173143 107509067 106866537 105148982 103744837
2784 103744837 102834749 101616383 100105224 98973693 100287923 99762764 99267638 99984501 99719964
2775 99719964 98970996 99507669 98903018 98510347 98013950 98644633 99563236 100454806 100317606
2766 100317606 100652628 100545566 100364082 100412259 100384033 102013996 103204737 103576786 103029818
2757 103029818 104169043 104381128 104786308 104991238 105255573 105873252 106563978 109191707 110789615
2748 110789615 111201592 110668708 112413201 113744009 114632413 115682506 116664964 119654086 122136382
2739A22136382K709999J954694J491297K660121J541098J902758L310543K846658
2731A40553550K981235M915794M222664M920825L779257K381563L786701K709178
2723A70250767K591078J603852J741363J800144K658197J452756J455100Q45807
2715A84399064L08119J305959O29549K449586K244179L255422L199432L197068
2707B00988378L469408K892490K863756L871675M481131M446697O112246O154566
2699B35280347N408605O175280N432002L216173K534085K46607j90483k203245
2691B55899371l243780j846691l485143l393213j878957k711502k177597k118967
2683B35043521k149130j413560k559474l479779m182135o157924p330761p361739
$$ plain form
2739 122136382 124846381 126801075 128292372 130952493 132493591 134396349 137706892 140553550
2731 140553550 143534785 148450579 152673243 157594068 161373325 163754888 167541589 170250767
2723 170250767 172841845 174445697 176187060 177987204 180645401 182098157 183553257 184399064
2715 184399064 184707183 186013142 186642691 189092277 191336456 194591878 197791310 200988378
2707 200988378 204457786 207350276 210214032 214085707 218566838 223013535 229125781 235280347
2699 235280347 240688952 246864232 252296234 255512407 258046492 258293099 258102616 255899371
2691 255899371 252655591 250808900 247323757 243930544 242051587 239340085 237162488 235043521
2683 235043521 232894391 231480831 228921357 225441578 221259443 215101519 207770758 200409019
2675B00409019q314165p623333p700413p060007n015764n020605m538420m266735
2667A50869577k689061j932892j748322l040360k728760j809312q99523p47195
2659A35274152j024585K77784r32880l11277k49829q84291o72463q47655q74294
2650A29754662o41817m33701j41514R19652n39834q51103n81562k14601J096297
2641A28366479r20817k91771J039585q5168j389823j228394p33935K88276p3379
2632A24971053j163527q3235M2536Q2927Q33260k24472M11072m78002Q00343J522933
2622A26714888Q44392J218948M66822R29120O45705J579455P73718J810448J14347
2613A35097843J458399J917523K129559K377162J630809J250317K196667K696262
$$ plain form
2675 200409019 192094854 184471521 176771108 169711101 164695337 159674732 155136312 150869577
2667 150869577 148180516 146247624 144499302 141458942 138730182 136920870 136021347 135274152
2659 135274152 134249567 134527351 133594471 133283194 133033365 132149074 131476611 130628956 129754662
2650 129754662 129112845 128679144 128537630 129457282 128917448 128066345 127484783 127270182 128366479
2641 128366479 127445662 127153891 128193476 128108308 126718485 125490091 124756156 125044432 124971053
2632 124971053 123807526 123724291 123766827 123849754 124683014 124458542 124869614 124391612 125191955 126714888
2622 126714888 127559280 128778228 129245050 130174170 130819875 132399330 133173048 134983496 135097843
2613 135097843 136556242 138473765 140603324 142980486 144611295 145861612 148058279 150754541
2605A50754541J950205L186597K187733J887433L060803K310170K627634M146564
2597A72111680K470263L638455M105368N153404L784926L941461L456439N638332
2589B04300328N296367O399294O608700N660605O980459O420289P886566Q348664
2581B57901272R288477Q655247J1044812R951924R722972Q967572P083016O939273
2573C29554565N587517M090202M060854M757000N082637O763442P713788Q611055
2565C76221060R257188Q484996O782941O494343M693187M976247K589462L114581
2557D22614005L406526M172712P662476P711036R112879J0232016J1059010J1212060
2549D87182720R493332M115829J730673m353873q585174j0030403j2173578j0278449
$$ plain form
2605 150754541 152704746 155891343 158079076 159966509 163027312 165337482 167965116 172111680
2597 172111680 174581943 178220398 182325766 187479170 191264096 195205557 198661996 204300328
2589 204300328 209596695 215995989 222604689 228265294 235245753 241666042 249552608 257901272
2581 257901272 267189749 275844996 286889808 296841732 306564704 315532276 322615292 329554565
2573 329554565 335142082 339232284 343293138 348050138 353132775 359896217 367610005 376221060
2565 376221060 385478248 393963244 400746185 407240528 411933715 416909962 419499424 422614005
2557 422614005 426020531 430193243 437855719 445566755 454679634 464911650 475970660 487182720
2549 487182720 496676052 500791881 502522554 498168681 489583507 479553104 467379526 457101077
2541D57101077p948162o145750l141624j625752m41877K50271k50163L78746M42796
2532D38619562j755707j191272r29342j748300j413007p19283o47539R8563k39098
2523D30074577J187163j28006j239030j277342l448689n648548p040482p451683
2515D05027960o300372n376041n267394m098977n690788o090143n639943p513679
2507C59050623q812140r175808r658497p649436r485990q496670p873888p926696
2499B89971498o654427p357401p969457o832222o790641o642675o445311p862986
2491B33416378p726287p489590q018280o875335p420159p263967o171368o508648
2483A75942744o285669m655928m699751m075441m799251m224809l106598k325700
$$ plain form
2541 457101077 449152915 443007165 439865541 438239789 437797912 438048183 437798020 438176766 438619562
2532 438619562 436863855 435672583 434743241 432994941 431581934 430862651 430215112 430313675 430074577
2523 430074577 431261740 431133734 429894704 428617362 425168673 419520125 412479643 405027960
2515 405027960 398727588 393351547 388084153 383985176 378294388 372204245 366564302 359050623
2507 359050623 350238483 341062675 331404178 323754742 314268752 305772082 297898194 289971498
2499 289971498 283317071 275959670 267990213 261157991 254367350 247724675 241279364 233416378
2491 233416378 225690091 218200501 210182221 203306886 195886727 188622760 182451392 175942744
2483 175942744 169657075 165001147 160301396 156225955 151426704 147201895 144095297 141769597
2475A41769597l970754k568567k922621l141357l084498l052458k110036k928879
2467A17990427k866535k946497k268009k298531q05547k165088k433739k071050
2459A00135431k013585j986114j925128k286985k111957j601152p81792k14296
2451H7214422k788881k356958j743994k134512j035311k629668j242609P57863
2443G4040352j059680j451925j067197l007763j085102j087052j663313k27218
2435F3391102r93996k192662O50304j700112j135309m91298k724314m1057o20258
2426E4142400m66544j223136j709953P77387r57306k529318l96136p99488n62529
2417D6275377j57101k560518M66827m03875j044933K35545q41611j695827M47580
$$ plain form
2475 141769597 137798843 135230276 132307655 129166298 126081800 123029342 120919306 117990427
2467 117990427 115123892 112177395 109909386 107610855 106805308 104640220 102206481 100135431
2459 100135431 98121846 96135732 94210604 91923619 89811662 88210510 87428718 87214422
2451 87214422 84425541 82068583 80324589 78190077 77154766 74525098 73282489 74040352
2443 74040352 72980672 71528747 70461550 67453787 66368685 65281633 63618320 63391102
2435 63391102 62397106 60204444 60854748 59154636 58019327 57528029 54803715 54762658 54142400
2426 54142400 53675856 52452720 50742767 51520154 50562848 48033530 47637394 46837906 46275377
2417 46275377 46118276 43557758 44024585 43620710 42575777 42811322 41969711 40273884 40721464
2408D0721464m02997o20488M91288k024224J555151j09098j426433p2222j278970
2399C6833471o92958R8563l47800q22163j00234q19675q0070J98551n93803j2653
2389C3661229j022053O32487m42153n97211n34605J80852n9473L80193p20501
2380C1478765r54654k25775q19597j33390L14909j515306k87782l68538m92736
2371B6995896N22826r8969k81181j120022j61948p18008J294901j644589p03846
2362B4085060q92723o77463l3562o0767Q1337L22066k71236r98927P46346o46258
2352B1653873o99152r53829L02580P32310l98030n71771J068951Q96931n56349
2343B1475514j9435o92959J95322L0375j315954J97857Q27071j18550l11868n95399
$$ plain form
2408 40721464 40318467 39697979 40189267 38165043 39720194 39611096 38184663 38112441 36833471
2399 36833471 36140513 36239076 35891276 35069113 34968879 34149204 34069134 34267685 33673882 33661229
2389 33661229 32639176 33271663 32829510 32232299 31697694 31878546 31819073 32199266 31478765
2380 31478765 30524111 30298336 29478739 29345349 29660258 28144952 27857170 27488632 26995896
2371 26995896 27518722 27419753 27138572 26018550 25856602 25138594 26433495 24788906 24085060
2362 24085060 23192337 22514874 22481312 22420545 22501882 22823948 22552712 21553785 22300131 21653873
2352 21653873 20954721 20000892 20303472 21035782 20637752 20065981 21134932 22031863 21475514
2343 21475514 21456079 20763120 20958442 20988817 19672863 19870720 20697791 20579241 20267373 19671974
2333A9671974J020352j94280k78757o8460k52095R4529o95677o46483O21082l74696
2323A8897489m15858J909950L16541j092401q84589N2406r0349N18687o91684
2314A8520192M17587J41686l52217q13166M42112O9319j39856R0773k06804J230770
2304A9400396Q26007j217479n67977J01573N38903l00959r19899M48486M50199
2295A8759250N53556j72922O01426j25711m65882J57781J88298J65354K22515
2286A9883665L21221O80359j28360o34687K8765J2943M6568r48001M08116Q18853
2276B0489442N14270J68229m61209l42925K42281n67803n32101L27055j79227
2267A9658012J088076K06004J63463L9759m57195p37292N39224n32408J09164
$$ plain form
2333 19671974 20692326 20498046 20219289 20150829 19898734 19993263 19297586 18651103 19272185 18897489
2323 18897489 18481631 20391581 20708122 19615721 18731132 18783538 18693189 19211876 18520192
2314 18520192 18937779 19079465 18727248 17914082 18356194 18425513 18285657 18376430 18169626 19400396
2304 19400396 20226403 19008924 18440947 18542520 19081423 18780464 17860565 18309051 18759250
2295 18759250 19312806 19139884 19741310 19615599 19149717 19307498 19495796 19661150 19883665
2286 19883665 20204886 20885245 20756885 20122198 20150963 20163906 20210474 19262473 19670589 20489442
2276 20489442 21003712 21171941 20710732 20367807 20610088 20042285 19510184 19837239 19658012
2267 19658012 20746088 20952092 21115555 21155314 20698119 19960827 20500051 19967643 20076807
2258B0076807o67478N4733P57325J86144K41056K06500k76712L00262J264431
2249B2143068m7925L65862n40452o19280O69609L73631L43980j68418l78241O28061
2239B2769895J50854N60153K87841m17856J14203L44193m47787J496642o89236
2230B4168902o93231R03228j11385P00948m94855n47103J184786J135465J81832
2221B6428587L09344j448993R2145J807923R0096q06534K39247J57962N8833Q97913
2211B7826523n67299R9671J46178M15447R10910J396723R7615J2560O20095N12934
2201C1471357r16999O95095J014172J335455M34205J40993J629855Q91626N15821
2192C7211580M20200J058918J104181J535204J262212J831544k05837M07371R71964
$$ plain form
2258 20076807 19409329 19464062 20221387 20407531 20648587 20855087 20578375 20878637 22143068
2249 22143068 22095143 22461005 21920553 21301273 21970882 22344513 22688493 22520075 22141834 22769895
2239 22769895 22920749 23480902 23768743 23350887 23465090 23809283 23361496 24858138 24168902
2230 24168902 23475671 24378899 24267514 24968462 24473607 23926504 25111290 26246755 26428587
2221 26428587 26737931 25288938 25381083 27189006 27279102 26472568 26711815 26869777 26928610 27826523
2211 27826523 27259224 27358895 27505073 27920520 28831430 30228153 30325768 30338328 30958423 31471357
2201 31471357 30554358 31249453 32263625 33599080 34033285 34174278 35804133 36695759 37211580
2192 37211580 37631780 38690698 39794879 41330083 42592295 44423839 44218002 44625373 45597337
2183D5597337K683918J697932J836624K117837J653020L123847L280773J713153
2175F3704441K153507K009485J187496J260720J398125Q84836P30733M18501Q03181
2166G4551025J089849n15868k20615q39957p48760j858277k426984o95156o98411
2157F7636846k028416j800617k670285j428690j520983l962888j645383j324948
2149E1254636k138996j619417p70868p05845J056619p18893n38511O12597k136461
2140D4294861P0365k526893k700553k331036k357073r00783j949977k284502p14149
2131B8600260o95272n56700j198581j049655o83534K16663q39200o50445r81178
2122B2162358N67128K90405r34994M90317n28941j444051K62167R07590k89577
$$ plain form
2183 45597337 48281255 49979187 51815811 53933648 55586668 58710515 61991288 63704441
2175 63704441 65857948 67867433 69054929 70315649 71713774 72598610 73329343 73747844 74551025
2166 74551025 75640874 75125006 74904391 74064434 73315674 71457397 69030413 68335257 67636846
2157 67636846 65608430 63807813 61137528 59708838 58187855 54224967 52579584 51254636
2149 51254636 49115640 47496223 46725355 46019510 47076129 46357236 45818725 46431322 44294861
2140 44294861 44365226 41838333 39137780 36806744 34449671 33548888 31598911 29314409 28600260
2131 28600260 27904988 27348288 26149707 25100052 24416518 24633181 23793981 23143536 22162358
2122 22162358 22729486 23019891 22084897 22575214 22046273 20602222 20864389 21771979 21482402
2113B1482402L35600L49972p9169Q94298R56705k38164l29440K62739l60675j778133
2103B1496135l14915n54027m46069j859791n13640o29752K57484K57411r12902
2094A6779934j2353j021047m27406r1500O58783j074007N01559K58972L24367
2085A5897302L49682k069357P38417j018784r0972P64626k67400K32281J223709
2076A5759504p96383l82769q55269p59235K12801j238538J33539R65986L35330
2067A3374966j4839j395528L13096l16109j286752l74923M56876N69746O98352
2058A2024885J36126j77314p05431j465118n61213K71003j50571R08414P83493
2049A1064274J26573L20330j445714l88976J59270m08750j80987N02071Q8691
$$ plain form
2113 21482402 21818002 22167974 22088805 22983103 23939808 23701644 23372204 23634943 23274268 21496135
2103 21496135 21181220 20627193 20181124 18321333 17807693 17177941 17435425 17692836 16779934
2094 16779934 16767581 15746534 15319128 15227628 15886411 14812404 15313963 15572935 15897302
2085 15897302 16246984 14177627 14916044 13897260 13806288 14570914 14303514 14535795 15759504
2076 15759504 14963121 14580352 13725083 12965848 13178649 11940111 12073650 13039636 13374966
2067 13374966 13360127 11964599 12277695 11961586 10674834 10299911 10756787 11326533 12024885
2058 12024885 12161011 11983697 11278266 9813148 9251935 9522938 9372367 10280781 11064274
2049 11064274 11190847 11511177 10065463 9676487 9835757 9427007 9246020 9748091 9836782
2040I836782P82743j47418K26433j51175k10546M8873p01917p79213k27683M05046
2030I081925k24831j63951R36784j65879j326568k56883n59828L90312P33039
2021H444120N04549q29401n68500R56090k60669J85517k149282n07931J31578
2012E906071K05471M35963K00676k2415k7940L31688p35360M37557l63682n03931
2002E864098O11142P10768J163415m77321m70774J09996m79161m01993K09352
1993F839522m68882q72626M47940L89565M20523N97269q16440K23625k9041K69997
1983G001452k02614k73101O67705R8847L46672N88187n63731j023783o72408O4038
1973F031264R99595k64194m12181Q5439M16880J816571j047221j835401Q03445
$$ plain form
2040 9836782 10619525 10472107 10698540 10547365 10336819 10385692 9683775 8904562 8676879 9081925
2030 9081925 8857094 8693143 9629927 9464048 8137480 7880597 7320769 7711081 8444120
2021 8444120 8948669 8119268 7550768 8506858 8246189 8431706 6282424 5774493 5906071
2012 5906071 6111542 6547505 6748181 6725766 6697826 7029514 6294154 6731711 6368029 5864098
2002 5864098 6475240 7186008 8349423 7872102 7401328 7511324 7032163 6630170 6839522
1993 6839522 6370640 5498014 5945954 6335519 6756042 7353311 6536871 6760496 6731455 7001452
1983 7001452 6798838 6525737 7193442 7292289 7638961 8227148 7663417 6639634 5967226 6031264
1973 6031264 7030859 6766665 6354484 6439923 6856803 8673374 7626153 5790752 6594197
1964F594197J260693j57333q80450k69524K03473J478354K86357M6596o05948
1955G956415j214210J50168J387975J32872m52153k13Q41667Q10151n74481J71452
1945I209643J27130m67611l24170M11377N77705O99337P6676R52098p4532o70783
1935A0516870k43926p75374R15113R76533j51621O82465L56232j242858n63518
1926A0469916J05056l4713P32778L09211n38500K213675R72637M76796n86596
1917A4120260p26344Q18026J68731k47513P79652N86510L1511J183682J64954
1908A6879469P32882J58116p33220L37759R64797k31207m66108j41261N10124
1899A8011351O39642r31703l41546n86211n13351k37484j193114J09369M77744
$$ plain form
1964 6594197 7854890 7697557 6817107 6547583 6751056 8229410 8515767 8562363 7956415
1955 7956415 6742205 6892373 8280348 8413220 7961067 7960854 8802521 9612672 9038191 9209643
1945 9209643 9336773 8869162 8544992 8956369 9534074 10233411 10310087 11262185 11187653 10516870
1935 10516870 10272944 9497570 10412683 11389216 11237595 11920060 12276292 11033434 10469916
1926 10469916 10574972 10540259 11273037 11582248 11043748 13257423 14230060 14706856 14120260
1917 14120260 13393916 14211942 14380673 14133160 14912812 15499322 15530833 16714515 16879469
1908 16879469 17612351 17770467 17037247 17375006 18339803 18108596 17642488 17501227 18011351
1899 18011351 18650993 17719290 17377744 16791533 16278182 16040698 14847584 14956953 15434697
1890A5434697m43376J006428M44087K13828r17329O14206R06329J343134j208020
1881A7393984Q39118L08380J943276J130648M6905J072839J47809p3734J279543
1872B4088768J580016m7841k74323J7655L25372O7862o52172j259205q25176j645372
1862B1375584L43248o21171j146332j96164n92820Q4438p22179j462421l53565
1853A6708618j26827M50710M84206J21891L02752J048329o1268J054790k41617
1844A9741584j68814M30104J019879M74928J811689J164572J919073L62195j565222
1835B5189988J4353k51538o02727k57246J47033J189938o80674L51101q6376j156467
1825B3857385j068424n31821q52910o38665K079927q30442J9207K74804K0841
$$ plain form
1890 15434697 14991321 15997749 16441836 16655664 15738335 16352541 17258870 18602004 17393984
1881 17393984 18233102 18541482 20484758 21615406 21662311 22735150 22882959 22809225 24088768
1872 24088768 25668784 25620943 25346620 25364275 25689647 25757509 25105337 23846132 23020956 21375584
1862 21375584 21718832 21097661 19951329 19755165 19162345 19246783 18524604 17062183 16708618
1853 16708618 16581791 17032501 17516707 17638598 17941350 18989679 18928411 19983201 19741584
1844 19741584 19572770 20002874 21022753 21497681 23309370 24473942 26393015 26755210 25189988
1835 25189988 25204341 24952803 24350076 24092830 24239863 25429801 24749127 25100228 25013852 23857385
1825 23857385 22788961 22257140 21404230 20765565 22845492 22015050 22034257 22309061 22329902
1816B2329902M03234n16657J3519J97934Q12024K361713R72726n5690P71288P67237
1806B8057230K09716j343881K74840m51167l14457j396119q98633j766397p91622
1797B1579510j096370r46979k39518j800186p65278L65121Q61267O2615Q71067
1788A8891249j270555L06408M42723k74451p95135l83359M82551M72068j63481
1779A7708018R23939L52641K50724O91948j173056n00795k0659m46142o60965
1770A7125653o99721O20247N73556L5959r26623j001047j132895j469312K74776
1761A3400593o62775k21188l26329M98142n1993p48473j588069Q82262O72666
1752A1854836j105298j085640J17342P37980k08730j332183j719443m16956N83866
$$ plain form
1816 22329902 22733136 22216479 22229998 22427932 23239956 25601669 26574395 26518705 27289993 28057230
1806 28057230 28266946 26923065 27197905 26746738 26432281 25036162 24137529 22371132 21579510
1797 21579510 20483140 19536161 19296643 17496457 16731179 17096300 17957567 18020182 18891249
1788 18891249 17620694 17927102 18369825 18095374 17300239 16916880 17399431 17871499 17708018
1779 17708018 18631957 18984598 19235322 19927270 18754214 18253419 18232760 17786618 17125653
1770 17125653 16425932 17046179 17619735 17655694 16729071 15728024 14595129 13125817 13400593
1761 13400593 12737818 12516630 12190301 12688443 12636450 11887977 10299908 11182170 11854836
1752 11854836 10749538 9663898 9781240 10519220 10310490 8978307 7258864 6841908 7425774
1743G425774Q50641j198097q63O93981N3343n19151p03212n25026m7931p4395
1733E955064m2707p21245M2825M41036j77857k99529q8534P77432j027629m7338
1723D811518j329922m6951N11982K03960P87671j83455P75529j575310R48258
1714D903280p54008j04763n06465l31458P878J378343N24938n09275n99775M16431
1704D425126q07630p18672R50596O48198K161p65529K74443l50778l70847j50793
1694C136275O76920L70596k01858k5508K61359q26817n49892m68134J16880R42677
1684C432498n58891N68758q26654N15080m29172p65125O26488n08145P35854m6276
1674B744415k62638N7855J023693m73902j31704m65806P2423o7064m90139k71263
$$ plain form
1743 7425774 8276415 7078318 7077455 7771436 7824779 7305628 6602416 6077390 6029459 5955064
1733 5955064 5912357 5191112 5233937 5674973 5497116 5197587 5109053 5886485 4858856 4811518
1723 4811518 3481596 3434645 3946627 4150587 4938258 4754803 5530332 3955022 4903280
1714 4903280 4149272 4044509 3538044 3206586 3214464 4592807 5117745 4608470 4008695 4425126
1704 4425126 3617496 2898824 3849420 4497618 4499779 3734250 4008693 3657915 3287068 3136275
1694 3136275 3813195 4183791 3981933 3956425 4217784 3390967 2841075 2372941 2489821 3432498
1684 3432498 2873607 3442365 2615711 3130791 2701619 1936494 2562982 2054837 2790691 2744415
1674 2744415 2481777 2539632 3563325 3089423 2957719 2491913 2564336 2497272 2007133 1735870
1664A735870k56253J90888R39937n68356P88465k02085N09288K37548k41170q70816
1654B263316P92877j78237n93777O89401r4063O32712m31994K80781j063475q0187
1644B217354n50769l7729k12301J3832O50025L56478m7987K10911o00866r35511
1634A063437K28852L44154l65326J89630j095144P05233J103136r23943r82289
1625B67740p64628J043314J257223O30238m59940o81630n00573M21397K05152
1616A418293n18572L47085r57458O19991J174459o67504k08958K44595J39500
1607A591431m42043O8784R9916Q52400n5046m19107m58732o41736Q00446P8442
1597A474755j2301J042497j019220j13470N33082L19761m58803J21184o13813
$$ plain form
1664 1735870 1479617 1670505 2610442 2042086 2830551 2628466 3137754 3375302 3134132 2263316
1654 2263316 3056193 2877956 2284179 2973580 2879517 3512229 3080235 3361016 2297541 2217354
1644 2217354 1666585 1628856 1416555 1430387 2080412 2436890 2388903 2599814 1998948 1063437
1634 1063437 1292289 1636443 1271117 1460747 365603 1070836 2173972 1250029 267740
1625 267740 -496888 546426 1803649 2433887 1973947 1292317 791744 1213141 1418293
1616 1418293 899721 1246806 289348 909339 2083798 1416294 1207336 1451931 1591431
1607 1591431 1149388 1218172 1318088 2170488 2115442 1696335 1237603 595867 1396313 1474755
1597 1474755 1462454 2504951 1485731 1372261 1905343 2225104 1766301 1887485 1273672
1588A273672j50023J68230O56623P1461m52708j125039m3931J104102l20813N2657
1578A234231o1006L5914m63697q8238R25812J47692L93141j072224K40245l64121
1568I27749L39222L40230k72524j5192j265962J318425m33252N49102n36772o79413
1558B71613k12721J020811O04072P9206l44147K47714M95114j075120j122180
1549c5638j99457j7561N93479J038825Q02367l01228j775814l66602J052903M97754
1539A289028j018413k17796J99353J041730J6516K96685q6760m17127P9597M1742
1529A224555L21090O60673p05542n39816K192308m6369J17751j032382j16965
1520B075303J003036m4359K44010p26979L03069K59102O79972K9119O99977l04268
$$ plain form
1588 1273672 1123649 1291879 1948502 2019963 1567255 442216 398285 1502387 1181574 1234231
1578 1234231 1173225 1209139 745442 657204 1583016 1730708 2123849 1051625 1291870 927749
1568 927749 1266971 1607201 1334677 1319485 53523 1371948 938696 1487798 951026 271613
1558 271613 58892 1079703 1683775 1762981 1418834 1666548 2161662 1086542 -35638
1549 -35638 -235095 -252656 340823 1379648 2182015 1880787 104973 -261629 791274 1289028
1539 1289028 270615 52819 252172 1293902 1310418 1607103 1520343 1103216 1182813 1224555
1529 1224555 1545645 2206318 1500776 960960 3153268 3106899 3224650 2192268 2075303
1520 2075303 3078339 3033980 3277990 2551011 2854080 3113182 3793154 3822273 4522250 4217982
1510D217982m15585N05681l82041N99341O7591K52787M75727r05081N26482O96769
1500E639653l83884l26909n82260m62627P72103N52663Q51328P23019j059473
1491E723613q41614m86184J18182n30055N58057m6918J060757Q04841q04235J60878
1481E717322n77592K5818j60050L78885J226576P15709N30147j48764L74026k015544
1471F066533O78609M78449n22217P18939M56448M28361m6545K52033q15606r19172
1461F775832m68568L2893k54718N1574j88177N926J82183m00650L64793l40943
1451E760145n19233o70515N1148J0583J65802M70566o9029m516o85855L1090k44185
1440D296001q91384J53443Q08072j81861K06825O6589o25086K07530L98625K50800
$$ plain form
1510 4217982 3802397 4308078 3926037 4525378 4592969 4845756 5321483 4416402 4942884 5639653
1500 5639653 5255769 4928860 4346600 3883973 4656076 5208739 6060067 6783086 5723613
1491 5723613 4881999 4395815 4513997 3983942 4541999 4495081 5555838 6360679 5556444 5717322
1481 5717322 5139730 5165548 5005498 5384383 6610959 7326668 7856815 7708051 8082077 6066533
1471 6066533 6745142 7223591 6701374 7420313 7876761 8305122 8258577 8510610 7695004 6775832
1461 6775832 6307264 6340157 6085439 6137013 5948836 5954762 6136945 5736295 6101088 5760145
1451 5760145 5240912 4570397 4621545 4632128 4797930 5268496 5199467 5194951 4509096 4540186 4296001
1440 4296001 3404617 3558060 4366132 4184271 4391096 4457685 3832599 4040129 4438754 4689554
1430D689554k8354q00218L82228o35973J84452l47181j204418M84689r9081p23808
1420A901890m4140k41102J12320O18171j496406P24754J231916L01447p85905
1411B322945r53258J220792P59369K39013r17874o44949o52212Q27851o83391
1402A518286k11692l7794n97902k26202o19282J7347k5915k75342J54251J779868
1392A475623m23225N50012M91280o37800o57930n48948n48458O75500k9138P1649
1382D18565J26805K97799k70710k43642k72179j21857J04889k71769O48527l18671
1372I7757J141408Q44007r53386n07189k12150M40462J289246r13951q30044j41305
1362B54855j20250O19731L22131n89566P97118o14147k61962N86864j013793p56960
$$ plain form
1430 4689554 4661200 3860982 4243210 3607237 3791689 3444508 2240090 2724779 2625698 1901890
1420 1901890 1857750 1616648 1728968 2347139 850733 1575487 2807403 3108850 2322945
1411 2322945 1369687 2590479 3349848 3588861 2670987 2026038 1373826 2201677 1518286
1402 1518286 1306594 1268800 670898 444696 -174586 -157239 -183154 -458496 -304245 1475623
1392 1475623 1052398 1602410 2093690 1455890 797960 249012 -299446 376054 346916 418565
1382 418565 545370 843169 572459 328817 56638 -65219 39670 -232099 416428 97757
1372 97757 1239165 2083172 1129786 622597 410447 850909 2140155 1226204 396160 254855
1362 254855 134605 754336 1076467 486901 1284019 669872 407910 994774 -19019 -775979
1352g75979N68336n94644O59852N78637q50652n69822p37146k39867p83742j99188
1342b944215K008110L86244R5897J451399m54596o99616o2014j401316J308861
1333c11246n98204l50425M84117N62923N37748k68828M514j7153j53824r99432
1323a109810P6687K30591P00072J62328j094898j46603Q0133l19275P87742O70962
1313C7929n4188J90194N51509l00516L61833n30044o4665K86650M71924m2234
1303I08392m94690o6313O34257N53363K72887n81838J88861m71645j124585J28737
1293e2574R90323M00358r033M6906L08415K98452j083156K88210K1615o63019
1283E46497o55023L30533M51617m9923O79059r56771r5940m75642J065694j03888
$$ plain form
1352 -775979 -207643 -802287 -142435 436202 -414450 -984272 -1721418 -1961285 -2745027 -2944215
1342 -2944215 -936105 -549861 -453964 997435 542839 -156777 -218791 -1620107 -311246
1333 -311246 -909450 -1259875 -775758 -212835 324913 56085 60599 43446 -110378 -1109810
1323 -1109810 -1033123 -802532 -102460 59868 -1035030 -1181633 -1101500 -1420775 -633033 37929
1313 37929 -16259 173935 725444 424928 786761 256717 192052 478702 950626 908392
1303 908392 413702 347389 981646 1535009 1807896 1226058 1414919 943274 -181311 -52574
1293 -52574 937749 1338107 1329074 1375980 1684395 1982847 899691 1187901 1209516 546497
1283 546497 -108526 222007 673624 623701 1302760 345989 250049 -225593 840101 736213
1273G36213l1916k42767k11035l11078j7859K90008j48946O52540L79186M74042
1263A568388n29035m46852p24648j186315n49043M26895R59351J444312L00938
1254A263991m86751o12174L1372j046349K22686K51698r34372P21731M14649M07678
1244B34159R37462k30362r74436Q47546P1562r67717n18685J21884N18307K83770
1234C23490j057469J141926j136768N69629l48815K1492N80537J88278J7716o30856
1224c30840J367m16133R52202o28797q4259j92667J171801l43838M99751j264366
1214f35779R0792r2499O38106l50548j860775N5088O5745J107093M8836K13181
1204g20760l13906M58978M52394R20523j167897J603o89167k45607R16392M26057
$$ plain form
1273 736213 704297 461530 250495 -60583 -78442 211566 62620 715160 1094346 1568388
1263 1568388 1039353 592501 -132147 -1318462 -1867505 -1440610 -481259 963053 1263991
1254 1263991 777240 165066 196438 -849911 -627225 -375527 -1309899 -588168 -173519 234159
1244 234159 1171621 941259 -33177 814369 885931 -81786 -600471 -478587 39720 323490
1234 323490 -733979 407947 -728821 -159192 -508007 -486515 94022 282300 300016 -330840
1224 -330840 -329473 -745606 206596 -422201 -506460 -699127 472674 128836 628587 -635779
1214 -635779 -544987 -637486 620 -349928 -2210703 -2155615 -2089870 -982777 -933941 -720760
1204 -720760 -1034666 -575688 -123294 797229 -370668 -369065 -1058232 -1303839 -387447 38610
1194C8610P30668p92987L94860J29514Q84550j350390J12068n96743R21334m3858
1184D27626P43683l51820p86270m70613L07909P99196r12543p53014k65676J009831
1174b51691L436J29101m42759J35173J85299l83667l04285P47252K53011k74471
1164b03601M257O08913N22070j653684K49586K38390n81440P89827J74924l07796
1154a58554l13550J10238O91189L02180m23059l04513k89774Q02697J54004j180228
1144f09370L01166k02506n59090L7373o46166k19418J121234J07406k48831M06946
1134e11256n04353J40620j288168J126499P98024m70775j80573J54027k00368
1125i36323R70606R27777o07656J59057m50435J98472K79078M36500R0511m0302
$$ plain form
1194 38610 769278 -23709 371151 500665 1385215 34825 146893 -449850 471484 427626
1184 427626 1171309 819489 33219 -437394 -129485 669711 -242832 -995846 -1261522 -251691
1174 -251691 -248255 -119154 -561913 -426740 -241441 -625108 -929393 -182141 70870 -203601
1164 -203601 -199344 409569 931639 -722045 -472459 -234069 -815509 -25682 149242 -158554
1154 -158554 -472104 -361866 329323 631503 208444 -96069 -385843 416854 570858 -609370
1144 -609370 -308204 -510710 -1069800 -1032427 -1678593 -1898011 -776777 -669371 -918202 -511256
1134 -511256 -1015609 -874989 -2163157 -1036658 -238634 -709409 -889982 -735955 -936323
1125 -936323 34283 962060 354404 513461 63026 261498 540576 977076 1067587 1027285
1115A027285k59262J342938R9197j061600q98105l53116N96468L88813j56372
1106G26246K13498N13792k86569P64531j72443n21513q16552J010639R72541k59767
1096B144403j141442L40059P62493K8021l17289K20274P66613l77014k97541J0742
1086B139319J037843K21156m28845p1592N8096J048430O41779M4470j079949o72663
1076B938044O34932l72355k05136N87407q11066q28399N45809k75236k76411L03603
1066B241192k18785J51344J034422j361500J64454M70702j462432m79411L5932
1057E75918J367917n68448l56707J346414O81703j414135M57620o1156J81996
1048B211122J98329p48659Q05274J642101j05486P7769r72459p28401O83133j95000
$$ plain form
1115 1027285 768023 2110961 2210158 1148558 250453 -102663 493805 882618 726246
1106 726246 939744 1453536 1166967 1931498 1759055 1237542 420990 1431629 2404170 2144403
1096 2144403 1002961 1343020 2105513 2133534 1816245 2036519 2803132 2426118 2128577 2139319
1086 2139319 3177162 3398318 2969473 2897881 2955977 4004407 4646186 4690656 3610707 2938044
1076 2938044 3572976 3200621 2995485 3582892 2771826 1943427 2489236 2214000 1937589 2241192
1066 2241192 2022407 2173751 3208173 1846673 2011127 2481829 1019397 539986 575918
1057 575918 1943835 1375387 1018680 2365094 3046797 1632662 2090282 2029126 2211122
1048 2211122 2409451 1660792 2466066 4108167 4002681 4080450 3107991 2379590 3062723 2867723
1038B867723j25204n12675Q74614Q58877K38262j467316N48245O7362K93978P6150
1028C720016M09925L47111k45499J35041K46698J90959M05059K62015j83420J065510
1018F353415M02313K44317k39616n97432Q95006Q84958M70605k10182J27498R4274
1008H425156O98783M8276r3011N28772M66128P69446L64111p94635l64282Q15670
998A0864414N34433Q12890l39157R85984J105351l01201P66230J200815l42788
989A5286971o23420P9025J889399J291974j46306J319357J882762O46668J853293
980B3479723K212295O37634K223423J400838K374135L894962K787933J424299
972D0435242K789990L980163M230360L426217K309496M946385L160554N834136
$$ plain form
1038 2867723 2742519 2229844 3104458 3963335 4201597 2734281 3282526 3349888 3643866 3720016
1028 3720016 4129941 4477052 4231553 4366594 4613292 4804251 5209310 5471325 5287905 6353415
1018 6353415 6755728 7000045 6760429 6162997 7058003 7942961 8413566 8203384 8330882 8425156
1008 8425156 9123939 9172215 9079204 9607976 10074104 10843550 11207661 10413026 10048744 10864414
998 10864414 11398847 12211737 11872580 12858564 13963915 13662714 14428944 15629759 15286971
989 15286971 14663551 14742576 16631975 17923949 17777643 19097000 20979762 21626430 23479723
980 23479723 25692018 26329652 28553075 29953913 32328048 36223010 39010943 40435242
972 40435242 43225232 47205395 51435755 54861972 57171468 62117853 65278407 71112543
964G1112543P202168Q588288J2331945J4555692J8013594K1422574J9509350J0871486
956A83607640O137958m844452j7481276k5706542k2027500k1396171j9264442
949G9025215j3554557r497321o371864m425197m013585m422081k510050j953456
941C2277104j974728j910318j486872k759620k186968k137585J28148k105067
933A7844094j149701j206001j467402k65890r4833n28025m1824Q89111l52994
924A3626535L37512j663680o53562o10567m89960j98004J04660j95969m73160
915I783805P52386j467847n11959j070382p1815L12224m50518L9984J09396k83282
905G141992j33707q04623l38580o82285K70838l14964K50739p00319j7821M24841
$$ plain form
964 71112543 78314711 86902999 99234944 113790636 131804230 153226804 172736154 183607640
956 183607640 189745598 184901146 167419870 141713328 119685828 98289657 79025215
949 79025215 65470658 55973337 49601473 45176276 41162691 36740610 34230560 32277104
941 32277104 30302376 28392058 26905186 24145566 21958598 19821013 19949161 17844094
933 17844094 16694393 15488392 14020990 13755100 13660267 13132242 13090418 13979529 13626535
924 13626535 13964047 12300367 11646805 11036238 10546278 10348274 10452934 10256965 9783805
915 9783805 10536191 9068344 8556385 7486003 7414188 7726412 7275894 7315878 7425274 7141992
905 7141992 7008285 6203662 5865082 5182797 5453635 5138671 5389410 4689091 4671270 5096111
895E096111p58962J012766n37385j68305N1428j34094o12664J292777n3900r85820
885D201952l93748l86853N40661L01042m18116j30732p23727r9594N69687r666
875C450906m32215j59142j41030O65443K70619j287888m47955l77126K66802j80567
865A627847P97525m02203N1431l83979l88087L85019j87590N50398r42049K53496
855A361808J14461j21801k38310L02556j046643K37617K87244K22913J03324l50814
845H72355m2493k28710O1522k10219K28336N12668J7469k38640O54627J02567
835A729482O1057j220408O10204P33972j53072j026732K99578O5161j26834L84737
825A357145m35812R43804j352141K58727Q51071M41023l06033n49919q90554K37384
$$ plain form
895 5096111 4337149 5349915 4812530 4644225 4695653 4561559 3948895 5241672 5187772 4201952
885 4201952 3808204 3421351 3962012 4263054 3844938 3714206 2990479 2890885 3460572 3450906
875 3450906 3018691 2859549 2718519 3383962 3654581 2366693 1918738 1541612 1808414 1627847
865 1627847 2425372 2023169 2074600 1690621 1302534 1687553 1499963 2050361 1108312 1361808
855 1361808 1476269 1354468 1116158 1418714 372071 609688 896932 1119845 1223169 872355
845 872355 829862 601152 662674 452455 680791 1193459 1210928 972288 1626915 1729482
835 1729482 1790539 570131 1180335 1914307 1761235 734503 1034081 1099242 972408 1357145
825 1357145 921333 1865137 512996 771723 1622794 2063817 1757784 1207865 317311 554695
815E54695N59817j393995N35643m63422P90351l56910j217365Q43800J70637O37128
805F60379m01143k99100p8150m79081o16142K75369J149147l44972R77379J42427
795I86113L01177j730609p14149m64354k81378J63282N616K566957M84530O27966
785A945151k14367K3137j475408m99431K07317m73947Q11052j75114k2568R02816
775A028638m0187j73900k75579m46419j034139P88561P85431O80016l72093p26960
765B13369Q44109k55182Q27002j309783o65990N14722K2117j60195K83782L09407
755F23358o6803Q09184q48996J09282L28021k288L21333o97255q57919p52686
745a034769J040654J431370n29925q94643L61066j66809L33185L43272j016485
$$ plain form
815 554695 1114512 -279483 256160 -207262 583089 226179 -991186 -147386 23251 660379
805 660379 259236 -39864 -118014 -597095 -1213237 -937868 211279 -133693 843686 986113
795 986113 1287290 -443319 -1157468 -1621822 -1903200 -1739918 -1734302 832655 1317185 1945151
785 1945151 1730784 1753921 278513 -220918 -13601 -487548 323504 148390 125822 1028638
775 1028638 988451 814551 538972 92553 -941586 -153025 632406 1312422 940329 213369
765 213369 1057478 802296 1629298 319515 -346475 168247 190364 30169 313951 623358
755 623358 556555 1365739 516743 626025 954046 951758 1273091 575836 -282083 -1034769
745 -1034769 5885 1437255 907330 12687 373753 206944 540129 883401 -133084
736a33084O03739J24780r970K23189p32440l21596m55804k22842J92300J16848
726f14880K71007P83998j17908J91448l07754l32462j501738O36978R03907K29296
716A41892n38408j37662Q16005q20997l65631l839l767o24901Q98009n00910j93818
705a334027q6615J363645o8964k08735o8177n35711M87528K8753K40239j191594
695a373658O24962N66748R61897j22311p50265Q3547R15847m27593r49012M14408
685e5430J65473O76667P28346Q14534k44568J02813K55195R428j317473P60001
675A894986J78486K25199l83185j314332P19966Q01162j51313k35541j226070
666E09358k60568R22795n92224P94038j078632r54354R7664M05075J27505J214576
$$ plain form
736 -133084 470655 595435 585465 808654 76214 -245382 -701186 -924028 -731728 -614880
726 -614880 -343873 440125 322217 513665 205911 -126551 -1628289 -991311 -87404 141892
716 141892 -396516 -534178 281827 -539170 -904801 -908640 -912407 -1537308 -639299 -1140209 -1334027
705 -1334027 -1420642 -56997 -125961 -334696 -402873 -938584 -451056 -422303 -182064 -1373658
695 -1373658 -748696 -181948 779949 657638 -92627 -9080 906767 479174 -469838 -55430
685 -55430 110043 786710 1515056 2329590 2085022 2187835 2443030 2452458 1134985 1894986
675 1894986 2073472 2298671 1915486 601154 1321120 2122282 1970969 1735428 509358
666 509358 248790 1171585 579361 1373399 294767 -659587 -561923 -156848 -29343 1185233
656A185233k53784m32898o19746K0001N1318k19677P80019K15385m79899K50837
646D96789J050901j192743j34380r5860j006692R34286L54829n31900K51628q54672
636g27814k10078Q7306l17082O57247k23809j80287J71916j20099K3521J96961
626f42218k34491J42318l12398l97423N2028M2183L17486j59011Q3158q08346
616a916714P54768O16335j86278k20219J047838o97833M48028m94305j05439p72038
606a525857L87295Q17282l93446m34884j415802J000192P61293N25996j338481
597a616412R59076o55707N72817l94033J53184O22597j139903K16971K25972k35073
587a290511M8063n12720q14963J757005J38582j34884J6379P09085J71984P33566
$$ plain form
656 1185233 931449 498551 -121195 -101194 -49876 -269553 510466 725851 245952 496789
646 496789 1547690 354947 220567 124707 -881985 52301 407130 -124770 126858 -727814
636 -727814 -937892 -850586 -1167668 -510421 -734230 -914517 -742601 -862700 -839179 -642218
626 -642218 -876709 -734391 -1046789 -1444212 -1392184 -1350001 -1032515 -1191526 -1108368 -1916714
616 -1916714 -1161946 -545611 -731889 -952108 95730 -602103 -154075 -648380 -753819 -1525857
606 -1525857 -1138562 -321280 -714726 -1149610 -2565412 -1565220 -803927 -277931 -1616412
597 -1616412 -657336 -1313043 -740226 -1134259 -981075 -358478 -1498381 -1281410 -1055438 -1290511
587 -1290511 -1242448 -1755168 -2570131 -813126 -674544 -809428 -793049 -83964 88020 821586
577H21586j308799J80919J49212o18636K8633p44764L57299r6684P50407m87943
567i68770M11756o07092J90127K37029M88688k26590J38604M86728M60650l88809
557B22321k46245j099865q21595K114014l89465r257r53496J10652N26899R7725
547d48312k93402l43432q22056R59077J188037j27719n25848J05478j326992R8556
537a536613L40974j69586O63574n44058M46815K23201N94728j034971M46440P34998
527A65502K76669r20999L7887O91545l77042K76416J098o88257m58559K09404
517g86336o33269N65645m81463m12472P51143K29903M68941k00606j055369J344934
507b08949J59378l59814m87798m40867Q66977L34719j92677n10281K21144m23231
$$ plain form
577 821586 -487213 -306294 -157082 -775718 -747085 -1491849 -1134550 -1231234 -480827 -968770
567 -968770 -557014 -1164106 -973979 -736950 -248262 -474852 -336248 150480 611130 222321
557 222321 -23924 -1123789 -1945384 168630 -220835 -230092 -1183588 -1072936 -546037 -448312
547 -448312 -741714 -1085146 -1907202 -948125 239912 112193 -413655 -308177 -1635169 -1536613
537 -1536613 -1195639 -1365225 -701651 -1245709 -798894 -575693 19035 -1015936 -569496 165502
527 165502 442171 -478828 -440941 250604 -126438 149978 151076 -537181 -995740 -786336
517 -786336 -1419605 -853960 -1335423 -1747895 -996752 -766849 -297908 -498514 -1553883 -208949
507 -208949 -49571 -409385 -897183 -1338050 -471073 -136354 -329031 -839312 -618168 -1041399
497a041399J331246l30147L05636o81210L08239K30507L56629q73799l24948M5388
487f73858J061998K85573o30346P9189j19470o38605n7281J089131j093872L06139
477c91402M78461j09268k9873o52806r29175K88662k4709J029005N7776O17063
467C33734O11864p77781j14794j410451M67803j85803J033494o38969M39886M3999
457a97018m18209j80632J07103J578054o59646m23319o28634L91229k77019P63984
447E5893j316732P89717k39052O88839L53411n23720r07954P88170O70414k11918
437A47068r12922l60010J044881m3418q72978q89248j79363j36493N13467K33285
427a455731n38022L90137J78856K97461r18417K86570p6061o6715N43737k527
$$ plain form
497 -1041399 289847 -40300 265336 -415874 -107635 122872 479501 -394298 -719246 -673858
487 -673858 388140 673713 43367 122556 3086 -635519 -692800 396331 -697541 -391402
477 -391402 87059 -22209 -52082 -704888 -1634063 -1345401 -1370110 -341105 -283329 333734
467 333734 945598 167817 53023 -1357428 -889625 -1075428 -41934 -680903 -241017 -197018
457 -197018 -615227 -795859 -688756 889298 229652 -193667 -822301 -431072 -708091 55893
447 55893 -1260839 -471122 -710174 -21335 332076 -191644 -1099598 -311428 358986 147068
437 147068 -765854 -1125864 -80983 -124401 -997379 -1886627 -2065990 -2202483 -1689016 -1455731
427 -1455731 -1993753 -1603616 -1424760 -1127299 -2045716 -1759146 -1835207 -1901922 -1358185 -1360712
417a360712j81372J452354r1349p31272l38338m23941n64778Q54957N94218j136875
407a927108O42579L74089P8246r4537P65110m70308M29110r86271M64772k22920
397i47238N72345q79799O6467J075634k46031l71702O39650l40287j050521Q12548
387f68934J55107r84933J413108o21143N52684m46754j029393N77719n25344p9993
377a657876K94103k98507m21084P61636Q7118J35635l37822m10224K21508p23809
367b349322P45274o73906R9477l63207q55566P11438K57078N18395l23909J829366
357d04882p30739M84940j91624m20443J15789L25878L58784L00325j47857l86670
347f96499j63831l38027M4314O27773J34030O32451p67759K44895n92059j123188
$$ plain form
417 -1360712 -1542084 -89730 -181079 -912351 -1250689 -1674630 -2239408 -1384451 -790233 -1927108
407 -1927108 -1284529 -910440 -832194 -926731 -161621 -631929 -202819 -1189090 -724318 -947238
397 -947238 -374893 -1254692 -1188225 -112591 -358622 -730324 -90674 -430961 -1481482 -668934
387 -668934 -513827 -1498760 -85652 -706795 -154111 -600865 -1630258 -1052539 -1577883 -1657876
377 -1657876 -1363773 -1662280 -2083364 -1321728 -1234610 -1098975 -1436797 -1847021 -1625513 -2349322
367 -2349322 -1604048 -2277954 -2178477 -2541684 -3397250 -2685812 -2428734 -1910339 -2234248 -404882
357 -404882 -1135621 -650681 -842305 -1262748 -1146959 -821081 -462297 -161972 -309829 -696499
347 -696499 -860330 -1198357 -1154043 -526270 -392240 240211 -527548 -282653 -874712 -1997900
337a997900l57129N47247m10252J109269Q89718p71195l19m96604K46212p31843
327a972796r9521Q04777l28074q50908J794771P73056l67793o55188o41105q67573
317b410354J208275L5484O16259J29918L24164j80643M24135M88504j497994k92360
307a154612Q01414L13984m1352o95239k02309M66945n51373N06404k8778r67108
297a552024m1689j45641P60214j276612M00512o33838K46844K07656l40818o8621
287b444017M18498N44596K50475J325547r26351q2074j503361q61054Q36864O39032
277a801845r72845L02192J60480J442777Q13945q12504m48794o87451k11249P83353
267a431941n31206O762N59387J32722J720805n35378j430419K62176L974J39277
$$ plain form
337 -1997900 -2355029 -1807782 -2218034 -1108765 -219047 -990242 -990561 -1487165 -1240953 -1972796
327 -1972796 -2072317 -1267540 -1595614 -2446522 -651751 121305 -246488 -901676 -1542781 -2410354
317 -2410354 -1202079 -1166595 -550336 -420418 -96254 -276897 147238 635742 -862252 -1154612
307 -1154612 -353198 -39214 -80566 -775805 -978114 -511169 -1062542 -556138 -584916 -1552024
297 -1552024 -1593713 -1739354 -979140 -2255752 -1855240 -2489078 -2242234 -2034578 -2375396 -2444017
287 -2444017 -2025519 -1480923 -1230448 95099 -831252 -913326 -2416687 -3277741 -2440877 -1801845
277 -1801845 -2774690 -2472498 -2312018 -869241 -55296 -867800 -1316594 -2004045 -2215294 -1431941
267 -1431941 -1963147 -1956385 -1396998 -1264276 456529 -78849 -1509268 -1247092 -1243118 -1103841
257a103841q90471N43080J07596K27368J83895J89766n18364N98358q03070O63673
247h02010N8630l85089K9303L70682l17307J05626K16205o34691J002852j00601
237d56400P31772l14644J9997n21223p50033p27367L51865R97791N6396N2812
227e59034N96543j051739j366524K98914J073193q98772n0382k0789P38969k03241
217a442862l47180m41373J195260J03516o90453m87701l64756k3702j42770R99859
207a642162k15349N01233m43649J18698l00756l40211l11850k553J58163P56359
197a722077l4297q10423J152877m93618k85578K38876p01245l69969j164266n08071
187d697791J454477P53401j30817j052362m44453J222457R54749j747683M45385
$$ plain form
257 -1103841 -1994312 -1451232 -1343636 -1116268 -932373 -742607 -1260971 -662613 -1465683 -802010
247 -802010 -743380 -1128469 -1099166 -728484 -1045791 -940165 -723960 -1358651 -355799 -456400
237 -456400 275372 -39272 -19275 -540498 -1290531 -2017898 -1666033 -668242 -611846 -559034
227 -559034 37509 -1014230 -2380754 -2081840 -1008647 -1907419 -1957801 -1978590 -1239621 -1442862
217 -1442862 -1790042 -2231415 -1036155 -932639 -1623092 -2110793 -2475549 -2499251 -2642021 -1642162
207 -1642162 -1857511 -1356278 -1799927 -1681229 -1981985 -2322196 -2634046 -2636599 -2478436 -1722077
197 -1722077 -1756374 -2566797 -1413920 -1907538 -2193116 -1954240 -2655485 -3025454 -4189720 -4697791
187 -4697791 -3243314 -2489913 -2620730 -3673092 -4117545 -2895088 -1940339 -3688022 -3242637
178c242637K49958M8934J076801q88974O76588n98706M97279n50607J92656j14195
168b652903K37425N4381M80344l21299k1723P28447L71718k23128q01544L46290
158a801992N59051Q16680J05782m54515R9573L86193j120274J6895k87334M50275
148a229666R3058L52816m63128J468608n00220J09880M0206n70373J64070k67632
138h02381k06l847M74726n10811O33179K11671m65860j98422N9810n33245p53944
127a889330M38785o35269O22234P65030M0582k51715o97265m497o0609n61999
117b234053m39907Q26500n11419O9981R90083L7109n75950K88062K77189m4960
107a317365m10902k89367M04587l8269j30097J91290l2988j40199m91286J181358
$$ plain form
178 -3242637 -2992679 -2943745 -1866944 -2755918 -2079330 -2678036 -2180757 -2731364 -2538708 -2652903
168 -2652903 -2415478 -2361097 -1880753 -2202052 -2223775 -1495328 -1123610 -1346738 -2148282 -1801992
158 -1801992 -1242941 -426261 -320479 -774994 -675421 -289228 -1409502 -1392607 -1679941 -1229666
148 -1229666 -1136608 -783792 -1246920 221688 -278532 -168652 -128446 -698819 -534749 -802381
138 -802381 -802587 -806434 -331708 -842519 -209340 2331 -463529 -661951 -602141 -1135386 -1889330
127 -1889330 -1450545 -2085814 -1463580 -698550 -657968 -909683 -1606948 -1611445 -1672054 -2234053
117 -2234053 -2673960 -1847460 -2358879 -2288898 -1298815 -1261706 -1837656 -1549594 -1272405 -1317365
107 -1317365 -1728267 -2017634 -1613047 -1651316 -1781413 -1590123 -1623111 -1763310 -2254596 -1073238
97a073238m31461l32062M17801r27427N008N11849r67996K11839P36750K28552
87a620385M26720q2965j095887k10099m78172K5662M5723m9864O2583J64564Q79661
76a932459J79610k74729J38957o6230o96192L00273k13944O07528m15140m2099
66b414425k03534j56662Q62434j48323L09419m80484N21775k6697o01023j62856
56b500376K60064L60387l78233m29237o9981k81692j42286j94249K88669Q48510
46b238424m96966n69292M56159P49848m71023k81283J65536P58485m65052L05771
36b086241L97186J041035j010629J42622k86185k0549j36002m54507N66934Q03711
26a042625R04645m89611l32323q4603K02598m88339J80459J04403j65399j70214
$$ plain form
97 -1073238 -1504699 -1836761 -1418960 -2346387 -2341379 -1829530 -2797526 -2585687 -1848937 -1620385
87 -1620385 -1193665 -1276630 -2372517 -2582616 -3060788 -3035126 -2989403 -3039267 -2976684 -2812120 -1932459
76 -1932459 -1752849 -2027578 -1888621 -1954851 -2651043 -2350770 -2564714 -1957186 -2372326 -2414425
66 -2414425 -2617959 -2774621 -1912187 -2060510 -1751091 -2231575 -1709800 -1736497 -2337520 -2500376
56 -2500376 -2240312 -1879925 -2258158 -2687395 -2757376 -3039068 -3181354 -3375603 -3086934 -2238424
46 -2238424 -2735390 -3304682 -2848523 -2098675 -2569698 -2850981 -2685445 -1926960 -2392012 -2086241
36 -2086241 -1689055 -648020 -1658649 -1516027 -1802212 -1822761 -1958763 -2413270 -1846336 -1042625
26 -1042625 -137980 -627591 -959914 -1044517 -841919 -1330258 -1149799 -1045396 -1210795 -1381009
16a381009L16603q18n64491j202914k90384P94869k2297l97455O35332l58446
6b471010k15886Q11856p94246k454m21741j01407
0c194888
$$ plain form
16 -1381009 -1064406 -1065224 -1629715 -2832629 -3123013 -2328144 -2350441 -2747896 -2112564 -2471010
6 -2471010 -2686896 -1875040 -2669286 -2671740 -3093481 -3194888
0 -3194888
$$ Imaginary data points
##PAGE= N=2
##DATA TABLE= (X++(I..I)), XYDATA
16383a3167894K05560k04659J372232M32958O83127K59575l20125k38449P9401
16374a0898274n0739r9412J369667m62380k46900L76749J000415L20579k7104
16365h717399K031L29184j4371j91567k5852J77840M6841L9034L73457N48030
16355g432772Q70556Q9371p52366P4089L52000k88701l54097J004285n04440Q10326
16345f131749K60921P08584k78435j241258J72761J159601L31736m31362l99402
16336e848603P26265R92872p52239M32862m39858r2732R56889L98967K44964L63308
16326c017305n29244P59072K98620o16789p52072N181J014639J143649m95479
16317b189728k39964Q77095m73517J94776k09950K8807J37163O72112K57224n15842
$$ plain form
16383 -13167894 -12962334 -13166993 -11794761 -11361803 -10678676 -10419101 -10739226 -10977675 -10898274
16374 -10898274 -10949013 -11048425 -9678758 -10141138 -10388038 -10011289 -9010874 -8690295 -8717399
16365 -8717399 -8715368 -8386184 -8400555 -8592122 -8617974 -8440134 -8393293 -8354259 -7980802 -7432772
16355 -7432772 -6562216 -6472845 -7225211 -7151122 -6799122 -7087823 -7441920 -6437635 -6942075 -6131749
16345 -6131749 -5870828 -5162244 -5440679 -6681937 -6509176 -5349575 -5017839 -5449201 -5848603
16336 -5848603 -5122338 -4129466 -4881705 -4448843 -4888701 -4981433 -4024544 -3625577 -3380613 -3017305
16326 -3017305 -3546549 -2787477 -2488857 -3105646 -3857718 -3852537 -2837898 -1694249 -2189728
16317 -2189728 -2429692 -1552597 -2026114 -1831338 -2041288 -2012481 -1875318 -1203206 -945982 -1461824
16307a461824k774J14148l28104q100J234723j212114n4557p723n4150K65603
16297a514872K01445O04114R15533p55744j06113L12102J7593r41399K76273J065657
16287G4589J38689L96866O72105k48989j1146K46580r15339K74254j35091N12437
16277A004955P52393N35771Q34343j20543o79034R91059j33330n84766J79542
16268B780390L43541J0056M6850n39100J258814k24698q01161r944j22616J74523
16258B916655K79353K74305M19861q29649k85961n25K43721P9994o81542r57062
16248A459150J330438L45238n74341o23947p12537N00439Q53657M27042L47807
16239C352946k08408n79475J411916l32276K07890j27737q56086L69438J22155
$$ plain form
16307 -1461824 -1464598 -1350450 -1678554 -1686654 -451931 -1664045 -1718602 -1726325 -1780475 -1514872
16297 -1514872 -1313427 -709313 206220 -549524 -655637 -343535 -325942 -1267341 -991068 74589
16287 74589 213278 610144 1282249 1033260 1022114 1268694 353355 627609 492518 1004955
16277 1004955 1757348 2293119 3127462 3006919 2327885 3318944 3185614 2600848 2780390
16268 2780390 3123931 3133987 3180837 2641737 3900551 3675853 2874692 2864748 2742132 2916655
16258 2916655 3196008 3470313 3890174 3060525 2774564 2774039 3017760 3097754 2416212 1459150
16248 1459150 2789588 3134826 2560485 1936538 1224001 1724440 2578097 3005139 3352946
16239 3352946 3144538 2565063 3976979 3644703 3852593 3724856 2868770 3238208 3360363
16230C360363j01377J198471o54595k37228M40729m8496Q6866O33763M44177L13403
16220E436076J99117j15864M5592J86486J29359l89206P9509j49505o65958k36763
$$ plain form
16230 3360363 3258986 4457457 3802862 3565634 4006363 3957867 4044733 4678496 5122673 5436076
16220 5436076 5635193 5519329 5564921 5751407 5880766 5491560 5571069 5421564 4755606 4518843
$$ [...]
##END NTUPLES=NMR SPECTRUM
##END=
