##TITLE=1H_EC-3254(3-1)
 CDCl3, 8 sc, 
 1.06.2021
##JCAMPDX= 6.0         $$ Bruker NMR JCAMP-DX V2.0
##DATA TYPE= NMR SPECTRUM
##DATA CLASS= NTUPLES
##ORIGIN= UXNMR, Bruker Analytische Messtechnik GmbH
##OWNER= root
$$ XWIN-NMR		Version 3.5
$$ Tue Jun  1 12:28:59 2021 Russian Standard Time (UT+4h)  she@DPX200
##.OBSERVE FREQUENCY= 200.131506
##.OBSERVE NUCLEUS= ^1H
##.ACQUISITION MODE= SIMULTANEOUS
##.ACQUISITION SCHEME= undefined
##.AVERAGES= 8
##.DIGITISER RES= 18
##SPECTROMETER/DATA SYSTEM= spect
##.PULSE SEQUENCE= zg30
##.SOLVENT NAME= CDCl3
##.SHIFT REFERENCE= (INTERNAL, CDCl3, 0, 15.9823)
##AUDIT TRAIL= $$ (NUMBER, WHEN, WHO, WHERE, WHAT)
$$ ##TITLE= Audit trail, XWIN-NMR		Version 3.5
$$ ##JCAMPDX= 5.01
$$ ##ORIGIN= Bruker BioSpin GmbH
$$ ##OWNER= she
$$ F:/spectra/data/she/nmr/H-F/1/pdata/1/auditp.txt
$$ ##AUDIT TRAIL=  $$ (NUMBER, WHEN, WHO, WHERE, WHAT)
(   1,<2021-06-01 12:27:44.65 +0400>,<she>,<DPX200>,
      <created by zg, POWCHK disabled, PULCHK disabled
       configuration hash MD5:
       00 E9 B6 7A A2 85 ED C7 34 08 36 98 17 FE 4E 26
       data hash MD5: 16K
       40 83 18 3F A1 E1 84 00 C9 18 D7 86 C7 E2 42 B0>)
(   2,<2021-06-01 12:27:46.89 +0400>,<she>,<DPX200>,
      <Start of raw data processing
       efp BC_mod = 2 LB = 0.24 FT_mod = 6 PKNL = 1 PHC0 = -11476.03 PHC1 = 8.80099 SI = 16K 
       data hash MD5: 16K
       34 32 A9 F6 F8 20 79 5B A0 70 BE F2 2D 29 4D C3>)
(   3,<2021-06-01 12:28:06.89 +0400>,<she>,<DPX200>,
      <pk PHC0 = 0.5994434 PHC1 = -0.9999999 
       data hash MD5: 16K
       9A 35 EF 21 2E EB C5 AC 24 89 77 A5 24 65 F1 71>)
(   4,<2021-06-01 12:28:10.18 +0400>,<she>,<DPX200>,
      <abs ABSG = 5 
       data hash MD5: 16K
       A9 62 0B 22 07 C5 6F F0 BA 75 E0 AD 0C 06 DA B3>)
$$ ##END=
$$ 
$$ hash MD5
$$ 01 7E 86 12 A2 AE DE F2 4A 3A 0C 99 3C E2 20 0F
##$RELAX= 
##$RELAX= 
##$RELAX= 
##$RELAX= 
##$RELAX= 
##$RELAX= 
$$ Bruker specific parameters
$$ --------------------------
##$DU= <F:/spectra>
##$EXPNO= 1
##$NAME= <H-F>
##$PROCNO= 1
##$TYPE= <nmr>
##$USER= <she>
##$AMP= (0..31)
100 100 100 100 100 100 100 100 100 100 100 100 100 100 100 100 100 100 
100 100 100 100 100 100 100 100 100 100 100 100 100 100 
##$AQSEQ= 0
##$AQ_mod= 1
##$AUNM= <au_zg>
##$AUTOPOS= <>
##$BF1= 200.13
##$BF2= 200.13
##$BF3= 200.13
##$BF4= 200.13
##$BF5= 200.13
##$BF6= 200.13
##$BF7= 200.13
##$BF8= 200.13
##$BYTORDA= 1
##$CFDGTYP= 0
##$CFRGTYP= 5
##$CHEMSTR= <none>
##$CNST= (0..31)
1 1 145 1 1 1 1 1 1 1 1 1 1 1 1 1 1 1 1 1 1 1 1 1 1 1 1 1 1 1 1 1 
##$CPDPRG= <>
##$CPDPRG1= <>
##$CPDPRG2= <>
##$CPDPRG3= <>
##$CPDPRG4= <mlev>
##$CPDPRG5= <mlev>
##$CPDPRG6= <mlev>
##$CPDPRG7= <mlev>
##$CPDPRG8= <mlev>
##$CPDPRGB= <>
##$CPDPRGT= <>
##$D= (0..31)
0 1.2 0 0 0 0 0 0 0 0.06 0 0.03 0 0 0 0 0.0002 0 0 0 0 0 0 0 0 0 0 0 0 
0 0 0 
##$DATE= 1622536064
##$DBL= (0..7)
120 120 120 120 120 120 120 120 
##$DBP= (0..7)
150 150 150 150 150 150 150 150 
##$DBP07= 0
##$DBPNAM0= <>
##$DBPNAM1= <>
##$DBPNAM2= <>
##$DBPNAM3= <>
##$DBPNAM4= <>
$$ [...]
##$SUBNAM3= <"">
##$SUBNAM4= <"">
##$SUBNAM5= <"">
##$SUBNAM6= <"">
##$SUBNAM7= <"">
##$SUBNAM8= <"">
##$SUBNAM9= <"">
##$SW= 16.9725357007746
##$SWIBOX= (0..15)
0 0 2 0 0 0 0 0 0 0 0 0 0 0 0 0 
##$SW_h= 3396.73913043478
##$TD= 16384
##$TD0= 1
##$TE= 0
##$TE2= 300
##$TE3= 300
##$TEG= 300
##$TL= (0..7)
0 120 120 120 120 120 120 120 
##$TP= (0..7)
150 150 150 150 150 150 150 150 
##$TP07= 0
##$TPNAME0= <>
##$TPNAME1= <>
##$TPNAME2= <>
##$TPNAME3= <>
##$TPNAME4= <>
##$TPNAME5= <>
##$TPNAME6= <>
##$TPNAME7= <>
##$TPOAL= (0..7)
0.5 0.5 0.5 0.5 0.5 0.5 0.5 0.5 
##$TPOFFS= (0..7)
0 0 0 0 0 0 0 0 
##$TUNHIN= 0
##$TUNHOUT= 0
##$TUNXOUT= 0
##$USERA1= <user>
##$USERA2= <user>
##$USERA3= <user>
##$USERA4= <user>
##$USERA5= <user>
##$V9= 5
##$VALIST= <valist>
##$VCLIST= <CCCCCCCCCCCCCCC>
##$VD= 0
##$VDLIST= <DDDDDDDDDDDDDDD>
##$VPLIST= <PPPPPPPPPPPPPPP>
##$VTLIST= <TTTTTTTTTTTTTTT>
##$WBST= 1024
##$WBSW= 4
##$XGAIN= (0..3)
0 0 0 0 
##$XL= 0
##$YL= 0
##$YMAX_a= 373492
##$YMIN_a= -389923
##$ZGOPTNS= <>
##$ZL1= 120
##$ZL2= 120
##$ZL3= 120
##$ZL4= 120
##$ABSF1= 15.98232
##$ABSF2= -0.990344
##$ABSG= 5
##$ABSL= 3
##$ALPHA= 0
##$AQORDER= 0
##$ASSFAC= 0
##$ASSFACI= 0
##$ASSFACX= 0
##$ASSWID= 0
##$AUNMP= <proc_1d>
##$AZFE= 0.1
##$AZFW= 0.1
##$BCFW= 0
##$BC_mod= 2
##$BYTORDP= 0
##$COROFFS= 0
##$CY= -3
##$DATMOD= 1
##$DC= 0
##$DFILT= <>
##$DTYPP= 0
##$F1P= 0
##$F2P= 0
##$FCOR= 1
##$FTSIZE= 16384
##$FT_mod= 6
##$GAMMA= 0
##$GB= 0
##$INTBC= 1
##$INTSCL= 1.334414e-10
##$ISEN= 128
##$LB= 0.24
##$LEV0= 0
##$LPBIN= 0
##$MAXI= 10000
##$MC2= 0
##$MEAN= 0
##$ME_mod= 0
##$MI= 1.114404
##$NCOEF= 0
##$NC_proc= -7
##$NLEV= 6
##$NOISF1= 3.799351
##$NOISF2= 2.8
##$NSP= 0
##$NTH_PI= 0
##$NZP= 0
##$OFFSET= 15.98232
##$PC= 1
##$PHC0= -11475.43
##$PHC1= 7.80099
##$PH_mod= 1
##$PKNL= yes
##$PPARMOD= 0
##$PSCAL= 0
##$PSIGN= 0
##$REVERSE= no
##$SF= 200.130005829869
##$SI= 16384
##$SIGF1= 3
##$SIGF2= 2
##$SINO= 5.538805
##$SIOLD= 16384
##$SREGLST= <1H.CDCl3>
##$SSB= 0
##$STSI= 16384
##$STSR= 0
##$SW_p= 3396.73913043479
##$SYMM= 0
##$S_DEV= 0
##$TDeff= 16384
##$TDoff= 0
##$TI= <>
##$TILT= no
##$TM1= 0
##$TM2= 0
##$TOPLEV= 0
##$USERP1= <user>
##$USERP2= <user>
##$USERP3= <user>
##$USERP4= <user>
##$USERP5= <user>
##$WDW= 1
##$XDIM= 16384
##$YMAX_p= 388193379
##$YMIN_p= -670960
$$ End of Bruker specific parameters
$$ ---------------------------------
##NTUPLES= NMR SPECTRUM
##VAR_NAME=  FREQUENCY,     SPECTRUM/REAL,   SPECTRUM/IMAG
##SYMBOL=    X,             R,               I
##VAR_TYPE=  INDEPENDENT,   DEPENDENT,       DEPENDENT
##VAR_FORM=  AFFN,          ASDF,            ASDF
##VAR_DIM=   16384,         16384,           16384
##UNITS=     HZ,            ARBITRARY UNITS, ARBITRARY UNITS
##FACTOR=    0.207333158178282, 1,           1
##FIRST=     3198.5417611226, 0,             0
##LAST=      -198.19736931219, 0,            0
##MIN=       -198.19736931219, -670960,      0
##MAX=       3198.5417611226, 388193379,     0
$$ Real data points
##PAGE= N=1
##DATA TABLE= (X++(R..R)), XYDATA
$$ [...]
5189A5619015M09015N99528N52538N40212O19961J038070R48705J109129J022827
5180B2459000J078167J163745R73875Q76106Q62223M56685L53501K9916n25717
5171B7727501p55535o44757n37255j74333k19028l68429l1438K94658M57657M72351
5161B6221392P32160J105879J275018J295470J580709J904785J993983K313065
5153C8422461K529184K603496K487326K619011K786327J934152J631355J022428
5145E6035740K25422r72287j627141j821088j919119j972594j711400j459946
5137D4777587j208175r86954n06947k11381m45803k98707p126P09426R15842J453528
5127D4191290J608215K065541K806733K835460L385640L679281M087735M612018
$$ plain form
5189 15619015 16028030 16627558 17180096 17720308 18340269 19378339 20327044 21436173 22459000
5180 22459000 23537167 24700912 25674787 26550893 27413116 27869801 28223302 28253218 27727501
5171 27727501 26971966 26327209 25789954 25615621 25396593 25028164 24996726 25291384 25749041 26221392
5161 26221392 26953552 28059431 29334449 30629919 32210628 34115413 36109396 38422461
5153 38422461 40951645 43555141 46042467 48661478 51447805 53381957 55013312 56035740
5145 56035740 56261162 55288875 53661734 51840646 49921527 47948933 46237533 44777587
5137 44777587 43569412 42582458 42075511 41864130 41418327 41119620 41112494 41821920 42737762 44191290
5127 44191290 45799505 47865046 50671779 53507239 56892879 60572160 64659895 69271913
5119F9271913M521265M288459L949797L288680K229014P00293j424646l671934
5111H3152841n322026o275139o179626n448143m567404l700367k882351k540832
5103D6236953k209503j778157j394322j155378j091641p37597o08560p4665P1357
5094C7258487K11233K98724P56951J119627J261335J631023J673675J435881J511293
5085D7158229J498884Q62004N02124k65381r39500j996632k909340l532937l166159
5076C7211292l050484k929146k082149j981077j777590j431307j332917j373458
5068B1253164j353259j027981q68201r15637q11197n81840o97350p92936m29715
5059A3775048m95816n06973m82019m01692j94307l12469l59263k30688m04285
$$ plain form
5119 69271913 73793178 78081637 82031434 85320114 87549128 88249421 86824775 83152841
5111 83152841 77830815 71555676 65376050 59927907 55360503 51660136 48777785 46236953
5103 46236953 44027450 42249293 40854971 39699593 38607952 37870355 37261795 37187130 37258487
5094 37258487 37469720 37768444 38525395 39645022 40906357 42537380 44211055 45646936 47158229
5085 47158229 48657113 49519117 50021241 49755860 48816360 46819728 43910388 40377451 37211292
5076 37211292 34160808 31231662 29149513 27168436 25390846 23959539 22626622 21253164
5068 21253164 19899905 18871924 18003723 17088086 16276889 15695049 14997699 14204763 13775048
5059 13775048 13279232 12772259 12290240 11888548 11694241 11381772 11022509 10791821 10387536
5050A0387536n21336m44308J49125J05744l04545k09310m0950k35764m86808j8597
5040H380787j57170k31466p6258R8459j59947m76649k069J61554k88988k87732
5030F960521N7582q0681k85061L6854r6375m21826q8917Q1271K6802m82795j7372
5019E690003K53160o2947j10450m4206K2087j71171M5359J07351R800k5864k4307
5008E688815K27308k80209k76072K13832L48301p1735m14365K09894L15585k06957
4998E754397r7355l865J61708l9991K968K42553k86799k34415O6267m8698m74599
4987E042171j26368L39450J17952J15776j39767o3733j54071J62732K45179r7110
4977E442211k30734K1738L18104k10511j87077J10201R6253Q5179J70403q3580
$$ plain form
5050 10387536 9866200 9421892 9571017 9676761 9372216 9162906 9121956 8886192 8399384 8380787
5040 8380787 8223617 7992151 7915893 8014352 7854405 7377756 7375687 7537241 7248253 6960521
5030 6960521 7018103 6937422 6652361 6689215 6592840 6171014 6082097 6163368 6190170 5707375 5690003
5019 5690003 5943163 5880216 5769766 5725560 5747647 5576476 5621835 5729186 5738986 5713122 5688815
5008 5688815 5916123 5635914 5359842 5573674 5921975 5850240 5435875 5645769 5961354 5754397
4998 5754397 5657042 5653177 5814885 5774894 5777862 6020415 5733616 5499201 5565468 5516770 5042171
4987 5042171 4915803 5255253 5373205 5488981 5349214 5285481 5131410 5294142 5539321 5442211
4977 5442211 5211477 5233215 5551319 5340808 5153731 5263932 5360185 5445364 5615767 5532187
4967E532187N7819r6499K86789J2140k75705l6377O0477J986j00626o5066n9541
4956E317584k58516l52989J64216P0433k79257k02096j62959k8848N2376K6540
4946D346484J1109j02358o2656j2254N8854j94442k20906K11811K909N6852o3088
4935D032315k18129j9301K14604K13516L2919l63491k29825L54595J42518p2112
4925D087609j72898l8875Q5518k27937r6130j75490l7793m8796R4672P3857k63195
4914C280542m0967n0616J60512l00588k16125Q7789N9061j892J80685J05311k87758
4903B975954o1248P2716J29114p7874j4926J31422j28874J5623J19809j54303
4893C007413l23529J2509K64470J12174q9078l9021J2549J44502L8965p4253j70613
$$ plain form
4967 5532187 5590006 5493507 5780296 5792436 5516731 5480354 5540831 5542817 5442191 5377125 5317584
4956 5317584 5059068 4706079 4870295 4940728 4661471 4459375 4296416 4267568 4319944 4346484
4946 4346484 4357593 4255235 4192579 4180325 4239179 4044737 3823831 4035642 4038551 4095403 4032315
4935 4032315 3814186 3794885 4009489 4223005 4255924 3892433 3662608 4017203 4159721 4087609
4925 4087609 3914711 3875836 3961354 3733417 3637287 3461797 3424004 3375208 3469880 3543737 3280542
4914 3280542 3239575 3188959 3349471 3048883 2832758 2920547 2979608 2977716 3158401 3263712 2975954
4903 2975954 2914706 2987422 3116536 3038662 3023736 3155158 3026284 3041907 3161716 3007413
4893 3007413 2683884 2696393 2960863 3073037 2983959 2944938 2957487 3101989 3140954 3066701 2896088
4882B896088q4895N9022O2823q3421j34476K8847O7380R0794K39653q0220k26730
4871B834865m7324J03962J4808o9009J10146n4902R4706P1069k33653O7037n1842
4860B839863J29051j66258k45991P2674J99894K73848r0239j26817O3484J25261
4850C074770N9941o1399q5901K39659J79654m0370O506J19325J4928n1521J11891
4839C567483k29125q7120J82094L96658J12268k35248N8178K36587N4592k00351
4829C856016K493J10244J56666j07231k2829N7511O1489k27876J98264L5202q5530
4818D034419J30913J37981m5961n7617L4626K09213P9872j83641o8843j46888
4808D124074L6668J45297m5254q2942J73532J20719k73089k70189j44191J00237
$$ plain form
4882 2896088 2811193 2870215 2933038 2849617 2715141 2743988 2811368 2902162 3141815 3061595 2834865
4871 2834865 2787541 2891503 2906311 2837302 2947448 2892546 2987252 3058321 2824668 2891705 2839863
4860 2839863 2968914 2802656 2556665 2629339 2829233 3103081 3012842 2886025 2949509 3074770
4850 3074770 3134711 3073312 2987411 3227070 3406724 3366354 3372860 3492185 3507113 3455592 3567483
4839 3567483 3338358 3251238 3433332 3829990 3942258 3707010 3765188 4001775 4056367 3856016
4829 3856016 3858509 3968753 4125419 4018188 3995359 4052870 4114359 3886483 4084747 4119949 4034419
4818 4034419 4165332 4303313 4257352 4199735 4234361 4443574 4523446 4339805 4270962 4124074
4808 4124074 4160742 4306039 4260785 4177843 4351375 4472094 4199005 3928816 3784625 3884862
4798C884862j34895L3139Q9753k24693M7077O8991k07341Q3137K65205K52045
4788D157280J0533j39392J1381o1128p3153P5555J36310j44967J63479K43597
4778D379495J47096j26181R8000K91806J38302j38951k10060l5924j00067J50032
4768D593548J75502k32179j74731j50919J07458k08861k55934O8762N4799q5399
4758C892046n1509j2511J14614j40604R4339J20411m0451J94626q0541r7448Q7533
4747D080505L9666J04111p010j74793J44094l12O5536l6363Q3520n017J2985l894
4735D303028j56797j64648l6910N9547r8478j35061j62774n7344q0291q4265r2004
4724C294003j34163m5741L0219J0993n109k1585Q6772J43921J19853j90328j80835
$$ plain form
4798 3884862 3749967 3783106 3872859 3648166 3695243 3764234 3556893 3640030 3905235 4157280
4788 4157280 4167813 4028421 4039802 3978674 3905521 3981076 4117386 3972419 4135898 4379495
4778 4379495 4526591 4400410 4498410 4790216 4928518 4789567 4579507 4543583 4443516 4593548
4768 4593548 4769050 4536871 4362140 4211221 4318679 4109818 3853884 3922646 3977445 3892046
4758 3892046 3840537 3828026 3942640 3802036 3896375 4016786 3976335 4170961 4090420 3992972 4080505
4747 4080505 4120171 4224282 4217272 4042479 4186573 4186261 4251797 4215434 4298954 4293937 4306922 4303028
4735 4303028 4146231 3981583 3944673 4004220 3905742 3770681 3607907 3550563 3470272 3386007 3294003
4724 3294003 3159840 3114099 3144318 3155311 3150202 3128617 3215389 3359310 3479163 3288835 3108000
4713C108000L6528K12061J36657j26418r7948o4434J37874k19112J0482k966J18740
4702C249464K23522Q2055M9162j13551P5599K81168j26897k34987Q3627J50986
4692C720148r315q8267P8119j48065l6145L6360L7647m4055j8313R1772K40254
4681C860140J83103j42033R4025J47240l9447J02715J13242K5766q9627r2518
4671D162606m5219O5964J1434K5394r1798k7924J16711J76589q616j11008P2159
4660D346292O0997j68960Q765J80083j02981N9850J50146J69257J91462p3646
4650D821265R0316J99351J79287l0492r338J77595K06785J62996O746J02426k8362
4639E878575O6015L98j90437o2668o7320K71970K10188p6457j17465o8507J45018
$$ plain form
4713 3108000 3144528 3356589 3493246 3366828 3268880 3204446 3342320 3123208 3133690 3130724 3249464
4702 3249464 3472986 3555041 3604203 3490652 3566251 3847419 3720522 3485535 3569162 3720148
4692 3720148 3710833 3622566 3700685 3552620 3516475 3552835 3590482 3546427 3528114 3619886 3860140
4681 3860140 4043243 3901210 3995235 4142475 4103028 4205743 4318985 4344751 4255124 4162606
4671 4162606 4117387 4183351 4194785 4220179 4128381 4100457 4217168 4393757 4385141 4274133 4346292
4660 4346292 4407289 4238329 4247094 4427177 4324196 4384046 4534192 4703449 4894911 4821265
4650 4821265 4911581 5110932 5290219 5259727 5250389 5427984 5634769 5797765 5804511 5906937 5878575
4639 5878575 5944590 5944988 5754551 5691883 5624563 5896533 6106721 6030264 5912799 5844292 5989310
4628E989310J56277n0996L6173J35936n1478L21967L9041J30983K52506L52015
4618G311734K90761J05934Q810J67184O18389J36331K30752K24119J63992K13396
4608I471402M51769M04667J74673N77273O77250L82751N08405P28268P39226N71054
4598A4686738P09552J110910P05660N10565Q09189K64764j44777k23641o6708
4589A8362252J17954k51244k25358K08109M11221L07949M47620O24486N50133
4580B0553122L83857N04243N15389M20258P01239Q66624N58371M19496O10789
4571B5533388P15759Q41988Q26526J447393J489882J294288J225121Q96109R11308
4562C5181762N43357k84969j293149j832986j756269j100435r11506q98995o96313
$$ plain form
4628 5989310 6145587 6094591 6130764 6266700 6215222 6537189 6576230 6707213 6959719 7311734
4618 7311734 7602495 7708429 7717239 7884423 8502812 8639143 8869895 9094014 9258006 9471402
4608 9471402 9923171 10327838 10502511 11079784 11757034 12139785 12648190 13376458 14115684 14686738
4598 14686738 15396290 16507200 17212860 17723425 18532614 18797378 18652601 18428960 18362252
4589 18362252 18480206 18228962 18003604 18211713 18622934 18930883 19378503 20002989 20553122
4580 20553122 20936979 21441222 21956611 22376869 23078108 23944732 24503103 24922599 25533388
4571 25533388 26249147 27091135 27917661 29365054 30854936 32149224 33374345 34270454 35181762
4562 35181762 35725119 35440150 34147001 32314015 30557746 29457311 28545805 27646810 26950497
4553B6950497n32942n97427l45980j71456l95480r43252o71128j19771l05586
4544B2867475o38451m64490j45457j86996k40384j87007p1409K43395L47177M49117
4534B1972970K11237Q712Q6141j6497k12533l77132m64739q98568j001671m35185
4524A8872735l33093m94093l93574n30979l02866m43622m98688k02391k19144
4515A5454285j35672j62580m3873L246O7699l17561n03398m63009l02776j6887
4505A3579474k12909j01030o373q8186K39413L6558J35641K87610o4356L10828
4495A4116670M00583L37859Q401L1796L19770L68772k21696j64859J15609J22396
4485A5435301K29621O4980p6313R2865J38760J36509L09377J89816m8219J55795
$$ plain form
4553 26950497 26417555 25820128 25474148 25302692 24907212 23963960 23292832 23173061 22867475
4544 22867475 22229024 21764534 21619077 21432081 21191697 21004690 20933281 21176676 21523853 21972970
4534 21972970 22184207 22192919 22279060 22262563 22050030 21672898 21208159 20309591 19307920 18872735
4524 18872735 18539642 18045549 17651975 17120996 16818130 16374508 15875820 15673429 15454285
4515 15454285 15318613 15156033 15112160 15115406 15183105 14865544 14362146 13899137 13596361 13579474
4505 13579474 13366565 13265535 13259162 13170976 13410389 13446947 13582588 13870198 13805842 14116670
4495 14116670 14517253 14855112 14863513 14895309 15215079 15583851 15362155 15197296 15312905 15435301
4485 15435301 15664922 15729902 15653589 15746454 15885214 16021723 16331100 16520916 16472697 16628492
4475A6628492p6696j45948P48N2330N9651Q0371J95904J91933J88016K71745K82493
4464A7729039J63240L56854N11079M85111M84872M68782N34999Q16949Q16736
4455B2367661O75566Q77862Q11030R79398Q80387R30907J290601J079762J486770
4446C1379944J764192J857421K156950K199674K259141K757429L158194L546840
4438E1079785M107396M566690N033419N606011O261150O336213O630454O431589
4430I6052707O411941O832223O437056N620375M476386L635438K405144J000462
4422A32871732q22106k465210m351587n630391o191192o676203o582000o129020
4414I4024023o009382o260715o048370n959648n277935m703684m496456m093255
$$ plain form
4475 16628492 16551796 16405848 16406596 16458926 16518577 16598948 16794852 16986785 17174801 17446546 17729039
4464 17729039 17892279 18249133 18760212 19245323 19730195 20198977 20733976 21550925 22367661
4455 22367661 23043227 23921089 24732119 25711517 26591904 27522811 28813412 29893174 31379944
4446 31379944 33144136 35001557 37158507 39358181 41617322 44374751 47532945 51079785
4438 51079785 55187181 59753871 64787290 70393301 76654451 82990664 89621118 96052707
4430 96052707 102464648 109296871 115733927 121354302 125830688 129466126 131871270 132871732
4422 132871732 132049626 129584416 125232829 119602438 113411246 106735043 100153043 94024023
4414 94024023 88014641 81753926 75705556 69745908 64467973 59764289 55267833 51174578
4406E1174578l314955l075287k652435k665754k335482j661722j637506j504870
4398C2326567j613132j526763j193797j030179j200600j115227r32157n35235
4390B3179477n18796q47155q35227n30177m58030m78572n12850n67937n72717
4381A7858016l79994k37528m48946o53592m31181k01947j41132m14303n86061
4372A4363332k60885N859p3387j79427m03353m90616r3290J78694J41080M1244
4362A3229251j41590l1123K32023K21495J68349L19599J02975M35991M36575J38607
4352A5112152k70243n03730o66005k58440n29796o32205o17704m11801k56763
4343A0965465k89172k40256l01661j61979k07488N4385k35356m45781j41773j8415
$$ plain form
4406 51174578 47859623 44784336 42131901 39466147 37130665 35468943 33831437 32326567
4398 32326567 30713435 29186672 27992875 26962696 25762096 24646869 23714712 23179477
4390 23179477 22660681 21813526 20978299 20448122 19990092 19511520 18998670 18430733 17858016
4381 17858016 17478022 17240494 16791548 16137956 15706775 15504828 15363696 14949393 14363332
4372 14363332 14102447 14108306 14034919 13855492 13452139 12961523 12868233 13046927 13188007 13229251
4362 13229251 13087661 13056538 13288561 13510056 13678405 13998004 14100979 14536970 14973545 15112152
4352 15112152 14841909 14338179 13672174 13413734 12883938 12251733 11634029 11222228 10965465
4343 10965465 10676293 10436037 10134376 9972397 9764909 9819294 9583938 9138157 8996384 8977969
4333H977969l3494j64869m76023l45454o9751K65997m5391k54161r5369n2543
4323G706911o8443O3003j19088k54352j77334J19444p4073l16347k92877p7570
4313F509274j09337J66135j2571j97112o6599l0642O0538j37072j45371J82370
4303F219613K4707m3689j4424p0461j10278j7682J73061J13243j97799j6704K77129
4292F336716N6748O6660N1246r3909k34640j65289l9552K7312j23067j34103K2164
4281E770286l5137J68127j3736O8663J45937o8151J31004O3804l30995m8037L61882
4270F213647J05023o7326J64971K67762K73218J8663L31230L12149L06745L54754
4260H280836L68367L51765K06506O7630K77800M59571K12490J69526j19610j7659
$$ plain form
4333 8977969 8944475 8779606 8303583 7958129 7888378 8154375 8108984 7854823 7759454 7706911
4323 7706911 7638468 7701471 7582383 7328031 7150697 7270141 7196068 6879721 6586844 6509274
4313 6509274 6399937 6566072 6553501 6356389 6289790 6259148 6319686 6182614 6037243 6219613
4303 6219613 6244320 6200631 6186207 6115746 6005468 5987786 6160847 6274090 6076291 6059587 6336716
4292 6336716 6393464 6460124 6511370 6417461 6182821 6017532 5977980 6005292 5882225 5748122 5770286
4281 5770286 5735149 5903276 5889540 5958203 6104140 6035989 6166993 6230797 5899802 5851765 6213647
4270 6213647 6318670 6251344 6416315 6684077 6957295 6975958 7307188 7619337 7926082 8280836
4260 8280836 8649203 9000968 9207474 9275104 9552904 10012475 10224965 10394491 10274881 10257222
4250A0257222M00332N76031M47802L44985L3077p09224p87555n09826m69099k58410
4240I325335n73365n38514m29927l68556j25446K64191j95271o5337J05046m91
4230G397665m7292j5188M3755m49794k21799J07549j10434j22097o9404o6089
4220F446872j48155m0617j011j870k94422q2449N2143l0488R4388m5012j36215
4209E813164N9881J45043o7777j74268k1283J49852L27196R3674K71879L35500
4199F932861L1380K6949J70317J19119J78603L83577L07276L15155M69330K54549
4189I189116O06062L51647M9647K58074m13479q19213o46156n30639o65035l76747
4179G003277k03993l21910k12115J06540J45652j76417j25599o1849L9730P5718
$$ plain form
4250 10257222 10657554 11233585 11681387 12026372 12059449 11350225 10562670 10052844 9583745 9325335
4240 9325335 8751970 8213456 7783529 7414973 7289527 7553718 7358447 7293110 7398156 7397665
4230 7397665 7350373 7335185 7378940 6929146 6707347 6814896 6704462 6582365 6512961 6446872
4220 6446872 6298717 6258100 6257089 6255219 5960797 5878348 5930491 5900003 5994391 5949379 5813164
4209 5813164 5873045 6018088 5950311 5776043 5754760 5904612 6231808 6325482 6597361 6932861
4199 6932861 6964241 6991190 7161507 7280626 7459229 7842806 8150082 8465237 8934567 9189116
4189 9189116 9795178 10146825 10196472 10454546 10041067 9221854 8575698 8045059 7380024 7003277
4179 7003277 6799284 6477374 6265259 6371799 6517451 6341034 6215435 6153586 6193316 6269034
4169F269034j79391j0352J9090K00718j00563J63430J43536J78976j06590k61359
4159F316529K25154J02599n446m7547j79978l25160n5100j41111l53558k07296
4149E329086R3284j38455n7067j23880j22160J4751o7323o7881j58446j87237
4139D514672r0135N3052m8819O7355j84124k10929J74473J86907p4260k34368
4129D153824q996K27351Q9878j18963O1141j9744m9013J52814J74380R7240k10047
4118D549865K32960q5363j10981M5456L85404K4175L391R3201j5106K5486p3000
4107E075488J17478K57546p798J65418K01430J12098M2068J87009L13014R7722
4097F561473j66454Q8469K43800k08999j72699j06388j06887k63233k74474k32986
$$ plain form
4169 6269034 6089643 6079291 6098381 6299099 6198536 6361966 6505502 6684478 6577888 6316529
4159 6316529 6541683 6644282 6638836 6591289 6411311 6086151 6031051 5889940 5536382 5329086
4149 5329086 5422370 5283915 5226848 5102968 4980808 4995559 4928236 4860355 4701909 4514672
4139 4514672 4424537 4477589 4428770 4496125 4312001 4101072 4275545 4462452 4388192 4153824
4129 4153824 4144828 4372179 4462057 4343094 4404235 4384491 4335478 4488292 4662672 4759912 4549865
4118 4549865 4782825 4697462 4586481 4631937 5017341 5041516 5044907 5138108 5123002 5148488 5075488
4107 5075488 5192966 5450512 5442714 5608132 5809562 5921660 5963728 6150737 6463751 6561473
4097 6561473 6395019 6483488 6727288 6518289 6345590 6239202 6132315 5869082 5594608 5361622
4087E361622j74604k15579m7653k11706k06848O1915J9684k6883j76569l9161
4077D344218P131l04867m0099Q2638j62724Q4055K17765k02296O4811p3982K7111
4066D043761q1659p9622J46133K25783K3636j24257j02452r7021j16063O0614
4056C898853J33842j17116l520M81640J65355q8889p3865o4965K7705J05420r1526
4045D372934k09832P7671K68139J15700k27487j94981J02913J35119J97055J38303
4035D775534l5615q0976O5513j14522n0528k4312k1117k778J79794l7174n3785
4024D600034r9891P3967j33786q7512K67379J24083J0219P2837K0002j22349r6601
4013D628382l002R2212N6681M22638K29616j06966l32211J09538L59013O1346
$$ plain form
4087 5361622 5187018 4971439 4923786 4712080 4505232 4567147 4586831 4559948 4383379 4344218
4077 4344218 4351349 4046482 4006383 4089021 3926297 4010352 4228117 4025821 4090632 4016650 4043761
4066 4043761 3962102 3882480 4028613 4254396 4278032 4153775 4051323 3954302 3838239 3898853
4056 3898853 4032695 3915579 3912059 4393699 4559054 4470165 4396300 4331335 4359040 4464460 4372934
4045 4372934 4163102 4240773 4508912 4624612 4397125 4202144 4305057 4440176 4637231 4775534
4035 4775534 4739919 4658943 4724456 4609934 4559406 4535094 4513977 4511199 4690993 4653819 4600034
4024 4600034 4500143 4574110 4440324 4352812 4620191 4744274 4754493 4827330 4847332 4724983 4628382
4013 4628382 4625380 4717592 4774273 5196911 5426527 5319561 4987350 5096888 5455901 5517247
4003E517247k69181N470L0510o798k1864m6932j29357n4306J6974K25929k9065
3992E238627r9288J91499J44457j97620k09834J51397K28693j11985j00985m1478
3982E193483k9269k1841N1519r788m3233k7481M8350K33477k9228k37788l7986
3971E090215r1738J87779Q9919O150N7191q5954J01954R6636j81922l9453K1749
3960E252526J63595Q3136o6422M9257o2972L967N1373p222O1869J8218M0403j73914
3948E413814j11080K11387K14176K34317j34981J5684K84452o6425r4275P7953
3938F045022J80029j05748l30493K42160L25799o0241n6738L13395N139j77314
3928F381010J05937J73533n4528j23894J60029K18287j07277J44782K08134m1262
$$ plain form
4003 5517247 5248066 5253536 5284046 5277248 5255384 5208452 5079095 5024789 5041763 5267692 5238627
3992 5238627 5139339 5330838 5475295 5277675 5067841 5219238 5447931 5335946 5234961 5193483
3982 5193483 5164214 5142373 5193892 5184104 5140871 5113390 5161740 5395217 5365989 5128201 5090215
3971 5090215 4998477 5186256 5276175 5282325 5339516 5253562 5355516 5452152 5270230 5230777 5252526
3960 5252526 5416121 5499257 5432835 5482092 5419120 5423087 5474460 5467238 5529107 5547325 5587728 5413814
3948 5413814 5302734 5514121 5728297 5962614 5827633 5843317 6127769 6061344 5967069 6045022
3938 6045022 6225051 6119303 5788810 6030970 6356769 6296528 6239790 6553185 6558324 6381010
3928 6381010 6486947 6660480 6605952 6482058 6642087 6860374 6753097 6897879 7106013 7064751
3918G064751k71655j9695K99715N3118P4405J11381K15785k45331j14820L9012
3908G206666J44119n5727p9959J29869Q2351j26289J41505L47379j40083N3737
3898G703568K19970m5961j83842J58207L2984K7858Q6372Q3792j25511k646j84410
3887G770381p1189P5932O8555p6933L01759K27229j18588j72042K18296K37817
3877H461217k2425j47709M4865J18889J05229J29550J75542N7573j8067N9567
3867H964231J45563J46148R7191m71K38802J61533k6422O3277J47845K1041J01684
3856A0060422K14266P1766j1518P5870K73399J0431K6881J31971K60648K65556
3846A1379692K35023J24314J44976o453L21076L59587J36634k3973M64702K33652
$$ plain form
3918 7064751 6793096 6773401 7073116 7126234 7200639 7312020 7527805 7282474 7167654 7206666
3908 7206666 7350785 7295058 7215099 7344968 7427319 7301030 7442535 7789914 7649831 7703568
3898 7703568 7923538 7877577 7693735 7851942 7884926 7912784 7999156 8082948 7957437 7954791 7770381
3887 7770381 7699192 7775124 7843679 7766746 8068505 8295734 8177146 8005104 8223400 8461217
3877 8461217 8438792 8291083 8335948 8454837 8560066 8689616 8865158 8922731 8904664 8964231
3867 8964231 9109794 9255942 9353133 9352662 9591464 9752997 9726575 9789852 9937697 9958738 10060422
3856 10060422 10274688 10346454 10334936 10410806 10684205 10694636 10721517 10853488 11114136 11379692
3846 11379692 11614715 11739029 11884005 11877552 12198628 12558215 12694849 12670876 13135578 13369230
3836A3369230K47373J39727L09248L63760L46851N57363O53897N00356K67462
3827A6755267O93233Q18537K32277K81777L09343L03178J70731J4539j21551j72211
3817A9285120p1262M4788L05612P8508q1603K8773J01988j03564k07764l7326
3807A9343270L14039K2199Q9964J53850R663L29197M84199L30066L42933L92695
3797B1812075M43451O08424N38911O80072P03119N42965M49164P19708Q88736
3788B7386625M61631J47904K02730N09897L57798K41580K9596n4147L51533M54311
3778C0089458J60949O4495M31460O61149L65773O49971O47083M55045N70623L95453
3768C4491459M59503L82887P17616R43454N67279L80688P10541P97671R31824
$$ plain form
3836 13369230 13616603 13756330 14065578 14429338 14776189 15333552 15987449 16487805 16755267
3827 16755267 17448500 18267037 18499314 18781091 19090434 19393612 19564343 19578882 19457331 19285120
3817 19285120 19213858 19258646 19564258 19642766 19561163 19589936 19691924 19588360 19380596 19343270
3807 19343270 19657309 19679508 19769472 19923322 19932985 20262182 20746381 21076447 21419380 21812075
3797 21812075 22255526 22863950 23402861 24082933 24786052 25329017 25778181 26497889 27386625
3788 27386625 27848256 27996160 28198890 28708787 29066585 29308165 29337761 29283614 29635147 30089458
3778 30089458 30250407 30314902 30746362 31407511 31773284 32423255 33070338 33525383 34096006 34491459
3768 34491459 34950962 35333849 36051465 36994919 37562198 37942886 38653427 39451098 40382922
3759D0382922Q93667Q36269Q24312J089399J293499J181312J097847J161578J358864
3750E0119669R97159J027526J023815J107246P88342R85268J184343R65048J147420
3741E9345836J065059J155221J506477J625750J768498K014398J905301K188120
3733G2574660K533702K154911K129818K182507K327677K270520J932657J493699
3725H9600151J519820J240310J529562J391383J328745J482240J940314K403000
3717A02435525K167417K253503K640532K766161K527656K343227K072099K025986
3709A21232106K096499K133314J180195O73142O24714J069458J018801P36731
3701A30764960R72056R65486Q73250P35597K26586n24386j142592j778965k891188
$$ plain form
3759 40382922 41276589 42112858 42937170 44026569 45320068 46501380 47599227 48760805 50119669
3750 50119669 51116828 52144354 53168169 54275415 55063757 56049025 57233368 58198416 59345836
3741 59345836 60410895 61566116 63072593 64698343 66466841 68481239 70386540 72574660
3733 72574660 75108362 77263273 79393091 81575598 83903275 86173795 88106452 89600151
3725 89600151 91119971 92360281 93889843 95281226 96609971 98092211 100032525 102435525
3717 102435525 104602942 106856445 109496977 112263138 114790794 117134021 119206120 121232106
3709 121232106 123328605 125461919 126642114 127315256 127939970 129009428 130028229 130764960
3701 130764960 131737016 132702502 133575752 134311349 134537935 134013549 132870957 131091992 128200804
3692A28200804l959581m620478m595396m665992m545689l831145k875418k282447
3684I6824658j219047k66789O21944O16376N55398Q80104K45271p64438j891609
3675I5601868l221757m674767n402278n214552n211689m518355l623612k860922
3667F0873936k572406k302954j797381j718282j418226j267951o73818r58670
3659D8164248q59287m09245j75777m53560q60411o51665m16778q62288q24627
3650D2650610q90280j197220j272741j166518j026824j311467j040974o22992
3642C4121594n25797n58590o28169n97997m71940p59748n73190n58261j049469
3633B8398433q14862p49742p54264j015734o46786l45076m99799r44383m24563
$$ plain form
3692 128200804 124241223 119620745 115025349 110359357 105813668 101982523 99107105 96824658
3684 96824658 95605611 95338822 95960766 96577142 97132540 98012644 98257915 97493477 95601868
3675 95601868 92380111 87705344 82303066 77088514 71876825 67358470 63734858 60873936
3667 60873936 58301530 55998576 54201195 52482913 51064687 49796736 49122918 48164248
3659 48164248 47304961 46895716 46719939 46266379 45405968 44754303 44337525 43475237 42650610
3650 42650610 41760330 40563110 39290369 38123851 37097027 35785560 34744586 34121594
3642 34121594 33595797 33037207 32409038 31811041 31339101 30579353 30006163 29447902 28398433
3633 28398433 27583571 26833829 26079565 25063831 24417045 24071969 23572170 22627787 22203224
3624B2203224j65668m03663m53182k48612k48249n00825l30321j80620k57100
3615A9414984m74711k36001k20233k20270n5767j34634j94350j14641q0197k4909
3605A7659271l42018l36637j57839o887k96721k26528R6608k68516n01447N3236
3595A5672522J6365j4522k56658n6669R8275p4069j39674k7478j43624j48201
3585A4926267Q1124J92752n4033k91864j53341M0897P6809p7344r1557J53829
3575A4803539K9853q6729k81375j40720K27969j1251j16316j02973q0329k3638
3565A4218030K1181m2254j50442r8421J12675j71304q472k33037j02096m5377
3555A3500483P969j94049k05189K27134J02834n7615k95180n8129R8463J49256
$$ plain form
3624 22203224 22037556 21633893 21180711 20932099 20683850 20183025 19852704 19672084 19414984
3615 19414984 18940273 18704272 18484039 18263769 18208002 18073368 17879018 17764377 17684180 17659271
3605 17659271 17317253 16980616 16822777 16815890 16519169 16292641 16389249 16120733 15619286 15672522
3595 15672522 15688887 15674365 15417707 15361038 15459313 15385244 15245570 15218092 15074468 14926267
3585 14926267 15007391 15200143 15146110 14854246 14700905 14741802 14818611 14741267 14649710 14803539
3575 14803539 14833392 14746663 14465288 14324568 14552537 14541286 14424970 14321997 14241668 14218030
3565 14218030 14239211 14196957 14046515 13948094 14060769 13889465 13880993 13647956 13545860 13500483
3555 13500483 13508452 13314403 13109214 13336348 13439182 13381567 13086387 13028258 13126721 13275977
3545A3275977M8754l8508j05749J60862M0020J2933Q547K12195N3302M2643K07125
3534A3918101J8809K81157K41681J80613K28192R5289J20827K10707r0018k41840
3524A4963518l09450N099p2461l36365m23988j3871R6114k03264n5789J23234
3514A3772777r6265R0968J52152m9338n0614L7964J73630L44085j39424J12566
3504A4348501L37844J82270R7753J04167K52882L90280L08945l3312K08740L37483
3494A6535553J94693K09868K12422j42424J55315J73332l9874l4790n9750R1343
3484A7295688J74001J40328K1257J07079J01460M31896K89824n0028J13390L24385
3474A8949280K61988R6032K91894M24122L66530K01402M50546J18416L22657N66120
$$ plain form
3545 13275977 13324731 13286223 13180474 13341336 13381356 13394289 13402836 13615031 13668333 13710976 13918101
3534 13918101 13936910 14218067 14459748 14640361 14868553 14963842 15084669 15295376 15205358 14963518
3524 14963518 14654068 14659167 14586706 14250341 13826353 13812482 13908596 13705332 13649543 13772777
3514 13772777 13676512 13767480 13919632 13870294 13819680 13857644 14031274 14375359 14235935 14348501
3504 14348501 14686345 14868615 14966368 15070535 15323417 15713697 16022642 15989330 16198070 16535553
3494 16535553 16730246 16940114 17152536 17010112 17165427 17338759 17298885 17264095 17204345 17295688
3484 17295688 17469689 17610017 17631274 17738353 17839813 18271709 18561533 18511505 18624895 18949280
3474 18949280 19211268 19307300 19599194 20023316 20389846 20591248 21041794 21160210 21482867 22048987
3464B2048987K91029J27150J82074O21054L77888M11629L98557M07614L26352
3455B5192334L10040L45032M55049L79752K52651N54189M93871O24039P89463
3446B9396420P12150P69041Q35704J144263R02585R81373J159430J132757J473357
3437C8507080J284087J521052J645265J521934J883278K094906J957217K435454
3429E2850273K879850L058528L193787L438793M209579M876380N476873O107869
3421H6091932P122382Q224473Q810672J0095638J1073242J2444959J3993279J5751205
3413A73607782J7459928J8634385J8536084J7144350J3796350R189567K357943
3406B70726389q205485j9201913k5399572k5951873k2768137j8664583j5026270
$$ plain form
3464 22048987 22340016 22467166 22649240 23270294 23648182 24059811 24458368 24865982 25192334
3455 25192334 25502374 25847406 26302455 26682207 26934858 27489047 27982918 28606957 29396420
3446 29396420 30108570 30877611 31713315 32857578 33760163 34741536 35900966 37033723 38507080
3437 38507080 39791167 41312219 42957484 44479418 46362696 48457602 50414819 52850273
3429 52850273 55730123 58788651 61982438 65421231 69630810 74507190 79984063 86091932
3421 86091932 93214314 101438787 110249459 120345097 131418339 143863298 157856577 173607782
3413 173607782 191067710 209702095 228238179 245382529 259178879 268368446 270726389
3406 270726389 262520904 243318991 217919419 191967546 169199409 150534826 135508556
3399A35508556j1538981r418335p772475o624094n972462m856234m604992m292125
3391H0428858m008907l692093l091138k706891k400489k280048k191339j955558
3383E8102395j498752j340411j194340r70495p03995p73332n86382l38539k96867
3374E0399282l65626J0976M72738N41929L26642M74362M91523N63435M13111L09073
3364E3637445j30355j49624k57023j39843J72128j0607L322O52548Q29694Q81144
3354E5488829J063942R83746J265230J596723J575180J082880J382823J845086
3346F6284439K319075K278935K315665K813802K713286K191846J644378J344577
3338H3906003L70702p20574j623746k297916k498537k458951j698567j093074
$$ plain form
3399 135508556 123969575 114551240 106778765 100154671 94182209 89325975 84720983 80428858
3391 80428858 76419951 72727858 69636720 66929829 64529340 62249292 60057953 58102395
3383 58102395 56603643 55263232 54068892 53098397 52394402 51621070 51034688 50696149 50399282
3374 50399282 50033656 50044632 50517370 51059299 51385941 51860303 52351826 52915261 53328372 53637445
3364 53637445 53507090 53357466 53100443 52960600 53132728 53122121 53125443 53777991 54607685 55488829
3354 55488829 56552771 57536517 58801747 60398470 61973650 63056530 64439353 66284439
3346 66284439 68603514 70882449 73198114 76011916 78725202 80917048 82561426 83906003
3338 83906003 84276705 83556131 81932385 79634469 77135932 74676981 72978414 71885340
3330G1885340q85267l98991L58113O15259Q61365J479575J862784J939313J720189
3321G9437680K245514K499567K262344K189315K316460K310584K432060K713464
3313I8406988L231000L759378M080997M118421L789222K497326P24481j089368
3305A19518445l618863o215092p322253p147209o614318n774554m668335l706671
3297G4451150k943781k546167j656356j359474j343149q68457k46270K9894l0255
3288F3487135M50765N75603L48732N96332O67999L13999L92594N91850R04253
3279F8329262O38656O05264O28704L68734j16187r70720j831517k543173l256047
3270F1852976l578624l382595k908088k434416k400878j889560k067495j835441
$$ plain form
3330 71885340 71000073 70601082 70959195 71574454 72435819 73915394 75778178 77717491 79437680
3321 79437680 81683194 84182761 86445105 88634420 90950880 93261464 95693524 98406988
3313 98406988 101637988 105397366 109478363 113596784 117386006 119883332 120607813 119518445
3305 119518445 115899582 109684490 102362237 95215028 88600710 82826156 78157821 74451150
3297 74451150 71507369 68961202 67304846 65945372 64602223 63733766 63487496 63517390 63487135
3288 63487135 63937900 64513503 64862235 65458567 66126566 66440565 66833159 67425009 68329262
3279 68329262 68967918 69573182 70201886 70570620 70454433 69483713 67652196 65109023 61852976
3270 61852976 58274352 54891757 51983669 49549253 47148375 45258815 43191320 41355879
3262D1355879j427931j318368j148843q20954q21422q39360p08812r24795k87111
3253C3058283n69696l47926k97349L6520k19138R4933J81651J29562L0081J46052
3243C2242973L04342J42857K9461K99070O32073M21259J20277L62285O86616M14293
3233C5655506L69038J015210J093023R97243J292226J699177J861603K142348
3225D6125374K794176L202763L371665L667225M533054N206341N962535O363452
3217H1226585P090543P103847O220516N055395K981462n10461m680228p377818
3209I7109841q539312q151234o570056m589323l213435k817469k079007j708806
3201E9441199j526077j782922j945819j546202j458639j061254p30400p49110
$$ plain form
3262 41355879 39927948 38609580 37460737 36639783 35818361 34979001 34270189 33345394 33058283
3253 33058283 32488587 32140661 31843312 31879832 31660694 31755627 31937278 32066840 32096921 32242973
3243 32242973 32547315 32690172 32719633 33018703 33650776 34072035 34192312 34554597 35241213 35655506
3233 35655506 36024544 37039754 38132777 39130020 40422246 42121423 43983026 46125374
3225 46125374 48919550 52122313 55493978 59161203 63694257 68900598 74863133 81226585
3217 81226585 88317128 95420975 101641491 106696886 109678348 109167887 104487659 97109841
3209 97109841 88570529 80419295 73849239 69259916 66046481 63229012 61150005 59441199
3201 59441199 57915122 56132200 54186381 52640179 51181540 50120286 49389886 48640776
3193D8640776q95925q97776m86971o47524r88906r19914q04435j102712j166847
3184D0729766j190355j090623j321091q85723p15849r93488r47094p83105n75880
3175C2226558m46121m34230l43608l65241l18194m88030m05593q3053j32318k84087
3165B8926083k20450j7773J12873K45258K86483K93185L93948K54619K44416J70176
3155C0688818N42770M57981N17903Q04361O34660P60536O83045M25501L96377
3146C5911952m04o94952j281824j316977j395061j096148p69018o93839l07036
3137B8356693k20697K0573m0719P7202j81811m2210L21301K99835L2974j11740
3127B8511401J26158J60968K66284J28730J65846K52670J49965L63413K89522
$$ plain form
3193 48640776 47744851 46847075 46360104 45712580 44723674 43803760 42999325 41896613 40729766
3184 40729766 39539411 38448788 37127697 36241974 35526125 34532637 33585543 32802438 32226558
3175 32226558 31780437 31346207 31002599 30637358 30319164 29831134 29425541 29342488 29210170 28926083
3165 28926083 28705633 28687860 28800733 29045991 29332474 29625659 30019607 30274226 30518642 30688818
3155 30688818 31231588 31689569 32207472 33011833 33646493 34407029 35090074 35515575 35911952
3146 35911952 35911548 35216596 33934772 32617795 31222734 30126586 29357568 28663729 28356693
3137 28356693 28135996 28156569 28115850 28193052 28011241 27969031 28290332 28590167 28623141 28511401
3127 28511401 28637559 28798527 29064811 29193541 29359387 29612057 29762022 30125435 30414957
3118C0414957J13737L64916P55306O65699M90475M97688J126412R95826Q97908
3109C6322924O94801O60850L32972J23393j13340n36374n55972j55988K72297
3100C7045563L01332N60185J425163J614320J660416K131795K548568K989537
3092E0276879L334430M018972M379953M502192M230595L374464J766724j157194
3084G4727015m160806n913325o796608o199201m553917l523144k715329k058993
3076C8805692j707055j593911j637968j152491j008790j420301j349005p76754
3068B8159417n87557r82364r61156l91597n32921n97871m04978l01054k26063
3059B3173856j88650k6803o3198n02325k93899k2710r1516l68200j9553n4504
$$ plain form
3118 30414957 30528694 30893610 31648916 32314615 32805090 33302778 34429190 35425016 36322924
3109 36322924 37017725 37678575 38011547 38134940 38021600 37485226 36929254 36773266 37045563
3100 37045563 37346895 37907080 39332243 40946563 42606979 44738774 47287342 50276879
3092 50276879 53611309 57630281 62010234 66512426 70743021 74117485 75884209 74727015
3084 74727015 70566209 64652884 57856276 51657075 47103158 43580014 40864685 38805692
3076 38805692 37098637 35504726 33866758 32714267 31705477 30285176 28936171 28159417
3068 28159417 27571860 26589496 25628340 25236743 24703822 24105951 23700973 23399919 23173856
3059 23173856 22985206 22958403 22895205 22392880 22098981 22076271 21984755 21616555 21597002 21542498
3049B1542498j91838k23849k30434q9158k14819o1449J65854j57150m40559m5986
3039B0053110n3951r0727j06299j4544k93908o8938J32658K1234J5415j90734
3029A9403316J37928r0940l13234O9176N44708J50033k70742j36881p1612O036
3019A9427788J07039K28060l3852J24023J95615P6569J30175J11914L70980M05789
3009B1144100M3085J16261L54260J79074K15100K89905L47739L82092L95781N24043
2999B3991440K93620k81783J66821N24987J82992L885N9990L92334M54950K08861
2989B5998097k3847M32624K68754L07482M56027L16484L22020O67077N17163L73973
2979B9635854L86424L78840M29428L43525O04119O36614O30985N03839O46086
$$ plain form
3049 21542498 21350660 21126811 20896377 20807219 20592400 20530951 20696805 20539655 20099096 20053110
3039 20053110 19999159 19908432 19802133 19787589 19493681 19424743 19557401 19578635 19594050 19403316
3029 19403316 19541244 19450304 19137070 19206246 19750954 19900987 19630245 19493364 19421752 19427788
3019 19427788 19534827 19762887 19729035 19853058 20048673 20125242 20255417 20367331 20738311 21144100
3009 21144100 21187185 21303446 21657706 21836780 22051880 22341785 22689524 23071616 23467397 23991440
2999 23991440 24285060 24003277 24170098 24695085 24878077 24881962 24941952 25334286 25789236 25998097
2989 25998097 25974250 26406874 26675628 26983110 27439137 27755621 28077641 28744718 29261881 29635854
2979 29635854 30022278 30401118 30830546 31174071 31778190 32414804 33045789 33549628 34195714
2970C4195714O15812N15781Q09980P37886Q61335O53487O49781P97049M08972
2961D0245797K12010O91373N93848N11502Q01735M27399N62988Q11992Q53632
2952D5712276P96902P87037R18064J041872P85395Q18792J065229J216126J041409
2943E4183102J095639Q60558J186620J457774J374428J184124J218082J467836
2935F4028163J775523J700468J366952J780819J893348J804354J890163K054097
2927G8293887J895344K364219K513170K657610K474888K277513K584481K608844
2919I7669956K590131L080321K929904K857688K782353K630403K756433K873967
2911A20171156K985032L026720K891893L048187L025398L049719K630357K366056
$$ plain form
2970 34195714 34811526 35327307 36137287 36875173 37736508 38389995 39039776 39836825 40245797
2961 40245797 40457807 41149180 41743028 42254530 43056265 43483664 44046652 44858644 45712276
2952 45712276 46509178 47296215 48214279 49256151 50041546 50860338 51925567 53141693 54183102
2943 54183102 55278741 56139299 57325919 58783693 60158121 61342245 62560327 64028163
2935 64028163 65803686 67504154 68871106 70651925 72545273 74349627 76239790 78293887
2927 78293887 80189231 82553450 85066620 87724230 90199118 92476631 95061112 97669956
2919 97669956 100260087 103340408 106270312 109128000 111910353 114540756 117297189 120171156
2911 120171156 123156188 126182908 129074801 132122988 135148386 138198105 140828462 143194518
2903A43194518K479294K308919K401919K146909K267936K273104K394380K294240
2895A61761219K119369J792430J821212K070238J760627J294385J435309J120297
2887A75175086N42950L1513q3366l06966n45283q66204j210131j462216j896313
2878A69379070k128766j812336k114410k454572k490197k654799l550372l640082
2870A48533536l348291l736176l920678l895638l912750m026446l964088l669211
2862A18060258l689810l836243l669604l458912l647258l879377l480374l266873
2854H9131807l149360l356837l089834k694949k870989k432697j975112k281733
2846F7280296k097481j713108j540590j721083j673063j435677j086288r07187
$$ plain form
2903 143194518 145673812 147982731 150384650 152531559 154799495 157072599 159466979 161761219
2895 161761219 163880588 165673018 167494230 169564468 171325095 172619480 174054789 175175086
2887 175175086 175718036 175749549 175666183 175359217 174813934 173947730 172737599 171275383 169379070
2878 169379070 167250304 165437968 163323558 160868986 158378789 155723990 152173618 148533536
2870 148533536 145185245 141449069 137528391 133632753 129720003 125693557 121729469 118060258
2862 118060258 114370448 110534205 106864601 103405689 99758431 95879054 92398680 89131807
2854 89131807 85982447 82625610 79535776 76840827 73969838 71537141 69562029 67280296
2846 67280296 65182815 63469707 61929117 60208034 58534971 57099294 56013006 55105819
2838E5105819j167434r75112j030187q10184l67237m54871p90339o91641n63524
2829D8255290k93821m31881q71007n41310n19403l54324m47851m23732o73937
2820D3698024m16905j05099k20856m20401n30618k74191j09349k31653l04062
2811D1084890k24649m5026j52622p0271j98739l75116M087Q7574O6072l15997
2801C9860203l00930k10878k51620J70160J12923J26396j88436K36698O6089M4139
2791C9664744O5276L47719N27994J72284K61617N40372M78520K79431O94798O83028
2781D3715783N81970P60978R71844R56832Q50565J073598R46343R40331J149850
2772E1948094J120571J121740J147633R68552L05576j63941k75534L9715K37461
$$ plain form
2838 55105819 53938385 52963273 51933086 51122902 50755665 50300794 49510455 48818814 48255290
2829 48255290 47961469 47529588 46658581 46117271 45597868 45243544 44795693 44371961 43698024
2820 43698024 43281119 43176020 42955164 42534763 42004145 41729954 41620605 41388952 41084890
2811 41084890 40860241 40815215 40662593 40592322 40393583 40018467 40022554 40110128 40176200 39860203
2801 39860203 39559273 39348395 39096775 39266935 39379858 39506254 39317818 39554516 39620605 39664744
2791 39664744 39730020 40077739 40605733 40778017 41039634 41580006 42058526 42337957 43032755 43715783
2781 43715783 44297753 45058731 46030575 46987407 47837972 48911570 49857913 50798244 51948094
2772 51948094 53068665 54190405 55338038 56306590 56612166 56448225 56172691 56212406 56449867
2763E6449867N66889O48932J067686J201022J378657J456404J056389J260883
2755F5086729J192246J123560J008311N67558P97845O32414N26445Q29802J300922
2746G3065832J312734J432155J876770K270193K592116K736312K631882K292620
2738I0210614K218511J110036l32698j056889j243584m70125N85265J536008J900274
2729I4457412K218302K490372K720918L058280L575168L876491M094002M224152
2721A20715097M852578N192025N541641O061951O724770P233766P975957Q954824
2713A73252609R231291R832493J0404777J0568804J1237114J1325313J2134650
2706B47987051J3380966J4150121J5256081J5958663J6210533J6351431J5541674
$$ plain form
2763 56449867 57016756 57665688 58733374 59934396 61313053 62769457 63825846 65086729
2755 65086729 66278975 67402535 68410846 68978404 69776249 70408663 70935108 71764910 73065832
2746 73065832 74378566 75810721 77687491 79957684 82549800 85286112 87917994 90210614
2738 90210614 92429125 93539161 93206463 92149574 90905990 90435865 91021130 92557138 94457412
2729 94457412 96675714 99166086 101887004 104945284 108520452 112396943 116490945 120715097
2721 120715097 125567675 130759700 136301341 142363292 149088062 156321828 164297785 173252609
2713 173252609 182483900 192316393 202721170 213289974 224527088 235852401 247987051
2706 247987051 261368017 275518138 290774219 306732882 322943415 339294846 354836520
2699C54836520J3488772J0311680O647680K908727q52080l722898n407902o017700
2691C72192799n896063n551206m764603l812140l042266k872476l425923m442437
2683C38385685o011286p850620j0604469j3194741j5649977j7038669j7559648
2676B50476275j7285874j6323652j5135330j3583991j1713998j0388539r163483
2669A56881408q120826p331946o544276n915618n399067m955311m819291m563694
2661A09231379m271261l586364l550507l401058l455546k954915k885001k734005
2653H2392722k247012k380607k035094j809370j546407j628180j454310j312705
2645F7979037j341450j123960j220880j196375r74743r64072q81442r54069j040565
$$ plain form
2699 354836520 368325292 378636972 385284652 388193379 387341299 383618401 378210499 372192799
2691 372192799 366296736 360745530 355980927 352168787 349126521 346254045 342828122 338385685
2683 338385685 332374399 324523779 313919310 300724569 285074592 268035923 250476275
2676 250476275 233190401 216866749 201731419 188147428 176433430 166044891 156881408
2669 156881408 148760582 141428636 134884360 128968742 123569675 118614364 113795073 109231379
2661 109231379 104960118 101373754 97823247 94422189 90966643 88011728 85126727 82392722
2653 82392722 80145710 77765103 75730009 73920639 72374232 70746052 69291742 67979037
2645 67979037 66637587 65513627 64292747 63096372 62121629 61157557 60276115 59322046 58281481
2636E8281481p71398o50011m79269o00989o77202m16662l42909m20725n83524
2627E3338792j95829l43141k77923k47518q8877l16893j69512p0963k87258L3485
2617E1374363K67310P6128j45662J01380M45514M49044J66669K13835L14694J85689
2607E3448964L20401O08999L82082K13266P10648Q70855P11881N71477N14441
2598E8353014R09609J269688Q53996Q61580J038517Q71899J420474J645535J197237
2589F8421549J202549J578379J655715J937161J817956J872577J933939J771273
2581H2191098J874437J859150J795177J769932J669171J585742J517110J542222
2573I5804039J517870J507492J721768J936531J736897J519990J311557J372835
$$ plain form
2636 58281481 57510083 56860072 56380803 55779814 55102612 54685950 54343041 53922316 53338792
2627 53338792 53142963 52799822 52521899 52274381 52185504 51868611 51699099 51628136 51340878 51374363
2617 51374363 51641673 51717801 51572139 51673519 52119033 52568077 52734746 52948581 53263275 53448964
2607 53448964 53769365 54378364 54760446 54973712 55684360 56555215 57267096 57838573 58353014
2598 58353014 59262623 60532311 61386307 62247887 63286404 64158303 65578777 67224312 68421549
2589 68421549 69624098 71202477 72858192 74795353 76613309 78485886 80419825 82191098
2581 82191098 84065535 85924685 87719862 89489794 91158965 92744707 94261817 95804039
2573 95804039 97321909 98829401 100551169 102487700 104224597 105744587 107056144 108428979
2565A08428979J582284J042573J041804J063551O29351O28240Q72726P38294O40825
2556A16668627P75066R85347J427382J372619J350202J575098J667951J805243
2548A27627535J999416K363662K848264L196877L467699L727063L970700N011057
2540A54212273N834476O350246P034299P667989Q217252Q982819R723183R968641
2532B17991178J0362062J0932974J1288402J1657152J1470582J1306237J0583338
2525B95591925R597588Q203069O793804O054545O061448O008291N902047O430691
2517C50643408O477427O672322O149946N061299L995852K148044J14966k102089
2509C79161175m907857p110547q467656r419411j0216281j0600641j0231255r724748
$$ plain form
2565 108428979 110011263 111053836 112095640 113159191 113788542 114416782 115289508 116027802 116668627
2556 116668627 117443693 118429040 119856422 121229041 122579243 124154341 125822292 127627535
2548 127627535 129626951 131990613 134838877 138035754 141503453 145230516 149201216 154212273
2540 154212273 160046749 166396995 173431294 181099283 189316535 198299354 208022537 217991178
2532 217991178 228353240 239286214 250574616 262231768 273702350 285008587 295591925
2525 295591925 305189513 313392582 320186386 326240931 332302379 338310670 344212717 350643408
2517 350643408 357120835 363793157 369943103 375004402 379000254 381148298 381263264 379161175
2509 379161175 374253318 367142771 358675115 349255704 339039423 328438782 318207527 308482779
2501C08482779r517039r148313q725072q589813q667193r061734r535411j0065203
2493B35173001j0656583j1292593j1821314j1507317j1042721j0281652r841538
2486A58729283q816524p892851p232634o398320o012044n481774m766127m484332
2478A07644677m464823l729824l747595l468154l019556k876461k679911k621822
2470H1036531k331735k131381j989065k043280j864298j980274j732581j205689
2462F5758228j285129j686222j504342j404995j158930j051968j184291r81571
2454E5500780j155867j219848r29551q90373r28729j036533r86617q06515r44989
2445D6601758q38025q79756q08685q72265r02509o27012o44785n37076o52695
$$ plain form
2501 308482779 298965740 289817427 281092355 272502542 263835349 254773615 245238204 235173001
2493 235173001 224516418 213223825 201402511 189895194 178852473 168570821 158729283
2486 158729283 149912759 142019908 134787274 128388954 122376910 116895136 112129009 107644677
2478 107644677 103179854 99450030 95702435 92234281 89214725 86338264 83658353 81036531
2470 81036531 78704796 76573415 74584350 72541070 70676772 68696498 66963917 65758228
2462 65758228 64473099 62786877 61282535 59877540 58718610 57666642 56482351 55500780
2454 55500780 54344913 53125065 52195514 51305141 50376412 49339879 48353262 47546747 46601758
2445 46601758 45763733 44883977 44075292 43203027 42300518 41673506 41028721 40491645 39838950
2436C9838950p16238o91012o08372m83036m41862p02193o70458o76161m57225
2427C4392393o11947l88793k68879n93601o87628p07999l37013m15184k97061
2418C0084288m57183m53805o06193l12072j11782n05663n87774n13074k83549
2409B6253193k29812k36965k10135l54269l58700k80354j72666l05249m32612
2400B3672431p8664j9411l84019n08608o6165r4755n07282m86890J4441K71532
2390B1812610l37130j32217k89931m21095l97964m1892n6903k98755j52346j30111
2380A9554266m63773k55656r2755p166k97299l24002j16383k57466k58913l60910
2370A7119943j20973j19025l21419j83303j47520j44253j74116k65090k42757
$$ plain form
2436 39838950 39122712 38431700 37823328 37340292 36898430 36196237 35525779 34849618 34392393
2427 34392393 33780446 33391653 33122774 32529173 31841545 31133546 30796533 30381349 30084288
2418 30084288 29627105 29173300 28567107 28255035 28143253 27637590 27049816 26536742 26253193
2409 26253193 26023381 25786416 25576281 25222012 24863312 24582958 24410292 24105043 23672431
2400 23672431 23593767 23574356 23190337 22681729 22615564 22520809 22013527 21526637 21541078 21812610
2390 21812610 21475480 21343263 21053332 20632237 20234273 20192381 20135478 19836723 19684377 19554266
2380 19554266 19090493 18834837 18742082 18734916 18437617 18113615 17997232 17739766 17480853 17119943
2370 17119943 16998970 16879945 16558526 16375223 16227703 16083450 15909334 15644244 15401487
2361A5401487m06387k722j34559k50361q7139m5904O2649k36966k55173o7286
2351A3977639j96588k87528J24209J29619m02370l21734J1988M23362j4142n09350
2341A2935105P1535J41805j0180k68533n5576N222l6886P6078N8392k14765j6432
2330A2685765K18053K00258j59541l8290Q7943j75491L5983l0350J58894l6732
2320A2946492N3036J64499j27632l18952j06945j75612j65568l58526L762l1587
2310A1882967j21578j54713m3940j4200j12684j87540J28134M495k20853q4103
2300A1075985j4377j45680R6042J24144J29428q4214j76376O7134J67260k27926
2290A1011420j29967J38488K9063J30894M6430k12852L0034J03609J76400n8889
$$ plain form
2361 15401487 14995100 14992378 14857819 14607458 14520319 14474415 14537064 14300098 14044925 13977639
2351 13977639 13781051 13493523 13617732 13747351 13344981 13023247 13035235 13458597 13444455 12935105
2341 12935105 13006640 13148445 13138265 12869732 12814156 12819378 12782492 12858570 12916962 12702197 12685765
2330 12685765 12903818 13104076 12944535 12906245 12994188 12818697 12854680 12824330 12983224 12946492
2320 12946492 12999528 13164027 13036395 12717443 12610498 12434886 12269318 11910792 11914554 11882967
2310 11882967 11761389 11606676 11562736 11548536 11435852 11248312 11376446 11380941 11160088 11075985
2300 11075985 11061608 10915928 11011970 11136114 11265542 11181328 11004952 11072086 11239346 11011420
2290 11011420 10881453 11019941 11049004 11179898 11226328 11013476 11043510 11147119 11323519 11264630
2280A1264630m0546O1577J39445J41902k47823l08089N1142J52318O9802J23868
2270A1408226j07578k9350K99555J18678k48447j04448j04337L16979J59475p7058
2260A1631695j14895M9660R4608J97049K73215r2591J0906K18212L7883L9589
2250A2345331k67030K2454J52547P5137j9148J24924L1510K32124J44722Q9776
2240A2932347J56754N184q6789K6928Q5322J88914J99575M0508Q7663J12201J18341
2229A3866948K27498L31876K52112K13329L16059j2423M743J73187M20839P2011
2219A5866179K53553M13403J42308K3748K62955K72558K55149J07459K97384L90898
2209A8285594N7311J91797K06125J23667K69526L11242K72964K24552j57829L62556
$$ plain form
2280 11264630 11224084 11285661 11425106 11567008 11319185 11011096 11062238 11214556 11284358 11408226
2270 11408226 11300648 11271298 11570853 11689531 11441084 11336636 11232299 11549278 11708753 11631695
2260 11631695 11516800 11566460 11661068 11858117 12131332 12038741 12049647 12267859 12305742 12345331
2250 12345331 12078301 12100755 12253302 12328439 12309291 12434215 12465725 12697849 12842571 12932347
2240 12932347 13089101 13094285 13007496 13034424 13119746 13308660 13508235 13548743 13636406 13748607 13866948
2229 13866948 14094446 14426322 14678434 14891763 15207822 15195399 15200142 15373329 15794168 15866179
2219 15866179 16119732 16533135 16675443 16699191 16962146 17234704 17489853 17597312 17894696 18285594
2209 18285594 18342905 18534702 18740827 18864494 19134020 19445262 19718226 19942778 19784949 20147505
2199B0147505N59260L19970K74810K53464J58597M07955M83024L81722L25948
2190B3312255J67454M28588O70700N03439N76277Q81947Q07463O46960J006602
2181B9001685R87982P33145R08927J018709J376059J246708J122188J300206J088880
2172C8784489J023326J352623J267636P02913K83622K2250k58475r39231j355684
2163D0883469j701631j769375j802523j598529j393527j410566j355074p76751
2155B9075493p09908r44448r65076p93265q13440o89357q91842p01953n74378
2146B1991826p40727m93804n93941l93052j37408k39513l41645m71081k51569
2137A8329086k30400l3369J1772q479j46680R0417L3133j7265o4130R791Q1201
$$ plain form
2199 20147505 20706765 21026735 21301545 21555009 21713606 22121561 22604585 22986307 23312255
2190 23312255 23479709 23908297 24578997 25082436 25658713 26540660 27348123 27995083 29001685
2181 29001685 29989667 30722812 31631739 32650448 34026507 35273215 36395403 37695609 38784489
2172 38784489 39807815 41160438 42428074 43130987 43414609 43436859 43178384 42239153 40883469
2163 40883469 39181838 37412463 35609940 34011411 32617884 31207318 29852244 29075493
2155 29075493 28365585 27421137 26456061 25662796 24849356 24159999 23268157 22566204 21991826
2146 21991826 21251099 20757295 20163354 19770302 19632894 19393381 19051736 18580655 18329086
2137 18329086 18098686 18065317 18077089 18068610 17921930 18012347 18045480 18028215 17964085 17973876 18055077
2126A8055077J80824J81525j9018l57620j37432K19538N7571n07663n86222p70400
2116A6316180p65973n12358k12242k25982n35968l71613j52317K0453k78118j91984
2106A3090078k32392k30871o7173j18692j64434Q346m1144J53428k07582j47083
2096A2042481j64252J07023m7985R5273K02728j9088k07545O7302L70575l8702
2086A2407810m0057j21368m2806m97405l61595R1011j77465l93330R5235P2059
2076A1032089l73698j36574k82716R0398r5529k44715k03492N3806p0856k28807
2066I539906l1495j31720J6908j28559M5035j5116j70237J13946K88913K1042
2056I548623j2821K24640j56586q3595K03054M11658k16979J90476p4284p6619
$$ plain form
2126 18055077 18235901 18417426 18398408 18040788 17903356 18122894 18180465 17672802 17086580 16316180
2116 16316180 15550207 15037849 14825607 14599625 14063657 13692044 13539727 13560180 13282062 13090078
2106 13090078 12857686 12626815 12559642 12440950 12276516 12284862 12243718 12397146 12189564 12042481
2096 12042481 11878229 11985252 11937267 12032540 12235268 12216180 12008635 12075937 12446512 12407810
2086 12407810 12367753 12246385 12203579 11706174 11344579 11435590 11258125 10864795 10960030 11032089
2076 11032089 10658391 10521817 10239101 10329499 10233970 9989255 9785763 9839569 9768713 9539906
2066 9539906 9508411 9376691 9393599 9265040 9310075 9294959 9124722 9238668 9527581 9548623
2056 9548623 9535802 9760442 9603856 9520261 9723315 10134973 9917994 10108470 10034186 9957567
2046I957567k60570l59110j9790l24712k46571j35703O466k16404j7658j7184
2036H366331m3709j11691n0111J40592j01788j20522K71041n1886k28900K6420
2026H095777K89659N7960k6150R4538J28171O2511N6872J98935K15917J48562
2016I322752M64741M76679o4648K5913J96784k82445o39971m61396k33523k85365
2006H519521l11113j02764j46174k54372p2560K41455o9939m33913K3791J71498
1996G565430J2133j34538n8487j80774J52831J20459l1236J26435p1509P9458
1986G580202q5020j41336m987K49867J1337J02946L05813j38455J22591j8338
1976G984620L3878M1993K1884j98404m9498k89947l80374j46799N5030j81668
$$ plain form
2046 9957567 9696997 9337887 9318097 8993385 8746814 8611111 8617577 8401173 8383515 8366331
2036 8366331 8322622 8210931 8160820 8301412 8199624 8079102 8350143 8298257 8069357 8095777
2026 8095777 8385436 8443396 8417246 8511784 8639955 8702466 8759338 8958273 9174190 9322752
2016 9322752 9787493 10264172 10199524 10225437 10422221 10139776 9499805 9038409 8804886 8519521
2006 8519521 8208408 8105644 7959470 7705098 7632538 7873993 7804054 7370141 7393932 7565430
1996 7565430 7577563 7443025 7384538 7203764 7356595 7477054 7445818 7572253 7500744 7580202
1986 7580202 7495182 7353846 7348859 7598726 7610063 7713009 8018822 7880367 8002958 7984620
1976 7984620 8018498 8060491 8082375 7883971 7834473 7544526 7164152 7017353 7072383 6890715
1966F890715k1595M8555j8281j40176P4766J62350o8828q1057m1102J96460q9753
1955F912054r4993J28458R5885k48582R2955J66682j46639J25788J24706J2231
1945G168545r3926J05599J96232j09034N1913L65157J42353Q7879j33071L34243
1935H115890K47060l64778K16308L58736K54991N8338L16037K12431J21021J52424
1925I688458L64368L21221M01778N33375M84286L13546M76518M41394N04092M64982
1915A3994018O71243M73686L22699L81148M34444J24946j24926l0255j08129J01815
1905A6240689l27687R798J42648j30113k56151j97470j12322j72309m7452j64830
1895A4984801r3452l6981L41812J45322M5670L25605O01680M69786M88527M88245
$$ plain form
1966 6890715 6869120 6917675 6899394 6759218 6833984 6996334 6927506 6846449 6805347 7001807 6912054
1955 6912054 6817061 6945519 7041404 6792822 6885777 7052459 6905820 7031608 7156314 7168545
1945 7168545 7074619 7180218 7376450 7267416 7319329 7684486 7826839 7914718 7781647 8115890
1935 8115890 8362950 7998172 8214480 8573216 8828207 8886545 9202582 9415013 9536034 9688458
1925 9688458 10052826 10374047 10775825 11309200 11793486 12107032 12583550 13024944 13529036 13994018
1915 13994018 14665261 15138947 15461646 15842794 16277238 16402184 16277258 16247003 16138874 16240689
1905 16240689 15913002 15922800 16065448 15935335 15679184 15481714 15369392 15197083 15149631 14984801
1895 14984801 14891349 14854368 15196180 15341502 15387172 15712777 16314457 16784243 17272770 17761015
1885A7761015P73888Q81245O44834J001485J064059J046040J178495J322745Q93757
1876B6567563O90855R28387O60651L08264L9128k08122p13037r85209m70429o44131
1866B6173920q20269k86345n49378p18019p16322q18427q32007r36837r92627
1857A9503689q61693k96519J52663k72292j28997J48861m6911L70225K22498J73142
1847A8964666L28662N98722N91439O80761M91814N05081P83092Q48908P23836
1838B4516981N51381N86089L38320O4337k14954m49408l83816m46485m29053q2756
1828B4050636n63328o76390m80086k65178k76944n27908o66855m58323j50519
1819A9985105l09478l04671k4614o6526j75803J75079R6025K31258K54703M75361
$$ plain form
1885 17761015 18534903 19416148 20060982 21062467 22126526 23172566 24351061 25673806 26567563
1876 26567563 27258418 28186805 28847456 29155720 29194848 28986726 28273689 27288480 26818051 26173920
1866 26173920 25353651 25067306 24517928 23799909 23083587 22265160 21433153 20496316 19503689
1857 19503689 18641996 18345477 18498140 18225848 18096851 18245712 18198801 18569026 18791524 18964666
1847 18964666 19293328 19892050 20483489 21164250 21656064 22161145 22944237 23793145 24516981
1838 24516981 25068362 25654451 25992771 26057108 25842154 25392746 25008930 24562445 24133392 24050636
1828 24050636 23487308 22810918 22330832 22065654 21788710 21260802 20593947 20135624 19985105
1819 19985105 19675627 19370956 19346342 19279816 19104013 19279092 19375117 19606375 19861078 20336439
1809B0336439K75290L25990K19683J85878l13876j64009L4184m17563o94158n59878
1799A9227980l83470l64967l12703k06512o8100k67043o7275m5019M8365k39789
1789A7321467n9154L04642J83017J15648N6829K73655o9107n2780N3433j20309
1779A8007341k12686K0166N0744j43347n63273j57019j07764l99637k86112m14574
1769A5793839l27048k98873m44625n90464m02303j55874j75388k34691j47299
1760A3017274j21317R5810l82394k24856j30938K0476l7409j51903n03194j89648
1750A1391901l1394k72459l21880l90037j62054n019j7826l58185l03079j14888
1740I415080k87229j9012l34231m50242j45650J60846j87785k21040k15953r7809
$$ plain form
1809 20336439 20611729 20937719 21157402 21343280 21029404 20865395 20899579 20482016 19787858 19227980
1799 19227980 18844510 18479543 18166840 17960328 17892228 17625185 17557910 17512891 17561256 17321467
1789 17321467 17262313 17566955 17749972 17865620 17922449 18196104 18126997 18074217 18127650 18007341
1779 18007341 17794655 17814821 17865565 17722218 17158945 17001926 16894162 16494525 16208413 15793839
1769 15793839 15466791 15167918 14723293 14132829 13730526 13574652 13399264 13164573 13017274
1760 13017274 12895957 12991767 12609373 12384517 12253579 12274055 12236646 12084743 11581549 11391901
1750 11391901 11360507 11088048 10766168 10376131 10214077 10209058 10191232 9833047 9529968 9415080
1740 9415080 9127851 9108839 8774608 8324366 8178716 8339562 8151777 7930737 7714784 7616975
1730G616975M3164q5035l12985l08846K1041K42132j03660m79315p4163r8210
1720F461098p1473k41588l3357N6111l3328j79880o4957o4032J6805j9690P4821
1709E900530j73977k22930J10213o3021k67310k48032Q3902J36381j15544l23529
1699D816683M7216J23698j96372o1951j35778j27850j444J82261j40728k65636
1689D240099J54708J44973j01916k08305j78108l0239K56770R1907k16079l89649
1679C764161k72674L81837K59689k45853k02171r3755K31093l88332l88664J79101
1669C224432N54659j50002j02214P3987l15079j15296R4034l3412k37338j02355
1659B891416K99240j45649j50101J37150L4959j32445p6559j16525m8294J05030
$$ plain form
1730 7616975 7660139 7575104 7262119 6953273 6974314 7216446 7112786 6633471 6559308 6461098
1720 6461098 6389625 6148037 6114680 6170791 6137463 5957583 5892626 5828594 5845399 5825709 5900530
1709 5900530 5726553 5503623 5613836 5550815 5283505 5035473 5119375 5255756 5140212 4816683
1699 4816683 4863899 4987597 4791225 4729274 4593496 4465646 4464202 4646463 4505735 4240099
1689 4240099 4394807 4539780 4437864 4229559 4051451 4021212 4277982 4369889 4153810 3764161
1679 3764161 3491487 3873324 4133013 3887160 3684989 3591234 3822327 3433995 3045331 3224432
1669 3224432 3779091 3629089 3526875 3600862 3285783 3170487 3264521 3231109 2993771 2891416
1659 2891416 3190656 3045007 2894906 3032056 3067015 2934570 2858011 2741486 2693192 2798222
1649B798222J17254J98903k49890p6565j45075K11312l86840k17008K70918K61636
1639B782867n2056k15227l4500J77661K861Q588j22469j05447K20141M2908l30209
1628B375118j68934L68913J02142j63768k21714k8981J60358j6362M9555j7603
1618B438724n6704O8023Q7078j37875p7150L8528J46300O0898p3584J406J20155
1607B615799l5088n7259J83518J14069p4556o793k3916k311R1474R1345J0915
1596B907197Q1141j93982o1235o1227O5661N5045J01920L9466J9295n048k97295
1585B650938n1239P9600K87106P0587q3816r633J49017o906j9993r7313J00447
1574C068795l2548N6018j01611j36260J94302L13845L9562q4693Q0120J17675
$$ plain form
1649 2798222 2915476 3114379 2864489 2787924 2642849 2854161 2467321 2250313 2521231 2782867
1639 2782867 2730811 2515584 2481084 2658745 2661606 2670194 2547725 2442278 2662419 2705327 2375118
1628 2375118 2206184 2575097 2677239 2513471 2291757 2262776 2423134 2406772 2456327 2438724
1618 2438724 2382020 2450043 2537121 2399246 2322096 2360624 2506924 2567822 2494238 2495644 2615799
1607 2615799 2580711 2523452 2706970 2821039 2746483 2739690 2715774 2713463 2804937 2896282 2907197
1596 2907197 2988338 2794356 2733121 2671894 2737555 2792600 2894520 2933986 2953281 2948233 2650938
1585 2650938 2599699 2679299 2966405 3036992 2953176 2943543 3092560 3085654 3065661 2968348 3068795
1574 3068795 3036247 3092265 2990654 2854394 3048696 3362541 3402103 3317410 3397530 3515205
1564C515205j07508O7807K11000q1455j79417j4219N0486J35018J1866M244R7231
1553C710258j69288k24415L45483K77470j81453k0937K41012P2678M865j08313
1543C947360J34765K06456J56858L46518N5193l96618K59451M48429j83195j79045
1533D796172J72794J86301j55382o9564M1525Q9900M3994L72770K6099k89432
1523E215177j02853K33160M67063k22963k4407K36489J95472N2418K77458M43912
1513F770926K36793J4458J29635J50589k74936K19096N20915K23399j24879n3830
1503G812166k2299O2635R4113L31451m1978p5819L4960J59541r1876k29306J94976
1492H228564J59822q5494p9814J82323l4747m3242J96551J27967J17525q5426
$$ plain form
1564 3515205 3407697 3475504 3686504 3605049 3425632 3411413 3461899 3596917 3608783 3613027 3710258
1553 3710258 3540970 3316555 3662038 3939508 3758055 3737118 3978130 4050808 4055673 3947360
1543 3947360 4082125 4288581 4445439 4791957 4847150 4450532 4709983 5158412 4975217 4796172
1533 4796172 4968966 5155267 4999885 4930321 4971846 5061746 5105740 5478510 5504609 5215177
1523 5215177 5112324 5345484 5812547 5589584 5565177 5801666 5997138 6049556 6327014 6770926
1513 6770926 7007719 7022177 7151812 7302401 7027465 7246561 7767476 7990875 7865996 7812166
1503 7812166 7789867 7852502 7946615 8278066 8236088 8160269 8195229 8354770 8262894 8033588 8228564
1492 8228564 8388386 8302892 8223078 8405401 8370654 8327412 8523963 8651930 8769455 8684029
1482H684029L8846L99804J79407J84303K52439j0058K9383M12693O17639j6282
1472A0772203O0221J72553o3833l12063m35548j90533k15342k87622j39830K6458
1462I386664o0125l93300L355K9764k05768j88661j34539L928m0865o8079p6984
1451H255390o4118j43506O977q4881p0451j24264O9689K533J2867k1079J79205
1440H018362r7390p906L60487L02088j4345j55848K17701k23205l23032k23462
1430G853450k79836k97133l42021l57307m09157k70774l73112n3872L2439r4091
1420E408586l04042J6969P8171l03954k08594M8262J5155q8649J49345j91633
1410D619616k36600j57161j20766k49579j32247l5813L1856R7898j51827M0775
$$ plain form
1482 8684029 8722875 9122679 9302086 9486389 9738828 9728770 9758153 10170846 10788485 10772203
1472 10772203 10832424 11004977 10941144 10629081 10193533 10003000 9787658 9500036 9360206 9386664
1462 9386664 9326539 8933239 8936594 8966358 8760590 8571929 8437390 8441318 8400453 8332374 8255390
1451 8255390 8191272 8047766 8054743 7969862 7899411 7775147 7844836 7847369 7860236 7839157 8018362
1440 8018362 7920972 7913066 8273553 8575641 8561296 8405448 8623149 8399944 8076912 7853450
1430 7853450 7573614 7276481 6934460 6577153 6167996 5897222 5524110 5470238 5502677 5408586
1420 5408586 5104544 5121513 5199684 4895730 4687136 4735398 4750553 4661904 4811249 4619616
1410 4619616 4383016 4225855 4105089 3855510 3723263 3687450 3719306 3817204 3665377 3706152
1400C706152J11945k38422j03908N5386j86238M1229R2576R3781l05954l96807
1390B869740J9149K34376l66586o04333l1375Q5114O9368j26703j81033o5851
1380A901866k29472N9503K97048q7228j94848J17001J86282k03656m06341M2336
1370A482491q4179K03806R1085j91324j91639j37816K26680j82316n2898j22961
1360A040929K16969L7852l97311m849R7465J00708l0517N1237K08935j62968n8116
1349A100334n9651j17706j55121N0140l0289P1549K10045K54942k46377j73670
1339I04196q5882J51399K80281L3056l31398J733k4932M081q6996n086n7261p7949
1327G05242K31982p3604k27173j6452Q4711O8415q4385j12950O2237J64252j04611
$$ plain form
1400 3706152 3818097 3579675 3475767 3531153 3344915 3386144 3478720 3572501 3266547 2869740
1390 2869740 2888889 3123265 2756679 2152346 2120971 2206085 2275453 2148750 1967717 1901866
1380 1901866 1672394 1731897 2028945 1941717 1746869 1863870 2050152 1846496 1440155 1482491
1370 1482491 1398312 1602118 1693203 1501879 1310240 1172424 1399104 1216788 1163890 1040929
1360 1040929 1257898 1295750 898439 893590 991055 1091763 1061246 1112483 1321418 1158450 1100334
1349 1100334 1040683 922977 767856 817996 787707 859256 1069301 1324243 1077866 904196
1339 904196 818314 969713 1249994 1283050 951652 953385 928453 932534 845538 840452 783191 705242
1327 705242 937224 863620 636447 619995 704706 773121 688736 575786 638023 802275 697664
1316F97664o2775k7645M0494Q8343p4185L9391k13133O3820j0568m9508j7643
1305D74255L3705J8350M618k45560J59469O6261P3785l76179R7149Q608q9417
1294B25044M5477L475j8273M3383M1903O7432j01261j34938J12008N8787M5885
1283C88922R726o6252N3952q7135L4541L3608n6195m840K60639M1405q0077J75878
1271G04172p5349p7979j41642L2228q7682J08000k889N9511j5443o2931P4320
1260E14316N4057O166j32455J04299M6709j28313j25952L2592N7771j24167L9697
1249C44720P3557K9087K32806K249q5961J7492o251p49j41026k07110M6546N2722
1237C58082J08388j47034k28871K04289J66690O8050k8873o4760l4890J7366q7840
$$ plain form
1316 697664 634889 607244 647738 736081 661896 701287 488154 551974 541406 491898 474255
1305 474255 507960 526310 530928 285368 444837 511098 584883 208704 305853 314461 225044
1294 225044 270521 273996 255723 299106 341009 408441 307180 172242 284250 343037 388922
1283 388922 398648 332396 386348 299213 333754 367362 311167 306327 566966 608371 528294 704172
1271 704172 628823 550844 409202 441430 353748 461748 458859 518370 502927 439996 514316
1260 514316 568373 574539 442084 546383 593092 464779 338827 371419 429190 305023 344720
1249 344720 418277 447364 680170 682419 596458 613950 607699 606950 465924 258814 305360 358082
1237 358082 466470 319436 90565 294854 461544 529594 500721 435961 401071 418437 330597
1226C30597j97623J82945J34070o1059l0882q3444J02975r8446n0400L6946M7375
1215C13054m5736J86902J99664l33219k32669K1997P3589J73343K17462J4837
1205E89224j36340k27028m7792J92744L2313J54078j23705j8063R543J79945J53082
1194G58001k46277k14016P2457J75989j72702j87790J2685J87727j09786j79059
1184I7229Q7274J05218l7657L8312J51727m6518j75153K012J07240j59341R0205
1173B60548J11607p6328j68673r308n7771J1059R0843K23258p493j86507m7618
1162A43617O9555Q5327j65877m97J84152j61018P5553R8793m3770p1395l3074
1151A81366K22293l3120k07035k43J2761P46O9375O7040O5915k79097k54377M19818
$$ plain form
1226 330597 132974 315919 449989 388930 358048 274604 377579 279133 228733 265679 313054
1215 313054 267318 454220 653884 320665 87996 109993 183582 356925 574387 589224
1205 589224 452884 225856 178064 370808 403121 557199 433494 415431 424974 604919 758001
1194 758001 511724 297708 370165 546154 373452 185662 198347 386074 276288 97229
1184 97229 184503 289721 252064 290376 442103 395585 220432 222444 329684 170343 260548
1173 260548 372155 295827 127154 117846 60075 71134 161977 385235 377742 191235 143617
1162 143617 213172 298499 132622 132125 316277 155259 230812 329605 285835 214440 181366
1151 181366 403659 370539 163504 163261 176022 176768 246143 313183 379098 100001 -154376 265442
1139B65442K35104j47555j60752Q2575O1438J6309k9919P9075j4014R7798O8642
1128E54143j40512m4547Q7814J30531k8532K8401j62426J03184j57647r5115M8298
1117C23592J27599j74941j7247P3338P7767K16848j57094j80995P748R3716K1594
1106D11925k27261j23700J37511J97895r7765r1122K5256r2972L6718r5517M6300
1095A27268K17693J27013J81322k81607q5785J24190K73351Q6412l31946j39015
1085B98896J47231j0921K10858j5491k41491q2707N3466L9698O3891J51766J381
1074F16577j0987N0993j11392k05582Q4665J25888l7123J8023Q9209k64317K11806
1063E67760N3903j13056L76539M9238j52885k56356O0927J124o0682O0819Q8218
$$ plain form
1139 265442 500546 352991 192239 274814 336252 352561 322642 401717 387703 485501 554143
1128 554143 413631 369084 456898 587429 558897 587298 424872 528056 370409 275294 323592
1117 323592 451191 276250 259003 332341 410108 626956 469862 288867 296615 390331 411925
1106 411925 184664 60964 198475 396370 298605 207483 232739 139767 176485 80968 127268
1095 127268 344961 471974 653296 371689 285904 410094 683445 769857 437911 298896
1085 298896 446127 435206 646064 630573 389082 306375 359841 399539 463430 615196 616577
1074 616577 605590 656583 545191 339609 424274 550162 513039 531062 620271 355954 567760
1063 567760 621663 508607 885146 934384 781499 525143 586070 587194 526512 587331 675549
1052F75549Q1905P9205K21014J4043k20873K63905M87044j15294m71378M5750
1042A060870J64245o6059l4637j39876o0576J38527J86228n8285j74347j32678
1032H83412K36654K58222k32502r3336J16474J61214J20422N6819j60405j8651
1022A328323J25989J2258j08864j32883J87760L63189n0191l88523n1050K24329
1012A510337J08833J32450O706k20219o7363K16026L36642j51238k3546J46425
1002A995053K97117j40826k01860K4387J28443J47650L02672r9745M2829J52057
992B647777J30487M1064J88166K54163M19859R7473K5937L81805K09000Q2059
982D477790K85927K80562J18861M59953M11160L38121N89795O43218P06114N17366
$$ plain form
1052 675549 757454 836659 1057673 1071716 850843 1114748 1601792 1486498 1015120 1060870
1042 1060870 1225115 1159056 1124419 984543 923967 1062494 1248722 1190437 1016090 883412
1032 883412 1120066 1378288 1145786 1052450 1168924 1330138 1450560 1507379 1346974 1328323
1022 1328323 1454312 1466570 1357706 1224823 1412583 1775772 1725581 1337058 1286008 1510337
1012 1510337 1619170 1751620 1758326 1538107 1470744 1686770 2023412 1872174 1848628 1995053
1002 1995053 2292170 2151344 1949484 1973871 2102314 2249964 2552636 2452891 2495720 2647777
992 2647777 2778264 2819328 3007494 3261657 3681516 3778989 3804926 4186731 4395731 4477790
982 4477790 4763717 5044279 5163140 5623093 6034253 6372374 6962169 7605387 8311501 8828867
972H828867P15118P08864R98487J101335J213726J329161J700929K129261K556530
963B1282278K640137L199031M002889M890924N242177N358413M740699L853411
955E5209959r20490p514171p632147q047808o286457l922383k508876j813971
947A6563656j726928j196365q73435r81511p14272l21257n04812o43712m55675
938I145689p19465o78737o90052m11259l15692m11208m60119j30056l70664m06270
928D552167j26088j74055m9287j12749j95442j78531j48978q3434J00193j51096
918C432700j36101r2982J17868k22447l60130p8278J85757k70279m7050j72549
908B356509j98005k730n7469K300k66597j51244j4299N4040q3442J8366o4711
$$ plain form
972 8828867 9543985 10252849 11251336 12352671 13566397 14895558 16596487 18725748 21282278
963 21282278 23922415 27121446 31124335 36015259 41257436 46615849 51356548 55209959
955 55209959 54289469 46775298 39143151 31095343 24808886 20886503 18377627 16563656
947 16563656 14836728 13640363 12766928 11785417 11071145 10749888 10245076 9601364 9145689
938 9145689 8426224 7747487 7057435 6646176 6330484 5919276 5459157 5329101 4958437 4552167
928 4552167 4426079 4252024 4202737 4089988 3894546 3716015 3567037 3483603 3583796 3432700
918 3432700 3296599 3203617 3321485 3099038 2738908 2660630 2846387 2576108 2529058 2356509
908 2356509 2158504 2155774 2098305 2100605 1834008 1682764 1668465 1722505 1639063 1657429 1592718
897A592718j24172L1004J19329j24384j10977j89466Q2131J49752j50235j83036
887A092664k05335K15064K78398j19972j75885J23553r6196q4120n4474j95652
877G78045J63148K82501k13021j91781L4177J43164q7174j1297L6001N3103k945
866I83921l4208L8441J81662o3997o2358o4505M5594M4220j00797m6304j13287
855H08382N0849p0456k1697R8610j75288p2126l3221O954J22360j24134M0201
844F30434j13445K0191J88769k39779j64707J41040J02890k31446j74287K24429
834C84089J94120n9327j68678j60617m0888K65000K422j64035j21364J76609L219
823C10550J8842l1705J52398O3156j61328J38011m1580l9126J21997k0371j15932
$$ plain form
897 1592718 1468546 1499550 1618879 1494495 1383518 1194052 1276183 1425935 1275700 1092664
887 1092664 887329 1102393 1380791 1260819 1084934 1208487 1112291 1028171 973697 778045
877 778045 941193 1223694 1010673 818892 853069 996233 909059 897762 933763 986866 983921
866 983921 949713 988154 1169816 1105819 1043461 978956 1024550 1068770 967973 921669 808382
855 808382 859231 788775 767078 865688 690400 618274 585053 592007 714367 590233 630434
844 630434 516989 537180 725949 486170 321463 462503 565393 333947 159660 384089
834 384089 578209 518882 350204 189587 148699 413699 416121 252086 130722 307331 310550
823 310550 329392 297687 450085 513241 351913 489924 448344 409218 531215 510844 394912
812C94912j08749l5034J96362k9113k91710J91284J54581j92634O0395K7645J5510
801C83449L4575R6688m4190m3404o4061L5617o8436q5762o6521J1812K98590l1050
789D57307r4727k09141j18180M4174J83600J5050j66696P0547J71281j55969j64016
778C3230P7400n3792l2733n6446O3444J41237R741o5353J97525j67749O8088o0820
766A53772j58888O7701J49080J06136n4799j57625k04881K45394M0659l17915
756a31366p1451M99766P824q6797j73233K2509q4288j41031Q7245j1195j78385
745b60402Q2361L63577q7389q6580N4445J87540k1546r2153r5103N0032M7892
734A42674m5578J27300j32637k18386J54617L66724L2206j40047j3108r6542L2374
$$ plain form
812 394912 286163 251129 447491 418378 126668 317952 472533 279899 340294 367939 383449
801 383449 418024 514712 470522 427118 363057 398674 330238 244476 177955 189767 488357 457307
789 457307 362580 153439 35259 79433 263033 278083 111387 181934 353215 197246 33230
778 33230 110630 56838 24105 -32341 31103 172340 182081 116728 314253 146504 214592 153772
766 153772 -5116 62585 211665 317801 263002 105377 -99504 145890 186549 -131366
756 -131366 -202817 296949 304773 217976 44743 67252 -17036 -158067 -70822 -82017 -260402
745 -260402 -178041 185536 98147 11567 66012 253552 232006 139853 44750 94782 142674
734 142674 97096 224396 91759 -126627 27990 394714 426920 286873 273765 177223 209597
723B09597R2131j57892k41358j19212m0254K70482J65305j68306j54583K02941
713E8851J64593j18601k1755L7405j53698j48573J71902R7960m0680o7840J93215
702A72779r8565j12237N0635K8129l3197P8986j3778k05985j5548K09094o8751
691h438l6311l326P8044J92635j59564r6865M813J80210p4429N3801o8084r4883
679c2397J9863R0832q3517J57144K665J97223Q5478j08784Q2197P0820j68527
668C12997j66694O0023r5346p4797P2723l962R1529j3484j81589k12037N8382
657a52255O8145m1559J4451j76071J98598K47222r6094k09655j09465J76420J12643
646C2380l1370j97416N3396J84925K0751J76814j03584k2763j30589R6886J46763
$$ plain form
723 209597 301728 143836 -97522 -216734 -256988 13494 178799 10493 -144090 58851
713 58851 223444 104843 83088 120493 -33205 -181778 -9876 88084 47404 -20436 172779
702 172779 74214 -38023 12612 40741 7544 86530 72752 -133233 -148781 60313 -8438
691 -8438 -44749 -48075 29969 222604 63040 -33825 -29012 151198 76769 130570 62486 -32397
679 -32397 -12534 78298 -5219 151925 154590 351813 437291 328507 410704 481524 312997
668 312997 146303 206326 110980 36183 108906 104944 196473 182989 1400 -210637 -152255
657 -152255 -84110 -125669 -111218 -287289 -88691 158531 62437 -147218 -256683 -80263 32380
646 32380 1010 -196406 -143010 41915 62666 239480 135896 113133 -17456 79430 226193
635B26193m53487k1314L37531M9471j05308n3193M9439P785J55868j60476p1705
624c9196m0241J53769P2337k11849j05214L4766J42073o8946m0261J45177K7025
613F9440j24966n0956R1277l5621P2187J51492n0509r5129J01856N9382q0759
602A07694k71852j02038L90697j04734l01814R6677J06631j09780j59571P9565
592b68525n7997m4310J23264K64258j6123j08790M8511K49733k6408l02355J18493
581b0249J44962k25351j26907J78508J06724j57445J30724K4393k89566K69101
571C4894K70730j41801m36191L4948K56967j4564l15457m3997L76917j7379k07300
560b02233k5026J09675j48247J17457J91197o6461k88429K80764K07677l50400
$$ plain form
635 226193 -227294 -248608 88923 138394 33086 -20107 29332 37117 192985 32509 -39196
624 -39196 -79437 74332 146669 -65180 -170394 -135628 6445 -62501 -102762 42415 69440
613 69440 -55526 -106482 -15205 -50826 21361 172853 122344 27215 129071 188453 107694
602 107694 -164158 -266196 124501 19767 -282047 -185370 -78739 -188519 -348090 -268525
592 -268525 -326522 -370832 -247568 16690 567 -108223 -59712 190021 163613 -138742 -20249
581 -20249 124713 -100638 -227545 -49037 57687 -99758 30966 55359 -234207 34894
571 34894 305624 163823 -272368 -237420 19547 4983 -310474 -354471 22446 5067 -202233
560 -202233 -227259 -117584 -265831 -148374 42823 -23638 -312067 -31303 176374 -174026
550a74026J58249K89004j04401k23263k07529M9813J10213L2721R6863j2954k41736
539b27046l2867J50338K7374q2904j13280K24575k7109j75253Q5771j02349r081
528b81831L36915Q9179j38999k19657j26604J75581k2062j42050K09478P9122
518d0928j50717j05125J60283J0902k02212M3592J36403j07100R7208J85063o0002
507c2633l34819j36169K76674J46465r924P5546n3708m7720P091q5984P877m4308
495b31612J74562J75734l38025q2713K46096K18442j61873o8215R7896K4697J976
484E6965J4435k4148j31639k14563J93613K18820n8595n2936J16769J1104k78169
473a48344k64113J32280L785P7586J89298o288j18137j58169L6153o2311Q1579
$$ plain form
550 -174026 -15777 273227 168826 -54437 -261966 -212153 -101940 -69219 27644 14690 -227046
539 -227046 -259913 -109575 -82201 -165105 -278385 -53810 -80919 -256172 -170401 -272750 -281831
528 -281831 55084 144263 5264 -214393 -340997 -165416 -187478 -329528 -120050 -40928
518 -40928 -191645 -296770 -136487 -125585 -327797 -284205 -147802 -254902 -157694 27369 -32633
507 -32633 -367452 -503621 -226947 -80482 -90406 -14860 -68568 -116288 -109197 -195181 -187304 -231612
495 -231612 -57050 118684 -219341 -302054 -55958 162484 611 -67604 30292 54989 56965
484 56965 71400 47252 -84387 -298950 -105337 113483 54888 1952 118721 129825 -148344
473 -148344 -412457 -280177 -276392 -198806 -9508 -15796 -133933 -292102 -255949 -318260 -236681
462b36681J6505O3174N7923L9112J41415q7406k13047o8764J23808j0403N0114
451a24250J25375j19197M058j91337L8097K96970j72295k2124N3861J56139j28511
440h3214K9248j51903M6773K11306Q8103j53678q3680J38329n6593j4489k27725
429b57523L7894R1434M7226J56749j34489q6483J32474Q0115j47844l64124J46794
418b97777k7771O8392N8481L685p3512J6092O2128K6269k11747Q7885j01709O5057
406c24527J74046J5838J80612j20612q088j57683r2666K32668J35161j44927k84285
395c94463J72396J9859J40273k364k68117K11926K28784l6309k60406j91876L7732
384c42565J43611J77125j23729l4904P4002J6491N5244r6187l8266j6381J41644
$$ plain form
462 -236681 -220176 -157002 -99079 -59967 81448 -5958 -219005 -287769 -163961 -174364 -124250
451 -124250 1125 -118072 -114014 -305351 -267254 29716 -142579 -164703 -110842 45297 -83214
440 -83214 -53966 -205869 -159096 52210 140313 -13365 -97045 41284 -15309 -29798 -257523
429 -257523 -219629 -128195 -80969 75780 -58709 -145192 -12718 67397 -80447 -444571 -297777
418 -297777 -325548 -257156 -198675 -194990 -268502 -252410 -190282 -164013 -375760 -287875 -389584 -324527
406 -324527 -150481 -134643 45969 -74643 -82731 -240414 -333080 -100412 34749 -110178 -394463
395 -394463 -222067 -202208 -61935 -64299 -332416 -120490 108294 71985 -188421 -380297 -342565
384 -342565 -198954 -21829 -145558 -180462 -106460 -89969 -34725 -130912 -169178 -185559 -43915
373d3915k9928j50641j27689l8618J53916R0238R8148J0354L3953K8090p1580
362d7672p1194K3947J07956j30121j91609n684J89040j01266J65145J5137p0519
351a16840m7832k85193J83839r1392K34581K58019j23779l18413j64422J94256
341b77176Q567K01967j65975K9170J14950r2067L0495J3698j66968M0401J97149
330f5789j92139p3567p3563J81468J59l0062j9559j35124o2348J14302P9604m2119
318c18737r8378Q9982K58739R2780l00904j9432J43830r8264k0341p3809j66490
307e11024L27024K65138Q4422j48921m01924J05757J07130K7869j44734M4306
297b44957Q9516J71513m0385K8846o4783j54296J81565o3743k91727Q268J99121
$$ plain form
373 -43915 -73843 -224484 -352173 -390791 -236875 -146637 -48489 -38135 -4182 23908 -47672
362 -47672 -118866 -94919 13037 -117084 -308693 -314377 -125337 -226603 -61458 -46321 -116840
351 -116840 -164672 -449865 -266026 -357418 -122837 135182 11403 -307010 -471432 -277176
341 -277176 -268609 -66642 -232617 -203447 -88497 -180564 -150069 -136371 -303339 -262938 -65789
330 -65789 -257928 -331495 -405058 -223590 -223431 -253493 -273052 -408176 -470524 -356222 -276618 -318737
318 -318737 -417115 -327133 -68394 24386 -276518 -295950 -152120 -250384 -270725 -344534 -511024
307 -511024 -184000 81138 165560 16639 -385285 -279528 -172398 -144529 -289263 -244957
297 -244957 -155441 16072 -24313 4533 -60250 -214546 -32981 -96724 -388451 -380183 -181062
286a81062J58478j30745j94949m5034J44806n5354Q242Q0349J856j23773R615
275c27571J559L741Q9148L7679j22456j00166K11297P8679j09432p9281P539J28686
263a80578P6999k1013j80423m645N9415O1304j80179k04130O2474J34216j0535
252c87095m7455k8374L10637r8687j99751O5066j15130P8588K85774J19073m8845
241f6199k32186P8560L38213k17763j72470Q5542J33298k65175l7157J34009m1204
230b62532j24069K1126J95232R5257m8585K1789P9576j34572N3118L3929L8923
219c0808p1018o0990K04445r0073l97040l8058K43639J23971L6794j54239o3176
208b96553q6791J1727M846L3236n5920N7068J23294M2087k19041K4518J95865
$$ plain form
286 -181062 -22584 -153329 -348278 -393312 -248506 -303860 -295618 -215269 -213413 -337186 -327571
275 -327571 -326012 -322271 -233123 -195444 -317900 -418066 -206769 -128090 -237522 -316803 -309264 -180578
263 -180578 -103579 -124592 -305015 -309660 -250245 -188941 -369120 -573250 -510776 -376560 -387095
252 -387095 -434550 -462924 -152287 -250974 -450725 -385659 -500789 -422201 -136427 -17354 -66199
241 -66199 -298385 -219825 118388 -99375 -271845 -186303 -53005 -318180 -355337 -221328 -262532
230 -262532 -386601 -365475 -170243 -74986 -123571 -101782 -22206 -156778 -103660 -69731 -30808
219 -30808 -101826 -162816 41629 -48444 -445484 -483542 -239903 -115932 -79138 -233377 -296553
208 -296553 -383344 -371617 -366771 -333535 -389455 -332387 -209093 -167006 -386047 -361529 -165664
197a65664L816j39011r4984O5177j5376j57902J70356J78851j59539P461j33410
186d40225m8147O2410K23141o0201j96736k04291J04400J44134P1651J1622Q3358
175b48884J70708o9773k08554q2658l737J98078P8433j20420q4169j10392K10665
164b70703n6741M1610j03872J75418K47350j25173l67496O8703K68875J42605
154B0576l8294j43762k42878J76077n608n6531r3030K292J25913J7729j36019
143c73535p7432m0852Q6852l4259j13117j38337K9931L5295k3570J18068P7294
132d53662J53846q7946M347J1172J01975k8647j01977j6833m4460J5315K79200
121a67670J24657j46736q2940q7818J1542j3350r3149Q7624J50246N6862j8161
$$ plain form
197 -165664 -161848 -300859 -395843 -330666 -346042 -503944 -333588 -154737 -314276 -306815 -440225
186 -440225 -488372 -425962 -202821 -263022 -459758 -664049 -559649 -415515 -343864 -332242 -248884
175 -248884 -78176 -147949 -356503 -439161 -442898 -244820 -166387 -286807 -370976 -481368 -270703
164 -270703 -327444 -285834 -389706 -214288 33062 -92111 -459607 -390904 -122029 20576
154 20576 -17718 -161480 -404358 -228281 -233889 -290420 -383450 -381158 -255245 -237516 -373535
143 -373535 -450967 -491819 -404967 -439226 -552343 -690680 -660749 -625454 -649024 -530956 -453662
132 -453662 -299816 -387762 -383415 -372243 -270268 -298915 -400892 -417725 -462185 -446870 -167670
121 -167670 -43013 -189749 -272689 -360507 -348965 -362315 -455464 -367840 -217594 -160732 -178893
110a78893r7821r6743O5456M3591o1178k1986J52522J6518j95073r8511J75259
99b96859J81020l3427j14695k9210o6626j9571P8595j9102p9012J21691M5698
88b31498j15803p4826R0987r5023j28779J96813J26255p6315M6765L8733Q552
77b14139j84153O0491J402Q5051m0680m4519J1090P4307l0659j11217j3168n9349
65d65543M3788Q5720O8055J9542j29969j36083m0045n5008J80508R4468p4454
54d09021N4009r5921m3356q5287J7658J24618l2359j27317R7541m7633o991J48623
42d05436J05913j10238k19807R1655K65734n8518l5823p2769K6906j2804r3484
31e18671L1401O8893P2954K2531J10625o3761m8622l6026l0539l5514J21085N4231
$$ plain form
110 -178893 -276714 -373457 -308001 -264410 -325588 -347574 -195052 -178534 -373607 -472118 -296859
99 -296859 -115839 -149266 -263961 -293171 -359797 -379368 -300773 -319875 -398887 -277196 -231498
88 -231498 -347301 -422127 -331140 -426163 -554942 -358129 -231874 -308189 -261424 -222691 -214139
77 -214139 -398292 -337801 -336399 -251348 -292028 -336547 -325457 -251150 -281809 -393026 -406194 -465543
65 -465543 -421755 -336035 -267980 -248438 -378407 -514490 -554535 -609543 -429035 -334567 -409021
54 -409021 -355012 -450933 -494289 -579576 -561918 -437300 -469659 -596976 -499435 -547068 -554059 -405436
42 -405436 -299523 -409761 -629568 -537913 -272179 -330697 -366520 -439289 -412383 -425187 -518671
31 -518671 -487270 -418377 -345423 -322892 -212267 -276028 -324650 -360676 -391215 -426729 -305644 -251413
19b51413q6702o0376m6557o544O6247R6102k5385K2339O2141j09149j18527p6748
7e34572L5327J1634J29226O3250j56029p7238N3859
0d74543
$$ plain form
19 -251413 -338115 -398491 -445048 -451592 -385345 -289243 -314628 -292289 -230148 -339297 -457824 -534572
7 -534572 -499245 -487611 -358385 -295135 -451164 -528402 -474543
0 -474543
$$ Imaginary data points
##PAGE= N=2
##DATA TABLE= (X++(I..I)), XYDATA
16383f045916o1402J82225K17974J90772L2160J7984J99050J8230k9243o4483
16373e342649K4181J25588O0430O0853l844m177J47981J14951L5863K19201O5759
16362d495863N9560K37719l0443l7746P8198J28207J27257N3978j70602k1447
16352d071182K32412K12235j5931R500J21949J5814Q5716O0262m2792K8550K25340
16341c138127L9228p6464J6283R1325K43538J15667p3973N3397l9990M5800J62530
16330b560786n6J67247k0849j76584K87198k5284L2049J4816R6560J33467J18550
16319a933672L2959p4290M2603J9631K18117k4531J1029P2807P1057j1582J30057
16308a445815Q4583k0604P9331J90160R6721R1964J9480N5663R6914J48836R7790
$$ plain form
16383 -6045916 -6107318 -5925093 -5707119 -5516347 -5484187 -5466203 -5267153 -5248923 -5278166 -5342649
16373 -5342649 -5318468 -5192880 -5132450 -5071597 -5075441 -5079618 -4931637 -4816686 -4780823 -4561622 -4495863
16362 -4495863 -4436303 -4198584 -4229027 -4266773 -4188575 -4060368 -3933111 -3879133 -4049735 -4071182
16352 -4071182 -3838770 -3626535 -3642466 -3632966 -3511017 -3495203 -3409487 -3349225 -3392017 -3363467 -3138127
16341 -3138127 -3098899 -3175363 -3159080 -3067755 -2824217 -2708550 -2782523 -2729126 -2769116 -2723316 -2560786
16330 -2560786 -2560842 -2393595 -2414444 -2591028 -2303830 -2329114 -2297065 -2282249 -2185689 -2052222 -1933672
16319 -1933672 -1900713 -1975003 -1932400 -1912769 -1694652 -1719183 -1708154 -1635347 -1564290 -1575872 -1445815
16308 -1445815 -1361232 -1381836 -1302505 -1112345 -1015624 -923660 -904180 -848517 -751603 -602767 -504977
16297e04977m9664j17862P9935J91845P6130l580P6329Q2638m5000p0906J30357
16286a54755J08912L546R3485R0150j47732P5420P7524J10345M0768l874K1749
16275C15538J06677L8013o5555j0679J8604J59987J40823J8841M3K7847J06997
16264H57136M7556r6118Q381n9529K06723J04896j60367P5079M6628J50799K9735
16253A210919j0013Q9884L9671M1884J25730l6611J210q3351K1527K06951k2555
16242A585246j06755J48716J0149P6099j9743m7237J79299Q2541J13905p3031
16232A949189j69849J79988J80903l7467q9416Q2915K59386J50555n8375j23146
16222B324683Q5599M3329q9499j4029J31127k8928P7387K6647N5144j602J02065
$$ plain form
16297 -504977 -554641 -672503 -592568 -400723 -324593 -328173 -251844 -169206 -214206 -285112 -154755
16286 -154755 -45843 -42297 51188 141338 -6394 69026 146550 256895 297663 293789 315538
16275 315538 422215 460228 394673 383994 402598 562585 703408 722249 722292 750139 857136
16264 857136 904692 808574 816955 757426 964149 1069045 908678 983757 1030385 1181184 1210919
16253 1210919 1200906 1290790 1330461 1372345 1498075 1461464 1462674 1379323 1400850 1607801 1585246
16242 1585246 1478491 1627207 1637356 1713455 1693712 1646475 1825774 1908315 2022220 1949189
16232 1949189 1779340 1959328 2140231 2102764 2013348 2096263 2355649 2506204 2447829 2324683
16222 2324683 2410282 2453611 2364112 2350083 2481210 2452282 2529669 2556316 2611460 2609858 2711923
16211B711923m4217j57770L06368L2471k28086K0866J93514m7266j62354k722
16201B622727J12403J87616j2680O2387M8959L458k17432J64758K39803k78233
16191B933766k10040K25661M6317j16385J62914K55569j65489q9933K20310J4536
16181C277226q4461p7031J54578J29504j50271j32198J15034J02015j38204Q1671
16171C277863k7852k36466l3085K29196K26209L8807l2820K78708l340j87716
16161C529504m8714r2842j05388J63203L78725q1645j53571J83550L05596k45177
16151C833241j49030K30601K23486k1760j47126p5397p6868l5744K00764O856
16141C989023m33762J05986K67164J89099j80913j22830O4287j22349j39724J88068
$$ plain form
16211 2711923 2667706 2509936 2816304 2848775 2620689 2641555 2835069 2787803 2625449 2622727
16201 2622727 2735130 2922746 2910066 2972453 3021412 3024870 2807438 2972196 3211999 2933766
16191 2933766 2723726 2949387 2995704 2879319 3042233 3297802 3132313 3042380 3262690 3277226
16181 3277226 3192765 3115734 3270312 3399816 3249545 3117347 3232381 3334396 3196192 3277863
16171 3277863 3250011 3013545 2980460 3209656 3435865 3474672 3441852 3720560 3717220 3529504
16161 3529504 3480790 3387948 3282560 3445763 3824488 3742843 3589272 3772822 4078418 3833241
16151 3833241 3684211 3914812 4138298 4116538 3969412 3894015 3817147 3781403 3982167 3989023
16141 3989023 3555261 3661247 3928411 4117510 3936597 3813767 3878054 3755705 3615981 3804049
16131C804049J56105n3010Q4421K30954j78937l56623J96493K97673O4744l08993
16121C936876j0209J67538j02785j09448j93713o0988K96148J66621R126k08130
16111C891036j9411K39603m6133j18268k00386P9224J65472j20023M6417o219
16101C911312R6176K30752n5681l129Q452J91368J15029j66767j37772L6220Q6915
16090D312875m7918l1978P7814j62952J97632N9685k77433l36903P9066L05463
16080D175351k31066r079J74026J19093N2224j22797J8906P2607J19389J0960
16070D379614j28869q6847j48004L42166m4931j1424J8329J19895Q5223o5999
16060D459153k65425j60831J71727J15583M5748j31921q0773N9587K21340P4409
$$ plain form
16131 3804049 3960154 3907144 3991565 4222519 4043582 3686959 3883452 4181125 4245869 3936876
16121 3936876 3926667 4094205 3991420 3881972 3688259 3627271 3923419 4090040 4099166 3891036
16111 3891036 3871625 4111228 4065095 3946827 3746441 3825665 3991137 3871114 3917531 3911312
16101 3911312 4007488 4238240 4182559 4179430 4187882 4379250 4494279 4327512 4189740 4225960 4312875
16090 4312875 4264957 4232979 4310793 4147841 4345473 4405158 4127725 3790822 3869888 4175351
16080 4175351 3944285 3935206 4109232 4228325 4280549 4157752 4176658 4249265 4368654 4379614
16070 4379614 4250745 4163898 4015894 4358060 4313129 4301705 4320034 4439929 4525152 4459153
16060 4459153 4193728 4032897 4204624 4320207 4365955 4234034 4153261 4212848 4434188 4508597
16050D508597l21759m4372J8080n2025J67809J61517p5065j15863l7557j47874
16040D061488k40931K38405M64965p7148m23282K06809N6665j06131k4379O2561
16030D219022J88450j46581m6414n778m6512J21140J4060K68322k0434j47603
16020D397672m853j78668k08009m4818J82627K18961L5653j36076m8228r1478
16010D122783J25767J05382p6672j02229m0423K26613n6109l506R6332J0689J5310
15999D423937m5508o443K4297l6641m0059O8564j23012P7310j39775N8647O7754
15988D329071J41596K66418N4597l55118q7769O4364j36038o4364K7470K71807
15978D512034q3906k17894j76201K11M0487K5276K19479J44834l00536J31901
$$ plain form
16050 4508597 4186838 4142466 4160546 4108521 4276330 4437847 4362782 4246919 4209362 4061488
16040 4061488 3820557 4058962 4523927 4446779 4023497 4230306 4286971 4180840 4156461 4219022
16030 4219022 4407472 4260891 4214477 4208699 4162187 4283327 4297387 4565709 4545275 4397672
16020 4397672 4392819 4214151 4006142 3961324 4143951 4362912 4398565 4262489 4214261 4122783
16010 4122783 4248550 4353932 4277260 4175031 4134608 4361221 4305112 4301606 4397938 4408627 4423937
15999 4423937 4378429 4371986 4396283 4359642 4319583 4388147 4265135 4342445 4202670 4261317 4329071
15988 4329071 4470667 4737085 4791682 4436564 4348795 4413159 4277121 4212757 4240227 4512034
15978 4512034 4428128 4210234 4034033 4034244 4074731 4100007 4319486 4464320 4163784 4295685
15968D295685J06003l7081k93Q671K5129l81941O7539J54936j256r4477K49040
$$ plain form
15968 4295685 4401688 4364607 4364314 4372985 4398114 4016173 4083712 4238648 4237392 4142915 4391955
$$ [...]
##END NTUPLES=NMR SPECTRUM
##END=
