##TITLE=1H_EC-3253(IV-3)
 CDCl3, 8 sc, 
 29.06.2021
##JCAMPDX= 6.0         $$ Bruker NMR JCAMP-DX V2.0
##DATA TYPE= NMR SPECTRUM
##DATA CLASS= NTUPLES
##ORIGIN= UXNMR, Bruker Analytische Messtechnik GmbH
##OWNER= root
$$ XWIN-NMR		Version 3.5
$$ Tue Jun 29 10:24:23 2021 Russian Standard Time (UT+4h)  she@DPX200
##.OBSERVE FREQUENCY= 200.131506
##.OBSERVE NUCLEUS= ^1H
##.ACQUISITION MODE= SIMULTANEOUS
##.ACQUISITION SCHEME= undefined
##.AVERAGES= 8
##.DIGITISER RES= 18
##SPECTROMETER/DATA SYSTEM= spect
##.PULSE SEQUENCE= zg30
##.SOLVENT NAME= CDCl3
##.SHIFT REFERENCE= (INTERNAL, CDCl3, 0, 17.4971)
##AUDIT TRAIL= $$ (NUMBER, WHEN, WHO, WHERE, WHAT)
$$ ##TITLE= Audit trail, XWIN-NMR		Version 3.5
$$ ##JCAMPDX= 5.01
$$ ##ORIGIN= Bruker BioSpin GmbH
$$ ##OWNER= she
$$ F:/spectra/data/she/nmr/H-F/1/pdata/1/auditp.txt
$$ ##AUDIT TRAIL=  $$ (NUMBER, WHEN, WHO, WHERE, WHAT)
(   1,<2021-06-29 10:23:00.56 +0400>,<she>,<DPX200>,
      <created by zg, POWCHK disabled, PULCHK disabled
       configuration hash MD5:
       00 E9 B6 7A A2 85 ED C7 34 08 36 98 17 FE 4E 26
       data hash MD5: 16K
       71 CB 68 A1 81 19 3F CC CA B7 17 85 15 CF 08 90>)
(   2,<2021-06-29 10:23:03.00 +0400>,<she>,<DPX200>,
      <Start of raw data processing
       efp BC_mod = 2 LB = 0.24 FT_mod = 6 PKNL = 1 PHC0 = -11921.13 PHC1 = 13.00101 SI = 16K 
       data hash MD5: 16K
       A9 B9 5D 24 D4 11 D6 BE 9D 4B 9E CA 93 16 AC F6>)
(   3,<2021-06-29 10:23:27.34 +0400>,<she>,<DPX200>,
      <pk PHC0 = 0.3752528 PHC1 = -0.6000001 
       data hash MD5: 16K
       83 52 CB B6 29 2A 76 44 77 B4 27 5B 18 53 50 3C>)
(   4,<2021-06-29 10:23:30.62 +0400>,<she>,<DPX200>,
      <abs ABSG = 5 
       data hash MD5: 16K
       68 FA 64 BA 2F 78 B5 06 9F 1C EC 70 B6 FD 6C 98>)
$$ ##END=
$$ 
$$ hash MD5
$$ 6F AE 49 15 27 FD 6B D9 4A D2 11 4A 26 B1 94 75
##$RELAX= 
##$RELAX= 
##$RELAX= 
##$RELAX= 
##$RELAX= 
##$RELAX= 
$$ Bruker specific parameters
$$ --------------------------
##$DU= <F:/spectra>
##$EXPNO= 1
##$NAME= <H-F>
##$PROCNO= 1
##$TYPE= <nmr>
##$USER= <she>
##$AMP= (0..31)
100 100 100 100 100 100 100 100 100 100 100 100 100 100 100 100 100 100 
100 100 100 100 100 100 100 100 100 100 100 100 100 100 
##$AQSEQ= 0
##$AQ_mod= 1
##$AUNM= <au_zg>
##$AUTOPOS= <>
##$BF1= 200.13
##$BF2= 200.13
##$BF3= 200.13
##$BF4= 200.13
##$BF5= 200.13
##$BF6= 200.13
##$BF7= 200.13
##$BF8= 200.13
##$BYTORDA= 1
##$CFDGTYP= 0
##$CFRGTYP= 5
##$CHEMSTR= <none>
##$CNST= (0..31)
1 1 145 1 1 1 1 1 1 1 1 1 1 1 1 1 1 1 1 1 1 1 1 1 1 1 1 1 1 1 1 1 
##$CPDPRG= <>
##$CPDPRG1= <>
##$CPDPRG2= <>
##$CPDPRG3= <>
##$CPDPRG4= <mlev>
##$CPDPRG5= <mlev>
##$CPDPRG6= <mlev>
##$CPDPRG7= <mlev>
##$CPDPRG8= <mlev>
##$CPDPRGB= <>
##$CPDPRGT= <>
##$D= (0..31)
0 1.2 0 0 0 0 0 0 0 0.06 0 0.03 0 0 0 0 0.0002 0 0 0 0 0 0 0 0 0 0 0 0 
0 0 0 
##$DATE= 1624947779
##$DBL= (0..7)
120 120 120 120 120 120 120 120 
##$DBP= (0..7)
150 150 150 150 150 150 150 150 
##$DBP07= 0
##$DBPNAM0= <>
##$DBPNAM1= <>
##$DBPNAM2= <>
##$DBPNAM3= <>
$$ [...]
##$SUBNAM3= <"">
##$SUBNAM4= <"">
##$SUBNAM5= <"">
##$SUBNAM6= <"">
##$SUBNAM7= <"">
##$SUBNAM8= <"">
##$SUBNAM9= <"">
##$SW= 20.0188882624521
##$SWIBOX= (0..15)
0 0 2 0 0 0 0 0 0 0 0 0 0 0 0 0 
##$SW_h= 4006.41025641026
##$TD= 16384
##$TD0= 1
##$TE= 0
##$TE2= 300
##$TE3= 300
##$TEG= 300
##$TL= (0..7)
0 120 120 120 120 120 120 120 
##$TP= (0..7)
150 150 150 150 150 150 150 150 
##$TP07= 0
##$TPNAME0= <>
##$TPNAME1= <>
##$TPNAME2= <>
##$TPNAME3= <>
##$TPNAME4= <>
##$TPNAME5= <>
##$TPNAME6= <>
##$TPNAME7= <>
##$TPOAL= (0..7)
0.5 0.5 0.5 0.5 0.5 0.5 0.5 0.5 
##$TPOFFS= (0..7)
0 0 0 0 0 0 0 0 
##$TUNHIN= 0
##$TUNHOUT= 0
##$TUNXOUT= 0
##$USERA1= <user>
##$USERA2= <user>
##$USERA3= <user>
##$USERA4= <user>
##$USERA5= <user>
##$V9= 5
##$VALIST= <valist>
##$VCLIST= <CCCCCCCCCCCCCCC>
##$VD= 0
##$VDLIST= <DDDDDDDDDDDDDDD>
##$VPLIST= <PPPPPPPPPPPPPPP>
##$VTLIST= <TTTTTTTTTTTTTTT>
##$WBST= 1024
##$WBSW= 4
##$XGAIN= (0..3)
0 0 0 0 
##$XL= 0
##$YL= 0
##$YMAX_a= 470596
##$YMIN_a= -569645
##$ZGOPTNS= <>
##$ZL1= 120
##$ZL2= 120
##$ZL3= 120
##$ZL4= 120
##$ABSF1= 17.502
##$ABSF2= -2.517038
##$ABSG= 5
##$ABSL= 3
##$ALPHA= 0
##$AQORDER= 0
##$ASSFAC= 0
##$ASSFACI= 0
##$ASSFACX= 0
##$ASSWID= 0
##$AUNMP= <proc_1d>
##$AZFE= 0.1
##$AZFW= 0.1
##$BCFW= 0
##$BC_mod= 2
##$BYTORDP= 0
##$COROFFS= 0
##$CY= -3
##$DATMOD= 1
##$DC= 0
##$DFILT= <>
##$DTYPP= 0
##$F1P= 0
##$F2P= 0
##$FCOR= 1
##$FTSIZE= 16384
##$FT_mod= 6
##$GAMMA= 0
##$GB= 0
##$INTBC= 1
##$INTSCL= 1.334414e-10
##$ISEN= 128
##$LB= 0.24
##$LEV0= 0
##$LPBIN= 0
##$MAXI= 10000
##$MC2= 0
##$MEAN= 0
##$ME_mod= 0
##$MI= 1.114404
##$NCOEF= 0
##$NC_proc= -6
##$NLEV= 6
##$NOISF1= 3.799351
##$NOISF2= 2.8
##$NSP= 0
##$NTH_PI= 0
##$NZP= 0
##$OFFSET= 17.49711
##$PC= 1
##$PHC0= -11920.75
##$PHC1= 12.40101
##$PH_mod= 1
##$PKNL= yes
##$PPARMOD= 0
##$PSCAL= 0
##$PSIGN= 0
##$REVERSE= no
##$SF= 200.130007509341
##$SI= 16384
##$SIGF1= 3
##$SIGF2= 2
##$SINO= 5.538805
##$SIOLD= 16384
##$SREGLST= <1H.CDCl3>
##$SSB= 0
##$STSI= 16384
##$STSR= 0
##$SW_p= 4006.41025641026
##$SYMM= 0
##$S_DEV= 0
##$TDeff= 16384
##$TDoff= 0
##$TI= <>
##$TILT= no
##$TM1= 0
##$TM2= 0
##$TOPLEV= 0
##$USERP1= <user>
##$USERP2= <user>
##$USERP3= <user>
##$USERP4= <user>
##$USERP5= <user>
##$WDW= 1
##$XDIM= 16384
##$YMAX_p= 412685054
##$YMIN_p= -212037
$$ End of Bruker specific parameters
$$ ---------------------------------
##NTUPLES= NMR SPECTRUM
##VAR_NAME=  FREQUENCY,     SPECTRUM/REAL,   SPECTRUM/IMAG
##SYMBOL=    X,             R,               I
##VAR_TYPE=  INDEPENDENT,   DEPENDENT,       DEPENDENT
##VAR_FORM=  AFFN,          ASDF,            ASDF
##VAR_DIM=   16384,         16384,           16384
##UNITS=     HZ,            ARBITRARY UNITS, ARBITRARY UNITS
##FACTOR=    0.24454680195387, 1,            1
##FIRST=     3501.69682910371, 0,            0
##LAST=      -504.713427306547, 0,           0
##MIN=       -504.713427306547, -212037,     0
##MAX=       3501.69682910371, 412685054,    0
$$ Real data points
##PAGE= N=1
##DATA TABLE= (X++(R..R)), XYDATA
$$ [...]
$$ plain form
6281 193202 128249 65482 129385 135648 133471 57451 140374 242246 222795 156492 153217 101051
6269 101051 149308 156576 245941 251494 117117 193649 268221 304114 239347 203590 230756 228601
6257 228601 213850 241566 237733 208280 228171 162118 152973 77669 133777 190404 216582 202476
6245 202476 81701 121110 227774 188250 113829 61296 55681 151587 116293 167314 178289
6234 178289 139882 192837 228189 191428 117246 59236 171533 160168 98935 133049 253683
6223 253683 171548 179234 109102 78773 37663 42710 104298 78066 117827 233460 209248 137488
6211 137488 166752 106792 29395 63466 67880 187588 247786 146396 133051 138101 212978 184601
6199 184601 145751 158357 163133 141758 186982 112949 82323 40364 175438 291797 297265 272561
$$ packed form
6281A93202o4953o2767O3903O263k177p6020Q2923J01872j9451o6303l275n2166
6269A01051M8257P268Q9365N553j34377P6532P4572L5893o4767l5757K7166k155
6257B28601j4751K7716l833k9453J9891o6053r145p5304N6108N6627K6178j4106
6245B02476j20775L9409J06664l9524p4421n2533n615R5906l5294N1021J0975
6234A78289l8407N2955L5352l6761p4182n8010J12297j1365o1233L4114J20634
6223B53683q2135P686p0132l0329m1110N047O1588k6232L9761J15633k4212p1760
6211A37488K9264n9960p7397L4071M414J19708O0198j01390j3345N050P4877k8377
6199A84601l8850J2606M776k1375M5224p4033l0626m1959J35074J16359N468k4704
$$ plain form
6187 272561 277543 289467 317993 227412 307919 384333 341243 269249 330649 344567 366306 358427
6175 358427 371646 358754 373168 496616 428874 418955 500245 535166 545979 573935 533787 549095
6163 549095 560848 561606 603937 574362 421916 455178 568389 560164 462162 475676 433595 351762
6151 351762 321260 321301 329309 296786 262753 310785 317860 355204 334721 274471 304903 288205 300978
6138 300978 307997 241802 255515 146831 206487 221507 218956 192539 155710 171443 202234 244724
6126 244724 229648 195956 191238 97200 177315 247887 208101 171880 227310 269650 279165 274991
6114 274991 234729 155269 175942 214429 209506 281822 261134 205661 182407 152537 79034 154891
6102 154891 163381 208495 259880 284181 289384 241076 224028 218140 276761 260990 286828 280615
$$ packed form
6187B72561M982J1924K8526r0581Q0507P6414m3090p1994O1400J3918K1739p879
6175C58427J3219j2892J4414J23448o7742r919Q1290L4921J0813K7956m0148J5308
6163E49095J1753P58M2331k9575j52446L3262J13211q225r8002J3514m2081q1833
6151C51762l0502M1Q008l2523l4033M8032P075L7344k0483o0250L0432j6698J2773
6138C00978P019o6195J3713j08684N9656J5020k551k6417l6829J5733L0791M2490
6126B44724j5076l3692m718r4038Q0115P0572l9786l6221N5430M2340R515m174
6114B74991m0262p9460K0673L8487m923P2316k0688n5473k3254k9870p3503P5857
6102A54891Q490M5114N1385K4301N203m8308j7048n888N8621j5771K5838o213
$$ plain form
6090 280615 251509 205604 168633 236299 266448 220330 228437 233626 250519 204074 295218 285470
6078 285470 251001 248934 241201 257772 275850 260957 147601 252859 241129 298369 314737 373639
6066 373639 407676 461190 441360 341555 375006 489486 573519 547051 530413 654286 735680
6055 735680 777422 712317 807627 832668 730400 664585 634667 653398 594549 573498 672203
6044 672203 697839 694812 747999 733975 606501 597195 617666 491110 454285 419815 451968 462982
6032 462982 410540 334652 418031 315040 305290 379605 367612 372162 317119 291727 321500 384411
6020 384411 309289 329597 359951 393432 258531 247203 352658 295504 215838 221369 253762
6009 253762 270513 238551 245281 266302 277003 279095 274156 232585 193268 247714 259221 232645
$$ packed form
6090B80615k9106m5905l6971O7666L0149m6118Q107N189J6893m6445R1144r748
6078B85470l4469k067p733J6571J8078j4893j13356J05258j1730N7240J6368N8902
6066C73639L4037N3514j9830r9805L3451J14480Q4033k6468j6638J23873Q1394
6055G35680M1742o5105R5310K5041j02268o5815k9918J8731n8849k1051R8705
6044F72203K5636l027N3187j4024j27474r306K0471j26556l6825l4470L2153J1014
6032D62982n2442p5888Q3379j02991r750P4315j1993M550n5043k5392K9773O2911
6020C84411p5122K0308L0354L3481j34901j1328J05455n7154p9666N531L2393
6009B53762J6751l1962O730K1021J0701K092m939m1571l9317N4446J1507k6576
$$ plain form
5997 232645 271279 255360 297860 297725 270832 326943 351935 309059 336410 305878 347789 326812
5985 326812 349524 277481 281685 302795 318760 270284 157494 267143 280926 236258 174055
5974 174055 198104 204646 216901 275694 234645 220213 215444 241653 268809 321339 340099 260047
5962 260047 282361 201547 170999 271041 238371 174085 242094 216502 186437 231502 222823 257157
5950 257157 246983 236368 203581 245815 220475 224721 236430 201329 251180 206931 283439 262353
5938 262353 283338 302747 244237 185014 274959 301192 260128 293869 370728 325212 267280 202764
5926 202764 253124 273849 328682 339771 302418 250323 272024 272007 380223 329822 379058 379835
5914 379835 369412 419764 389800 457667 507579 446904 475212 506158 557847 498160 500420 495841
$$ packed form
5997B32645L8634j5919M2500j35k6893N6111K4992m2876K7351l0532M1911k0977
5985C26812K2712p2043M204K1110J5965m8476j12790J09649J3783m4668o2203
5974A74055K4049O542J2255N8793m1049j4432m769K6209K7156N2530J8760q0052
5962B60047K2314q0814l0548J00042l2670o4286O8009k5592l0065M5065q679L4334
5950B57157j0174j0615l2787M2234k5340M246J1709l5101M9851m4249P6508k1086
5938B62353K0985J9409n8510n9223Q9945K6233m1064L3741P6859m5516n7932o4516
5926B02764N0360K0725N4833J1089l7353n2095K1701j7J08216n0401M9236P77
5914C79835j0423N0352k9964O7867M9912o0675K8308L0946N1689n9687K260m579
$$ plain form
5902 495841 512594 646273 672682 677519 657693 654884 494826 489091 470785 473424 417311 449553
5890 449553 379422 435117 448620 334981 364329 369349 377970 343704 290816 391961 408676 453060
5878 453060 355005 315090 403786 320272 322244 371758 451218 420618 346237 266881 222292 307866
5866 307866 306971 238121 294293 265707 407201 378388 414827 437524 446899 351057 328347 408209
5854 408209 375751 411814 366806 414027 402124 393566 342772 350833 375862 416096 383919 329135
5842 329135 316129 392593 392480 433369 432190 394990 302828 379474 353664 328113 311607 235059
5830 235059 340042 369355 383490 442099 471040 455120 476664 433324 486836 497766 495093 554229
5818 554229 505696 438866 422744 405507 389142 384328 272045 270633 315640 363767 402056 364319
$$ packed form
5902D95841J6753J33679K6409M837j9826k809j60058n735j8306K639n6113L2242
5890D49553p0131N5695J3503j13639K9348N020Q621l4266n2888J01145J6715M4384
5878D53060r8055l9915Q8696q3514J972M9514P9460l0600p4381p9356m4589Q5574
5866C07866q95o8850N6172k8586J41494k8813L6439K2697R375r5842k2710P9862
5854D08209l2458L6063m5008M7221j1903q558n0794Q061K5029M0234l2177n4784
5842C29135j3006P6464j13M0889j179l7200r2162P6646k5810k5551j6506p6548
5830B35059J04983K9313J4135N8609K8941j5920K1544m3340N3512J0930k673N9136
5818E54229m8533o6830j6122j7237j6365m814j12283j412M5007M8127L8289l7737
$$ plain form
5806 364319 288864 416961 458449 383219 294515 346045 435503 338559 336152 469386 472535 402225
5794 402225 349421 312638 335319 412895 520832 581040 604144 558272 507611 489206 522400
5783 522400 482851 421775 473971 531396 446872 364988 441658 544065 473706 364389 345798
5772 345798 426493 493865 465682 466768 492805 480291 443269 436176 442281 530710 551856 551226 579565
5759 579565 510413 450495 516333 539047 604926 578378 503713 530430 575432 622066 553491 551041
5747 551041 587598 557073 498809 549152 539244 621569 676824 584969 606788 700122 708992 643689
5735 643689 650177 625895 691011 603816 648658 677640 690449 737363 704805 705251 686197 766990
5723 766990 866822 863747 820666 865536 829142 901068 949515 872364 920962 951117 992772 1049459
$$ packed form
5806C64319p5455J28097M1488p5230q8704N1530Q9458r6944k407J33234L149p0310
5794D02225n2804l6783K2681P7576J07937O0208K3104m5872n0661j8405L3194
5783E22400l9549o1076N2196N7425q4524q1884P6670J02407p0359j09317j8591
5772C45798Q0695O7372k8183J086K6037j2514l7022p093O105Q8429K1146o30K8339
5759E79565o9152n9918O5838K2714O5879k6548p4665K6717M5002M6634o8575k450
5747E51041L6557l0525n8264N0343r908Q2325N5255r1855K1819R3334Q870o5303
5735F43689O488k4282O5116q7195M4842K8982J2809M6914l2558M46j9054Q0793
5723G66990R9832l075m3081M4870l6394P1926M8447p7151M8598L0155M1655N6687
$$ plain form
5711 1049459 1049179 1076289 1026597 1192981 1274466 1318001 1244491 1218625 1268406 1256270 1139640
5700 1139640 1244183 1255960 1218284 1332221 1248436 1222092 1195483 1238479 1325019 1295104 1328664
5689 1328664 1352181 1461950 1478436 1531765 1565471 1544564 1629942 1761563 1823276 1822448 1863477
5678 1863477 1849041 1924150 1996802 2012765 1846975 1800197 1801541 1742889 1707692 1672684 1675845 1656804
5666 1656804 1647627 1584269 1690408 1737550 1712116 1753692 1738775 1672576 1712283 1677134 1755887
5655 1755887 1798999 1847517 1885795 1816172 1820506 1784507 1837204 1828440 1732109 1758671 1782225 1652635
5643 1652635 1649064 1624209 1540907 1467212 1463351 1477408 1522072 1593335 1635389 1506233 1556305 1465415
5631 1465415 1461382 1490920 1472522 1529339 1476822 1503055 1509263 1519414 1512372 1474710 1488783 1485430
$$ packed form
5711A049459k80K7110m9692J66384Q1485M3535p3510k5866M9781j2136j16630
5700A139640J04543J1777l7676J13937q3785k6344k6609M2996Q6540k9915L3560
5689A328664K3517J09769J6486N3329L3706k0907Q5378J31621O1713q28M1029
5678A863477j4436P5109P2652J5963j65790m6778J344n8652l5197l5008L161j9041
5666A656804r177o3358J06139M7142k5434M1576j4917o6199L9707l5149P8753
5655A755887M3112M8518L8278o9623M334l5999N2697q764r6331K6562K3554j29590
5643A652635l571k4855q3302p3695l861J4057M4664P1263M2054j29156N0072r0890
5631A465415m033K9538j8398N6817n2517K6233O208J0151p042l7662J4073l353
$$ plain form
5619 1485430 1484312 1485601 1488958 1469247 1376707 1433787 1491118 1536305 1602038 1641525 1547281 1581734
5607 1581734 1625317 1555526 1630139 1665756 1633277 1668912 1759363 1808888 1814559 1702830 1734276
5596 1734276 1737187 1758010 1771540 1830130 1845053 1843164 1831989 1789634 1794499 1758458 1810370 1875915
5584 1875915 1935126 1998754 2027469 1976109 1983683 1925214 1945515 1909370 1930476 1965777 2019152 2035851
5572 2035851 2015733 2022544 2108387 2171698 2145169 2181998 2109388 2007949 2099696 2076871 2085367 2147212
5560 2147212 2184368 2203005 2144082 2175887 2178813 2238632 2230212 2329229 2414085 2387319 2450789 2597182
5548 2597182 2569456 2659185 2670625 2612568 2724333 2756850 2781001 2858304 2852257 2855879 2848852 2897161
5536 2897161 2908156 2910714 2954021 3002932 3077001 3103512 3228949 3402910 3512805 3554746 3552816
$$ packed form
5619A485430j118J289L357j9711r2540N7080N7331M5187O5733L9487r4244L4453
5607A581734M3583o9791P4613L5617l2479L5635R0451M9525N671j11729L1446
5596A734276K911K0823J3530N8590J4923j889j1175m2355M865l6041N1912O5545
5584A875915N9211O3628K8715n1360P574n8469K0301l6145K1106L5301N3375J6699
5572B035851k0118O811Q5843O3311k6529L6829p2610j01439R1747k2825Q496O1845
5560B147212L7156J8637n8923L1805K926N9819q420R9017Q4856k6766O3470J46393
5548B597182k7726Q9729J1440n8057J11765L2517K4151P7303o047L622p027M8309
5536B897161J0995K558M3307M8911P4069K6511J25437J73961J09895M1941j930
$$ plain form
5525 3552816 3681276 3828240 3937719 4190467 4290194 4432101 4532196 4690113 4804891 4907851
5515 4907851 5004321 5203620 5523345 5758870 5938387 6125197 6429258 6805215 7182476 7510393
5505 7510393 8046685 8514072 9051248 9550697 10142262 10619026 10967457 11226280 11257406 11051979
5495 11051979 10771505 10498674 10294644 9958767 9811006 9603606 9539391 9563590 9565629 9669699
5485 9669699 9726769 9914388 10201141 10542971 10898991 11361548 11873900 12467073 13120232 13797486
5475 13797486 14424264 15097834 15714682 16388915 17027750 17490219 17716818 17823299 17765858 17538085
5465 17538085 17211756 16830767 16329126 15811693 15226986 14726123 14183105 13785997 13453145
5456 13453145 13067917 12776382 12613358 12557743 12592418 12552372 12712399 12933020 13209364 13542869
$$ packed form
5525C552816J28460J46964J09479K52748R9727J41907J00095J57917J14778J02960
5515D907851R6470J99299L19725K35525J79517J86810L04061L75957L77261L27917
5505G510393N36292M67387N37176M99449N91565M76764L48431K58823L1126k05427
5495A1051979k80474k72831k04030l35877j47761k07400o4215K4199K039J04070
5485I669699N7070J87619K86753L41830L56020M62557N12352N93173O53159O77254
5475A3797486O26778O73570O16848O74233O38835M62469K26599J06481n7441k27773
5465A7538085l26329l80989n01641n17433n84707n00863n43018l97108l32852
5456A3453145l85228k91535j63024n5615L4675m0046J60027K20621K76344L33505
$$ plain form
5446 13542869 13904216 14394559 14999632 15770823 16539637 17339705 18230936 19085169 19799046
5437 19799046 20432604 20760891 21087143 21557880 22102013 22751224 23606860 24527091 25293232
5428 25293232 25761579 25523027 24839235 23679204 22405232 21176551 20083198 19187681 18392225
5419 18392225 17807411 17467766 17108651 16999006 17108041 17178713 17510721 18007222 18552925 19280724
5409 19280724 20231346 21445494 22815230 24455534 26235981 28326178 30549782 32728787
5401 32728787 34754174 36483990 37397271 37386488 36322923 34404376 32132465 29679570 27256327
5392 27256327 25108317 23141738 21471518 20071128 18817641 17907262 17077109 16435901 16107683
5383 16107683 15858802 15750496 15732565 15791964 16143133 16436387 16906063 17645490 18524902 19440967
$$ packed form
5446A3542869L61347M90343O05073P71191P68814Q00068Q91231Q54233P13877
5437A9799046O33558L28287L26252M70737N44133O49211Q55636R20231P66141
5428B5293232M68347k38552o83792j160031j273972j228681j093353q95517p95456
5419A8392225n84814l39645l59115j09645J09035P0672L32008M96501N45703P27799
5409A9280724R50622J214148J369736J640304J780447K090197K223604K179005
5401C2728787K025387J729816R13281j0783j063565j918547k271911k452895k423243
5392B7256327k148010j966579j670220j400390j253487r10379q30153o41208l28218
5383A6107683k48881j08306j7931N9399L51169K93254M69676P39427Q79412R16065
$$ plain form
5373 19440967 20530671 21564504 22349370 22732247 22521322 21528009 20136394 18511111 16963551
5364 16963551 15532262 14191095 13060711 12078048 11199077 10500553 9896582 9446150 9037500
5355 9037500 8659351 8278508 7910394 7621596 7425997 7077094 6744007 6422390 6140220 5935328
5345 5935328 5732629 5507079 5339360 5131462 4995352 4847067 4736344 4569458 4495641 4418610
5335 4418610 4287173 4149469 3928489 3806473 3646071 3588806 3423122 3400812 3370295 3193526
5325 3193526 3158289 3104231 3086792 2997473 2850167 2813100 2792963 2691170 2579829 2607733 2637091
5314 2637091 2545458 2500151 2493214 2574928 2454565 2464968 2354844 2293164 2387785 2326672 2280690
5303 2280690 2255053 2151673 2171031 2055946 2066711 2062871 2012058 1961975 1973910 1985564 1918637
$$ packed form
5373A9440967J089704J033833P84866L82877k10925r93313j391615j625283j547560
5364A6963551j431289j341167j130384r82663q78971o98524o03971m50432m08650
5355I037500l78149l80843l68114k88798j95599l48903l33087l21617k82170k04892
5345E935328k02699k25550j67719k07898j36110j48285j10723j66886p3817p7031
5335D418610j31437j37704k20980j22016j60402n7265j65684k2310l0517j76769
5325C193526l5237n4058j7439q9319j47306l7067k0137j01793j11341K7904K9358
5314B637091r1633m5307o937Q1714j20363J0403j10124o1680R4621o1113m5982
5303B280690k5637j03380J9358j15085J0765l840n0813n0083J1935J1654o6927
$$ plain form
5292 1918637 1894499 1905671 1969704 1949635 1979490 1918897 1820166 1802385 1838763 1772775 1783112
5281 1783112 1763831 1799112 1791477 1761451 1736773 1733795 1676265 1646940 1697040 1697390 1645592 1649630
5269 1649630 1677905 1709474 1730395 1684031 1625182 1709069 1657635 1753922 1669146 1683107 1653268
5258 1653268 1649039 1639154 1655930 1690415 1681841 1647184 1681675 1719468 1794296 1712889 1689010 1641281
5246 1641281 1607140 1677475 1686953 1603800 1610468 1576522 1619074 1646399 1657279 1645676 1565614 1650879
5234 1650879 1723768 1651232 1599598 1600668 1495100 1612465 1608901 1598704 1650121 1630818 1617853
5223 1617853 1605935 1613112 1655842 1623521 1632930 1624164 1640565 1703101 1645909 1689462 1693617 1656926
5211 1656926 1611636 1607277 1583446 1545309 1550121 1528864 1602178 1596143 1576715 1531516 1536241 1586772
$$ packed form
5292A918637k4138J1172O4033k0069K9855o0593r8731j7781L6378o5988J0337
5281A783112j9281L5281p635l0026k4678k978n7530k9325N0100L50n1798M038
5269A649630K8275L1569K0921m6364n8849Q3887n1434R6287q4776J3961k9839
5258A653268m229r885J6776L4485q574l4657L4491L7793P4828q1407k3879m7729
5246A641281l4141P0335R478q3153O668l3946M2552K7325J0880j1603q0062Q5265
5234A650879P2889p2536n1634J070j05568J17365l564j0197N1417j9303j2965
5223A617853j1918P177M2730l2321R409q766J6401O2536n7192M3553M155l6691
5211A656926m5290m359k3831l8137M812k1257P3314o035j9428m5199M725N0531
$$ plain form
5199 1586772 1640321 1683802 1712304 1724384 1709219 1665824 1687542 1724603 1702432 1645338 1686661
5188 1686661 1745885 1780301 1757483 1829423 1863602 1838846 1869810 1846531 1808563 1787720 1859464
5177 1859464 1872185 1860678 1855741 1853592 1923714 1890001 1917240 2029366 2067859 2104430 2078845 2108766
5165 2108766 2161397 2130304 2153437 2172946 2170940 2272314 2395495 2471287 2481451 2394701 2426215
5154 2426215 2500932 2555817 2585435 2573213 2669251 2863609 2855004 2957580 2967554 2961352 3050625 2987868
5142 2987868 3071363 3252487 3296537 3314988 3379592 3447053 3462154 3584624 3731493 3779830 3832259
5131 3832259 3945520 3991661 3972810 4147498 4278571 4324506 4439294 4525504 4669619 4767688
5121 4767688 4963214 5050934 5067415 5146469 5365242 5488006 5605015 5722604 5807076 5967857
$$ packed form
5199A586772N3549M3481K8502J2080j5165m3395K1718L7061k2171n7094M1323
5188A686661N9224L4416k2818P1940L4179k4756L0964k3279l7968k0843P1744
5177A859464J2721j1507m937k149P0122l3713K7239J12126L8493L6571k5585K9921
5165B108766N2631l1093K3133J9509k006J01374J23181P5792J0164q6750L1514
5154B426215P4717N4885K9618j2222R6038J94358q605J02576R974o202Q9273o2757
5142B987868Q3495J81124M4050J8451O4604O7461J5101J22470J46869M8337N2429
5131C832259J13261M6141j8851J74688J31073M5935J14788Q6210J44115R8069
5121D767688J95526Q7720J6481P9054K18773J22764J17009J17589Q4472J60781
$$ plain form
5111 5967857 6228096 6437056 6627695 6851851 7059795 7172735 7282319 7492500 7730420 7963628
5101 7963628 8141804 8354337 8676061 9002599 9219047 9511862 9912081 10359597 10762806 11296688
5091 11296688 11848407 12571422 13300407 14054489 15071506 16177372 17423361 18826848 20341856
5082 20341856 22140092 24180239 26435869 29080959 32066219 35356393 38955944 42643524
5074 42643524 46386472 49993915 53430789 56639262 59206941 60856158 61163386 59993996
5066 59993996 57765211 55079387 52142991 48977059 45754184 42362426 39099038 36002317
5058 36002317 33104950 30459381 28139457 26193210 24313201 22488910 20808965 19392408
5050 19392408 18023166 16847964 15749327 14761579 14057006 13310028 12760029 12169281 11695439
$$ packed form
5111E967857K60239K08960J90639K24156K07944J12940J09584K10181K37920K33208
5101G963628J78176K12533L21724L26538K16448K92815M00219M47516M03209N33882
5091A1296688N51719P23015P28985P54082J017017J105866J245989J403487J515008
5082B0341856J798236K040147K255630K645090K985260L290174L599551L687580
5074D2643524L742948L607443L436874L208473K567679J649217L07228j169390
5066E9993996k228785k685824k936396l165932l222875l391758l263388l096721
5058C6002317k897367k645569k319924j946247j880009j824291j679945j416557
5050A9392408j369242j175202j098637r87748p04573p46978n49999n90748m73842
$$ plain form
5041 11695439 11247376 10827942 10399574 9996538 9652387 9441904 9368402 9130758 8984709 8827345
5031 8827345 8667563 8629983 8579584 8717354 8822124 8776557 8616175 8295667 8033550 7748140
5021 7748140 7338605 7007883 6836422 6801208 6571040 6441387 6397843 6280983 6123954 5947457
5011 5947457 5877079 5860115 5769336 5765496 5688832 5611630 5414127 5330099 5418956 5400782 5400853 5447369
4999 5447369 5503902 5594363 5689379 5671078 5535103 5554974 5539233 5363928 5230369 5148430 5175144
4988 5175144 4967703 4997504 5082279 5157939 5022698 5010390 4927800 4850757 4884178 4806840 4740157
4977 4740157 4773198 4788705 4768292 4814897 4988957 5028170 5095837 5178631 5113904 5065323 4980621
4966 4980621 4830793 4771614 4748595 4677176 4570715 4519772 4504476 4502148 4515519 4467039 4615740
$$ packed form
5041A1695439m48063m19434m28368m03036l44151k10483p3502k37644j46049j57364
5031H827345j59782l7580n0399J37770J04770m5567j60382l20508k62117k85410
5021G748140m09535l30722j71461l5214k30168j29653m3544j16860j57029j76497
5011E947457p0378j6964r0779l840p6664p7202j97503q4028Q8857j8174P1M6516
4999E447369N6533R0461R5016j8301j35975J9871j5741j75305j33559q1939K6714
4988E175144k07441K9801Q4775P5660j35241j2308q2590p7043L3421p7338o6683
4977D740157L3041J5507k0413M6605J74060L9213O7667Q2794o4727m8581q4702
4966D980621j49828n9179k3019p1419j06461n0943j5296k328J3371m8480J48701
$$ plain form
4955 4615740 4593301 4567149 4676002 4808329 4851471 4942373 4948685 4798968 4637693 4396848 4086715
4944 4086715 3867220 3657296 3496316 3375527 3178731 3076032 2967822 2888073 2786693 2660166
4934 2660166 2617652 2474511 2492210 2526214 2498129 2449559 2333070 2290460 2218912 2189446 2169961
4923 2169961 2053169 2029453 1981374 1990833 1990903 2028385 2063738 2022450 2054147 1972059 1906716 1861150
4911 1861150 1749815 1816476 1798336 1736646 1753899 1725635 1775410 1795122 1700210 1634719 1678616
4900 1678616 1711806 1759715 1701980 1647799 1658845 1613574 1677019 1717883 1648650 1528945 1566277
4889 1566277 1687640 1623070 1561363 1569711 1593301 1545839 1586086 1461675 1476177 1545245 1535246
4878 1535246 1567665 1594799 1495836 1513981 1508960 1608238 1615205 1619992 1611697 1537300 1547628 1541856
$$ packed form
4955D615740k2439k6152J08853J32327M3142R0902O312j49717j61275k40845l10133
4944D086715k19495k09924j60980j20789j96796j02699j08210p9749j01380j26527
4934B660166m2514j43141J7699L4004k8085m8570j16489m2610p1548k9466j9485
4923B169961j16792k3716m8079R459P0L7482L5353m1288L1697q2088o5343m5566
4911A861150j11335O6661j8140o1690J7253k8264M9775J9712r4912o5491M3897
4900A678616L3190M7909n7735n4181J1046m5271O3445M0864o9233j19705L7332
4889A566277J21363o4570o1707Q348K3590m7462M0247j24411J4502O9068r999
4878A535246L2419K7134r8963J8145n021R9278O967M787q295p4397J0328n772
$$ plain form
4866 1541856 1595146 1537972 1594706 1635351 1637512 1672892 1579424 1627446 1672936 1715444 1667713 1701521
4854 1701521 1828547 1835271 1834350 1839720 1932417 1924262 1975520 2012182 2028794 1979562 2085126 2145510
4842 2145510 2255850 2305943 2453527 2515905 2572894 2775845 2894566 3141769 3293015 3525198
4832 3525198 3819878 4208405 4549933 5060739 5709855 6541076 7674626 9021903 9668833
4823 9668833 8958508 7741392 6609176 5680266 4826443 4256865 3908102 3527833 3307538
4814 3307538 3241485 3147422 2924891 2815714 2668613 2589710 2534512 2447565 2412489 2381601 2398143
4803 2398143 2257169 2321057 2312507 2309607 2263860 2182005 2174453 2168128 2180289 2258781 2270833 2243785
4791 2243785 2231468 2274163 2212606 2165863 2146773 2221149 2240695 2271031 2254612 2177635 2126420
$$ packed form
4866A541856N3290n7174N6734M0645K161L5380r3468M8022M5490M2508m7731L3808
4854A701521J27026O724r21N370R2697q155N1258L6662J6612m9232J05564O0384
4842B145510J10340N0093J47584O2378N6989K02951J18721K47203J51246K32183
4832C525198K94680L88527L41528N10806O49116Q31221J133550J347277O46930
4823I668833p10325j217116j132216r28910q53823n69578l48763l80269k20295
4814C307538o6053r4063k22531j09177j47101p8903n5198q6947l5076l0888J6542
4803B398143j40974O3888q550k900m5747q1855p552o325J2161P8492J2052k7048
4791B243785j2317M2695o1557m6743j9090P4376J9546L0336j6419p6977n1215
$$ plain form
4780 2126420 2071665 2049187 2037790 2072703 2051801 2023277 1946363 1962869 1956562 1994253 1964445 1973390
4768 1973390 1975112 1884340 1938908 1976184 1951515 1970748 2018759 2049170 1995068 1966613 1957019 2090027
4756 2090027 2121506 2082970 2130769 2151470 2149884 2166164 2071656 1969787 1929183 1908282 1969578
4745 1969578 1981350 2048324 2057004 2017191 1996916 2087499 2104450 2109261 2185932 2115823 2130594 2160413
4733 2160413 2119471 2120516 2066841 2053570 2034823 2153413 2147748 2124967 2119969 2098286 2001501 1968430
4721 1968430 2042814 2069622 2016952 2012414 2120293 2242564 2298148 2212960 2353936 2460360 2453690
4710 2453690 2491470 2604302 2545131 2430985 2473622 2540859 2561969 2553493 2516755 2470664 2497892
4699 2497892 2498475 2419990 2481286 2484198 2398316 2304037 2253458 2216715 2208428 2204826 2259846 2171567
$$ packed form
4780B126420n4755k2478j1397L4913k0902k8524p6914J6506o307L7691k9808Q945
4768A973390J722r0772N4568L7276k4669J9233M8011L0411n4102k8455r594J33008
4756B090027L1479l8536M7799K0701j586J6280r4508j01869m0604k0901O1296
4745A969578J1772O6974Q680l9813k0275R0583J6951M811P6671p0109J4771K9819
4733B160413m0942J045n3675j3271j8747J18590n665k2781m998k1683r6785l3071
4721A968430P4384K6808n2670m538J07879J22271N5584q5188J40976J06424o670
4710B453690L7780J12832n9171j14146M2637O7237K1110q476l6738m6091K7228
4699B497892N83p8485O1296K912q5882r4279n0579l6743q287l602N5020q8279
$$ plain form
4687 2171567 2202484 2263705 2268808 2319734 2356114 2412595 2350445 2374395 2321175 2414827 2416193 2382736
4675 2382736 2265905 2239369 2213156 2244948 2196466 2090072 2109512 2073654 2044050 1987776 2047339
4664 2047339 2075531 2014789 2020259 2023844 2045916 1981712 2027296 2170791 2217068 2339623 2192164
4653 2192164 2300906 2320264 2320839 2333263 2210542 2148417 2120578 2034086 2056174 2057177 1985770 1977866
4641 1977866 1992906 2002229 1977527 1952153 1943662 1887219 1878264 1894723 1935681 1929593 1948699 1976054
4629 1976054 1988890 2051418 2018867 1928180 1922396 1986364 2011740 2056345 2005182 2041539 1999995 1861349
4617 1861349 1930629 1939332 1999235 1993219 1993423 2031516 2011455 2043403 2025009 2006599 2045327 2002027
4605 2002027 2030539 2032137 1898452 1943758 2033035 2079729 2056333 2094307 2167291 2095385 2079927
$$ packed form
4687B171567L0917O1221N103N0926L6380N6481o2150K3950n3220R3652J366l3457
4675B382736j16831k6536k6213L1792m8482j06394J9440l5858k9604n6274N9563
4664B047339K8192o0742N470L585K2072o4204M5584J43495M6277J22555j47459
4653B192164J08742J9358N75J2424j22721o2125k7839q6492K2088J003p1407p904
4641A977866J5040R323k4702k5374q491n6443q955J6459M0958o088J9106K7355
4629A976054J2836O2528l2551r0687n784O3968K5376M4605n1163L6357m1544j38646
4617A861349O9280Q703N9903o016K04L8093k0061L1948j8394j8410L8728m3300
4605B002027K8512J598j33685M5306Q9277M6694k3396L7974P2984p1906j5458
$$ plain form
4594 2079927 2148660 2080130 2172694 2296960 2274579 2291747 2313147 2194021 2261518 2378274 2317430
4583 2317430 2401216 2461852 2507389 2449587 2516566 2525608 2525310 2615657 2694257 2800370 2897440 2894406
4571 2894406 2877625 3019346 3007382 3043262 3142800 3221059 3311122 3361817 3476761 3568652 3656824
4560 3656824 3622462 3580761 3689422 3811056 3818910 3829769 3826061 3832789 3965667 3962137 4049074 4086341
4548 4086341 4142780 4200752 4324508 4396358 4466269 4565807 4698627 4838432 4983217 5042681 5167658
4537 5167658 5339273 5683199 5878571 6028296 6305541 6521806 6821823 7179400 7488769 7830328
4527 7830328 8116986 8495549 8912426 9451233 9881881 10426004 10838191 11088554 11121712 11064959
4517 11064959 10865252 10517739 10160416 9874101 9727226 9558865 9415325 9450673 9412493 9448237
$$ packed form
4594B079927O8733o8530R2564J24266k2381J7168K1400j19126O7497J16756o0844
4583B317430Q3786O0636M5537n7802O6979R042k98R0347P8600J06113R7070l034
4571B894406j6781J41721j1964L5880R9538P8259R0063N0695J14944R1891Q8172
4560C656824l4362m1701J08661J21634P854J0859l708O728J32878l530Q6937L7267
4548D086341N6439N7972J23756P1850O9911R9538J32820J39805J44785N9464J24977
4537E167658J71615L43926J95372J49725K77245K16265L00017L57577L09369L41559
4527G830328K86658L78563M16877N38807M30648N44123M12187K50363L3158n6753
4517A1064959j99707l47513l57323k86315j46875j68361j43540L5348l8180L5744
$$ plain form
4507 9448237 9601273 9663083 9918225 10264550 10619232 10834519 11137880 11343941 11694415 12021526
4497 12021526 12379881 12692153 12972415 13287498 13580706 13730994 13894621 14107812 14333616
4488 14333616 14389031 14532097 14561757 14378742 14269352 14101418 13848035 13599663 13380491 13145544
4478 13145544 13110822 13176917 13265413 13324970 13412594 13465272 13471845 13434026 13326178 13380963 13522391
4467 13522391 13593813 13705737 13871254 13954945 14179702 14303986 14381401 14692843 15143412 15572388
4457 15572388 16108831 16790401 17536746 18368213 19094627 19724088 20004204 20020870 19907227 19603423
4447 19603423 19329234 18967080 18733205 18562118 18414299 18354263 18438639 18493378 18678252 18862505
4437 18862505 19022613 19210326 19422044 19665866 20014242 20356028 20698023 21177476 21789276
$$ packed form
4507I448237J53036O1810K55142L46325L54682K15287L03361K06061L50474L27111
4497A2021526L58355L12272K80262L15083K93208J50288J63627K13191K25804
4488A4333616N5415J43066K9660j83015j09390j67934k53383k48372k19172k34947
4478A3145544l4722O6095Q8496N9557Q7624N2678O573l7819j07848N4785J41428
4467A3522391P1422J11924J65517Q3691K24757J24284P7415L11442M50569M28976
4457A5572388N36443O81570P46345Q31467P26414O29461K80116J6666j13643l03804
4447A9603423k74189l62154k33875j71087j47819o0036Q4376N4739J84874J84253
4437A8862505J60108J87713K11718K43822L48376L41786L41995M79453O11800
$$ plain form
4428 21789276 22402225 23115114 23975536 25089334 26263118 27482002 28838438 30360028 31904128
4419 31904128 33299133 34774899 36367211 37929836 39745093 41535024 43338284 45114698
4411 45114698 46761350 48385923 50037305 51946082 54130490 56536786 59036249 61684629
4403 61684629 64364801 67187495 69896291 72390090 74429549 76199070 77711366 78590010
4395 78590010 78944269 78356291 76669927 74071220 70616840 66772425 63024442 59537858
4387 59537858 56690555 54569150 53179851 52425770 51920920 51446115 50399974 48457343 45658018
4378 45658018 42551999 39370012 36389661 33824348 31608668 29705514 28188991 26831926
4370 26831926 25755176 24751780 23770837 23116895 22536985 21989550 21502711 21171623 20777197
$$ packed form
4428B1789276O12949P12889Q60422J113798J173784J218884J356436J521590J544100
4419C1904128J395005J475766J592312J562625J815257J789931J803260J776414
4411D5114698J646652J624573J651382J908777K184408K406296K499463K648380
4403F1684629K680172K822694K708796K493799K039459J769521J512296Q78644
4395G8590010L54259n87978j686364k598707l454380l844415l747983l486584
4387E9537858k847303k121405j389299p54081n04850m74805j046141j942631k799325
4378D5658018l106019l181987k980351k565313k215680j903154j516523j357065
4370B6831926j076750j003396r80943o53942n79910n47435m86839l31088l94426
$$ plain form
4361 20777197 20392494 19980054 19485522 19033383 18580167 17988126 17419337 16883062 16441825
4352 16441825 16033396 15639967 15301269 14903051 14524899 14286548 14081576 13773485 13611477
4343 13611477 13285462 12929867 12552892 12282187 11921205 11632236 11199244 10998841 10779407
4334 10779407 10464841 10152430 9948335 9776780 9612578 9491428 9328052 9189705 9010986
4325 9010986 8931578 8830052 8646219 8633849 8460268 8359194 8270060 8119042 8124050 8042442 8051963
4314 8051963 8016542 7971030 8014436 7945606 7808304 7790260 7865882 7889781 7832728 7696035 7568789
4303 7568789 7548986 7600644 7582347 7524146 7489051 7505883 7528418 7504795 7515992 7492518 7512390
4292 7512390 7476165 7578461 7695095 7748282 7708395 7744607 7812194 7848864 7957017 7895063 7931292
$$ packed form
4361B0777197l84703m12440m94532m52139m53216n92041n68789n36275m41237
4352A6441825m08429l93429l38698l98218l78152k38351k04972l08091j62008
4343A3611477l26015l55595l76975k70705l60982k88969m32992k00403k19434
4334A0779407l14566l12411k04095j71555j64202j21150j63376j38347j78719
4325I010986p9408j01526j83833j2370j73581j01074q9134j51018N008q1608R521
4314H051963l5421m5512M3406o8830j37302j8044P5622K3899n7053j36693j27246
4303G568789j9803N1658j8297n8201l5095J6832K2535k3623J1197k3474J9872
4292G512390l6225J02296J16634N3187l9887L6212O7587L6670J08153o1954L6229
$$ plain form
4281 7931292 8049650 8115842 8300253 8388202 8496311 8646651 8700298 8769723 8883988 9060610
4271 9060610 9259283 9425986 9687331 9919103 10168711 10477893 10830154 11274702 11777652 12071702
4261 12071702 12519524 13160499 13673050 14216553 14785511 15395177 16180451 16870681 17346139
4252 17346139 17750738 18060420 18164707 18138521 17866956 17686735 17599449 17483731 17525105 17679556
4242 17679556 17905348 18165185 18536243 19049203 19727851 20470850 21139642 22045049 23085447
4233 23085447 24361262 25801596 27250570 28835789 30704374 32782545 35192490 37777174
4225 37777174 40269892 42316597 43599401 43753915 42689097 40987958 39035127 36987683
4217 36987683 35167451 33688858 32592936 31775849 31165098 30771696 30660585 30703206 31069763
$$ packed form
4281G931292J18358O6192J84411Q7949J08109J50340N3647O9425J14265J76622
4271I060610J98673J66703K61345K31772K49608L09182L52261M44548N02950K94050
4261A2071702M47822O40975N12551N43503N68958O09666P85274O90230M75458
4252A7346139M04599L09682J04287k6186k71565j80221q7286j15718M1374J54451
4242A7679556K25792K59837L71058N12960O78648P42999O68792R05407J040398
4233B3085447J275815J440334J448974J585219J868585K078171K409945K584684
4225C7777174K492718K046705J282804J54514j064818j701139j952831k047444
4217C6987683j820232j478593j095922q17087o10751l93402j11111M2621L66557
$$ plain form
4208 31069763 31408817 31975716 32629097 33546219 34748053 36012496 37607155 39547902 41742555
4199 41742555 44174807 46941913 50052337 53199413 55938949 57803585 58014851 56640959
4191 56640959 54154113 51007469 47632080 44623076 41979803 39807846 38103712 36813145
4183 36813145 35880136 35308872 34861653 34586793 34390073 34410848 34545621 34971781 35618290 36494254
4173 36494254 37612535 38840178 40369970 42215473 44254545 46578060 49107748 51901244
4165 51901244 54460394 56657892 58604780 60269839 62126633 64328570 67252858 71112371
4157 71112371 76072755 82402107 90382220 100115306 111396772 123028951 131570138 132071122
4149 132071122 124233201 112589673 100327462 88826752 78596688 70109470 63352396
$$ packed form
4208C1069763L39054N66899O53381R17122J201834J264443J594659J940747K194653
4199D1742555K432252K767106L110424L147076K739536J864636K11266j373892
4191E6640959k486846l146644l375389l009004k643273k171957j704134j290567
4183C6813145r33009n71264m47219k74860j96720K0775J34773M26160O46509Q75964
4173C6494254J118281J227643J529792J845503K039072K323515K529688K793496
4165E1901244K559150K197498J946888J665059J856794K201937K924288L859513
4157G1112371M960384O329352P980113R733086J1281466J1632179Q541187N00984
4149A32071122p837921j1643528j2262211j1500710j0230064q487218o757074
$$ plain form
4142 63352396 57997529 53672286 50202288 47251484 44620291 42210398 39840034 37481526
4134 37481526 35559220 33801374 32169903 30719369 29494112 28412047 27357969 26511055
4126 26511055 25809565 25166760 24523843 23954505 23470111 23039366 22595327 22228003 21861508
4117 21861508 21491424 21225713 20955370 20644977 20377187 20267228 20076718 19944499 19947349 19960777
4107 19960777 20040503 20261494 20490110 20790886 21186978 21735331 22343030 22973902 23843995 24653305
4097 24653305 25406663 25908000 26112388 25922762 25390419 24618385 23750420 22846135 22067944
4088 22067944 21452632 20942750 20487710 20303223 20246705 20247805 20220377 20270221 20465735 20555425
4078 20555425 20565722 20779610 21088361 21301862 21628389 21908964 22223000 22412243 22575182 22666597
$$ packed form
4142F3352396n354867m325243l469998k950804k631193k409893k370364k358508
4134C7481526j922306j757846j631471j450534j225257j082065j054078q46914
4126B6511055p01490o42805o42917n69338m84394m30745m44039l67324l66495
4117B1861508l70084k65711k70343l10393k67790j09959j90510j32219K850J3428
4107A9960777P9726K20991K28616L00776L96092N48353O07699O30872Q70093Q09310
4097B4653305P53358N01337K04388j89626n32343p72034q67965r04285p78191
4088B2067944o15312n09882m55040j84487n6518J100k7428M9844J95514Q9690
4078B0555425J0297K13888L08751K13501L26527K80575L14036J89243J62939R1415
$$ plain form
4068 22666597 22825265 23038282 23232191 23474787 23962006 24379185 24663372 25000202 25126946
4059 25126946 25349281 25258803 24785447 24177383 23609962 22957840 22509465 22080020 21454453 20840865
4049 20840865 20305497 19836013 19347081 18972997 18759066 18558125 18345302 18198313 18071147
4040 18071147 18034450 18062431 18230364 18542136 18809399 19141496 19410406 19751205 20041524 20174324
4030 20174324 20311003 20437805 20490422 20404951 20305303 19963319 19550557 19117417 18622288 18114618
4020 18114618 17684021 17363382 17101950 16828600 16708344 16642059 16620751 16634294 16697493 16819738
4010 16819738 16942974 17120252 17419788 17778015 18010431 18365121 18717404 19188411 19635314
4001 19635314 20200483 20819109 21465928 22197097 23087075 24097378 25214537 26552580 28236115
$$ packed form
4068B2666597J58668K13017J93909K42596M87219M17179K84187L36830J26744
4059B5126946K22335r0478m73356o08064n67421o52122m48375m29445o25567o13588
4049B0840865n35368m69484m88932l74084k13931k00941k12823j46989j27166
4040A8071147l6697K7981J67933L11772K67263L32097K68910L40799K90319J32800
4030B0174324J36679J26802N2617q5471r9648l41984m12762m33140m95129n07670
4020A8114618m30597l20639k61432k73350j20256o6285k1308J3543O3199J22245
4010A6819738J23236J77278K99536L58227K32416L54690L52283M71007M46903
4001A9635314N65169O18626O46819P31169Q89978J010303J117159J338043J683535
$$ plain form
3992 28236115 30208156 32525547 35126744 38033365 41340392 45309093 49977827 55591965
3984 55591965 62328225 70487206 79788394 89363732 95664606 95676428 90364200 82539393
3976 82539393 74186600 66158731 59362346 53879835 49576758 46343483 44058238 42376649
3968 42376649 41123336 40198644 39440165 38774124 38515333 38153326 37897922 37655557 37289930
3959 37289930 36789823 36083740 35331174 34593813 33800645 33163374 32640230 32280521 31873139
3950 31873139 31620475 31240240 30756730 30251185 29749241 29302367 28756634 28473889 28307006
3941 28307006 28309395 28496979 28617058 28580744 28489927 28518716 28593602 28783837 29218703 29809688
3931 29809688 30675669 31653241 32821277 34204172 35960932 37947050 40041527 42199004
$$ packed form
3992B8236115J972041K317391K601197K906621L307027L968701M668734N614138
3984E5591965O736260Q158981R301188R575338O300874J1822n312228p824807
3976H2539393q352793q027869o796385n482511m303077l233275k285245j681589
3968D2376649j253313r24692p58479o66041k58791l62007k55404k42365l65627
3959C7289930n00107p06083p52566p37361p93168o37271n23144l59709m07382
3950C1873139k52664l80235m83510n05545n01944m46874n45733k82745j66883
3941B8307006K389J87584J20079l6314r0817K8789P4886J90235M34866N90985
3931B9809688Q65981R77572J168036J382895J756760J986118K094477K157477
$$ plain form
3923 42199004 44358161 46894896 49836749 53152155 56987912 61634378 66965964 73137302
3915 73137302 79285876 82415789 80397538 75185975 69515728 64320324 59939838 56452944
3907 56452944 54251876 53214139 53109583 53711427 54542326 55206755 55094598 53987646 52348706
3898 52348706 50643734 49096113 47668860 46044525 44322678 42957453 41970045 41262137
3890 41262137 40982612 40937708 40926503 41087845 41300387 41683312 42566099 43799575 45312001
3881 45312001 47402187 50406208 54412824 59523854 65461877 69900175 69086515 64106219
3873 64106219 58258097 53042558 48416025 44290799 40778932 37897649 35625827 33640289
3865 33640289 31966609 30504045 29272246 28224598 27308277 26502100 25797320 25240051 24689009
$$ packed form
3923D2199004K159157K536735K941853L315406L835757M646466N331586O171338
3915G3137302O148574L129913k018251n211563n670247n195404m380486l486894
3907E6452944k201068j037737j04556O01844Q30899O64429j12157j106952j638940
3898E2348706j704972j547621j427253j624335j721847j365225r87408p07908
3890D1262137k79525m4904j1205J61342K12542L82925Q82787J233476J512426
3881D5312001K090186L004021M006616N111030N938023M438298q13660m980296
3873F4106219n848122n215539m626533m125226l511867k881283k271822j985538
3865C3640289j673680j462564j231799j047648r16321q06177p04780n57269n51042
$$ plain form
3856 24689009 24234155 23816988 23375115 23004945 22725464 22439642 21957548 21773584 21590764
3847 21590764 21383768 21230286 21181307 21223005 21274380 21364162 21603575 21966865 22256895 22683905
3837 22683905 23145520 23801817 24715825 25609604 26744137 28102093 29560004 30538623 30628310
3828 30628310 29888355 28827824 27667003 26568825 25538337 24899972 24493623 24178499 24045094
3819 24045094 23973842 23774322 23735327 23757412 23809623 23960620 24104857 24343812 24630068 24954085
3809 24954085 25331507 25849360 26450955 27014255 27785125 28742814 29576821 30271853 30556604
3800 30556604 30789839 30738405 30222456 29597955 29137556 28877551 28698864 28699864 28820807 29112052
3790 29112052 29520245 29976974 30391763 30958984 31520469 32159553 32876542 33534059 34340988
$$ packed form
3856B4689009m54854m17167m41873l70170k79481k85822m82094j83964j82820
3847B1590764k06996j53482m8979M1698N1375Q9782K39413L63290K90030M27010
3837B2683905M61615O56297R14008Q93779J134533J357956J457911R78619Q9687
3828C0628310p39955j060531j160821j098178j030488o38365m06349l15124j33405
3819B4045094p1252j99520l8995K2085N2211J50997J44237K38955K86256L24017
3809B4954085L77422N17853O01595N63300P70870R57689Q34007O95032K84751
3800C0556604K33235n1434n15949o24501m60399k60005j78687J000J20943K91245
3790B9112052M08193M56729M14789N67221N61485O39084P16989O57517Q06929
$$ plain form
3781 34340988 35333409 36376896 37476619 38672713 39968456 41278251 42688118 44131469
3773 44131469 45769874 47539878 49314275 51237525 53196621 55374410 57655113 59980824
3765 59980824 62393305 64981847 67676666 70373574 73041649 75831301 78538787 81368644
3757 81368644 84363881 87364172 90432069 93537715 96716181 99936332 102971011 106167638
3749 106167638 109298644 112338788 115195805 117878135 120504517 122844154 125096783 127097680
3741 127097680 128858436 130686338 132280253 133582906 134749956 135535000 136217380 136746505
3733 136746505 136818152 136552613 136007369 135251617 134289079 133003984 131550747 129870904 128061979
3724 128061979 126024503 123726739 121414696 118885577 116189356 113309237 110312075 107262199
$$ packed form
3781C4340988R92421J043487J099723J196094J295743J309795J409867J443351
3773D4131469J638405J770004J774397J923250J959096K177789K280703K325711
3765E9980824K412481K588542K694819K696908K668075K789652K707486K829857
3757H1368644K995237L000291L067897L105646L178466L220151L034679L196627
3749A06167638L131006L040144K857017K682330K626382K339637K252629K000897
3741A27097680J760756J827902J593915J302653J167050P85044O82380N29125
3733A36746505P1647k65539n45244p55752r62538j285095j453237j679843j808925
3724A28061979k037476k297764k312043k529119k696221k880119k997162l049876
$$ plain form
3716 107262199 104096272 100814960 97649713 94384762 91220765 88189839 85192975 82267756
3708 82267756 79345174 76575398 73807806 70980349 68327054 65789556 63303871 60960697
3700 60960697 58738662 56568948 54604411 52700412 51152211 49619273 48135165 46769826
3692 46769826 45403460 44220087 43117920 42083260 41070007 40200475 39417347 38721451 38041950
3683 38041950 37566860 37082504 36597083 36181605 35801695 35425706 35264140 35047203 34759812
3674 34759812 34725608 34627878 34592466 34535952 34575895 34706933 34902494 35027185 35090807 35304415
3664 35304415 35450503 35560320 35796433 36039876 36257554 36516680 36725681 37060353 37506423
3655 37506423 37983436 38325597 38555088 38647566 38748153 38789865 38805845 38925400 38998877 39087536
$$ packed form
3716A07262199l165927l281312l165247l264951l163997l030926k996864k925219
3708H2267756k922582k769776k767592k827457k653295k537498k485685k343174
3700F0960697k222035k169714j964537j903999j548201j532938j484108j365339
3692D6769826j366366j183373j102167j034660j013253q69532p83128o95896o79501
3683C8041950m75090m84356m85421m15478l79910l75989j61566k16937k87391
3674C4759812l4204r7730l5412n6514L9943J31038J95561J24691O3622K13608
3664C5304415J46088J09817K36113K43443K17678K59126K09001L34672M46070
3655C7506423M77013L42161K29491R2478J00587M1712J5980J19555P3477Q8659
$$ plain form
3645 39087536 39383534 39738814 40129229 40606901 41224162 41801854 42531155 43151384 43839835
3636 43839835 44437563 44971090 45590667 46231243 46822947 47554434 48459529 49351969 50301079
3627 50301079 51333864 52393399 53157445 53457855 53413423 52970556 52270126 51466578 50826213
3618 50826213 50252248 49704137 49459155 49317232 49348348 49482258 49603647 50001641 50452137 50755442
3608 50755442 51285676 51813239 52341794 52884341 53483536 54065939 54645429 55211919 55967285
3599 55967285 56781677 57823670 58614253 58957828 58831058 57981291 56733161 55176042 53455023
3590 53455023 51859150 50313862 48930590 47891230 47018109 46391984 45823340 45504398 45334278
3581 45334278 45233358 45188824 45294234 45479480 45598876 45699860 45673943 45848189 45980827 46232142
$$ packed form
3645C9087536K95998L55280L90415M77672O17261N77692P29301O20229O88451
3636D3839835N97728N33527O19577O40576N91704P31487R05095Q92440R49110
3627E0301079J032785J059535P64046L00410m4432m42867p00430q03548o40365
3618E0826213n73965n48111k44982j41923L1116J33910J21389L97994M50496L03305
3608E0755442N30234N27563N28555N42547N99195N82403N79490N66490P55366
3599E5967285Q14392J041993P90583L43575j26770q49767j248130j557119j721019
3590E3455023j595873j545288j383272j039360q73121o26125n68644l18942j70120
3581D5334278j00920m4534J05410J85246J19396J00984k5917J74246J32638K51315
$$ plain form
3571 46232142 46693526 47178042 47596182 47993256 48001359 47723927 47040159 45851941 44434312
3562 44434312 43034566 41675388 40381811 39172201 38154339 37329696 36431187 35749915 35120871
3553 35120871 34546147 33966223 33479436 32924037 32442277 31891793 31386338 31006759 30542538
3544 30542538 30265154 30038560 29799172 29571972 29327035 29217683 29059649 28783570 28431602
3535 28431602 28074068 27542058 27113262 26644276 26207859 25840449 25514152 25270061 24953741
3526 24953741 24784950 24526160 24401430 24255562 24136488 23910181 23810892 23795943 23700345 23541522
3516 23541522 23470388 23500511 23508281 23540205 23569929 23644019 23774179 23783297 23834025 24046979 24183095
3505 24183095 24362229 24527944 24696995 24859747 25080369 25310677 25430353 25702250 25995194
$$ packed form
3571D6232142M61384M84516M18140L97074Q103k77432o83768j188218j417629
3562D4434312j399746j359178j293577j209610j017862q24643q98509o81272o29044
3553C5120871n74724n79924m86787n55399m81760n50484n05455l79579m64221
3544C0542538k77384k26594k39388k27200k44937j09352j58034k76079l51968
3535B8431602l57534n32010m28796m68986m36417l67410l26297k44091l16320
3526B4953741j68791k58790j24730j45868j19074k26307r9289j4949r5598j58823
3516B3541522p1134L0123P770L1924K9724P4090J30160R118N0728K12954J36116
3505B4183095J79134J65715J69051J62752K20622K30308J19676K71897K92944
$$ plain form
3496 25995194 26238119 26380791 26603496 26801381 27022104 27265997 27485651 27764970 28026659
3487 28026659 28443536 28910925 29368972 29829063 30263838 30830143 31487139 32145174 32782031
3478 32782031 33615891 34619448 35569373 36665969 37891640 39255062 40740251 42351252
3470 42351252 44069399 45867940 48015603 50374520 52824819 55594959 58505646 61649198
3462 61649198 64624476 67328234 69808205 71920273 73705711 75260076 76672987 78101956
3454 78101956 79382475 80602542 81882398 83230532 84542759 85810878 86935967 87768959
3446 87768959 88355979 88609657 88508756 88143144 87485503 86743926 85977859 85338675 84808483
3437 84808483 84367068 84080646 84108684 84403223 84786022 85348779 86053971 86848256 87815684 88703476
$$ packed form
3496B5995194K42925J42672K22705J97885K20723K43893K19654K79319K61689
3487B8026659M16877M67389M58047M60091M34775N66305O56996O58035O36857
3478C2782031Q33860J003557R49925J096596J225671J363422J485189J611001
3470D2351252J718147J798541K147663K358917K450299K770140K910687L143552
3462F1649198K975278K703758K479971K112068J785438J554365J412911J428969
3454G8101956J280519J220067J279856J348134J312227J268119J125089Q32992
3446H7768959N87020K53678j00901l65612o57641p41577p66067o39184n30192
3437H4808483m41415k86422K8038K94539L82799N62757P05192P94285R67428Q87792
$$ plain form
3427 88703476 89702749 91157289 92673180 94533087 96714302 99087197 101830037 104910740
3419 104910740 108210114 111869278 115959849 120493778 125366029 130719413 136440369 142481867
3411 142481867 148751953 155397775 162324777 169351533 176563661 183922890 191534221 199122201
3403 199122201 206732367 214383764 222074938 229697655 237393467 245089307 252900434 260830720
3395 260830720 268708243 276433194 283933121 291404125 298543104 305525380 312362876 318977564
3387 318977564 325235980 330888370 336074112 340452937 343937501 346511749 348466293 349757357
3379 349757357 350630043 351489683 352197543 353069251 354071387 355218466 356485392 357662779 358734179
3370 358734179 360034486 361558526 363773991 367075774 371620886 377403324 384366556 391860029
$$ packed form
3427H8703476R99273J454540J515891J859907K181215K372895K742840L080703
3419A04910740L299374L659164M090571M533929M872251N353384N720956O041498
3411A42481867O270086O645822O927002P026756P212128P359229P611331P587980
3403A99122201P610166P651397P691174P622717P695812P695840P811127P930286
3395B60830720P877523P724951P499927P471004P138979O982276O837496O614688
3387C18977564O258416N652390N185742M378825L484564K574248J954544J291064
3379C49757357Q72686Q59640P07860Q71708J002136J147079J266926J177387J071400
3370C58734179J300307J524040K215465L301783M545112N782438O963232P493473
$$ plain form
3362 391860029 399051862 405469785 410322219 412685054 412005518 408535379 402891049 396038410
3354 396038410 388695298 381236888 374185563 367779843 361842845 355902561 349090574 340329976
3346 340329976 329084851 315156840 298986912 281118877 262318881 243556970 225601082
3339 225601082 209179323 194545754 181563877 170226393 160358919 151737168 144084425
3332 144084425 137121514 131035743 125524682 120549866 116024545 111943229 108335062 105037794
3324 105037794 101904950 99090529 96340015 93673744 91094588 88499703 85994012 83372044
3316 83372044 80689451 78012993 75431032 72858591 70378714 67888162 65780472 63702733
3308 63702733 61568954 59464548 57526818 55523462 53408405 51434020 49559742 47707630
$$ packed form
3362C91860029P191833O417923M852434K362835o79536l470139n644330o852639
3354C96038410p343112p458410p051325o405720n936998n940284o811987q760598
3346C40329976j1245125j3928011j6169928j7868035j8799996j8761911j7955888
3339B25601082j6421759j4633569j2981877j1337484r867474q621751p652743
3332A44084425o962911o085771n511061m974816m525321m081316l608167l297268
3324A05037794l132844k814421k750514k666271k579156k594885k505691k621968
3316H3372044k682593k676458k581961k572441k479877k490552k107690k077739
3308F3702733k133779k104406j937730k003356k115057j974385j874278j852112
$$ plain form
3300 47707630 45940812 44224109 42562093 41133301 39666010 38334078 37033797 35868445
3292 35868445 34707700 33702210 32753817 31793300 30991907 30092942 29221073 28428482 27770872
3283 27770872 27122468 26442030 25820212 25112916 24462948 23836249 23360265 22800149 22190726
3274 22190726 21666421 21109395 20532085 20058984 19586898 19153771 18698168 18246015 17838049
3265 17838049 17476024 17074877 16672025 16358099 15974081 15620789 15307626 14977042 14607039
3256 14607039 14356649 13948694 13587137 13483979 13201956 12997945 12763308 12606858 12389675
3247 12389675 12190893 12028081 11837157 11624986 11470212 11294891 11070590 10864925 10704130
3238 10704130 10626270 10477610 10245998 10144707 9954425 9782094 9640139 9444072 9295501 9197953
$$ packed form
3300D7707630j766818j716703j662016j428792j467291j331932j300281j165352
3292C5868445j160745j005490r48393r60517q01393q98965q71869p92591o57610
3283B7770872o48404o80438o21818p07296o49968o26699m75984n60116o09423
3274B2190726n24305n57026n77310m73101m72086m33127m55603m52153m07966
3265A7838049l62025m01147m02852l13926l84018l53292l13163l30584l70003
3256A4607039k50390m07955l61557j03158k82023k04011k34637j56450k17183
3247A2389675j98782j62812j90924k12171j54774j75321k24301k05665j60795
3238A0704130p7860j48660k31612j01291j90282j72331j41955j96067j48571r7548
$$ plain form
3228 9197953 9053523 8891613 8733102 8521775 8391883 8316991 8330299 8198936 8039042 7932814
3218 7932814 7919709 7688187 7664889 7570924 7477607 7418611 7290457 7171579 7130003 7016434 6976740
3207 6976740 6900927 6837953 6779964 6688617 6649672 6579177 6528412 6491105 6403485 6372728 6227033
3196 6227033 6185664 6096384 6083404 6073322 5938463 5943466 5793661 5700734 5701659 5657656 5548855
3185 5548855 5482823 5425871 5447160 5353712 5343415 5331988 5243518 5157289 5086300 5023248 4943771
3174 4943771 4869806 4744445 4790913 4811158 4723831 4644618 4570361 4610677 4531854 4506921 4418389
3163 4418389 4372362 4407275 4319672 4336014 4332048 4246679 4234013 4294742 4334632 4235530 4257253 4181566
3151 4181566 4239257 4270891 4230806 4303764 4351413 4324282 4374374 4343520 4390957 4504807 4409857
$$ packed form
3228I197953j44430j61910j58511k11327j29892p4892J3308j31363j59894j06228
3218G932814j3105k31522k3298r3965r3317n8996j28154j18878m1576j13569l9694
3207F976740p5813o2974n7989r1347l8945p0495n0765l7307q7620l0757j45695
3196F227033m1369q9280j2980j0082j34859N003j49805r2927R25m4003j08801
3185E548855o6032n6952K1289r3448j0297j1427q8470q6229p0989o3052p9477
3174D943771p3965j25361M6468K0245q7327p9213p4257M0316p8823k4933q8532
3163D418389m6027L4913q7603J6342l966q5369j2666O0729L9890r9102K1723p5687
3151D181566N7691L1634m0085P2958M7649k7131N0092l0854M7437J13850r4950
$$ plain form
3140 4409857 4361622 4428471 4471181 4529243 4526169 4466848 4550885 4531252 4553377 4522170 4606985 4686175
3128 4686175 4678061 4697993 4762641 4714698 4612122 4620016 4507288 4562246 4612015 4636872 4627206 4558153
3116 4558153 4517037 4530514 4550193 4572281 4603314 4545439 4598269 4635455 4598824 4680006 4749514
3105 4749514 4706429 4806097 4869461 4895638 4932296 5016098 5020710 5020549 5049546 5042408 5015540 4939852
3093 4939852 4960724 5013211 4922888 4879295 4820195 4794912 4659591 4499567 4429009 4237084 4047973
3082 4047973 3917284 3917789 3784800 3733415 3640115 3500415 3509112 3507052 3458305 3450083 3371423 3322632
3070 3322632 3545892 3679664 3821923 4049183 4232931 4098322 3795952 3571397 3352493 3214578
3060 3214578 3060380 3001750 2784628 2734760 2810147 2658824 2617379 2657648 2624364 2642617 2668531
$$ packed form
3140D409857m8235O6849M2710N8062l074n9321Q4037j9633K2125l1207Q4815P9190
3128D686175q114J9932O4648m7943j02576P894j12728N4958M9769K4857r666o9053
3116D558153m1116J3477J9679K2088L1033n7875N2830L7186l6631Q1182O9508
3105D749514m3085R9668O3364K6177L6658Q3802M612j61K8997p138k6868p5688
3093D939852K0872N2487r0323m3593n9100k5283j35321j60024p0558j91925j89111
3082D047973j30689N05j32989n1385r3300j39700Q697k060m8747q222p8660m8791
3070C322632K23260J33772J42259K27260J83748j34609l02370k24555k18904j37915
3060C214578j54198n8630k17122m9868P5387j51323m1445M0269l3284J8253K5914
$$ plain form
3049 2668531 2714938 2736209 2849415 2859218 2907581 3058427 3097072 3352483 3592307 3983596 4455731
3038 4455731 4971632 4987413 4654727 4130826 3639028 3221927 2988440 2811129 2617795 2495621
3028 2495621 2428257 2331071 2231992 2078383 2041143 2074839 2034370 2022048 2092288 2138991 2134395
3017 2134395 2155904 2206343 2241042 2309239 2316154 2322095 2504650 2709641 2984075 2885692 2719902
3006 2719902 2472019 2303480 2150148 1938264 1878467 1813026 1779077 1714798 1595526 1651849
2996 1651849 1535769 1502013 1481871 1433807 1429571 1423861 1353780 1349106 1369749 1378751 1338527 1315445
2984 1315445 1272715 1284610 1256488 1322379 1342573 1286234 1268535 1262586 1268966 1218372 1215309 1216733
2972 1216733 1193502 1245244 1146376 1133211 1114405 993906 1028208 1083359 993326 1013200 1089824
$$ packed form
3049B668531M6407K1271J13206R803M8363J50846L8645K55411K39824L91289M72135
3038D455731N15901J5781l32686n23901m91798m17101k33487j77311j93334j22174
3028B495621o7364r7186r9079j53609l7240L3696m0469j2322P0240M6703m596
3017B134395K1509N0439L4699O8197O915N941J82555K04991K74434r8383j65790
3006B719902k47883j68539j53332k11884n9797o5441l3949o4279j19272N6323
2996A651849j16080l3756k0142m8064m236n710p0081m674K0643R002m0224k3082
2984A315445m2730J1895k8122O5891K0194n6339j7699n949O380n0594l063J424
2972A216733k3231N1742r8868j3165j8806j20499L4302N5151r0033J9874P6624
$$ plain form
2961 1089824 1151717 1060720 960173 1008373 1018184 978467 860624 806322 925284 988599 919898
2950 919898 960839 932419 931369 855329 822612 917675 981110 881164 879537 987513 1014009 918065
2938 918065 897619 862234 871418 915319 935553 914268 922921 869509 852566 892628 911352 994008
2926 994008 949219 974733 920439 980144 958786 902394 988512 954060 987286 933423 931396 976264
2914 976264 1027367 1012242 1104725 1161223 1060113 924536 1007986 1038617 1050367 949589 956759
2903 956759 965594 1026795 963250 977674 932243 880048 927127 930646 920784 953888 931800 881121
2891 881121 934449 809165 868565 789392 811577 829452 879726 908763 899366 904792 844642 788827
2879 788827 758573 810155 825415 798934 850803 804128 786507 831426 766121 767375 774654 780504
$$ packed form
2961A089824O1893r0997j00547M8200R811l9717j17843n4302J18962O3315o8701
2950I19898M0941k8420j050p6040l2717R5063O3435r9946j627J07976K6496r5944
2938I18065k0446l5385R184M3901K0234k1285Q653n3412j6943M0062J8724Q2656
2926I94008m4789K5514n4294N9705k1358n6392Q6118l4452L3226n3863k027M4868
2914I76264N1103j5125R2483N6498j01110j35577Q3450L0631J1750j00778P170
2903I56759Q835O1201o3545J4424m5431n2195M7079L519r862L3104k2088n0679
2891H81121N3328j25284N9400p9173K2185J7875N0274K9037r397N426o0150n5815
2879G88827l0254N1582J5260k6481N1869m6675j7621M4919o5305J254P279N850
$$ plain form
2867 780504 726846 699305 780605 751958 754437 788294 777324 675147 636225 601953 613774 626491
2855 626491 643192 671050 575750 631541 618804 566172 608905 651766 584120 627463 622108 663745
2843 663745 643501 685821 678929 710885 680678 587627 628998 620092 690226 721444 678268 684324
2831 684324 719161 614244 580025 608561 684282 683164 573426 613340 680179 636717 732200
2820 732200 691337 609836 705098 668539 676545 746024 707491 757923 658686 681288 677207 689649
2808 689649 711016 736962 766433 715898 684598 620747 641265 720964 765440 746815 774446 757008
2796 757008 777011 733829 623238 589033 566158 677768 628303 630637 662035 619971 658511
2785 658511 678951 645545 644272 729028 733114 733865 784778 631608 737085 693749 612690 688664
$$ packed form
2867G80504n3658k7541Q1300k8647K479L3857j0970j02177l8922l4272J1821J2717
2855F26491J6701K7858r5300N5791j2737n2632M2733M2861o7646M3343n355M1637
2843F63745k0244M2320o892L1956l0207r3051M1371q906P0134L1218m3176O056
2831F84324L4837j04917l4219K8536P5721j118j09738L9914O6839m3462R5483
2820G32200m0863q1501R5262l6559Q006O9479l8533N0432r9237K2602m081J2442
2808F89649K1367K5946K9471n0535l1300o3851K0518P9699M4476j8625K7631j7438
2796G57008K0003m3182j10591l4205k2875J11610m9465K334L1398m2064L8540
2785F58511K0440l3406j273Q4756M086P51N0913j53170J05477m3336q1059P5974
$$ plain form
2773 688664 624747 586917 693896 728498 664765 601103 585344 579745 535428 521535 550486 564235
2761 564235 575528 534363 498324 511645 611036 637231 606291 568787 611939 601344 573625 608798
2749 608798 560594 597539 545806 542750 572862 602918 505101 466294 494287 561170 499906 427326
2737 427326 453353 443506 505609 453489 354945 306819 315648 321282 381924 354428 297382 371179
2725 371179 376403 336164 253186 259181 279014 343382 368395 299718 325872 290163 246274 324987
2713 324987 365920 378124 252180 303900 273174 239333 317267 288825 314394 332922 233810
2702 233810 275065 248236 344818 286126 231407 289649 287562 150324 193125 250885 311627 337714
2690 337714 301176 151220 171084 150225 165708 213736 200520 197764 176994 244940 116981
$$ packed form
2773F88664o3917l7830J06979L4602o3733o3662j5759n599m4317j3893K8951J3749
2761E64235J1293m1165l6039J3321R9391K6195l0940l7504M3152j0595k7719L5173
2749F08798m8204L6945n1733l056L0112L0056r7817l8807K7993O6883o1264p2580
2737D27326K6027r847O2103n2120r8544m8126Q829N634O0642k7496n7046P3797
2725C71179N224m0239q2978N995J9833O4368K5013o8677K6154l5709m3889P8713
2713C24987M0933J2204j25944N1720l0726l3841P7934k8442K5569J8528r9112
2702B33810M1255k6829R6582n8692n4719N8242k087j37238M2801N7760O0742K6087
2690C37714l6538j49956J9864k0859J5483M8028j3216k756k0770O7946j27959
$$ plain form
2679 116981 106668 116137 214709 308759 316933 211510 234808 254161 233842 234465 298902 294282
2667 294282 239121 232927 196144 172747 146876 214271 274017 187843 173409 178475 135486 105455
2655 105455 121132 108736 195949 203440 205382 246849 164681 146356 204941 255810 212978 217126
2643 217126 178323 121893 91282 165400 238924 199669 119601 174703 202103 121445 83279 78987
2631 78987 55554 87739 152115 116790 160018 125705 108316 65572 122682 50255 71766 85241
2619 85241 163314 172386 189441 290996 217656 88418 51144 41291 47032 148756 106378 110708
2607 110708 128252 121252 216021 157503 151835 154459 144502 166454 132041 156589 152196 95471 79955
2594 79955 130754 77820 62704 40175 14006 43106 -1155 -14743 32304 -20498 21033 76151
$$ packed form
2679A16981j0313R469R8572R4050Q174j05423K3298J9353k0319O23O4437m620
2667B94282n5161o194l6783k3397k5871O7395N9746q6174j4434N066m2989l0031
2655A05455J5677j2396Q7213P491J942M1467q2168j8325N8585N0869m2832M148
2643B17126l8803n6430l0611P4118P3524l9255q0068N5102K7400q0658l8166m292
2631G8987k3433L2185O4376l5325M3228l4313j7389m2744N7110p2427K1511J3475
2619H5241P8073R072J7055J01555p3340j29238l7274r853N741J01724m2378M330
2607A10708J7544p000R4769n8518n668K624r957K1952l4413K4548m393n6725j5516
2594G9955N0799n2934j5116k2529k6169K9100m4261j3588M7047n2802M1531N5118
$$ plain form
2582 76151 127836 275375 203805 136989 163261 82338 68233 65192 89241 117069 134533 163216
2570 163216 96758 104678 79360 44277 104718 128192 68796 159465 160958 111432 140125 105231
2558 105231 26717 116755 83398 35814 100461 104657 80013 96553 136341 57700 107372 182270
2546 182270 112910 54749 27570 -40346 -41439 72540 136478 117927 113064 100170 143641 156527
2534 156527 106182 116332 28447 44171 65638 -19555 -6115 32942 8701 53802 71300 17281
2522 17281 89464 60526 72391 70211 41964 99622 145527 160300 92905 63671 110177 63879
2510 63879 38115 64220 83671 143168 76091 60558 42348 43154 105945 54975 70897 70767 62168
2497 62168 -11435 91308 106823 54477 26099 -32926 -3645 -9110 34714 62381 95504 118352
$$ packed form
2582G6151N1685J47539p1570o6816K6272q0923j4105l041K4049K7828J7464K8683
2570A63216o6458P920k5318l5083O0441K3474n9396R0669J493m9526K8693l4894
2558A05231p8514R0038l3357m7584O4647M196k4644J6540L9788p8641M9672P4898
2546A82270o9360n8161k7179o7916j093J13979O3938j8551m863j2894M3471J2886
2534A56527n0345J0150q7885J5724K1467q5193J3440L9057k4241M5101J7498n4019
2522A7281P2183k8938J1865k180k8247N7658M5905J4773o7395k9234M6506m6298
2510F3879k5764K6105J9451N9497o7077j5533j8210Q06O2791n0970J5922j30q599
2497F2168p3603J02743J5515n2346k8378n9025K9281n465M3824K7667L3123K2848
$$ plain form
2485 118352 18016 42984 79382 132322 114506 91463 26004 -25998 21718 42412 73463
2474 73463 111626 69304 25270 -20221 48120 19630 -27560 19035 -590 15316 76984 -42987
2462 -42987 -37871 74884 93897 131082 84649 2760 62593 90867 113852 70174 13284 1947
2450 1947 63058 40999 -13945 -28988 30621 19101 -1732 40591 90613 39202 -8032 99815
2438 99815 206412 141540 101470 118634 84397 2123 -87519 -17338 -45509 28195 50460 -13222
2426 -13222 719 59917 43596 -11445 -24442 62626 89730 88221 18483 -26173 -2882 11929
2414 11929 68775 53920 46945 33486 -75236 -90519 -67261 -20566 43502 100923 51667 30907
2402 30907 54191 41220 120569 96782 68044 117355 31621 -57328 -34942 73508 128628 145763
$$ packed form
2485A18352j00336K4968L6398N2940j7816k3043o5459n2002M7716K0694L1051
2474G3463L8163m2322m4034m5491O8341k8490m7190M6595j9625J5906O1668j19971
2462d2987N116J12755J9013L7185m6433q1889N9833K8274K2985m3678n6890j1337
2450A947O1111k2059n4944j5043N9609j1520k0833M2323N0022n1411m7234J07847
2438I9815J06597o4872m0070J7164l4237q2274q9642P0181k8171P3704K2265o3682
2426a3222J3941N9198j6321n5041j2997Q7068K7104j509o9738m4656K3291J4811
2414A1929N6846j4855o975j3459j08722j5283K3258M6695O4068N7421m9256k0760
2402C0907K3284j2971P9349k3787k8738M9311q5734q8949K2386J08450N5120J7135
$$ plain form
2390 145763 116112 49501 34152 48596 -31904 35251 -58180 -42066 16961 40525 -14150 -12367
2378 -12367 -53638 947 37913 -11624 -4557 55409 -56860 -57613 -19587 25361 64673 -1620
2366 -1620 -20992 -21351 29809 19194 -9459 77853 122045 50269 54396 91068 -1497 -36432 -25525
2353 -25525 23802 52366 60986 116766 41134 -11980 6077 69442 110668 138144 117185 74016
2341 74016 -20639 -63646 -6154 82481 77549 -18736 -14603 839 -106265 -80031 -11585 -9811
2329 -9811 -13674 46217 -75148 -25452 44311 25012 56642 54962 20655 -18724 57877 96549
2317 96549 54952 111994 135592 102161 41643 59515 90051 74018 38035 76374 176533 221907
2305 221907 236170 182495 145266 132721 98817 62615 97780 104903 125981 118795 62979 135229
$$ packed form
2390A45763k9651o6611j5349J4444q0500O7155r3431J6114N9027K3564n4675J783
2378a2367m1271N4585L6966m9537P067N9966j12269p53L8026M4948L9312o6293
2366a620j9372l59N1160j0615k8653Q7312M4192p1776M127L6672r2565l4935J0907
2353b5525M9327K8564Q620N5780p5632n3114J8057O3365M1226K7476k0959m3169
2341G4016r4655m3007N7492Q8635m932r6285M133J5442j07104K6234O8446J774
2329i811l863N9891j21365M9696O9763j9299L1630j680l4307l9379P6601L8672
2317I6549m1597N7042K3598l3431o0518J7872L0536j6033l5983L8339J00159M5374
2305B21907J4263n3675l7229j2545l3904l6202L5165P123K1078p186n5816P2250
$$ plain form
2293 135229 87253 80312 155593 79464 5713 42922 77124 56284 75382 109136 44434 66221
2281 66221 64951 92935 47214 104102 58720 87071 41329 7804 474 55201 74897 -5534
2269 -5534 10945 37102 28400 54582 87213 68808 6253 -26647 -3117 41324 96853 76636
2257 76636 72590 103771 76774 135444 119883 -14305 3515 114482 144654 26253 27530 60268
2245 60268 80180 29358 -36472 29345 53232 105917 74138 13771 49179 133195 171159 116401
2233 116401 87184 17562 -13164 61645 31832 -6108 7847 40539 61272 81247 88084 84076
2221 84076 75364 43089 56675 -6521 -41838 -6187 -15597 -21466 -22112 -101270 21349 11070 53088
2208 53088 -19522 39785 93851 154062 86781 26973 70266 87653 113267 124468 42552 50282
$$ packed form
2293A35229m7976o941P5281p6129p3751L7209L4202k0840J9098L3754o4702K1787
2281F6221j270K7984m5721N6888m5382K8351m5742l3525p330N4727J9696q0431
2269e534J6479K6157q702K6182L2631j8405o2555l2900K3530M4441N5529k0217
2257G6636m046L1181k6997N8670j5561j34188J7820J10967L0172j18401J277L2738
2245F0268J9912n0822o5830O5817K3887N2685l1779o0367L5408Q4016L7964n4758
2233A16401k9217o9622l0726P4809k9813l7940J3955L2692K0733J9975O837m008
2221H4076q712l2275J3586o3196l5317L5651r410n869o46p9158J22619j0279M2018
2208E3088p2610N9307N4066O0211o7281n9808M3293J7387K5614J1201q1916P730
$$ plain form
2196 50282 68453 29496 45130 7079 2336 161836 118371 18520 124238 224194 281638 277536
2184 277536 202603 218732 199351 121640 184404 106198 182146 159738 27363 101485 83852
2173 83852 82093 115771 175976 122941 14929 63433 115531 191236 259263 167277 137024 110312
2161 110312 110415 197841 127743 155088 109613 233350 286962 286328 218249 175420 272288 256670
2149 256670 312058 312909 282622 289150 289044 285206 212796 318182 453095 438790 397440 413523
2137 413523 473020 460584 436937 438026 509928 487764 610548 624793 675151 725589 551866
2126 551866 607742 744769 760153 673660 612600 669660 750426 732633 717998 678862 616808
2115 616808 726164 724951 768916 784009 842359 875598 892274 967097 1060262 1115210 1067013 1058872
$$ packed form
2196E0282J8171l8957J5634l8051m743J59500m3465r9851J05718R9956N7444m102
2184B77536p4933J6129j9381p7711O2764p8206P5948k2408j32375P4122j7633
2173H3852j759L3678O0205n3035j08012M8504N2098P5705O8027r1986l0253k6712
2161A10312J03Q7426p0098K7345m5475J23737N3612o34o8079m2829R6868j5618
2149B56670N5388Q51l0287O528j06l838p2410J05386J34913j4305m1350J6083
2137D13523N9497j2436k3647J089P1902k2164J22784J4245N0358N0438j73723
2126E51866N5876J37027J5384q6493o1060N7060Q0766j7793j4635l9136o2054
2115F16808J09356j213M3965J5093N8350L3239J6676P4823R3165N4948m8197q141
$$ plain form
2103 1058872 1047227 1107037 1159760 1160421 1205958 1194359 1222386 1326073 1467307 1419166 1487490
2092 1487490 1653856 1821387 1971870 2060524 2181217 2208927 2345685 2527213 2695643 2833595
2082 2833595 3075930 3294363 3599651 3924358 4368804 4841625 5236528 5716839 6325206 7061306
2072 7061306 7922867 8909331 10165589 11770810 13778135 16367500 19521924 23910671 29398241
2063 29398241 29250967 24748963 20706500 17403505 14552380 11976027 10073438 8559054
2055 8559054 7636082 6861216 6269129 5840600 5603899 5230144 4707667 4278593 3917902 3615988
2045 3615988 3298551 2901898 2711507 2495298 2405976 2299624 2186403 2131014 2000642 1936583
2035 1936583 1938558 1879557 1793325 1728533 1589185 1543540 1489396 1379004 1360436 1347591 1161194
$$ packed form
2103A058872j1645N9810N2723O61M5537j1599K8027J03687J41234m8141O8324
2092A487490J66366J67531J50483Q8654J20693K7710J36758J81528J68430J37952
2082B833595K42335K18433L05288L24707M44446M72821L94903M80311O08367P36100
2072G061306Q61561R86464J256258J605221K007325K589365L154424M388747N487570
2063B9398241j47274m502004m042463l302995k851125k576353j902589j514384
2055H559054r22972p74866n92087m28529k36701l73755n22477m29074l60691l01914
2045C615988l17437l96653j90391k16209q9322j06352j13221n5389j30372o4059
2035A936583J975n9001q6232o4792j39348m5645n4144j10392j8568j2845j86397
$$ plain form
2024 1161194 1143282 1115378 1035727 1002389 959784 965271 912741 990493 993909 887549 785482
2013 785482 759669 828645 788416 713695 707586 696598 583776 592872 645905 690906 627357 571400
2001 571400 557130 488599 563307 469868 442158 402295 489185 480620 516186 449668 413110 455915
1989 455915 403883 411849 485097 405391 328663 339634 377128 379058 346784 222346 213670 278032
1977 278032 300166 235905 266814 275410 231438 227947 264695 287041 244029 241449 177375 161887
1965 161887 144088 155521 166963 181343 187746 192116 248979 143941 131684 141442 29964 83564
1953 83564 135398 213818 179608 84096 51012 165992 171832 104257 147849 166827 147915 116385
1941 116385 105748 48221 3135 59940 151468 176919 114582 113760 66046 84141 60200 2059
$$ packed form
2024A161194j7912k7904p9651l3338m2605N487n2530P7752L416j06360j02067
2013G85482k5813O8976m0229p4721o109j0988j12822R096N3033M5001o3549n5957
2001E71400j4270o8531P4708r3439k7710l9863Q6890q565L5566o6518l6558M2805
1989D55915n2032P966P3248p9706p6728J0971L7494J930l2274j24438q676O4362
1977B78032K2134o4261L0909Q596m3972l491L6748K2346m3012k580o4074j5488
1965A61887j7799J1433J1442J4380O403M370N6863j05038j2257R758j11478N3600
1953H3564N1834P8420l4210r5512l3084J14980N840o7575M3592J8978j8912l1530
1941A16385j0637n7527m5086N6805R1528K5451o2337q22m7714J8095k3941n8141
$$ plain form
1929 2059 29113 105530 69441 66063 90616 54170 -16629 11440 -11864 35967 99428 116316
1917 116316 118921 86778 143556 77226 35761 -10627 77323 47364 53986 48785 81955 144009
1905 144009 180459 166645 140559 123317 20278 62253 -13055 -40819 -2691 26719 36957
1894 36957 22617 67046 32184 18249 53416 87097 -11109 -34458 12790 -5940 -8666 -73627
1882 -73627 -34959 -36287 -112156 -23471 -22794 17466 29983 -28928 -28509 -7921 129081 130425 43041
1869 43041 18467 52217 43326 137869 89001 -8161 44009 20160 -112246 -66190 -4176 4524
1857 4524 -33453 -47754 -51052 12346 16895 40233 34513 58465 31982 7791 -22733 -25407 38364
1844 38364 100620 39707 -97950 -60041 -15133 19902 -49969 -50114 10578 33861 18653 82344
$$ packed form
1929B059K7054P6417l6089l378K4553l6446p0799K8069k3304M7831O3461J6888
1917A16316K605l2143N6778o6330m1465m6388Q7950k9959O622n201L3170O2054
1905A44009L6450j3814k6086j7242j03039M1975p5308k7764L8128K9410J0238
1894C6957j4340M4429l4862j3935L5167L3681r8206k3349M7248j8730k726o4961
1882g3627L8668j328p5869Q8685O77M0260J2517n8911M19K0588J37002J344q7384
1869D3041k4574L3750q891R4543m8868r7162N2170k3849j32406M6056O2014Q700
1857D524l7977j4301l298O3398M549K3338n720K3952k6483k4191l0524k674O3771
1844C8364O2256o0913j37657L7909M4908L5035o9871j45O0692K3283j5208O3691
$$ plain form
1832 82344 32868 39979 -30425 -35686 -33486 -84748 -79378 -20822 10991 27932 -1070 -45116 40008
1819 40008 73969 75135 73736 65898 101075 77684 578 65081 11340 40929 91505 46832
1807 46832 19712 -15569 -53167 -26521 -19048 -63509 -19123 43915 -37 -30122 -42398 -60872
1795 -60872 -104899 -37214 -68703 -38277 -76604 -104290 -34307 23015 54312 24627 -11349 -48599
1783 -48599 -79883 -31077 -7779 -69896 -93760 -63321 39235 -73068 -14569 17726 6946
1772 6946 2121 22524 52494 39873 16183 -19492 -24958 -48606 -81764 14340 -32443 -64
1760 -64 -62480 -58328 -98660 -59321 -122275 -76367 -61268 -65853 27404 -32013 22945 14153 -63494
1747 -63494 -24845 -31640 -24608 -7455 -36687 -56594 -50858 -53609 -83695 -56378 -14062 -36644 -64600
$$ packed form
1832H2344m9476P111p0404n261K200n1262N370N8556L1813J6941k9002m4046Q5124
1819D0008L3961J166j399p838L5177k3391p7106O4503n3741K9589N0576m4673
1807D6832k7120l5281l7598K6646P473m4461M4386O3038m3952l0085j2276j8474
1795f0872m4027O7685l1489L0426l8327k7686O9983N7322L1297k9685l5976l7250
1783d8599l1284M8806K3298o2117k3864L0439J02556j12303N8499L2295j0780
1772F946m825K0403K9970j2621k3690l5675n466k3648l3158R6104m6783L2379
1760f4o2416M152m0332L9339o2954M5908J5099m585R3257n9417N4958q792p7647
1747f3494L8649o795P032J7153k9232j9907N736k751l0086K7317M2316k2582k7956
$$ plain form
1734 -64600 26798 -2068 -43955 -83819 -78103 -109151 -7216 -1981 38354 -109452 -9950 56414
1722 56414 -10709 4916 5744 -2401 45959 -42993 -100817 -83360 -69366 -4147 84708 15541
1710 15541 -32007 3384 -44273 -43179 -124000 -131074 -142491 4557 -10863 -65146 52624 5022
1698 5022 2534 -13481 -25091 -52994 -48327 39465 -37526 -49806 -136081 -151456 -80960 49213
1686 49213 142821 62021 7655 -26236 -41951 -15906 7903 34909 -17541 -10670 -18782 16931
1674 16931 -11761 -35084 -79118 -20016 15517 67862 21338 -54725 -35626 36600 48162 14786
1662 14786 43534 57563 41251 56489 4550 -46500 -41402 -62391 -20601 -22816 32443 -138
1650 -138 -95724 -128206 -76215 -86580 -70768 -108681 -88668 -89105 -31169 -14313 18834 37052 -41488
$$ packed form
1734f4600R1398k8866m1887l9864N716l1048J01935N235M0335j47806R9502O6364
1722E6414o7123J5625Q28q145M8360q8952n7824J7457J3994O5219Q8855o9167
1710A5541m7548L5391m7657J094q0821p074j1417J47048j5420n4283J17770m7602
1698E022k488j6015j1610k7903M667Q7792p6991j2280q6275j5375P0496J30173
1686D9213R3608q0800n4366l3891j5715K6045K3809K7006n2450O871q112L5713
1674A6931k8692k3323m4034N9102L5533N2345m6524p6063J9099P2226J1562l3376
1662A4786K8748J4029j6312J5238n1939n1050N098k0989M1790k215N5259l2581
1650a38r5586l2482N1991j0365J5812l7913K0013m37N7936J6856L3147J8218p8540
$$ plain form
1637 -41488 -142969 -47616 -96798 -103050 -35766 -141171 -127060 -40228 -37440 -85981 -123814 -130545
1625 -130545 -139756 -2554 18418 6427 -33724 -26170 123304 29824 -99754 -57175 18852
1614 18852 18679 82583 105500 82414 82190 58560 18978 32552 447 -18176 -5683 55453 -12481
1601 -12481 45891 -15023 22294 40399 -53301 -37012 -39599 -108725 -30053 -47685 -77955 -17025
1589 -17025 -9496 48245 -10403 -29173 22779 7203 -43739 -132432 -73535 52018 67422 66569
1577 66569 66760 27276 243 -10524 -96428 -40335 -40924 -92263 -145844 8706 99681 8453
1565 8453 7842 60597 31113 -19040 -33589 -63811 -97356 -89868 -122445 -75997 1122 10777 -14803
1552 -14803 36050 28775 -94382 -78916 6306 -16700 -35027 -74562 -175181 -179724 -63227 -22369
$$ packed form
1637d1488j01481R5353m9182o252O7284j05405J4111Q6832K788m8541l7833o731
1625a30545r211J37202K0972j1991m0151P554J49474r3480j29578M2579P6027
1614A8852j73O3904K2917k3086k24k3630l9582J3574l2105j8623J2493O1136o7934
1601a2481N8372o0914L7317J8105r3700J6289k587o9126P8672j7632l0270O0930
1589a7025P529N7741n8648j8770N1952j5576n0942q8693N8897J25553J5404q53
1577F6569J91l9484k7033j0767q5904N6093n89n1339n3581J54550R0975r1228
1565H453o11N2755k9484n0153j4549l0222l3545P488l2577M6448P7119R655k5580
1552a4803N0853p275j23157J5466Q5222k3006j8327l9535j00619m543J16497M0858
$$ plain form
1540 -22369 -17695 -112754 -48423 -24007 -63063 54219 131660 125004 72935 -27515 -65400 -97519
1528 -97519 -121138 -84555 -44656 -43857 -1831 -5463 -10168 -8062 -30761 -14219 -62205 -52465 -41138
1515 -41138 -62302 -39861 6916 79556 27454 -1541 -15144 16079 30971 -27032 -90388 -35169
1503 -35169 50134 -52286 -840 -25345 -20391 -80440 21040 -32156 -46855 -5088 -67568 -69510
1491 -69510 -19187 -3994 133755 65127 24218 -68742 -82908 -140059 -111492 -55475 -54224 37113
1479 37113 -13022 37657 16951 -77844 29594 61617 -48066 23392 31223 -48609 -54302 -55428
1467 -55428 -38640 -76193 6370 11162 18520 -53729 -20864 28345 -44323 7609 35469 43113
1455 43113 -107382 4338 -50477 -83492 -136576 -71843 17422 15018 13898 58746 25785 1886
$$ packed form
1540b2369M674r5059O4331K4416l9056J17282P7441o656n2069j00450l7885l2119
1528i7519k3619L6583L9899P99M2026l632m705K106k2699J6542m7986R740J1327
1515d1138k1164K2441M6777P2640n2102k8995j3603L1223J4892n8003o3356N5219
1503c5169Q5303j02420N1446k4505M954o0049J01480n3196j4699M1767o2480j942
1491f9510N0323J5193J37749o8628m0909r2960j4166n7151K8567N6017J251R1337
1479C7113n0135N0679k0706r4795J07438L2023j09683P1458P831p9832n693j126
1467e5428J6788l7553Q2563M792P358p2249L2865M9209p2668N1932K7860P644
1455D3113j50495J11720n4815l3015n3084O4733Q9265k404j120M4848l2961k3899
$$ plain form
1443 1886 19085 45048 -27358 -51511 53863 35287 -70634 -72008 -53231 -51114 -91400 -35718
1431 -35718 34872 -53587 -110406 -110258 -4101 80575 20285 -117749 -143644 -109513 -221 43419
1419 43419 -37475 -76402 -105327 1133 22787 -108672 -104509 -60078 -21387 -78575 -89441 -114275
1407 -114275 -45452 -65053 -127034 -116445 7097 -74649 -61373 22559 -65455 -55430 67639
1396 67639 41590 -80190 -19705 -56825 -8315 -7398 16339 14993 60398 38868 25100 35586
1384 35586 -24491 -90451 21971 5442 12864 -16857 -39933 21680 -22162 4395 -16433 -35572
1372 -35572 -104543 -16547 44560 15763 -23305 -77267 -48166 -65390 5559 -68639 -38902 -71479
1360 -71479 -83091 -66089 -45341 -38390 21439 114349 71807 -28759 -31993 -45052 -2381 9639
$$ packed form
1443A886J7199K5963p2406k4153J05374j8576j05921j374J8777K117m0286N5682
1431c5718P0590q8459n6819J48J06157Q4676o0290j38034k5895L4131J09292M3640
1419D3419q0894l8927k8925J06460K1654j31459M163M4431L8691n7188j0866k4834
1407a14275O8823j9601o1981J0589J23542q1746J3276Q3932q8014J0025J23069
1396F7639k6049j21780O0485l7120M8510R17K3737j346M5405k1530j3768J0486
1384C5586o0077o5960J12422j6529P422k9721k3076O1613m3842K6557k0828j9139
1372c5572o8971Q7996O1107k8797l9068n3962K9101j7224P0949p4198K9737l2577
1360g1479j1612J7002K0748O951N9829R2910m2542j00566l234j3059M2671J2020
$$ plain form
1348 9639 -108248 -56610 14751 16189 -4118 -66036 -78734 -19323 -87342 -25589 13044 30900
1336 30900 24093 -48552 -78784 -124631 -42305 59081 52538 23488 25692 140669 40314 9218
1324 9218 -9014 103212 14418 -55425 -1447 36469 10364 39432 131448 63687 17024 -23696
1312 -23696 74296 71096 -42511 -3429 -13670 46662 65800 65257 -43756 -70032 -23445 51901
1300 51901 40513 -19535 9532 -49496 -43329 17233 72415 68031 36339 -3637 42224 -6163
1288 -6163 -10164 -20059 -100611 -62207 -74329 -154111 -104652 -83209 -83111 -63499 44542 -38700 -81901
1275 -81901 -63407 -8443 -38442 14777 73022 1942 15869 61703 26575 15717 42133 -38053
1263 -38053 -14000 -6662 8075 56690 62448 -8360 64593 -44023 -9175 72001 57606 -82314
$$ packed form
1348I639j17887N1638P1361J438k0307o1918j2698N9411o8019O1753L8633J7856
1336C0900o807p2645l0232m5847Q2326J01386o543k9050K204J14977j00355l1096
1324I218j8232J12226q8794o9843N3978L7916k6105K9068R2016o7761m6663m0720
1312b3696R7992l200j13607L9082j0241O0332J9138n43j09013k6276M6587P5346
1300E1901j1388o0048K9067n9028O167O0562N5182m384l1692l9976M5861m8387
1288f163m001r895q0552L8404j2122p9782M9459K1443R8J9612J08041q3242m3201
1275h1901J8494N4964k9999N3219N8245p1080J3927M5834l5128j0858K6416q0186
1263c8053K4053P338J4737M8615N758p0808P2953j08616L4848Q1176j4395j39920
$$ plain form
1251 -82314 -132060 -79675 -69979 -17390 -20841 -68230 13209 15475 -112658 10650 100322 -10161
1239 -10161 -1172 14454 -69351 29963 25782 -2904 41109 -9686 51530 60863 7588 25852
1227 25852 118681 89846 -31116 -45421 -23104 24783 5224 83142 47587 80986 -35179
1216 -35179 -49898 -35967 -34744 1355 -17341 34299 -82033 -92471 -15467 403 -29953 -78982
1204 -78982 -107281 -75957 -34456 -16490 -62195 -45093 -41472 -52015 26532 64209 66252 59584
1192 59584 15187 37675 32753 -52397 25012 -95459 -111062 14266 102838 60998 -22905 -48271
1180 -48271 -76275 -27999 31820 -28249 -30940 -25814 4299 8452 16870 56783 -13544 -28916 -277
1167 -277 -29281 -40620 -66705 -57719 -24225 68883 65728 94314 24028 -74389 42563 38414 42309
$$ packed form
1251h2314m9746N2385R696N2589l451m7389Q1439K266j28133J23308Q9672j10483
1239a0161Q989J5626q3805R9314m181k8686M4013n0795O1216R333n3275J8264
1227B5852R2829k8835j20962j4305K2317M7887j9559P7918l5555L3399j16165
1216c5179j4719J3931J223L6099j8696N1640j16332j0438P7004J5870l0356m9029
1204g8982k8299L1324M1501J7966m5705J7102L621j0543P8547L7677K043o668
1192E9584m4397K2488m922q5150P7409j20471j5603J25328Q8572m1840q3903k5366
1180d8271k8004M8276N9819o0069k691N126L0113M153Q418L9913p0327j5372K8639
1167b77k9004j1339k6085Q986L3494R3108l155K8586p0286r8417J16952m149L895
$$ plain form
1154 42309 -32025 -71296 -110301 -87019 -68256 -34844 -15623 -124746 -151664 -52142 -90476 -35952
1142 -35952 -7404 16945 24603 -67105 -57626 16632 21379 60928 49556 -62248 -136115 -93207
1130 -93207 -32218 -137238 -59702 -78747 -20162 -10340 -40840 -21531 -68068 14239 -24314 16314
1118 16314 5857 -44553 -54435 6315 -48087 -28689 8029 78965 54075 57012 43068 -62320
1106 -62320 -48884 -94852 -126297 -148856 -136610 -14270 -6112 -23577 16975 8711 -51380 -23097
1094 -23097 -107541 -80530 101851 44424 57540 92122 96578 52175 98539 -9808 -20409 103492
1082 103492 98007 37951 -8540 12999 60234 -4159 -38201 -28577 -109398 -55890 -60282 51605
1070 51605 142718 -56892 -34976 -22590 -85110 -46932 -106106 -94304 -51368 -115455 -149290 -205587
$$ packed form
1154D2309p4334l9271l9005K3282J8763L3412J9221j09123k6918R9522l8334N4524
1142c5952K8548K4349P658r1708R479P4258M747L9549j1372j11804p3867M2908
1130i3207O0989j05020P7536j9045N8585R822l0500J9309m6537Q2307l8553M0628
1118A6314j0457n0410r882O0750n4402J9398L6718P0936k4890K937j3944j05388
1106f2320J3436m5968l1445k2559J2246J22340Q158j7465M0552q264o0091K8283
1094b3097q4444K7011J82381n7427J3116L4582M456m4403M6364j08347j0601J23901
1082A03492n485o0056m6491K1539M7235o4393l4042R624q0821N3508m392J11887
1070E1605R1113j99610K1916J2386o2520L8178n9174J1802M2936o4087l3835n6297
$$ plain form
1058 -205587 -148429 -108593 -96763 42949 66208 -91591 -50555 -11808 -91163 -78454 14861
1047 14861 -62546 -42139 -45866 -17787 -8240 -657 -10241 -100073 -74439 -50453 -27468 -15782 -26137
1034 -26137 -62301 -77696 -31696 19264 -10420 -7308 19580 110727 12053 -73164 -5914 -26961
1022 -26961 -45352 -75653 -900 99485 -26699 -77120 -57768 81983 -95092 -106740 -53676
1011 -53676 -112796 -104764 -23484 16734 -50502 -14175 -29476 42239 -31846 -71126 -113497 -73611
999 -73611 -73172 -103676 25228 11986 59742 21723 -69768 -105843 -39331 -48607 10215 26023
987 26023 52244 18451 48615 50048 -3719 28513 23518 -20708 -73382 -23744 -40861 -60447
975 -60447 -80765 -4501 -19256 -63259 -15177 -55865 -42239 -61557 -72466 -121788 -134312 -31710
$$ packed form
1058b05587N7158L9836J1830J39712K3259j57799M1036L8747p9355J2709R3315
1047A4861p7407K0407l727K8079R547P583r584q9832K5634K3986K2985J1686j0355
1034b6137l6164j5395M6000N0960k9684L112K6888R1147r8674q5217O7250k1047
1022b6961j8391l0301P4753J00385j26184n0421J9352J39751j77075j1648N3064
1011e3676n9120Q032Q1280M0218o7236L6327j5301P1715p4085l9280m2371L9886
999g3611M39l0504J28904j3242M7756l8019r1491l6075O6512r276N8822J5808
987B6023K6221l3793L0164J433n3767L2232m995m4226n2674M9638j7117j9586
975f0447k0318P6264j4755m4003M8082m0688J3626j9318j0909m9322j2524J02602
$$ plain form
963 -31710 16852 1514 -52862 -29419 25386 76070 7166 -98326 -64008 44180 -6299 27461
951 27461 71915 22412 24907 86556 -4587 -43217 -57218 -15418 26225 -28831 -25828 -3128
939 -3128 -15758 -42038 42378 90556 24968 32763 54398 -35612 12398 87931 -44386 -30501
927 -30501 -53370 -28655 29943 48981 -27910 -14303 14435 -92140 -100266 -5549 7788 -58049
915 -58049 -86996 -22105 -6299 -12146 -50272 34959 63452 -10361 -42156 -28679 -10885 -32236
903 -32236 -14093 43505 -4639 18547 69216 1530 10001 55981 -22492 -35194 -28296 -103158
891 -103158 -15840 -13242 -9774 -81760 -37301 10667 -13082 -77033 -48280 -16341 32938 11734
879 11734 -34511 -7253 -34976 -102808 -34785 17604 33956 49194 50748 19328 -55885 -4619
$$ packed form
963c1710M8562j5338n4376K3443N4805N0684o8904j05492L4318J08188n0479L3760
951B7461M4454m9503K495O1649r1143l8630j4001M1800M1643n5056L003K2700
939c128j2630k6280Q4416M8178o5588P795K1635r0010M8010P5533j32317J3885
927c0501k2869K4715N8598J9038p6891J3607K8738j06575q126R4717J3337o5837
915e8049k8947O4891J5806n847l8126Q5231K8493p3813l1795J3477J7794k1351
903c2236J8143N7598m8144K3186N0669o7686Q471M5980p8473j2702O898p4862
891a03158Q7318K598L468p1986M4459M7968k3749o3951K8753L1939M9279k1204
879A1734m6245K7258k7723o7832O8023N2389J6352J5238J554l1420p5213N1266
$$ plain form
867 -4619 9462 -62689 -51269 -78833 24664 -35694 -41100 106181 108277 107164 62298 44534
855 44534 -60233 32957 67035 28627 24264 12086 56682 52924 -33476 -30251 33530 48534
843 48534 71393 -6954 -98519 -88003 -56029 -116865 -70354 -76550 -43452 6474 -36371 -27364
831 -27364 11468 -67432 -145098 -158251 25558 60548 -39494 -64331 -82795 35578 5903
820 5903 29534 -27247 -72355 -55227 -5282 -7998 -49298 -127374 -28499 -13920 16484 102700
808 102700 83807 12745 35875 32361 28658 19655 -8416 44861 -24961 14974 -28456 -32105 -31175
795 -31175 14857 -42482 -40458 64274 20934 -106400 -138724 -80588 6748 42124 68358 36399
783 36399 18032 -22989 5444 21497 -56475 -64203 -73713 -85112 -34760 -26255 -56841 -80449 -33423
$$ packed form
867d619J4081p2151J1420k7564J03497o0358n406J47281K096j113m4866j7764
855D4534j04767R3190L4078l8408m363j2178M4596l758q6400L225O3781J5004
843D8534K2859p8347r1565J0516L1974o0836M6511o196L3098M9926m2845R007
831b7364L8832p8900p7666j3153J83809L4990j00042k4837j8464J18373k9675
820E903K3631n6781m5108J7128M9945k716m1300p8076R8875J4579L0404Q6216
808A02700j8893p1062K3130l514l703r003k8071N3277o9822L9935m3430l649R30
795c1175M6032n7339K024J04732m3340j27334l2324N8136Q7336L5376K6234l1959
783C6399j8367m1021K8433J6053p7972p728r510j1399N0352Q505l0586k3608M7026
$$ plain form
770 -33423 -77430 -62049 29196 57215 87769 93693 77945 110914 8613 -84247 -18753 39344
758 39344 28676 32569 21652 -27964 -39460 -50803 -58359 -62508 -89859 -62087 80043 4326
746 4326 -29176 -21572 36594 35126 -2768 14712 -22 19006 -9268 58760 55876 70351 42001
733 42001 11110 6216 -2477 40783 -73618 -40133 -14546 -70734 -11002 69725 107414 106746 136001
720 136001 97103 17169 3923 17316 26921 21119 -26120 49020 98405 -13974 49650 92161
708 92161 -37382 28716 156178 20853 93690 44384 -11077 -12954 81473 109799 67698 16060
696 16060 8801 8235 67940 116340 39522 -24762 -24525 -20484 12654 3985 25763 -41341 -45746 -45449
682 -45449 -61302 -73546 -50148 -33021 -116213 -65685 61775 1292 34050 73738 25317 58877
$$ packed form
770c3423m4007J5381R1245K8019L0554N924j5748L2969j02301r2860O5494N8097
758C9344j0668L893j0917m9616j1496j1343p556m149k7351K7772J42130p5717
746D326l3502P604N8166j468l7894J7480j4734J9028k8274O8028k884J4475k8350
733D2001l0891m894q693M3260j14401L3485K5587n6188N9732Q0727L7689o68K9255
720A36001l8898p9934j3246J3393R605n802m7239P5140M9385j12379O3624M2511
708I2161j29543O6098J27462j35325P2837m9306n5461j877R4427K8326m2101n1638
696A6060p259n66N9705M8400p6818o4284K37M041L3138q669K1778o7104m405K97
682d5449j5853j2244K3398J7127q3192N0528J27460o0483L2758L9688m8421L3560
$$ plain form
670 58877 68679 32928 44004 -51553 -101079 -22920 -34562 60585 67916 43964 100143 25791
658 25791 48914 48909 -42214 20607 -28769 -6548 -15424 29650 618 -86830 15174 82759 43873
645 43873 3959 5044 6346 11960 64991 -21232 63523 1223 54899 81822 90914 62170 21982
632 21982 11394 42949 -39859 37517 76315 -16436 61361 24035 -21370 57021 204754 152466
620 152466 13471 -93985 -18274 93366 41848 -64992 -39874 50557 -47834 42402 146539
609 146539 111804 60266 65029 18408 -28383 10101 27253 -20298 -29668 9614 113361 78260
597 78260 69409 144010 68775 27784 134118 75548 33640 97288 101324 111695 51002 44340
585 44340 26467 -13542 -204 -11932 -88196 -21120 25052 14581 67071 19213 -6711 65313
$$ packed form
670E8877R802l5751J1076r5557m9526P8159j1642R5147P331k3952N6179p4352
658B5791K3123nr1123O2821m9376K2221q876M5074k9032q7448J02004O7585l8886
645D3873l9914J085J302N614N3031q6223Q4755o2300N3676K6923R092k8744m0188
632B1982j0588L1555q2808P7376L8798r2751P7797l7326m5405P8391J47733n2288
620A52466j38995j07456P5711J11640n1518j06840K5118R0431r8391R0236J04137
609A46539l4735n1538M763m6621m6791L8484J7152m7551r370L9282J03747l5101
597G8260q851P4601p5235m0991J06334n8570m1908O3648M036J0371o0693o662
585D4340j7873m0009J3338j1728p6264O7076M6172j0471N2490m7858k5924P2024
$$ plain form
573 65313 -3931 -53138 -73342 -69032 -9213 -45615 18561 35573 35704 31961 92481 20767 38202
560 38202 -4899 -19553 11620 -59997 60724 33002 74508 60206 56574 26402 88929 -3987
548 -3987 -76035 28344 41302 116363 116687 53195 104772 39511 62047 -15337 40323 42764 60289
535 60289 -4350 -46606 63703 -17409 48297 93988 -6934 7144 -1942 -39457 -19315 -14595
523 -14595 -72371 -71381 -128235 55565 20217 -33067 -20132 10122 15089 -78959 -63798 2456
511 2456 -33611 25389 96033 46312 -9924 60803 30970 33477 72911 23134 15732 -20625 -6673
498 -6673 54157 48988 -4490 -25725 -16427 548 -29360 84668 152970 90061 7397 -359 -28331
485 -28331 62087 -141 34638 -28678 11507 131709 81354 -16393 7421 -13462 -24755 -12217
$$ packed form
573F5313o9244m9207k0204M310N9819l6402O4176J7012J31l743O0520p1714J7435
560C8202m3101j4654L1173p1617J20721k7722M1506j4302l632l0172O2527r2916
548c987p2048J04379J2958P5061L24o3492N1577o5261K2536p7384N5660K441J7525
535F0289o4639m2256J10309q1112O5706M5691j00922J4078r086l7515K0142M720
523a4595n7776R90n6854J83800l5348n3284J2935L0254M967r4048J5161O6254
511B456l6067N9000P0644m9721n6236P0727k9833K507L9434m9777p402l6357J3952
498f673O0830n169n3478k1235R298J6975k9908J14028O8302o2909q2664p756k7972
485b8331R0418o2228L4779o3316M0185J20202n0355r7747K3814k0883j1293J2538
$$ plain form
473 -12217 44227 -11441 26076 12401 17396 81543 197320 147677 100907 55298 20418 13914
461 13914 5139 14217 -63690 -72254 21771 2007 30459 -2318 -58606 22336 6499 115033
449 115033 97321 60286 72869 66845 40532 4859 -10339 23134 -55 -67634 -81837 -44133
437 -44133 -58614 -21685 45281 77594 26425 2669 -8731 23332 20854 78806 89199 52680
425 52680 67839 38583 23865 40047 -76324 -75084 63567 20313 57233 110136 79070 32008
413 32008 15676 80110 115658 -9304 -30142 63961 12667 7172 -30902 29536 19052 -6531
401 -6531 -23789 5704 87700 -70598 -50640 27629 -50437 -129326 -75205 85879 161727 99708
389 99708 43325 77275 61640 67169 47829 -22679 -20595 -37695 18418 71930 34420 45246
$$ packed form
473a2217N6444n5668L7517j3675M995O4147J15777m9643m6770m5609l4880o504
461A3914q775R078p7907q564R4025j9764K8452l2777n6288Q0942j5837J08534
449A15033j7712l7035J2583o024k6313l5673j5198L3473k3189o7579j4203L7704
437d4133j4481L6929O6966L2313n1169k3756j1400L2063k478N7952J0393l6519
425E2680J5159k9256j4718J6182j16371J240J38651m3254L6920N2903l1066m7062
413C2008j6332O4434L5548j24962k0838R4103n1294n495l8074O0438j0484k5583
401f531j7258K9493Q1996j58298J9958P8269p8066p8889N4121J61084P5848o2019
389I9708n6383L3950j5635N529j9340p0508K084j7100N6113N3512l7510J0826
$$ plain form
377 45246 43000 111197 83135 40679 -377 -509 30777 -8835 23855 -19941 16041 11910 31354
364 31354 37286 74537 115070 109874 122976 94623 61222 121432 174457 27512 33709 90603
352 90603 71539 92696 46638 4256 -60051 3525 -9996 50047 -16511 -111656 -32384 -40102
340 -40102 16664 160151 125703 5739 5838 -39905 -66733 -59142 21449 -3475 -46324 13327
328 13327 66687 22099 27085 54803 44371 11239 -66578 -8690 -9877 8147 58256 31714
316 31714 48333 72036 -4307 -40235 -43527 -5607 29497 54335 8120 -11145 -38743 -22843
304 -22843 147178 182032 187452 118281 114520 -13507 -12953 73289 68232 12307 6406 25177 25209
291 25209 -56865 -82419 -43743 -69293 68162 67294 129403 49186 -16566 -11132 24824 87739
$$ packed form
377D5246k246O8197k8062m2456m1056j32L1286l9612L2690m3796L5982m131J9444
364C1354N932L7251M0533n196J3102k8353l3401O0210N3025j46945O197N6894
352I0603j9064K1157m6058m2382o4307O3576j3521O0043o6558r5145P9272p718
340d0102N6766J43487l4448j19964R9m5743k6828P591Q0591k4924m2849N9651
328A3327N3360m4588M986K7718j0432l3132p7817N7888j187J8024N0109k6542
316C1714J6619K3703p6343l5928l292L7920L5104K4838m6215j9265k7598J5900
304b2843J70021L4854N420o9171l761j28027N54Q6242n057n5925n901J8771L2
291B5209q2074k5554L8676k5550J37455q68O2109q0217o5752N434L5956O2915
$$ plain form
279 87739 -29345 64829 55710 3370 87851 89057 -14244 -28218 27871 -18021 -10119 -2508
267 -2508 -60798 1791 -43893 8861 -5090 -48912 -40672 -16121 25912 80128 -37978 -1222
255 -1222 21638 54828 113069 33026 -5452 -29265 25808 86666 81102 72333 112467 48581 33207
242 33207 -7137 27686 83896 28858 60173 63630 75398 34648 -56510 -12956 57174 21884
230 21884 20428 98485 92793 27159 53442 58943 -6403 7141 12769 62803 124936 76589 -35588
217 -35588 54219 63524 117697 33668 53806 67889 50537 17061 1124 27011 70973 19772
205 19772 22657 21196 80071 69442 87045 53875 21732 70452 -29636 -23617 -40604 52625
193 52625 123489 101782 99413 91035 72054 36741 41878 89330 33102 44764 27074 -20102 34596
$$ packed form
279H7739j17084R4174r119n2340Q4481J206j03301j3974N6089m5892P902P611
267b508n8290O2589m5684N2754j3951m3822Q240K4551M2033N4216j18106L6756
255a222K2860L3190N8241q0043l8478k3813N5073O0858n564q769M0134o3886j5374
242C3207m0344L4823N6210n5038L1315L457J1768m0750r1158M3554P0130l5290
230B1884j456P8057n692o5634K6283N501o5346J3544N628N0034O2133m8347j12177
217c5588Q9807R305N4173q4029K0138J4083j7352l3476j5937K5887M3962n1201
205A9772K885j461N8875j0629J7603l3170l2143M8720j00088O019j6987R3229
193E2625P0864k1707k369q378j8981l5313N137M7452n6228J1662j7690m7176N4698
$$ plain form
180 34596 57647 -5633 56386 51396 20391 4682 64907 15557 -119785 771 80856 107890
168 107890 143871 45429 51201 3322 11607 35750 -46310 -7019 13936 -12928 -48080 -30825
156 -30825 34000 38203 37758 74719 88386 9279 -84677 -46803 -24267 -10338 38582 49600 33055
143 33055 36204 47145 40873 92179 77342 54457 57691 121727 136767 126000 133866 66480 72696
130 72696 65073 72506 50501 37868 12654 -4884 -15327 32200 17194 45435 22018 -7364
118 -7364 -56004 -38731 -10162 58995 62903 -192 32761 23102 -16694 -51118 17885 16822 13610
105 13610 142341 110447 51097 59226 7820 25439 -7348 50808 60359 58313 95255 8476
93 8476 52662 86256 14791 61250 43789 33737 2738 -421 -1742 -35430 28836 31033 39037
$$ packed form
180C4596K3051o3280O2019m990l1005j5709O0225m9350j35342J20556Q0085K7034
168A07890L5981r8442N772m7879Q285K4143q2060L9291K0955k6864l5152J7255
156c0825O4825M203m45L6961J3667p9107r3956L7874K2536J3929M8920J1018j6545
143C3055L149J0941o272N1306j4837k2885L234O4036J5040j0767P866o7386O216
130G2696p623P433k2005j2633k5214j7538j0443M7527j5006K8241k3417k9382
118g364m8640J7273K8569O9157L908o3095L2953r659l9796l4424O9003j063l212
105A3610J28731l1894n9350Q129n1406J7619l2787N8156R551k046L6942q6779
93H476M4186L3594p1465M6459j7461j0052l0999l159j321l3688O4266K197Q004
$$ plain form
80 39037 86124 103390 104471 23869 31736 2801 40135 40498 36188 52143 135747 109239 40847
67 40847 -1113 -23781 22954 97023 59752 13810 -11553 358 8094 50046 50757 7963 57443
54 57443 43580 37844 60050 59573 7335 29054 44498 39479 66618 79586 84043 54296 60488
41 60488 55020 72632 51276 17265 -54 26958 86349 142145 75383 63162 46815 18504
29 18504 38755 -11806 -7086 42589 80873 128930 88707 15014 12712 -41990 9284 27179 38931
16 38931 42763 16849 -15544 23954 86338 157616 62563 58452 35845 67322 10474 63283 25877
3 25877 26213 61637 38135
0 38135
$$ packed form
80C9037M7087J7266J081q0602P867k8935L7334L63m310J5955Q3604k6508o8392
67D0847m1960k2668M6735P4069l7271m5942k5363J1911P736M1952P11m2794M9480
54E7443j3863n736K2206m77n2238K1719J5444n019K7139J2968M457k9747O192
41F0488n468J7612k1356l4011j7319K7012N9391N5796o6762j2221j6347k8311
29A8504K0251n0561M720M9675L8284M8057m0223p3693k302n4702N1274J7895J1752
16C8931L832k5914l2393L9498O2384P1278r5053m111k2607L1477n6848N2809l7406
3B5877L36L5424k3502
0C8135
$$ Imaginary data points
##PAGE= N=2
##DATA TABLE= (X++(I..I)), XYDATA
$$ plain form
16383 -2332251 -2263039 -2226019 -2169686 -2162787 -2138494 -2106645 -1987944 -1978586 -2013678 -2022798 -1952336 -1917418
$$ packed form
16383b332251O9212L7020N6333O899K4293L1849J18701R358l5092r120P0462L4918
$$ [...]
##END NTUPLES=NMR SPECTRUM
##END=
