##TITLE=1H_EC-3253(IV-2)
 CDCl3, 8 sc, 
 29.06.2021
##JCAMPDX= 6.0         $$ Bruker NMR JCAMP-DX V2.0
##DATA TYPE= NMR SPECTRUM
##DATA CLASS= NTUPLES
##ORIGIN= UXNMR, Bruker Analytische Messtechnik GmbH
##OWNER= root
$$ XWIN-NMR		Version 3.5
$$ Tue Jun 29 10:12:49 2021 Russian Standard Time (UT+4h)  she@DPX200
##.OBSERVE FREQUENCY= 200.131506
##.OBSERVE NUCLEUS= ^1H
##.ACQUISITION MODE= SIMULTANEOUS
##.ACQUISITION SCHEME= undefined
##.AVERAGES= 8
##.DIGITISER RES= 18
##SPECTROMETER/DATA SYSTEM= spect
##.PULSE SEQUENCE= zg30
##.SOLVENT NAME= CDCl3
##.SHIFT REFERENCE= (INTERNAL, CDCl3, 0, 17.5093)
##AUDIT TRAIL= $$ (NUMBER, WHEN, WHO, WHERE, WHAT)
$$ ##TITLE= Audit trail, XWIN-NMR		Version 3.5
$$ ##JCAMPDX= 5.01
$$ ##ORIGIN= Bruker BioSpin GmbH
$$ ##OWNER= she
$$ F:/spectra/data/she/nmr/H-F/1/pdata/1/auditp.txt
$$ ##AUDIT TRAIL=  $$ (NUMBER, WHEN, WHO, WHERE, WHAT)
(   1,<2021-06-29 10:11:32.40 +0400>,<she>,<DPX200>,
      <created by zg, POWCHK disabled, PULCHK disabled
       configuration hash MD5:
       00 E9 B6 7A A2 85 ED C7 34 08 36 98 17 FE 4E 26
       data hash MD5: 16K
       5E EC 7D 1C 00 76 97 F1 5E 27 1F 4C 3C F6 B6 A4>)
(   2,<2021-06-29 10:11:35.34 +0400>,<she>,<DPX200>,
      <Start of raw data processing
       efp BC_mod = 2 LB = 0.24 FT_mod = 6 PKNL = 1 PHC0 = -11916.77 PHC1 = -3.598991 SI = 16K 
       data hash MD5: 16K
       F7 83 E2 86 E5 EA 8D 59 01 F9 2B 8A 20 C9 AF CF>)
(   3,<2021-06-29 10:11:55.98 +0400>,<she>,<DPX200>,
      <pk PHC0 = -1.780438 PHC1 = 8.399998 
       data hash MD5: 16K
       80 EC C2 68 AE 5B 0B D3 B2 A3 EF 71 87 8E BF C5>)
(   4,<2021-06-29 10:11:59.21 +0400>,<she>,<DPX200>,
      <abs ABSG = 5 
       data hash MD5: 16K
       29 44 D4 A0 03 1B 4D CC 9E 6E 30 34 8A 23 C6 A2>)
$$ ##END=
$$ 
$$ hash MD5
$$ C5 06 D9 5C D3 CB 78 19 49 E2 65 6E A3 B2 F3 F0
##$RELAX= 
##$RELAX= 
##$RELAX= 
##$RELAX= 
##$RELAX= 
##$RELAX= 
$$ Bruker specific parameters
$$ --------------------------
##$DU= <F:/spectra>
##$EXPNO= 1
##$NAME= <H-F>
##$PROCNO= 1
##$TYPE= <nmr>
##$USER= <she>
##$AMP= (0..31)
100 100 100 100 100 100 100 100 100 100 100 100 100 100 100 100 100 100 
100 100 100 100 100 100 100 100 100 100 100 100 100 100 
##$AQSEQ= 0
##$AQ_mod= 1
##$AUNM= <au_zg>
##$AUTOPOS= <>
##$BF1= 200.13
##$BF2= 200.13
##$BF3= 200.13
##$BF4= 200.13
##$BF5= 200.13
##$BF6= 200.13
##$BF7= 200.13
##$BF8= 200.13
##$BYTORDA= 1
##$CFDGTYP= 0
##$CFRGTYP= 5
##$CHEMSTR= <none>
##$CNST= (0..31)
1 1 145 1 1 1 1 1 1 1 1 1 1 1 1 1 1 1 1 1 1 1 1 1 1 1 1 1 1 1 1 1 
##$CPDPRG= <>
##$CPDPRG1= <>
##$CPDPRG2= <>
##$CPDPRG3= <>
##$CPDPRG4= <mlev>
##$CPDPRG5= <mlev>
##$CPDPRG6= <mlev>
##$CPDPRG7= <mlev>
##$CPDPRG8= <mlev>
##$CPDPRGB= <>
##$CPDPRGT= <>
##$D= (0..31)
0 1.2 0 0 0 0 0 0 0 0.06 0 0.03 0 0 0 0 0.0002 0 0 0 0 0 0 0 0 0 0 0 0 
0 0 0 
##$DATE= 1624947091
##$DBL= (0..7)
120 120 120 120 120 120 120 120 
##$DBP= (0..7)
150 150 150 150 150 150 150 150 
##$DBP07= 0
##$DBPNAM0= <>
##$DBPNAM1= <>
##$DBPNAM2= <>
##$DBPNAM3= <>
##$DBPNAM4= <>
$$ [...]
##$SUBNAM3= <"">
##$SUBNAM4= <"">
##$SUBNAM5= <"">
##$SUBNAM6= <"">
##$SUBNAM7= <"">
##$SUBNAM8= <"">
##$SUBNAM9= <"">
##$SW= 20.0188882624521
##$SWIBOX= (0..15)
0 0 2 0 0 0 0 0 0 0 0 0 0 0 0 0 
##$SW_h= 4006.41025641026
##$TD= 16384
##$TD0= 1
##$TE= 0
##$TE2= 300
##$TE3= 300
##$TEG= 300
##$TL= (0..7)
0 120 120 120 120 120 120 120 
##$TP= (0..7)
150 150 150 150 150 150 150 150 
##$TP07= 0
##$TPNAME0= <>
##$TPNAME1= <>
##$TPNAME2= <>
##$TPNAME3= <>
##$TPNAME4= <>
##$TPNAME5= <>
##$TPNAME6= <>
##$TPNAME7= <>
##$TPOAL= (0..7)
0.5 0.5 0.5 0.5 0.5 0.5 0.5 0.5 
##$TPOFFS= (0..7)
0 0 0 0 0 0 0 0 
##$TUNHIN= 0
##$TUNHOUT= 0
##$TUNXOUT= 0
##$USERA1= <user>
##$USERA2= <user>
##$USERA3= <user>
##$USERA4= <user>
##$USERA5= <user>
##$V9= 5
##$VALIST= <valist>
##$VCLIST= <CCCCCCCCCCCCCCC>
##$VD= 0
##$VDLIST= <DDDDDDDDDDDDDDD>
##$VPLIST= <PPPPPPPPPPPPPPP>
##$VTLIST= <TTTTTTTTTTTTTTT>
##$WBST= 1024
##$WBSW= 4
##$XGAIN= (0..3)
0 0 0 0 
##$XL= 0
##$YL= 0
##$YMAX_a= 472749
##$YMIN_a= -808118
##$ZGOPTNS= <>
##$ZL1= 120
##$ZL2= 120
##$ZL3= 120
##$ZL4= 120
##$ABSF1= 17.50199
##$ABSF2= -2.51705
##$ABSG= 5
##$ABSL= 3
##$ALPHA= 0
##$AQORDER= 0
##$ASSFAC= 0
##$ASSFACI= 0
##$ASSFACX= 0
##$ASSWID= 0
##$AUNMP= <proc_1d>
##$AZFE= 0.1
##$AZFW= 0.1
##$BCFW= 0
##$BC_mod= 2
##$BYTORDP= 0
##$COROFFS= 0
##$CY= -3
##$DATMOD= 1
##$DC= 0
##$DFILT= <>
##$DTYPP= 0
##$F1P= 0
##$F2P= 0
##$FCOR= 1
##$FTSIZE= 16384
##$FT_mod= 6
##$GAMMA= 0
##$GB= 0
##$INTBC= 1
##$INTSCL= 1.334414e-10
##$ISEN= 128
##$LB= 0.24
##$LEV0= 0
##$LPBIN= 0
##$MAXI= 10000
##$MC2= 0
##$MEAN= 0
##$ME_mod= 0
##$MI= 1.114404
##$NCOEF= 0
##$NC_proc= -7
##$NLEV= 6
##$NOISF1= 3.799351
##$NOISF2= 2.8
##$NSP= 0
##$NTH_PI= 0
##$NZP= 0
##$OFFSET= 17.50933
##$PC= 1
##$PHC0= -11918.55
##$PHC1= 4.801007
##$PH_mod= 1
##$PKNL= yes
##$PPARMOD= 0
##$PSCAL= 0
##$PSIGN= 0
##$REVERSE= no
##$SF= 200.130005062409
##$SI= 16384
##$SIGF1= 3
##$SIGF2= 2
##$SINO= 5.538805
##$SIOLD= 16384
##$SREGLST= <1H.CDCl3>
##$SSB= 0
##$STSI= 16384
##$STSR= 0
##$SW_p= 4006.41025641026
##$SYMM= 0
##$S_DEV= 0
##$TDeff= 16384
##$TDoff= 0
##$TI= <>
##$TILT= no
##$TM1= 0
##$TM2= 0
##$TOPLEV= 0
##$USERP1= <user>
##$USERP2= <user>
##$USERP3= <user>
##$USERP4= <user>
##$USERP5= <user>
##$WDW= 1
##$XDIM= 16384
##$YMAX_p= 494466274
##$YMIN_p= -545695
$$ End of Bruker specific parameters
$$ ---------------------------------
##NTUPLES= NMR SPECTRUM
##VAR_NAME=  FREQUENCY,     SPECTRUM/REAL,   SPECTRUM/IMAG
##SYMBOL=    X,             R,               I
##VAR_TYPE=  INDEPENDENT,   DEPENDENT,       DEPENDENT
##VAR_FORM=  AFFN,          ASDF,            ASDF
##VAR_DIM=   16384,         16384,           16384
##UNITS=     HZ,            ARBITRARY UNITS, ARBITRARY UNITS
##FACTOR=    0.24454680195387, 1,            1
##FIRST=     3504.14245153917, 0,            0
##LAST=      -502.267804871086, 0,           0
##MIN=       -502.267804871086, -545695,     0
##MAX=       3504.14245153917, 494466274,    0
$$ Real data points
##PAGE= N=1
##DATA TABLE= (X++(R..R)), XYDATA
$$ [...]
8069 85853047 86513822 87213902 87753857 87766940 87522410 87086286 86059869 84969628 83954301
8060 83954301 83249728 82465584 81930939 81686969 81852977 82202303 82713489 83733091 84911143
8051 84911143 85760336 86704976 87757900 88650787 89460296 90386624 90923202 91360826 91667151
8042 91667151 92291255 92974832 93836057 94858619 96216927 97592291 99431534 101469276 103841267
8033 103841267 106618694 110258376 114148926 118392844 122978966 128083856 134315639 141632834
8025 141632834 150086243 160469803 171927912 184720863 200363656 219172107 239153591
8018 239153591 258432874 277492913 299309249 324758929 359185186 393930230 431172503
8011 431172503 463716909 477032543 492166491 494466274 460432382 394228959 338641733
8004 338641733 300218306 268601411 242873972 221236302 201934668 185331495 172162555
7997 172162555 160727207 151177068 142613391 134723331 127325712 121123264 115555295 110964614
7989 110964614 106484081 102392717 98244600 94697311 91136998 88015417 85092843 82510213
7981 82510213 79977233 77616254 75233986 73123099 70906807 68879425 66982372 65197264
7973 65197264 63405101 61790296 60172634 58957515 57660442 56842305 55873068 55087391 54655740
7964 54655740 54269607 53746439 53668856 53668589 53434769 52694920 51858270 51183766 50887051 50330237
7954 50330237 50030472 49595290 48974824 48272917 47830993 47344087 46784059 46275434 46166207
7945 46166207 45995216 46022010 45952689 46094266 45988228 46038262 45969571 46130079 46446422 46847407
7935 46847407 46986808 47466365 47973203 48631216 49163141 49799448 50682817 51656174 52682775
7926 52682775 53868847 54892103 55970325 57184975 58479216 59755855 61214462 62498343
7918 62498343 63535722 64484424 64957696 65214294 65188081 65081239 64797206 64418281 64014509
7909 64014509 63394604 62986444 62670982 62380551 62505746 62825109 63323971 64006936 65079911
7900 65079911 66170451 67562270 69164831 70785876 72549456 74578641 76808851 79004998
7892 79004998 81219438 83215177 84820269 85897616 86735923 87151982 86878687 86170296 85114220
7883 85114220 84073428 82748110 81349445 79559750 77626392 76038108 74619629 73364250
7875 73364250 72158100 71397305 70723092 70243081 70210606 70230404 70826386 71587831 72532263 73612477
7865 73612477 74955457 76297894 77737493 79256166 80986514 82628504 84009780 85417237
7857 85417237 86528034 87336778 88078868 88601510 89132377 89570859 90157958 90613384 90919820
7848 90919820 90889289 90625488 90156957 89931446 88872734 87557084 86534746 85403643 83953826
7839 83953826 82277268 80367614 78530436 76770373 74939591 73259100 71960357 70342183
7831 70342183 68727598 67295233 66124116 65284946 64674663 64095092 63871173 64109837 64651928
7822 64651928 65424499 66361800 67375590 68627233 69490759 70124448 70512595 70663730 70290807
7813 70290807 69621302 68925183 68088854 66737053 64861932 62970338 61055654 59169892 57281335
7804 57281335 55257902 53268200 51388096 49393842 47388303 45588377 44000941 42594247
7796 42594247 41280328 40141158 39439579 38536474 38190592 38038846 37534421 37279054 37228585
7787 37228585 36990784 36676639 36115885 35418569 34630760 33973691 33322005 32380728 31377613
7778 31377613 30406111 29297734 28349342 27368582 26302120 25279348 24363657 23392809 22449336
7769 22449336 21604358 21032148 20343530 19524250 18822365 18271478 17720415 17340817 16841705
7760 16841705 16373842 15924567 15559693 15134965 14670235 14269559 13969300 13629867 13362008
7751 13362008 13172638 12947206 12670242 12492429 12265937 12270043 11941283 11629394 11325830 11308646
7741 11308646 11163560 11028749 10898932 10579545 10478658 10431497 10280373 10007882 9857664 9688249
7731 9688249 9370729 9240596 9140291 8820395 8848698 8919786 8711758 8615180 8546884 8355463
7721 8355463 8169700 8016616 7957781 7900914 7658680 7718111 7569473 7544392 7472205 7347109
7711 7347109 7310751 7134548 7137493 6895535 6804745 6798197 6829282 6914811 6853663 6717822 6411920
7700 6411920 6402529 6606189 6453925 6392184 6263582 6476865 6195506 5918255 5967119 6124170
7690 6124170 6160534 6082775 6159365 6182375 6104600 6125301 6147679 6197719 6198384 6175031 6177437 6215418
7678 6215418 6221614 6176420 6152314 5910358 5725057 5799927 5646191 5601501 5570458 5550692 5637281
7667 5637281 5580715 5400802 5252909 5298348 5099371 5218362 5212356 5310718 5213766 5126777 5154318
7656 5154318 5295663 5226167 5226299 5385065 5233159 5265387 5166337 5210123 5172666 5258718 5313394
7645 5313394 5259653 5357026 5503130 5414382 5488932 5489991 5719197 5762806 5776204 5820754 5929046
7634 5929046 6023254 6027980 6120636 6218883 6183286 6115660 6167735 6247462 5942054 5656645 5635250
7623 5635250 5704244 5804562 5739654 5756984 5770258 5793837 5765514 5799785 5804969 5926173 6137277
7612 6137277 6134495 6265077 6338722 6540326 6611492 6695760 6803935 6760011 6653434 6613691 6656390
7601 6656390 6677136 6614202 6459985 6540040 6567465 6543630 6416742 6483476 6586634 6504879 6517212
7590 6517212 6723316 6834671 7030324 7063462 7187969 7190500 7440045 7709625 7956939 8167759
7580 8167759 8376238 8436332 8676530 8981197 8880472 8684132 8688196 8513576 8460051 8598318
7570 8598318 8498506 8569319 8591056 8726764 8726228 8874182 9063845 9099482 9027652 8887920 8983721
7559 8983721 9408001 9521586 9429684 9642834 9646863 9583793 9396021 9077948 8876489 8717091
7549 8717091 8489636 8344647 8240801 7962625 7861347 7938644 7824936 7803895 8011750 8039379
7539 8039379 8158210 8090035 8013751 8230885 8411442 8686404 8996314 9169436 9388325 9685663
7529 9685663 9952519 10256780 10659630 10833926 10990276 11132046 11302689 11037611 10805701 10717457
7519 10717457 10447321 10194162 9979612 9740919 9596624 9625588 9478097 9337211 9212441 9163330
7509 9163330 9242489 9088611 9031453 9070955 9018398 8992180 8985925 8924657 8861105 8778030 8657889
7498 8657889 8767188 8662906 8666789 8707264 8663434 8720592 8646450 8329785 8409250 8547680 8464511
7487 8464511 8480212 8431553 8311008 8372471 8593297 8638810 8395862 8288829 8132061 8176556
7477 8176556 7929356 7744670 7559486 7407549 7150782 6943136 6842443 6540717 6450966 6227901
7467 6227901 5999423 5843307 5641025 5592231 5505365 5363321 5357545 5291658 5274607 5251502 5149204
7456 5149204 5108942 5179245 5378460 5438209 5256688 5339148 5258673 5206992 5090408 4979911 4848064
7445 4848064 4673232 4497874 4453486 4363918 4264720 4042667 4050125 4004573 3948602 3887291 3890547
7434 3890547 3797813 3760204 3745338 3747294 3667985 3670498 3755664 3698962 3757684 3669248 3856829 3900773
7422 3900773 3934329 3852340 3950702 3982732 3861927 3754425 3898541 3864650 3726575 3692005 3589440
7411 3589440 3434452 3449492 3330268 3338563 3298844 3178825 3120667 3256430 3397745 3198157
7401 3198157 3166852 3141355 3120617 3250245 3332354 3394792 3360078 3276122 3432132 3448217 3377067
7390 3377067 3326679 3480578 3611924 3764029 3673613 3509802 3514528 3300846 3152059 3189515
7380 3189515 3337442 3204136 3205846 3227030 3014084 3162210 3054731 2939479 2936414 3033062 3160038
7369 3160038 3064631 2987193 3126972 3217801 3303391 3279333 3290265 3075982 3195564 3389937 3345337
7358 3345337 3308950 3208895 3239269 3185277 3160745 3256180 3329986 3319799 3393646 3372859 3555426
7347 3555426 3869107 3951970 3894442 4031533 4431242 4499413 4691103 4915417 4957098 5340753
7337 5340753 5587776 5853913 6113209 6129604 6210327 6223384 6233593 5937552 5617855 5526731
7327 5526731 5335219 5141134 4781256 4608653 4491480 4391463 4338462 4285655 4220643 4204638
7317 4204638 4144260 4102424 4393891 4296033 4207113 4328768 4275682 4320521 4487121 4675827 4726357
7306 4726357 4806190 5011510 5244065 5275648 5426621 5541559 5668029 5419304 5049101 4858835
7296 4858835 4588912 4402973 4203420 4050142 3746229 3640112 3469449 3225993 3127087 3222222
7286 3222222 3300386 3023241 2856853 2792347 2760181 2783747 2497914 2421528 2341488 2232240 2044699
7275 2044699 1911988 2095824 2078492 1935216 1942123 1833122 1830957 1703614 1718533 1765659 1468269
7264 1468269 1557052 1691171 1566037 1403487 1373173 1409592 1326571 1255476 1413266 1417861 1503815
7253 1503815 1439427 1398855 1275022 1246550 1211066 1130541 1060068 1145687 1068459 1110719 1148525
7242 1148525 1221739 1242442 1069009 1096222 1207213 1204720 1124396 1156913 1166138 1135074 1074844
7231 1074844 1098333 964575 965994 880661 900897 924894 933315 966393 1058542 992460 828861
7220 828861 850342 745843 780277 868332 841757 869856 875522 779757 715211 831242 798063
7209 798063 862284 866987 824825 789099 659833 724344 829548 894133 842815 891267 962347
7198 962347 1008212 856588 804905 850564 813089 811688 858920 829791 881995 836611 820932 735589
7186 735589 901315 903075 796689 743745 865038 849299 706779 685610 690875 759149 840613
7175 840613 892234 679180 717481 741938 747371 679840 683901 720936 611126 658306 777962
7164 777962 812511 867297 759056 741583 713780 686009 617902 619927 638280 610727 858493
7153 858493 979330 902308 686228 762417 898924 823759 849530 780606 833753 777563 845803
7142 845803 866499 771447 811257 900194 767263 886036 737326 636433 699030 719455 693732
7131 693732 884832 1009124 764912 640022 828740 876526 783168 779226 902616 905014 841058
7120 841058 677331 799897 794243 671743 723758 619779 681895 711510 627981 759666 783555
7109 783555 672670 868155 787382 632329 784417 804475 796395 1014049 997427 876834 827102
7098 827102 799509 793462 826864 778882 884232 880460 812194 765973 886656 923329 1065380
7087 1065380 999633 899324 985215 918610 1029446 836600 804694 786654 816723 1072148 986260
7076 986260 953323 905206 998439 952337 837357 876858 936045 1040994 964721 949058 1029602
7065 1029602 1070063 1060878 983666 1000210 977369 982218 1024724 1222040 1172431 907459 933907
7054 933907 1195515 1018370 975755 991319 1030029 1178175 1098112 1114014 1030578 1137464 1158194
7043 1158194 1096265 1091338 1097706 1018934 913588 1210898 1105861 1009766 1187040 1422751 1188882
7032 1188882 1065815 1060284 1027430 1097532 1206139 1134893 1079528 1124892 1213329 1294442 1290031
7021 1290031 1279791 1213726 1334039 1382912 1399498 1373205 1555755 1622495 1744484 1758453 1700628
7010 1700628 1677849 1733294 1798746 1789617 1713106 1818574 1775982 1815885 1673507 1475794 1493302
6999 1493302 1735550 1844620 1562903 1539580 1644312 1692007 1641156 1619848 1648784 1739768 1759709
6988 1759709 1705825 1684201 1763777 1696083 1722153 1568405 1574130 1705305 1563168 1483493 1592720
6977 1592720 1761755 1735735 1609384 1588639 1604714 1523097 1564368 1519670 1494596 1538214 1843864
6966 1843864 1798560 1743013 1908707 1828987 1786866 1723705 1668085 1706261 1607966 1673215 1662849
6955 1662849 1678594 1851497 1782776 1749886 1649630 1712110 1900994 2001899 1980842 2073835 1934553
6944 1934553 1922556 2097037 2179102 2069639 2029913 1983158 2186884 2234228 2002257 2176255
6934 2176255 2142554 2200857 2145054 2161831 2244724 2185779 2122106 2407580 2341794 2230165 2281914
6923 2281914 2164789 2201262 2367160 2373818 2298014 2276247 2323929 2122444 2102898 2228619 2278066
6912 2278066 2298974 2379847 2299192 2466629 2489520 2591696 2852126 2726138 2729922 2834087 2938055
6901 2938055 3073689 3271901 3239045 3328100 3301736 3462339 3422600 3392431 3429642 3522800 3731671
6890 3731671 3827473 3840028 3641735 3471570 3427682 3411089 3325757 3263924 3110851 3113525 3119142
6879 3119142 3168595 3270407 3271565 3301334 3197733 3251054 3100276 3086784 3363214 3356868 3353407
6868 3353407 3357222 3359026 3488207 3552780 3624228 3695263 3567501 3613884 3625327 3507060 3598794
6857 3598794 3614082 3507176 3503440 3347091 3205603 3193470 3019155 3204336 3088603 3015402
6847 3015402 3064127 2985114 2861397 2894835 2771023 2730532 2759005 2791972 2843267 2785988 2679550
6836 2679550 2700833 2662964 2571049 2707844 2709455 2785991 2853220 3064998 3168820 3064975 3122731
6825 3122731 3293798 3379000 3252340 3249615 3281372 3239952 3184676 3178919 3302210 3257335 3158162
6814 3158162 3177058 3111554 2966639 2856873 2770055 2734074 2616648 2662546 2705533 2571958 2317734
6803 2317734 2441737 2561235 2469408 2526189 2467758 2432562 2384340 2205459 2231002 2375328 2364529
6792 2364529 2316924 2232563 2324048 2317264 2280556 2312998 2305675 2056179 2106465 1932162 1804259
6781 1804259 1820147 1867499 2056037 2054250 1975204 1973261 2007381 1946333 2021504 1885670 1924485
6770 1924485 1812844 1845036 1822822 1832495 1957180 1962648 1895127 1837667 1860132 2155308 2111910
6759 2111910 1893507 2018806 2051006 1991289 1995033 1963839 1985877 2055494 2157219 2201669 2152442
6748 2152442 2188891 2158403 2130302 2250310 2201873 2121472 2129001 2098287 2243669 2343192 2375777
6737 2375777 2475484 2532661 2483254 2469920 2465488 2385592 2505290 2498664 2743368 2757823 2743304
6726 2743304 2786993 2870612 2936610 3019570 3059599 3137239 3243837 3109761 3072410 3173990 3144327
6715 3144327 3120094 3103311 3031791 3074215 3152204 2988772 2891029 2998253 2946148 2776187 2767658
6704 2767658 2704559 2696048 2629589 2700976 2764878 2637399 2594059 2747075 2784102 2716076 2562094
6693 2562094 2493487 2783767 2576729 2650222 2614352 2605970 2606221 2547222 2611091 2715850 2818154
6682 2818154 2734805 2614753 2671004 2709071 2775948 2573140 2727378 2659344 2739012 2865484 2777342
6671 2777342 2875059 2973088 2962776 2864167 2769161 2977761 3162110 3351803 3379734 3360772 3448521
6660 3448521 3414620 3368605 3625700 3816288 3998993 4060219 4055427 4250524 4280953 4182808 4199395
6649 4199395 4334547 4367189 4341729 4294168 4176378 4067572 3991518 4002034 3868833 3731399
6639 3731399 3610824 3475508 3566096 3716938 3754367 3624236 3566112 3805871 3779996 3667246
6629 3667246 3734920 3731929 3880343 3836783 3823710 3995280 4134048 4229604 4248246 4235770 4189362
6618 4189362 4197381 4328634 4506876 4631887 4706041 4762427 4796892 4845756 5001414 5238938 5319747
6607 5319747 5386258 5449524 5574022 5612607 5611282 5608874 5661875 5652657 5729009 5569248 5559901 5383809
6595 5383809 5235053 5273381 5372115 5250615 5193698 5221845 5377584 5306961 5388558 5461052 5570796
6584 5570796 5596030 5853313 5701425 5735734 5921032 6038714 6050206 6028578 5972216 5962373 6007696
6573 6007696 5935749 6096935 6041197 5800772 5861701 5856612 5727525 5649401 5416064 5469068 5358198
6562 5358198 5233852 5291473 5234603 5087987 5023358 4863433 4941377 4944060 4824595 4760225 4815315
6551 4815315 4859104 4778060 4903008 5016425 5038782 5072607 4926923 5023866 4953032 5023963 5086574
6540 5086574 5093310 5101443 5061501 5175694 5098787 5121952 5167811 5115878 5124841 5252208 5243181 5188655
6528 5188655 5471106 5506234 5468741 5348944 5195229 5200956 5489183 5467701 5450051 5444010 5443976 5611756
6516 5611756 5546421 5326742 5314407 5428120 5442127 5408144 5512022 5551006 5652880 5630387 5627711
6505 5627711 5754963 5876713 5873025 5826561 6085561 6279651 6202904 6318896 6233618 6230824 6331927
6494 6331927 6400333 6489351 6539221 6487493 6717469 6954048 7138491 7249094 7385868 7486704
6484 7486704 7709762 7694462 7823297 8111594 8215002 8228531 8315770 8505957 8828951 9106225
6474 9106225 9308059 9590473 9730875 9931402 10086646 10398354 10528800 10767360 10932124 10938859
6464 10938859 11088702 11301481 11557454 11684964 11941194 12113980 12284294 12645504 12837218
6455 12837218 13465369 13830065 14201326 14515569 14748941 15110843 15691196 16249880 16962830
6446 16962830 17676894 18314729 19218103 19890358 20802125 21936546 23050121 24226712 25208833
6437 25208833 26288039 27504225 28528689 29568580 30583137 31501185 32288356 32815110 33147365
6428 33147365 33124239 33055891 32522700 31887743 31054123 29950877 28722253 27670657 26407861
6419 26407861 25261969 23974267 22859803 21953317 21064195 20176585 19436465 18764065 17917714
6410 17917714 17216924 16664508 15969726 15396535 14991947 14545795 14208298 13797439 13459266
6401 13459266 13202044 12781143 12699991 12527684 12199990 11907353 11529234 11380612 11259091 11137856
6391 11137856 10956218 10784945 10524840 10398114 10278079 10226150 10164563 10008933 9891479 9769732
6381 9769732 9596695 9571112 9542470 9395948 9221778 9225404 9112806 8929028 8961687 9113493
6371 9113493 9059589 8980880 8996934 8979583 8782883 8830330 8821091 8635289 8672635 8729147 8712717
6360 8712717 8873708 8776186 8658733 8724231 8774492 8723725 8712244 8855011 8749637 8706590 8797711
6349 8797711 8654391 8717759 8732525 8571424 8663066 8776440 8572841 8683517 8739130 8774697
6339 8774697 8808968 8719017 8898743 8926007 8920021 8950442 9028204 8907655 8868323 9136251 9102274
6328 9102274 9276318 9499754 9503214 9597849 9611011 9541087 9496707 9509192 9505351 9577387 9665737
6317 9665737 9791248 10031682 10095541 10176891 10257654 10255882 10386093 10457087 10506834 10593739 10704351
6306 10704351 10728487 10930324 11135213 11235729 11295109 11274998 11383355 11739957 11980914 11990906
6296 11990906 11980525 12143792 12365000 12477535 12474914 12535689 12647107 12685965 12798097 12716099
6286 12716099 12541725 12462826 12520554 12576789 12478511 12274036 12245002 12295663 12420041 12306100
6276 12306100 12202107 12256203 12358066 12272733 12073070 12106818 12092136 12162641 12277031 12313488
6266 12313488 12240374 12258434 12280719 12427513 12628370 12561005 12539724 12604549 12717261 12808382 12774387
6255 12774387 12818402 12995465 13223928 13102849 13299356 13399410 13513613 13558947 13560948 13706666
6245 13706666 13621469 13777540 13972289 14005682 13892541 14071447 14113603 14221886 14249997 14192810
6235 14192810 14363870 14392963 14518910 14584800 14628953 14744326 14971645 15045375 15039208 15141279
6225 15141279 15016301 15116691 15180189 15390604 15362652 15427026 15592271 15751986 15764894 15909151
6215 15909151 16144719 16078054 16210182 16313664 16336188 16502793 16591332 16682761 16784730 16906452
6205 16906452 17126193 16997657 17292083 17473971 17445989 17616220 17874042 17762466 17881374 18037311
6195 18037311 18207951 18305953 18321229 18692478 18815667 18781071 18985086 19098415 19223079 19218455
6185 19218455 19337649 19639721 19646728 19697942 19932038 20092066 20156448 20287402 20406982 20505708
6175 20505708 20633798 20686939 20736121 20865149 21131102 21307872 21423326 21343208 21454930 21530417
6165 21530417 21656535 21843352 21990864 22268524 22451075 22476415 22677634 22679292 22809043 22929379
6155 22929379 23095904 23193801 23271393 23376105 23471162 23762711 23951402 24085604 24096545 24148532
6145 24148532 24278522 24526091 24559658 24666109 24726128 24803776 24976752 25035549 25129303 25223671
6135 25223671 25310590 25469062 25382446 25538516 25672862 25879595 26003611 26086183 26265294 26407285
6125 26407285 26376908 26393858 26571610 26629473 26652113 26744481 26833406 26978713 26952448 27147666 27257747
6114 27257747 27349454 27338710 27454830 27619290 27673516 27673227 27710912 27755973 27733735 27852334 28063513
6103 28063513 28073958 28104567 28148901 28145428 28199381 28295696 28259576 28181802 28316042 28348954 28362685
6092 28362685 28347427 28209624 28261045 28113524 28179321 28404659 28342659 28276988 28279804 28082621 27963004
6081 27963004 28109709 28213907 28170306 28025006 27856823 27826055 27902601 27738161 27686182 27479051
6071 27479051 27413030 27403016 27370824 27236096 27068663 27073698 26975352 26755203 26741751 26761501 26616453
6060 26616453 26477602 26514080 26487125 26247534 26099851 26086062 25976214 25966672 25897876 25746400
6050 25746400 25741586 25778265 25671289 25679848 25500860 25532048 25492595 25379082 25293943 25185525 25184505
6039 25184505 25143795 25056351 25048375 25016948 24874185 24758667 24545877 24397379 24304068 24272258 24242844
6028 24242844 24107862 23959996 23960872 23998533 23860695 23517715 23530694 23416658 22997262 22616997
6018 22616997 22386569 22339933 22169319 21866927 21764866 21635558 21493737 21326748 21200057 21022292
6008 21022292 20812869 20839220 20669502 20525708 20315273 20136838 20020593 19804258 19638935 19514042
5998 19514042 19533865 19296336 18985882 19054986 18903406 18683000 18563951 18420511 18345790 18219198
5988 18219198 17965231 17876861 17885573 17833134 17601174 17476571 17409744 17068905 16813086 16691897
5978 16691897 16734941 16541497 16235137 16307739 16242588 16120649 16082384 15909352 15707854 15481480
5968 15481480 15435469 15325083 15199885 15225384 15204868 15042609 14775666 14840838 14692177 14587062
5958 14587062 14597584 14535673 14420233 14273862 14124511 13978417 13958188 14059092 14138530 13782594
5948 13782594 13608747 13674775 13431673 13356370 13275251 13221187 13266200 13230265 13111584 12981953
5938 12981953 12939372 12850955 12750711 12688308 12630710 12538347 12401256 12388051 12350363 12353486 12348846
5927 12348846 12319358 12209659 12151563 12161258 12139248 12070836 11910543 11716652 11638662 11603422 11493038
5916 11493038 11403746 11240363 11191453 11342496 11323794 11364316 11317898 11178381 11257161 11106378
5906 11106378 11060911 11137076 11075807 11005735 11157620 10896711 10880141 10622082 10608232 10604422 10374884
5895 10374884 10352518 10439894 10480020 10513454 10267464 10335583 10252886 10157301 10024594 9926569 10004556
5884 10004556 9943105 9938250 10086724 9909462 9896918 9938939 9871886 9791792 9625161 9569504 9505694
5873 9505694 9562063 9550249 9503513 9586589 9412052 9330611 9455012 9637465 9549512 9514407 9582731
5862 9582731 9469333 9578850 9447083 9518792 9337043 9251374 9093866 9183724 9143367 9008171
5852 9008171 8861227 8856194 8811823 8510686 8343439 8478452 8413311 8362202 8367106 8311515 8250151
5841 8250151 8219043 8167446 8180380 8056215 7963870 8051947 8114609 7905703 7902426 7893193 7827360
5830 7827360 7783396 7997228 8128649 7834472 7581989 7537669 7527751 7692026 7812151 7876703
5820 7876703 7792121 7711644 7810018 7710114 7733893 7748391 7440920 7402136 7656978 7520431 7621102
5809 7621102 7643259 7569064 7667617 7547299 7542402 7365286 7492566 7601105 7532729 7426118 7511556
5798 7511556 7554866 7628693 7646514 7616953 7657339 7597470 7484284 7408990 7581284 7588769 7571914
5787 7571914 7566074 7551025 7636266 7889015 7859186 7694963 7506168 7537173 7523568 7632158 7823681
5776 7823681 7845067 7924822 7963315 8039416 8077929 7812218 7870960 7737541 7763709 7853463 7872838
5765 7872838 7807004 7713213 7779534 7921089 7883065 7898872 7817802 7726142 7685047 7656469 7720211
5754 7720211 7878761 7870666 7750035 7793078 7752237 7877873 7948199 7978044 7973079 8012652 8141982
5743 8141982 8094182 8221213 8166538 8239330 8160763 8121349 8246317 8222637 8205971 8223424 8336764
5732 8336764 8383361 8314262 8539643 8487949 8509203 8581715 8479157 8422939 8597576 8519347 8563504
5721 8563504 8589173 8596812 8686907 8574436 8680588 8642164 8873128 8889559 8860265 8978734 9015340
5710 9015340 9122566 9243788 9249987 9414729 9454894 9595773 9549727 9699175 9812156 9940678
5700 9940678 9936703 10094253 10242572 10224107 10063746 10255256 10353580 10632835 10632660 10626571 10833455
5689 10833455 11016792 11176660 11329897 11549751 11742342 11914617 12213164 12524995 12721922
5680 12721922 12934460 13066403 13197447 13336575 13514884 13633750 13822526 13978580 14277217
5671 14277217 14364381 14484423 14751029 14953147 15154889 15492080 15787117 16227923 16624618 16904936
5661 16904936 17372482 17492505 17546872 18080956 18381777 18614721 18754173 19006871 19106073 19077171
5651 19077171 19127486 19314374 19321382 19327525 19460714 19368068 19578144 19799688 20070279 20545159
5641 20545159 20724746 21032543 21360483 21850053 22247924 22731189 23039775 23300239 23798071
5632 23798071 24189738 24482041 24865784 24962329 24985264 25222112 25324082 25539908 25880799 26075404
5622 26075404 26455401 26990634 27468527 27950657 28630965 29440519 30405258 31333988 32676728
5613 32676728 33888387 34964559 36287111 37487178 38805361 40120234 41283348 42247005
5605 42247005 43178383 43420476 43922490 43984215 43723253 43282818 42577057 41809403 41280242 40835318
5595 40835318 40406911 40325599 40569294 41076854 41734210 42252140 43393559 44707898 46101125
5586 46101125 47721095 49732762 51844659 54011208 56068793 58145095 60152468 62028153
5578 62028153 63349272 64062651 64470820 63985428 63014853 61161944 58781997 56100032 53368817
5569 53368817 50820179 48533967 46620137 44817087 43416761 42538161 41688386 41027486 40923044
5560 40923044 40779013 40767405 41033812 41373557 41977584 42512440 43071723 43594371 44054163 44355920
5550 44355920 44484347 44543682 44374028 43690100 42769008 41485424 40086966 38529354 36779902
5541 36779902 35318219 33928548 32434071 31095267 29862402 28963051 28106470 27251926 26403382
5532 26403382 25758450 25284718 24996806 24680685 24398650 24132508 23794233 23520425 23279685
5523 23279685 23156536 23085515 22895058 22969619 22932933 23012749 23058030 23052032 22979992 22817426 22569179
5512 22569179 22427802 22134753 21792616 21372104 21007176 20770971 20384666 20015371 19736681
5503 19736681 19516089 19457023 19133690 18966313 18871432 18820755 18836221 18600240 18526531 18738618
5493 18738618 18796716 18837651 18892083 18955742 19001867 19099916 19301070 19296379 19467414 19417276 19449959
5482 19449959 19417473 19257781 19207289 19173430 18997245 18946513 18650482 18682120 18596153 18384696
5472 18384696 18150737 17865861 17742094 17450230 17211252 17093413 16878731 16853320 16949455 16933940
5462 16933940 16925802 17113311 16989992 16936876 17132020 17045378 17027931 17119429 17234638 17452892
5452 17452892 17616145 17882926 17827629 17876296 18066374 18077180 18054887 18094132 17928177 17749553
5442 17749553 17697664 17667439 17434428 17424160 17360126 17230803 17111346 16915069 16758667 16781645
5432 16781645 16636857 16493229 16469664 16511209 16409527 16477514 16488862 16428148 16330544 16235491 16439717
5421 16439717 16529298 16528376 16685304 16942277 16923591 16898715 16951145 17111808 17196927 17340276 17427634
5410 17427634 17495471 17477825 17602700 17670333 17875438 18025423 18112544 18236819 18448419 18806690
5400 18806690 19054668 19492102 19945487 20287115 20744438 21182818 21729465 22172572 22583539
5391 22583539 23218921 23878459 24441427 24983163 25644081 26137944 26711483 27416224 28161116
5382 28161116 28552322 29012847 29518468 29576838 29826426 29918937 29958682 29918569 29946777 30018767
5372 30018767 29991702 29976421 30280896 30425605 30575509 30991079 31487682 32193527 32720230 33200385
5362 33200385 33831495 34470457 35147405 35689390 36205798 36963852 37614901 38343840 38934248
5353 38934248 39450781 39746956 39789316 39951628 39679491 39299852 38687463 37840255 36694114
5344 36694114 35689845 34681716 33596195 32545630 31613225 30771415 30192325 29599991 28947897
5335 28947897 28679879 28350094 27985247 27568894 27323118 27311071 27277603 27295853 27289981 27262235
5325 27262235 27317324 27395586 27197452 26959115 26529780 26214981 25616416 24863729 23911373 23011604
5315 23011604 22183213 21230215 20374573 19629360 18964002 18296165 17674189 16965006 16444111
5306 16444111 15967362 15484990 15013860 14487213 14221227 13883568 13696926 13386401 12953595
5297 12953595 12836851 12620841 12244607 12004183 11749494 11510348 11440486 11470202 11300387 11111932
5287 11111932 11057446 10813205 10644965 10527777 10199419 10007839 9942655 9756669 9718392 9628140
5277 9628140 9557896 9305580 9192034 9092589 8961184 8822376 8768701 8540661 8632600 8621835
5267 8621835 8533757 8235461 8304173 8389813 8325495 8343318 8330415 8043603 8067507 8162309 8149574
5256 8149574 7990563 7930322 7825560 7731967 7786947 7743183 7683689 7623706 7753428 7710093 7739612
5245 7739612 7789629 7742564 7669174 7752623 7761370 7866479 7828669 7637952 7768976 7869398 7883226
5234 7883226 7962303 7803329 7876573 8041079 7921855 7892539 7903507 7968789 7928423 7995955 7820694
5223 7820694 7931151 8112171 8100964 8181045 8221773 8216540 8228066 8177499 8139245 8282382 8336787
5212 8336787 8357713 8544739 8526487 8405681 8282045 8403078 8557925 8466191 8487176 8539067
5202 8539067 8634627 8744808 8689199 8662734 8739314 8782906 8933335 8811331 8946113 9002948 8965139
5191 8965139 8990609 8964529 8984007 9110411 9159325 9151552 9178023 9421023 9554805 9529985 9431514
5180 9431514 9359940 9419951 9609358 9628843 9737371 9823963 9893503 9945256 9970537 10015952 10213014
5169 10213014 10294710 10434948 10524232 10554794 10839935 10797175 10816002 10986951 11051677 11220463
5159 11220463 11441057 11428028 11547332 11740719 11704841 11942891 12205124 12383234 12371029 12418187
5149 12418187 12618308 12799449 13080171 13186527 13349832 13565805 13743240 14089398 14091609 14485139
5139 14485139 14999331 15158406 15357021 15711454 16000544 16257663 16777869 17114223 17583059
5130 17583059 17860467 18224643 18758002 19089591 19277722 19653535 20084723 20327242 20701939
5121 20701939 21211170 21628153 21955033 22472627 22888795 23379205 23940836 24533871 24997908
5112 24997908 25570443 26080527 26594402 27120684 27696981 28428682 29122879 29803331 30430870
5103 30430870 31043329 31557977 31823161 32324707 32603569 32686414 32812678 33097740 33425046 33676325
5093 33676325 33981960 34255820 34549549 35039931 35798759 36334835 36955552 37617026 38236932
5084 38236932 38999425 39841954 40701263 41645146 42656292 43749823 44901750 46325203 47639989
5075 47639989 49064145 50833154 52766043 54524053 56406475 58526651 60893607 63448414
5067 63448414 66155342 68892534 71862201 74769330 77595933 80609876 83364272 86196475
5059 86196475 89197730 92094066 94908816 97767580 100859636 104242335 107791155 111661834
5051 111661834 115879433 120185645 124830461 129596725 134605423 139287007 143762899 148185224
5043 148185224 152272338 155762963 158402719 159794761 159790876 158636189 156103360 152125606
5035 152125606 147100186 141438079 135295861 128891488 122592833 116252992 110065334 104452415
5027 104452415 99273266 94415577 90150479 86454354 83145517 80082636 77102539 74443390
5019 74443390 71956857 69148351 66270284 63266864 60664725 58652917 56875809 55302789
5011 55302789 53976526 52643359 51394063 50563758 49913823 49223754 48666374 48279346 48187247
5002 48187247 48070489 48032643 48031569 48231636 48484092 48607547 49099290 49920476 50556714 50966645
4992 50966645 51308196 51771717 51741990 51199698 50453419 49694968 49161409 48780923 48777539 48658643
4982 48658643 48497463 48474035 48508429 48631151 48815331 49196407 49430795 49599580 49849847 50069727
4972 50069727 50293309 50537148 50969121 51294909 52192354 53038158 54006320 55039252 56404487
4963 56404487 57602703 59253455 60915078 62331657 63943409 65722516 67993253 70414442
4955 70414442 73324130 76544145 79987160 83770389 87628569 91200768 94344579 97343328
4947 97343328 99300680 100518754 101295490 102197077 103219600 104672999 106584991 108689423
4939 108689423 111145227 113981449 117088321 120292549 123778655 127342143 130598643 134101829
4931 134101829 137671238 141905983 146731487 151594403 155962621 159348075 161589964 162133459
4923 162133459 160395353 156227672 150608211 144690072 139268961 134444480 130154565 126243323
4915 126243323 122751037 119436627 116277016 113294231 110346308 107560978 105158496 102630864
4907 102630864 100557923 98706093 97216840 95893155 94310016 92486856 90391025 87706406
4899 87706406 84209274 79758141 75163378 70747628 66743506 63263590 60213636 57306054
4891 57306054 54824250 52501701 50380452 48389107 46443316 44620875 42948770 41618507
4883 41618507 40326002 38865718 37345468 36079475 34945685 34166563 33258460 32287783 31478141
4874 31478141 30677106 29967741 29295399 28914621 28352388 27765578 27359174 26818435 26511897
4865 26511897 26291378 26037756 25782248 25528062 25124902 24773142 24462030 24234077 24086004
4856 24086004 23709790 23252651 22918634 22734752 22276387 21906122 21686374 21303669 20880775
4847 20880775 20556374 20196705 20037344 19705413 19426172 19314850 19345495 18978522 19077484 18945343
4837 18945343 18649651 18686466 18777670 19016256 18896824 18941608 19129512 19180766 19125492 19169778
4827 19169778 19371348 19436432 19497396 19654522 19433688 19446647 19543607 19383712 19457638 19626528
4817 19626528 19391628 19418127 19569085 19639363 19559966 19746055 19990418 20386031 20774805 21247902
4807 21247902 21839627 22432470 23012033 23627066 24400284 25369935 26437601 27651576 28891447
4798 28891447 30309736 31868063 33994750 36194332 38424353 40477648 42589050 45302974
4790 45302974 48794520 52964886 57242060 60622943 61848607 63473564 64474709 60956037
4782 60956037 55487388 49593849 44164475 40057828 36765213 34171078 31659119 29666172
4774 29666172 28232922 27060526 26098342 25351552 24613318 23954968 23285977 22762856 22310766
4765 22310766 21920061 21593247 21319265 20772317 20420560 20151934 19825553 19520425 19347107
4756 19347107 18870048 18596221 18498380 18318392 18446981 18438524 18198993 18200579 18228901 18290275 18373110
4745 18373110 18195323 18039411 17824646 17610230 17484030 17229078 16980472 16857514 16650360
4736 16650360 16292990 16236168 16119701 15917442 15723331 15816931 15723658 15926243 15947545 15834982
4726 15834982 15794385 15761788 15607343 15404149 15125828 14571186 14023017 13553127 13105779 12982327
4716 12982327 12771119 12275026 11901911 11742673 11693862 11439322 11390202 11188707 11114255 10808821
4706 10808821 10745182 10702314 10554753 10584771 10588694 10445665 10440331 10302334 10265456 10219694 10268044
4695 10268044 10291167 10282730 10192731 10225688 10148003 10151218 10059444 10048257 9984258 9897360 9811671 9822362
4683 9822362 9841370 9566614 9597046 9624649 9521854 9635088 9548778 9527161 9505924 9441684 9403333
4672 9403333 9280953 9177317 9272500 9236580 9455018 9568029 9433628 9560770 9521033 9563747
4662 9563747 9554089 9726091 9791622 9833301 9820744 9835260 9816435 9735994 9814901 9963947 9926637
4651 9926637 9747029 9820095 9704774 9732074 9938481 9802860 9762429 9765568 9749927 9756994 9868138
4640 9868138 9850081 10018273 10147669 10142304 10059785 10021396 10049111 10006888 9947332 9717498 9660631
4629 9660631 9686159 9619052 9626534 9673557 9636465 9546044 9502974 9476160 9446133 9352138 9483866
4618 9483866 9345003 9289684 9326257 9430984 9384317 9401896 9397037 9374331 9501574 9534227 9625160
4607 9625160 9519752 9528434 9399642 9431156 9481014 9486227 9457983 9487488 9553286 9749807 9997020
4596 9997020 9963379 10148785 10123763 10148156 10239806 10269925 10456593 10468863 10537319 10731988 10831696
4585 10831696 10831022 10985908 11205804 11131231 11123573 11223493 11438421 11573914 11469401 11548389 11836108
4574 11836108 11943952 12098626 12047102 12201222 12194834 12202667 12625993 12655113 12699423 12776367 12958833
4563 12958833 12953547 13071016 13296381 13520590 13645855 13578261 13704755 13717471 13832670 14025091
4553 14025091 14005880 14113315 14127952 14187541 14387716 14340957 14407802 14405505 14386045 14400428 14498611
4542 14498611 14757081 14922070 14990414 15031577 15144247 15117728 15437621 15714764 15753911 16034049
4532 16034049 16267548 16537691 16755268 17015534 17302964 17429555 17499008 17828810 18029050 18337804
4522 18337804 18539784 18625882 18816692 19180603 19608763 19779622 20204798 20646115 20860398 21196317
4512 21196317 21602690 21871009 22298269 22848884 23149349 23568121 23644932 23833083 24066291 24156300
4502 24156300 24225332 24071767 24335084 24416790 24621695 24799798 24955113 25040210 25305835 25539137
4492 25539137 25614244 25563750 25800598 25945665 26023514 26264364 26526602 26772980 26849863 27037371
4482 27037371 27470219 27763561 28063293 28441180 28899515 29262958 29506495 29925424 30360480
4473 30360480 30759436 31221265 31655479 32249441 32825839 33457876 33923785 34522400 35195690
4464 35195690 35773591 36530411 37078387 37756260 38351321 39328454 40020318 40704876 41311778
4455 41311778 41770014 42403387 42847350 43294420 43649002 44160946 44709094 45414523 46057770
4446 46057770 46778815 47431144 48114941 49059217 49872208 50750170 51612821 52605896 53747379
4437 53747379 54736286 55849488 56896931 57870839 59045160 60328983 61741806 63121244
4429 63121244 64635427 66387021 67874566 69323275 71020291 72558784 74011510 75543418
4421 75543418 77302166 78948951 80654494 82606069 84592812 86516328 88699785 91100926
4413 91100926 93716679 96309309 99059432 101937223 104950109 108050415 111159864 114559820
4405 114559820 117801027 121237616 124903259 128498307 132319922 136045397 140105981 144263596
4397 144263596 148724728 153351619 157987826 162788586 167598226 172324233 176801216 181007607
4389 181007607 184967116 188706388 191884206 194670149 197160857 199344644 201095494 202982128
4381 202982128 204720332 206264081 207747985 208968689 209616549 209916441 209945243 209500754 208683929
4372 208683929 207353496 205600441 203506356 200962753 197965703 194942837 191532840 187859182
4364 187859182 184088587 179961576 175670521 171142229 166539524 161223799 155805479 150226240
4356 150226240 144619466 138874918 133478338 128475961 123858314 119782660 116161497 112703141
4348 112703141 109623307 107002344 104201984 101864120 99514364 97653722 95512543 93335194
4340 93335194 91157144 89161304 87107381 84887981 82632921 80307880 78297113 76284917
4332 76284917 74083130 72197699 70581462 68807339 67179350 65510483 64004123 62782408
4324 62782408 61581305 60170076 58873909 57686707 56398025 55491426 54523028 53852372 53193120
4315 53193120 52271275 51790596 51203795 50608729 50206117 49892371 49658293 49232697 49090571
4306 49090571 48892250 48530377 48181921 47871657 47518394 47134061 46745927 46123820 45808148
4297 45808148 45496020 45069599 44616830 44310610 44051760 43785733 43565871 43437055 43355759 43268635
4287 43268635 43160211 43318663 43473672 43712645 44040313 44252222 44507608 44737275 44813057 44955389
4277 44955389 44957245 44961974 45147535 45110776 44773152 44584066 44395158 44027612 44006489 43840958
4267 43840958 43755680 43836319 43994358 44039720 44198463 44404804 44840262 45115953 45514905 46169104
4257 46169104 46648964 47054336 47477190 48234774 48706268 49122664 49566753 50121737 50593380
4248 50593380 50904440 51100261 51231133 51176661 51238565 51034100 50672242 50578933 50344305 50130641
4238 50130641 49785591 49379481 49090544 48745103 48321401 48051319 47821854 47593338 47523368 47291997
4228 47291997 47019862 47011381 46954563 46842733 46937654 46927599 46829462 46988846 47192314 47417068
4218 47417068 47467057 47610599 47876361 47755993 47672966 47329118 47274804 47220122 47093960 46895654
4208 46895654 46436902 46202593 46020038 45707788 45437536 45206952 44923906 44916421 44660417 44307588
4198 44307588 44239774 44195354 44120681 44117184 43928957 44026685 44152497 44281991 44573201 44902484
4188 44902484 45241143 45369429 45625283 45752936 46233699 46652899 47059635 47602561 48002570
4179 48002570 48273298 48668069 49072256 49458508 49804257 50216695 50504624 50782086 51309606
4170 51309606 51810446 52442929 53088590 53790914 54527937 55337100 56296020 57483839 58666731
4161 58666731 60017402 61180950 62695198 64343104 66070796 67821623 69752604 72051926
4153 72051926 74454661 77181558 79977188 82919640 86353021 90043959 93711819 97996925
4145 97996925 102587583 107548971 113147903 119192989 125773647 132574062 140000740 148048538
4137 148048538 156436267 165519966 175684058 186889344 198593733 210706523 222932861
4130 222932861 234424846 244911062 254270005 262778964 270828642 279131071 287981605 296353203
4122 296353203 303030484 306770450 307118317 302684401 292813039 278455705 261510543 244668708
4114 244668708 228950593 214825488 202068608 190798564 180753625 172017296 164115242
4107 164115242 156981443 150630549 144495856 138968340 134099898 129762854 126024818 122786696
4099 122786696 120068990 117461614 115371168 113794685 112374124 111341244 110497725 109974812
4091 109974812 109739255 109626644 109771785 109901124 109966680 109932867 109564555 108986433 107888290
4082 107888290 106591189 104899549 103004569 101139465 99247206 97537149 96063663 94813246
4074 94813246 93856314 93161957 92668688 92451023 92571448 92831257 93163591 93797347 94435640
4065 94435640 95300499 96305880 97348521 98722246 99960262 101195145 102509570 103327298
4057 103327298 103407411 102726356 101248999 98967536 96026613 92746067 89601509 86721870
4049 86721870 84116509 81908670 79812693 77961687 76312319 74893619 73947688 73102381
4041 73102381 72412555 71789151 71312227 71129068 70826419 70713337 70878002 71026408 70979387 70965170
4031 70965170 70913867 70740731 70522316 69725539 68859895 67838258 66435086 65072272 63483843
4022 63483843 61861479 60320955 58925047 57530055 56388755 55342331 54351277 53344168
4014 53344168 52518286 51801535 51173693 50733955 50258747 49799337 49397876 49228099 49111373
4005 49111373 49192858 49193420 49281124 49571204 50002975 50423289 50958314 51377010 51824994 52511399
3995 52511399 53139755 53664325 53926659 54219345 54730342 54894034 54814827 54810564 54762754 54992318
3985 54992318 55191565 55586734 56064233 56883437 57909581 58887400 59947782 61341463 62901512
3976 62901512 64620164 66176543 67757795 69212015 70603546 71740577 72892093 74283222
3968 74283222 75796142 77427776 79343367 81072942 82611608 84088796 85050556 85379633
3960 85379633 85090354 84577551 84073080 83858739 83625364 83513959 83775551 83950921 83983307 83845235
3950 83845235 83225824 82236846 81194739 80143284 79067259 78042773 77072277 76177114 75498543
3941 75498543 74861547 74285092 73786392 73230884 73177407 73102264 73216084 73330663 73600405 73961210
3931 73961210 74388487 74898680 75484536 75923454 76131024 76603934 77049401 77387093 77869874
3922 77869874 78125037 78377622 78647028 79055782 79548987 79923935 80374822 81083708 81923655
3913 81923655 83102294 84304803 85947064 87646707 89589145 91808986 94086110 96606318
3905 96606318 99201059 101809060 103969510 105482772 106483558 107078534 107111621 106863727 106944794
3896 106944794 107192784 107525300 107742023 107503580 106730814 105598318 104046860 102251838 100775214
3887 100775214 99634599 98603240 97507035 96767423 96120056 95996151 96060145 96285381 97119874
3878 97119874 98311702 99923336 101982682 104360901 106290934 107995841 109581327 110402517
3870 110402517 110119135 109324124 108484531 108004374 107966111 108039349 107981705 107605973 106978303 105791338
3860 105791338 104280074 102256875 100336491 98636947 97194748 96291770 95504532 94892902
3852 94892902 94284851 93469542 92380000 90991707 89441634 87540507 85547042 83524028
3844 83524028 81685813 80253230 78832584 77462342 76197810 75255099 74343370 73668306 73286332
3835 73286332 72786938 72274803 72142298 72199754 72374590 72529065 72566863 72575903 72557357 72841679
3825 72841679 73091714 73382062 73879688 74502120 75174950 75942095 76904339 77983173 79001564
3816 79001564 79888326 80947595 81623125 81979810 81990968 81797046 81734273 81866926 82476091 83226337
3806 83226337 84078565 84366083 85120813 85763357 85423759 84758875 84172760 83827425 83972758
3797 83972758 84079905 84366915 84692376 85152565 85746787 86320552 86905158 87450970 87878626
3788 87878626 88343161 88651111 88662935 88590503 88680018 88679451 88669717 89046372 89523644 90188629 91137301
3777 91137301 92057384 93143184 94556495 96038988 97479067 99238689 100980816 102463070
3769 102463070 104074078 105967626 107600590 109110732 110568989 112035345 113663463 115233743
3761 115233743 116649037 118087499 119648865 121273593 122998840 124829207 126703557 128538831
3753 128538831 130534647 132531080 134592616 136601778 138600278 140475188 142401231 144275262
3745 144275262 146120426 147916418 149719032 151513325 153254436 154778047 156284530 157726216
3737 157726216 159011005 160239501 161446714 162558342 163517579 164351514 165227014 165908880 166694212
3728 166694212 167252250 167776431 168329771 168950019 169547644 170248528 170846005 171357293 171968689
3719 171968689 172652178 173090958 173569280 174178567 174725620 175234216 175824684 176351958 176904433
3710 176904433 177094191 177605262 177886375 178008257 178206337 178396134 178457734 178410933 178145940 177725552
3700 177725552 177417692 177141697 176994504 176861916 176647176 176480836 176426300 176380618 176307412 176135056
3690 176135056 175990494 175839501 175700247 175540559 175623666 175494594 175444263 175176474 174998765 174537864
3680 174537864 174150739 173555101 172945430 172252085 171467221 170565373 169701119 168727769 167863160
3671 167863160 166800512 165627949 164446581 163238328 161706114 159897743 158125146 156086817
3663 156086817 153764168 151234746 148978297 146526382 144201308 142043308 139796307 137571756
3655 137571756 135364855 133301409 131313048 129293933 127274411 125261655 123613740 121800799
3647 121800799 120094528 118558203 117205372 115822459 114397371 113417925 112345675 111229575
3639 111229575 110560124 110233402 109623771 109219199 108851755 108588701 108685180 108484505 108256201
3630 108256201 108394117 108358210 108275571 108177854 107951648 107754842 107477356 107339013 106964408 106629647
3620 106629647 106228158 105830901 105799709 105489846 105176127 104873395 104404546 104143447 103859960
3611 103859960 103510224 103155248 102861386 102452520 101919949 101413319 100805265 100145426 99620001
3602 99620001 99248311 98721773 98197905 97951942 97712521 97302954 97033198 96564557 95986324
3593 95986324 95599420 95001672 94609899 94268652 94060504 94008093 93937409 93878724 94038202 94337819
3583 94337819 94711196 95050149 95158268 95513733 96052741 96543554 96913509 97311034 97859709
3574 97859709 98378425 98974271 99710019 100479037 101219109 102073093 103072026 104033125 104981763
3565 104981763 106017139 107303182 108509160 110055741 111737629 113308978 115258119 117420811
3557 117420811 119850327 122687631 125656669 128926472 132500430 136351860 140216360 144420318
3549 144420318 148922055 154051873 159816948 166032279 172811545 180226346 188286809 196658319
3541 196658319 205502381 214562348 224144498 234111259 244312700 254619604 264425298 273615872
3533 273615872 281963693 288834441 293927793 297283727 298731980 298706544 297365905 295177963
3525 295177963 292440564 289078461 285596222 281494409 276973985 271916000 265769697 258720175
3517 258720175 250655398 241371269 231589300 221126344 210762088 200601360 191005764 182482770
3509 182482770 174509065 167406899 161333791 155732174 150481438 146007340 142077022 138486509
3501 138486509 135214808 132541874 129915993 127579143 125677474 123920694 122552044 121323606
3493 121323606 120199257 119230351 118500285 117970751 117555356 117379671 117288579 117389059 117628995
3484 117628995 118072385 118570219 119047786 119705469 120370443 121385890 122583603 123851217 125127339
3475 125127339 126375514 128168543 130240844 132306478 134640295 137150133 139887334 142878637
3467 142878637 146072347 149493338 153027478 156769466 160503951 164347700 168274664 172038159
3459 172038159 175595176 178968860 181882591 184564874 186968199 188772131 190376451 191983374
3451 191983374 193257108 194414840 195363589 196260227 196997158 197493340 197834163 197889301 197905207
3442 197905207 197793314 197501226 197292906 197240254 197417840 197837742 198428720 199367230 200866254
3433 200866254 202637541 204629189 207018412 209447776 212413437 215531906 218866797 222186421
3425 222186421 225560170 228855612 232157079 235359139 238403980 241052241 243528252 246192038
3417 246192038 248313553 250362129 252480059 254268833 256435536 258384662 260119699 261982034
3409 261982034 263720072 265611297 267370109 269165763 270830503 272622372 274548216 276534663
3401 276534663 278838727 281481436 284394790 287353838 290578131 294105019 297623338 301725382
3393 301725382 306247839 310965715 315804739 320871333 326128614 331458951 337282018 343185614
3385 343185614 349303533 355847835 362504535 369178497 376232451 383329809 390607916 397766202
3377 397766202 404645020 410909200 416515614 421598828 425848952 429586617 432583410 435058520
3369 435058520 437311543 439490288 441059675 442203422 442927501 442678236 441221187 438487817
3361 438487817 434486589 429653748 423766883 417099721 410190279 403560102 396903693 390643087
3353 390643087 384793848 379156496 373876125 368600636 363606107 358635610 353871332 349079197
3345 349079197 344197284 339023621 333734706 328409939 322603785 316262919 309876662 304036081
3337 304036081 298607142 294201257 290478540 287422310 285067964 282878842 280690076 278323949
3329 278323949 275867323 273267835 270586563 268162100 266461687 265483915 265319818 265710724
3321 265710724 265954045 265545318 263990421 261244093 256309284 249223892 240802738 232081652
3313 232081652 224335691 217569076 211726490 206592602 201872172 197427923 193401019 188978902
3305 188978902 184375060 179712379 174512801 169258253 164342888 159886332 155958547 152584749
3297 152584749 149386838 145806082 142057423 138035907 133051331 127648771 121847742 115911812
3289 115911812 110517381 105550006 101017865 96870233 93038341 89586992 86349872 83511168
3281 83511168 80985574 78532480 76082302 73914887 71727341 69745549 67904319 66015442
3273 66015442 64377857 62661198 61047194 59413888 57794872 56205997 54801403 53135026
3265 53135026 51605961 50137914 48831785 47379534 46115091 44945561 43761666 42707957
3257 42707957 41688855 40747183 39592407 38901186 38122718 37028103 36138904 35470295 34777038
3248 34777038 34007701 33193834 32305250 31472495 30771828 30155495 29581030 28855124 28395080
3239 28395080 27739303 27131108 26592682 26022934 25683471 25300803 24987625 24606549 24232738
3230 24232738 23744483 23183694 22964606 22604978 22228266 22126258 21807626 21477304 21228383
3221 21228383 20898041 20458796 20422090 20587311 20302991 20340796 20153006 19972883 20024702 19865891
3211 19865891 19750503 19451570 19090694 18748110 18357878 17784271 17442783 16946763 16579715
3202 16579715 16191662 15675057 15607590 15511010 15004670 14659715 14436138 14290431 13951650 13719001
3192 13719001 13532928 13457580 13151041 12905459 12616196 12416542 12243018 12033974 11959143 11765361
3182 11765361 11530847 11390477 11438200 11253115 11369177 11173994 11109044 10888004 10666894 10706691
3172 10706691 10589466 10526403 10364379 10416992 10389803 10267247 10040558 9968296 10018781 9995294
3162 9995294 10202807 10115631 9962702 9810707 9805178 9842217 9724947 9642030 9702998 9511975 9474934
3151 9474934 9397725 9505265 9415377 9328235 9349589 9418032 9424911 9307325 9353806 9234277 9290949
3140 9290949 9329049 9237280 9190959 9117719 9006962 8972664 9055957 8945189 8807252 9101855 9088077
3129 9088077 8882231 8830756 8751557 8862387 9013274 9054629 8981222 8987822 8927352 8913202 9011740
3118 9011740 9026532 8994647 8978617 9085548 9124000 9225394 9294474 9254514 9289942 9464697 9419405
3107 9419405 9273926 9387591 9520152 9410211 9564277 9544296 9634391 9577624 9615079 9644287
3097 9644287 9694567 9743096 9861674 9946293 10080138 10186101 10368368 10561369 10547746 10584896
3087 10584896 10673927 10817452 10907961 11086986 11033658 10911083 10820860 10879352 10719529 10480842
3077 10480842 10233892 10185298 9958506 9829127 9591508 9365187 9183190 9151954 9133715 8947458
3067 8947458 8748836 8674351 8494931 8574511 8571271 8492179 8504689 8518911 8442378 8375956 8509697
3056 8509697 8398881 8611292 8765246 8772409 8838706 9060114 9381854 9351616 9587290 9724622
3046 9724622 10080348 10533491 10859524 11332618 11985976 12636976 13096231 14007157 14510369 14864894
3036 14864894 15284476 15510531 15095912 14210636 13380103 12792167 12216021 11946576 11750061
3027 11750061 11582891 11390167 11241056 11396746 11572770 11854923 11993936 12326812 12674466
3018 12674466 13156051 13688928 14180744 14827217 15551715 16366766 17453686 18802560 20184946
3009 20184946 21251879 21768790 22315327 22207586 20914954 19199817 17559862 16191096 15091028
3000 15091028 14167962 13512422 12777727 12387939 12076680 11863070 11735546 11533526 11399064
2991 11399064 11356531 11315241 11389805 11425240 11594536 11541013 11500712 11843470 12142562 12601470
2981 12601470 13005190 13153498 13212436 13371513 13077622 12263792 11266487 10327276 9600499 9204381
2971 9204381 8713686 8173424 8011828 7657206 7276469 7036668 6976681 6773219 6537665 6275392
2961 6275392 6091362 5893327 5801620 5680613 5329693 5126230 4900090 4811237 4770590 4745142
2951 4745142 4612513 4356727 4353946 4270354 4238194 4183302 4109821 4020098 3739131 3955560 3900256
2940 3900256 4025043 3933977 3866981 3723278 3764682 3796363 3796276 3723213 3617184 3626109 3618372 3559221
2928 3559221 3535516 3555562 3441814 3307385 3073155 3067803 3172027 3185552 3086291 3174602 3144562
2917 3144562 3072958 3228196 3138290 2926289 2966801 3060634 3057592 2996355 3090370 3104452 3122935
2906 3122935 2996631 3152059 3024206 2921954 3041300 2835488 2716400 2621980 2477475 2440562
2896 2440562 2588192 2378628 2392280 2247821 2229364 2349080 2259203 2147042 2055958 2079321
2886 2079321 1974745 1925672 2098969 2069068 2045768 2023849 1963525 2100674 2072131 2087026 2053331
2875 2053331 2099655 2137255 1996357 1864870 2008862 2207537 2105534 2000458 2012284 2011955 2151182
2864 2151182 2034424 1930671 2171289 2151690 2358353 2262900 2254829 2288538 2256471 2461989 2494657
2853 2494657 2680778 2631075 2708249 2827878 2836497 2870975 3004902 2998645 3091357 3056172 3049045
2842 3049045 3055661 3000822 2898266 2874995 2903619 3004240 3046322 3162558 3189469 3300521 3458896
2831 3458896 3422428 3488138 3559744 3600432 3543226 3543320 3492208 3594180 3609341 3652087 3706537 3807201
2819 3807201 4007863 3992349 4094580 4168146 4061251 3992780 3976221 4082804 4159130 4151755 4309097
2808 4309097 4574059 4589104 4623457 4810867 4974042 5155324 5166926 5196362 5342827 5283789
2798 5283789 5282006 5276234 5288504 5467721 5552618 5688656 5798140 5900188 6205565 6531638 6651334
2787 6651334 6859098 7146688 7253154 7166911 7245550 7309461 7097230 7216421 7004563 6869053
2777 6869053 6874090 6668188 6884699 7181756 7170683 6947871 6957982 7185196 7238793 7400853
2767 7400853 7604000 7827349 7984134 8193730 8289664 8555813 8906423 9006426 9431287 9705306
2757 9705306 9897640 10008356 9977764 9962073 9833725 9352121 8779727 8200808 7656703 7222261
2747 7222261 6897306 6504468 6276705 6133944 5909092 5853055 5885209 5777047 5749497 5744720
2737 5744720 5782774 5867130 5798327 5785384 5658434 5916972 6144496 5949009 5763372 5792262
2727 5792262 5646963 5589715 5547867 5372765 5282460 5133574 4728835 4464408 4155946 3954415
2717 3954415 3698157 3723206 3290002 2949416 2731165 2757156 2825292 2635409 2650120 2400846
2707 2400846 2223323 2112561 2063989 2038532 2089888 1937665 1826437 1794171 1884824 1851878 1860191
2696 1860191 1768357 1707257 1549056 1653640 1498945 1379597 1299111 1351990 1339579 1421113 1322032
2685 1322032 1179439 1156893 1256047 1119711 1172053 1178557 1084305 1066638 1173744 986939 734800
2674 734800 881486 993358 971738 867242 943546 803891 764262 631902 648885 670767 770157
2663 770157 709048 729006 600256 631818 741052 895450 793671 694326 619010 620357 666403
2652 666403 741394 654683 580843 514473 530062 459114 411197 456904 367413 218729 289741
2641 289741 203569 129154 381664 591565 462491 317266 257471 223198 456557 278160
2631 278160 210573 286578 339698 395102 347380 216161 212362 138704 186736 101790 25600 55314
2619 55314 147086 82930 6094 119031 176662 -31651 59448 146450 147482 171308 119123 91891
2607 91891 90683 125593 138298 166960 146022 -15993 -79521 -86025 84369 134117 53507 25903
2595 25903 54362 64411 -38013 -136000 -124025 -60828 -162285 -1212 71187 80941 -10600
2584 -10600 -77924 12775 69799 43945 6939 112676 70359 21100 95549 -4030 -73063 -5418
2572 -5418 -63420 -103006 -43972 -90760 -72122 -62397 32974 20453 -61853 -24024 -3818 -165100
2560 -165100 -77916 -46998 -35486 46656 -59094 -88198 -14183 -194778 42912 38601 -198129
2549 -198129 -166448 -122285 -167327 -233782 -93802 -139188 -110609 -7676 -12086 -17449 43702 41544
2537 41544 832 -156789 -24757 138431 170812 121568 18942 -35222 -166968 51164 50084
2526 50084 -36088 8739 -79389 -22203 35591 -86294 -167162 -169063 -154070 -23316 -137354
2515 -137354 -180268 -153398 -45043 -20879 -89621 -47146 -23207 -63705 -242363 -251729 -73804
2504 -73804 -26009 32098 168473 184971 -81992 -139739 -104375 -38657 37184 22165 -22026
2493 -22026 8600 3382 24469 63415 94447 54234 60840 -11235 -95067 55239 126292 137278
2481 137278 255635 198725 92887 184831 218776 121489 11421 139976 260984 228793 128413
2470 128413 242122 114261 80635 356469 437221 505474 408445 378184 477392 253004 195009
2459 195009 272018 228006 155620 110394 65256 251955 140783 217648 276035 217887 200543
2448 200543 160687 195276 273925 310421 331143 437935 441216 441152 413325 530731 298403 247289
2436 247289 255619 396729 245209 74343 73047 124085 4674 68005 266769 237290 178174
2425 178174 94975 46443 1770 41532 -71084 -74375 25528 20068 -20769 -159535 -208623 -152549
2413 -152549 -194917 -156256 -99789 10782 -22459 -108921 -240526 -287129 -160799 -132696 -240132
2402 -240132 -249844 -106296 -275836 -330943 -234563 -269829 -176316 -117745 -188455 -184504 -19268
2391 -19268 -129998 -258359 -204688 -220244 -258152 -281038 -191546 -201783 -138517 -110440 -251671
2380 -251671 -259399 -221677 -277107 -262648 -189316 -298897 -274525 -363113 -283363 -264503 -341213 -233441
2368 -233441 -73692 -98671 -249325 -329628 -241258 -231286 -226886 -209954 -313444 -319575 -213272
2357 -213272 -183666 -326052 -322826 -209023 -277604 -248728 -268056 -381701 -311718 -313778 -323824
2346 -323824 -202694 -285915 -211478 -49327 -188297 -66939 -119255 -152969 -192863 -117490 -129185
2335 -129185 -83812 -41562 -167924 -251883 -184463 -59459 -75918 -206146 -248220 -169037 -265225
2324 -265225 -111914 -155264 -118299 -91663 -193071 -202535 -82064 -129325 -85374 -50727 -136736
2313 -136736 -147410 -89399 81516 -149405 -244468 -178857 -327763 -218506 -112625 -239702
2303 -239702 -284511 -178144 -153585 -53686 -127991 -164953 -31186 -96126 55035 119710 65016
2292 65016 67103 -67139 -104082 -125572 -161084 -157303 -49822 -145367 -212871 -123242 -143489 -39201
2280 -39201 65453 99974 78001 133408 2765 -55164 -93316 -79802 -47795 198334 206486
2269 206486 257468 222745 125866 217398 244995 232139 278239 364677 246244 326478 208077
2258 208077 316308 319966 281780 479442 560891 547947 487179 412488 392756 509941 371106
2247 371106 381393 377679 318905 336329 433957 405486 371066 390022 546248 623960 608150 569820
2235 569820 577168 496549 365232 497554 513328 414479 376623 396880 469446 479374 489569 319329
2223 319329 161864 173161 232461 296816 275693 359457 250892 347920 358558 309671 414311
2212 414311 262399 107778 217953 182623 136836 168257 7189 -41204 149504 84707 29779
2201 29779 59977 110721 124117 155727 307079 189890 -5269 -113802 16872 157410 66772
2190 66772 46736 267377 224647 37009 25524 -85895 -61207 39048 -82874 -156812 -223436
2179 -223436 -114628 138342 115253 -64409 -62295 -212709 -124098 -93133 -123508 -116044 -88520
2168 -88520 -34505 136546 124445 -19288 87601 180371 171813 -27879 -100174 21708 78948
2157 78948 -47728 -8361 -2610 24100 -30270 -7111 113860 63971 -23226 127705 168915
2146 168915 132372 35210 60864 46810 227388 314512 385179 388062 259827 274823 382177
2135 382177 362041 351477 484392 573541 494798 427416 396632 439136 398658 454132 536743
2124 536743 431616 552187 593643 595491 581768 588092 606769 770745 839711 819988 826354 888907
2112 888907 986721 960369 942513 1034680 1088117 1080435 1156907 1150585 1167070 1237184 962596 999143
2100 999143 1109709 1068575 1203878 1175078 1148518 1310055 1344509 1328473 1411586 1434048 1597178
2089 1597178 1804055 1932072 1857138 2000233 2059860 2016823 2061587 2172381 2302427 2535151
2079 2535151 2503974 2739763 3072512 3223153 3545412 3907347 4117448 4396690 4781618 5313279
2069 5313279 5843438 6295930 6831240 7422702 8161145 9148405 10126835 10905255 11925676
2060 11925676 13169032 14655231 16629857 18615895 20543719 21957652 22554721 23401050
2052 23401050 22907520 20520228 17025909 14413986 12516774 11061068 9837485 8871752
2044 8871752 8049588 7439085 6682048 5940744 5522947 5166719 4917188 4591589 4093539 3754581
2034 3754581 3675913 3309154 3037320 2671465 2500613 2465911 2333371 2271732 2015531 1855036
2024 1855036 1818389 1862943 1660724 1808097 1839047 1501814 1453667 1360646 1198459 1116748 1099603
2013 1099603 1008834 973441 979838 910672 864367 923970 863350 713714 953028 1075450 922940
2002 922940 760884 705880 678137 658431 568675 460909 564829 398015 198952 224336 275138
1991 275138 355842 381653 322462 409977 330626 260800 265638 308567 270732 304037 282399 261799
1979 261799 378505 332923 252397 234642 228231 151263 83125 -31845 102714 76241 -71534
1968 -71534 23965 40774 -28256 -53450 104020 38552 55831 -22434 14515 24143 45598 -49621
1956 -49621 -171581 -119101 -38903 -45763 25136 -18177 -132654 -25224 -45218 -45828 -118796 -198814
1944 -198814 -169767 -89934 40971 -17857 34168 -92302 -262031 -142383 50104 -111434
1934 -111434 -161018 -149162 -117321 -39110 50090 -41425 -105623 -241204 -104563 -137252 -65683
1923 -65683 -38425 24505 -83131 -105122 -96565 -78500 -76847 -133495 -114175 -69179 -85117 -167020
1911 -167020 -153034 -158622 -166644 -179270 -120207 -258428 -234075 -166485 -210769 -448271 -166604
1900 -166604 -205402 -73742 -212546 -172889 -280780 -282604 -187547 -343858 -331794 -262644 -282734
1889 -282734 -328050 -272262 -141270 -121326 -278723 -329050 -111823 -263559 -270157 -202750 -223134
1878 -223134 -116049 -172884 -261959 -319038 -240202 -153145 -42799 -247723 -216233 -144310 -272786
1867 -272786 -269513 -266346 -238790 -121825 -213127 -279161 -235467 -124861 -189903 -164115 -120974 -106320
1855 -106320 -20059 -216726 -218045 -139248 -289487 -310699 -210346 -174086 -73845 -102145 -131982
1844 -131982 -177143 -232790 -144744 -164987 -354534 -258522 -234264 -255791 -372816 -206990 -142944
1833 -142944 -406299 -431771 -188349 -216308 -251205 -120786 -213205 -274247 -348192 -240766 -9476
1822 -9476 -90481 -39101 -153757 -306302 -330217 -310940 -28281 -80540 -210855 -196306 -105454
1811 -105454 -135397 -88509 39621 -86301 24257 -19413 -55568 -104668 -280120 -278732 -207383
1800 -207383 -134958 -74274 -99851 -164574 -156917 -241442 -167201 -166615 -241826 -307825 -240206 -310600
1788 -310600 -173612 -164463 -99202 48332 -43681 -257861 -108925 -156831 -238813 -122458 56238
1777 56238 -20325 -179161 -5139 -24254 9584 -106050 -102086 -193015 -227891 -223422 -291798 -189611
1765 -189611 -42175 -41707 -113327 -242540 -234275 -135933 -228053 -225266 -346273 -324738 -200264 -193283
1753 -193283 -188158 -348698 -367299 -101212 -67583 -128982 -121361 -143196 -322084 -117911 44139
1742 44139 -113548 -212622 -321481 -321551 -111067 -213598 -181680 -108832 -139093 -251459 -365975
1731 -365975 -208935 -221323 -107339 -82337 -113154 -224328 -187772 -72209 -210727 -223715 -255822
1720 -255822 -167703 -259444 -172326 -222576 -308648 -244954 -207162 -357326 -307414 -80872 -142155
1709 -142155 -110580 -215497 -267097 -210609 -225436 -190711 -154921 -365300 -108293 -191819 -228327
1698 -228327 -327432 -289523 -87272 -316980 -242741 -234932 -155811 -93640 -111252 -100792 -186964
1687 -186964 -327681 -337512 -214388 -177902 -303122 -292290 -256723 -208258 -154986 -126268 -168981
1676 -168981 -392285 -231431 -94472 -54641 -140186 -293582 -310106 -324357 -150047 -67597 -228151
1665 -228151 -338933 -231435 -153951 -184573 -118198 -181440 -214008 -202684 -193308 -127479 -314461
1654 -314461 -282339 -81312 -213792 -248886 -213926 -229112 -143129 -266187 -343568 -361147 -302543
1643 -302543 -244747 -229729 -119481 -132416 -144630 -140861 -77745 -194096 -192241 -311162 -245606
1632 -245606 -274060 -299494 -87787 -124069 -257527 -175966 -259427 1719 -189797 -245853 -181965
1621 -181965 -237420 -111752 -234134 -129774 -129145 -216769 -45155 -1330 -167882 -208189 -252718
1610 -252718 -226760 -253143 -162418 -246844 -245724 -215061 -324709 -219442 -260559 -156071 -96338
1599 -96338 -296283 -286531 -272388 -320422 -191169 -148445 -221866 -222773 -191773 -52733 -119371 -259642
1587 -259642 -308314 -196606 -152083 -127487 -212305 -257320 -203609 -135138 -132345 -2387 -30908
1576 -30908 -69300 -218863 -116704 8364 -182309 -130936 21391 30666 22384 -156204 -162292
1565 -162292 -88711 -155594 -78525 -199803 -156345 -131617 -150248 -180278 -196534 -100069 -173940
1554 -173940 -95722 -266156 -181234 -183906 -250984 -189298 -80591 -229261 -392144 -368745 -358613
1543 -358613 -170363 -261471 -80493 -132930 -436063 -545695 -398193 -95805 1110 40381
1533 40381 -176288 -206374 -160273 -102862 168174 15880 -67685 3185 -56188 -106133 -220646
1522 -220646 -163098 -248754 -189361 -110743 -210413 -202117 -190239 -122995 10991 -20877 -151421
1511 -151421 -142729 -84289 -242439 -206014 -38475 -73378 -104591 -103970 -110063 -23342 -8012 -133721
1499 -133721 -173942 -205457 -272328 -298250 -299799 -312663 -369537 -235520 -76735 -65498 -77319
1488 -77319 -183794 -24126 -188979 -204201 -372485 -340872 -327949 -225894 -157431 -110687 -79830
1477 -79830 -183879 -257402 -119554 -139456 -121729 -111893 -268207 -236245 -222418 -171949 -59845
1466 -59845 -84590 -183230 -40572 65138 -87222 -82568 4586 -52656 20265 -65367 -162442
1455 -162442 -163405 -85775 -252873 9570 37109 -89785 -64207 74035 133953 80086 -86233
1444 -86233 -238042 -211062 -76244 -17958 -125867 -108794 -148786 -98684 -223980 -236383 -101939
1433 -101939 -148773 -101790 -145905 -319666 -245572 -122774 -104894 -328643 -285632 -301647 -194181
1422 -194181 -109241 -237843 -166578 -116889 -182838 -216800 -350802 -320264 -299207 -358778 -177231
1411 -177231 -18225 -55222 -72586 -165800 -395475 -342034 -122398 59286 -93822 -10738 66593
1400 66593 -65978 -55600 46886 -226907 -288435 -155252 -15917 76558 -48034 -249381
1390 -249381 -297951 -156898 -112081 -106075 -204367 -117855 -91307 14094 6233 -97013 -112606
1379 -112606 -27573 -122270 -217652 -111702 -163126 -194149 -105812 -207633 -251633 -242934 -214150
1368 -214150 -239646 -158522 12820 -108347 -246626 -179075 -31007 -74523 -162641 -257997 -68994
1357 -68994 -171190 -216722 -258404 -211952 -209402 -134261 -276116 -254646 -153665 -161268 -270729
1346 -270729 -245692 -194287 -357312 -208616 -158946 -23305 -158227 -419336 -107017 40928
1336 40928 -217609 -273333 -194787 -137225 -170754 -167891 -84610 -121234 -136092 -8749 -53838 8748
1324 8748 -13541 41163 -77326 -89556 120630 73626 -107905 -367694 -181856 -114094 -241264
1313 -241264 -214129 -110779 -175581 -131278 -120674 -136205 -20799 32568 -28796 -157049 -207444
1302 -207444 -182767 -146150 -144030 -136765 -210309 -220031 -135041 -41246 8103 204294 104348 8944
1290 8944 34162 -78381 21650 -21751 -236964 -22133 21704 -43880 -141495 45862 -33406
1279 -33406 -46305 -76067 126701 -17564 -16907 86921 -83610 -182836 -190100 -33275 -104987
1268 -104987 -94824 23726 70699 10719 -21148 -101183 -150424 -15917 129480 45185 20817
1257 20817 8689 41703 -112374 -167225 -118024 -36379 -7620 -137292 -221950 97108 196934
1246 196934 129519 141769 103260 41654 81001 30505 80597 -26186 -4753 118751 49835
1235 49835 -63780 -156608 -86816 -268560 -355142 -200573 -145596 -80504 668 74561 -24337
1224 -24337 -221691 -47132 52016 -42994 -63358 -74741 36122 -63322 -72094 -60345 -73426
1213 -73426 -85637 -40850 -60007 15693 -98314 -212721 -174779 -16762 110244 -41895 -60528
1202 -60528 -142109 -62266 -115229 -187568 -54646 -105365 -152136 -106902 -39479 13712 -154168
1191 -154168 -88822 10285 -35319 -121884 -100601 -122689 -75750 -118575 -10574 -59736 -12521
1180 -12521 -16211 -164509 -55623 16386 2933 67193 52717 -198714 -136677 68283 127068
1169 127068 -18309 -70040 -52261 137115 114864 28615 2975 153196 84190 -104017 -8938
1158 -8938 -31009 -115742 38393 162650 18372 -16891 -142826 -146763 -23418 138882 125259
1147 125259 169453 224620 31994 -60974 -5156 19863 81350 30447 -87571 192155 77522
1136 77522 -28580 -38296 -15038 -31994 -44886 -67929 -91611 -62374 -137061 -77013 -77332 -43258
1124 -43258 -25616 6059 -2983 135167 42747 29881 25422 -70142 -143551 -161267 -138909 -106410
1112 -106410 18003 42969 30851 5610 -15009 -37553 80269 57012 3615 -81803 52887
1101 52887 48901 14060 15644 -40168 -104265 -50656 63331 3796 21156 71432 146401 -70319
1089 -70319 -187289 -117718 -89903 -51865 -139797 -98529 -45769 26554 13843 -47163 31033 -82695
1077 -82695 -67830 -91659 24996 -137310 -157743 15080 14316 -244 -151879 -136166 -68560
1066 -68560 63221 36008 75202 117756 134099 161016 112931 149094 -40151 -45869 39710 75177
1054 75177 114175 11399 16370 41919 -7348 -20895 152143 165078 64945 -94315 -50277
1043 -50277 118137 89856 -53165 -160454 30902 82571 -138759 15295 234036 263489
1033 263489 204088 217703 174908 101898 29432 -33891 29842 23119 79862 29848 70299 -85363
1021 -85363 -66169 79090 226336 83249 101551 -957 -187382 -128912 -160361 -140972 -96698
1010 -96698 22960 108055 37043 70477 71160 103578 -31065 -135462 -131156 -84172 -22084 10704
998 10704 -12121 -17396 -52548 -202705 -94339 31660 135661 -9501 -49437 -35956 -23595
987 -23595 124899 239724 189559 72918 121189 -1295 58126 131260 -174105 -29774 743
976 743 -39578 -113240 36941 57875 141595 112368 -38787 141608 189468 133362 47595 7417
964 7417 30189 57681 88371 54447 -22691 219387 12740 -124722 110539 240025 185947
953 185947 110304 -16109 -141782 -28376 -40043 -3562 61125 205539 34727 25490 -23171
942 -23171 7316 69396 78563 158341 143095 119538 75939 17733 34388 -58302 21878 -27739
930 -27739 -32835 -120545 -22957 -2892 3824 -16092 76044 94919 26362 63096 -45062 -83261
918 -83261 -32053 -63164 -60782 -90746 -66680 42644 26610 40452 67718 -9902 -111282 -46119
906 -46119 59628 212399 246943 188966 119123 202835 -7471 113532 282156 103718 -39729
895 -39729 138358 -6582 -151108 -163757 -1831 124442 126146 109481 19303 -21687 -101524
884 -101524 65033 127790 -78104 -39846 8862 79688 68773 143814 93016 89625 111283 36915
872 36915 18334 186288 92156 -32400 -12050 117043 41989 47058 -78094 -161582 19939
861 19939 119328 -115692 -1698 91914 142048 160314 90674 41094 206511 129021 36024
850 36024 40371 117958 -36843 79249 293961 113032 32838 52808 134042 -32870 53339
839 53339 37993 133984 188877 156574 59090 24188 -2828 -94739 -121774 -30739 29471 171442
827 171442 136351 146828 107985 111026 133258 220222 134170 187661 130735 46161 115641 -51848
815 -51848 -38830 103441 22765 178248 88926 62811 110157 87577 5528 -130175 -27167
804 -27167 94143 -4622 -103976 -138662 -20729 153175 48877 70616 205117 187245 246315
793 246315 41739 173567 67280 135552 129435 112277 57475 49913 -20341 76829 139542 -108256
781 -108256 -52764 -40261 -60832 -31799 84180 164361 203769 103070 36509 90647 97138 13800
769 13800 -8432 -135318 -113505 -143697 -114829 -39057 -33634 -173426 -337160 -6583 95311
758 95311 -43318 109689 105811 141661 19344 85703 155480 56624 -75367 -97907 -9148
747 -9148 136224 107129 164766 106017 105985 12128 -72564 66071 18389 65375 127004 69050
735 69050 163492 158952 235006 175480 121601 125436 65812 127629 28255 43518 52563 109130 165697
722 165697 67984 -7696 -162254 -160502 -52650 -66881 60377 18491 134401 218317 235567
711 235567 53460 22319 221434 85360 166064 142117 142572 83144 104560 249759 218648
700 218648 63918 29587 -65700 200821 120353 8421 50662 40519 61785 34076 200850
689 200850 33486 173539 294907 254663 171668 76707 232453 96163 -32841 -17963 -30358
678 -30358 74707 81549 7208 2030 46292 35925 -49368 3499 137230 189146 26373 94488
666 94488 283563 133129 78881 104244 106784 -122923 -61328 -68627 27398 86933 81966 61835
654 61835 68952 39536 107818 110783 145096 323178 200935 -1272 -50297 41622 -42479 52985
642 52985 69108 68214 75009 69742 -16324 106668 89323 41235 32907 -63596 -5331 161629 245559
629 245559 157073 27161 -34888 -46595 4328 73943 61086 4590 26460 39435 78875 90891
617 90891 92892 127780 103911 73262 54923 74692 73309 219551 149095 22129 139281 269748
605 269748 95523 122319 213593 107858 181173 250023 191081 204976 209844 44031 -51724
594 -51724 82289 23789 195630 29773 -105082 -10497 -15775 33968 20365 27490 99037 14265
582 14265 50554 165472 218347 107765 5822 106659 133648 8126 -73951 52385 154094
571 154094 261543 135847 110953 66669 88024 -2643 196932 199270 110472 173653 84609
560 84609 -24484 -166148 -4905 -34451 140661 233908 181144 70111 -22881 1981 210760
549 210760 235028 85523 318076 229673 210653 160669 166774 102613 -22318 -97446 -65327
538 -65327 -102394 13927 32709 151305 248475 160682 272733 81024 132064 108558 -75501
527 -75501 14671 -1364 83005 167313 76797 -69945 47860 135066 255165 74261 52967
516 52967 174937 155739 170512 147705 183867 145260 171935 167384 163357 148036 38041 35638
504 35638 133872 8356 103110 27798 48370 26923 -5162 7737 85134 180164 143225 6169
492 6169 67556 106968 74641 240721 261804 129370 95401 116338 109074 101845 52288 -9475
480 -9475 -3809 6860 142124 163010 308829 165904 217103 91559 201098 223906 -5105
469 -5105 -34978 -22733 50553 4039 -65550 -28180 75115 279568 238710 218343 258415 205200
457 205200 232237 205839 314635 78473 117592 43484 52643 133641 203862 131563 176580 262916
445 262916 173261 101176 90795 -19880 105404 304234 222643 -8054 133865 128157 137051
434 137051 78761 142958 173427 273432 223804 267538 160585 88497 160767 179177 167224
423 167224 210447 242224 116066 168897 225377 40930 -89282 37050 138242 266675 77922
412 77922 163260 237501 100879 12404 140961 28825 69696 77965 169161 127523 82210 73305
400 73305 169456 154897 -26660 56133 166737 21148 -7351 67808 68336 -13116 -51004 93601
388 93601 128027 229396 149222 229459 60568 65008 139281 148971 118547 -44876 93787 195141
376 195141 268741 172818 -44912 57773 208129 203489 227897 266510 217283 59477 115456
365 115456 43 140056 262357 206832 229205 196762 166873 35731 48276 198964 213521
354 213521 162284 231606 192853 118767 8651 17364 -9846 -50694 69315 55211 54074 139513
342 139513 117854 14167 -44619 -72431 161995 251738 138109 159584 142313 106026 111505
331 111505 114679 170094 148169 162694 48030 163318 127337 -98541 7275 93389 174499
320 174499 105770 54765 56581 14741 92622 85783 96172 213600 142550 176464 181102 166045
308 166045 26889 93178 85431 -1028 148154 -16115 -62686 5911 87385 167114 156708
297 156708 168535 186736 112699 156389 167170 194694 193874 288614 279409 101407 77454 -22974
285 -22974 -44738 19706 -27418 82358 119662 69797 181908 302312 133148 49657 78238
274 78238 77254 104685 64965 139397 16701 3127 -14154 91175 159195 130319 18030 -29870
262 -29870 -26841 -65836 18747 81134 84717 129919 82340 81767 198415 251223 206363 204737 81102
249 81102 206005 220941 241992 138167 1785 -11736 210463 154856 24568 165612 83356
238 83356 77887 121143 186325 100571 69613 234165 240915 274000 183900 147551 221868 123047
226 123047 127384 21274 221195 141003 21181 -4719 58178 70054 208169 240799 222378
215 222378 126580 54612 169439 187752 110883 141675 182201 162738 188848 116161 176225 135622
203 135622 103189 211414 219226 152680 48393 135062 203374 126301 -2458 -28827 -2162
192 -2162 -7781 -34045 -12201 99313 154218 57808 125973 183766 199358 218743 153286 170350
180 170350 104918 146898 132112 149391 239815 126715 -20352 145725 156941 170624 206225
169 206225 258666 305522 204123 34810 -11511 5716 37606 120476 128542 210017 211692 138841
157 138841 195160 127350 89150 126637 201456 164821 154763 180046 229018 354907 292213 246109
145 246109 74755 98743 80009 113233 96437 131528 20094 -45669 -2103 26815 85492
134 85492 84289 98626 106597 106014 169596 188582 88879 37236 72385 65620 -70722 160415 150790
121 150790 119525 108121 145872 121212 87995 75327 187564 143642 4181 78348 219638
110 219638 214759 182619 87159 213772 224641 215849 141116 102648 120301 200018 210141 108047
98 108047 160240 48960 75258 168002 130196 155530 118990 68254 131118 41834 35690 105587
86 105587 95522 60435 82338 102559 182590 196395 69484 3944 151792 186772 218947 192801
74 192801 228893 118157 254593 216520 160209 57658 161773 308385 198023 14877 -26851
63 -26851 119784 216265 97411 30824 120135 88245 44060 79246 57155 72859 225543 180778
51 180778 207788 119550 81681 145775 169829 212658 223068 215921 181608 141820 135051 143674 134852
38 134852 219841 142768 123600 192513 90163 -5049 96676 79010 133429 172079 162621 87397
26 87397 128371 254932 272790 207003 98316 128559 48624 61188 90885 153973 142857 250798
14 250798 238037 168565 228621 184468 149765 93056 63242 106181 124990 98199 55036 112214
2 112214 160467 178134
0 178134
$$ Imaginary data points
##PAGE= N=2
##DATA TABLE= (X++(I..I)), XYDATA
16383 -5634985 -5569495 -5438091 -5296681 -5321706 -5261836 -5119345 -4951059 -4975255 -4928083 -4872472
16373 -4872472 -4767594 -4709756 -4552520 -4408887 -4361442 -4323192 -4225180 -4096482 -3930510 -3834778
16363 -3834778 -3785078 -3761605 -3745601 -3612901 -3531732 -3587618 -3467056 -3380750 -3190191 -3116051 -3070712
16352 -3070712 -3037062 -3075899 -2943271 -2740753 -2681749 -2647696 -2518116 -2522195 -2487762 -2311463 -2220086
16341 -2220086 -2115544 -2054803 -1947868 -1783207 -1848422 -1692364 -1629498 -1705790 -1613588 -1496703
16331 -1496703 -1415065 -1294629 -1337357 -1232851 -1071731 -1059833 -1005463 -842326 -739606 -757149
16321 -757149 -769829 -684084 -523720 -409090 -281399 -251411 -175961 -158607 -79352 -207170 -123421
16310 -123421 55012 197102 289459 266869 295305 458849 465489 549229 645409 641709 706189
16299 706189 648803 727828 984294 1027535 1047975 1194340 1150073 1374790 1372908 1510762 1585327
16288 1585327 1631703 1750109 1805321 1739158 1822081 1920498 1873563 1898343 2015654 2169455 2096531
16277 2096531 2162197 2301647 2297558 2383334 2390381 2383109 2462524 2535751 2628360 2689521 2760239 2876578
16265 2876578 2845122 2891969 3026518 3027402 3173481 3245620 3310959 3283472 3287507 3453365 3323671
16254 3323671 3364137 3469440 3595881 3639623 3673801 3719306 3756258 3917428 3776729 3853462
16244 3853462 3952773 4071488 4093482 4096922 4138494 4197396 4151327 4080585 4082166 4345065 4432701
16233 4432701 4373664 4447822 4461490 4567337 4606684 4577637 4612546 4735018 4776499 4720637 4701587
16222 4701587 4905814 5084458 5033224 5106537 5130170 4968881 4909522 5181355 5293264 5235912
16212 5235912 5095190 5085699 5085121 5126846 5137425 5171778 5183127 5364087 5421124 5363120 5348850
16201 5348850 5331999 5469738 5459239 5473932 5629803 5652199 5506976 5648718 5729999 5885628
16191 5885628 5874634 5734497 5760787 5808842 5976241 5807826 5833086 6066011 6093882 6095743 6050137
16180 6050137 6089834 6081746 6026593 6053232 6252528 6284259 6423228 6333357 6296670 6387790 6434981
16169 6434981 6350566 6325256 6439341 6442418 6550075 6657727 6441506 6326360 6288218 6452561
16159 6452561 6347820 6390005 6515382 6514238 6423763 6522357 6626145 6670325 6718179 6846913 6797340
16148 6797340 6860491 6840946 6624643 6638324 6760070 6980107 7006988 6926805 6833680 6854985 6645857
16137 6645857 6693772 6797925 6782389 6730314 6906633 7129658 7219271 7046459 6890266 6832218
16127 6832218 6900175 7051931 7097923 7135211 7095155 7017558 6986935 7090422 6936892 6988177 7219670
16116 7219670 7065133 7014909 7128907 7213920 7137395 7018015 6964781 7104548 7172273 7135819
16106 7135819 7147910 7157060 7210861 7135032 7043581 7156973 7207177 7198184 7177217 7201971 7327169
16095 7327169 7324365 7208514 7402891 7398394 7289927 7270776 7321645 7411297 7217009 7107610 7261380
16084 7261380 7318088 7350232 7331579 7295787 7263503 7239543 7087653 7304693 7321655 7322229 7436529
16073 7436529 7480620 7307999 7224747 7272470 7348637 7531890 7325413 7231996 7242156 7403931
16063 7403931 7390382 7380803 7403992 7411635 7343589 7417245 7412081 7276143 7210812 7359356 7382966
16052 7382966 7435888 7308946 7450491 7390589 7507635 7726246 7586543 7472633 7359673 7425843
16042 7425843 7371255 7372078 7251348 7391256 7468419 7524175 7409361 7302362 7288777 7404636 7519271
16031 7519271 7408648 7487188 7496651 7585508 7573385 7388889 7385781 7359561 7408144 7366981 7425103
16020 7425103 7470398 7421988 7441601 7437851 7424610 7409927 7427417 7435324 7345259 7345102 7412412 7395103
16008 7395103 7450258 7607382 7428808 7410342 7404361 7383769 7366381 7422255 7609175 7700969 7724763
15997 7724763 7603524 7466558 7488584 7548525 7506005 7537442 7438688 7337972 7366240 7453978 7414439
15986 7414439 7333137 7506215 7432438 7349688 7390652 7405797 7523123 7550000 7606368 7391064 7409297
15975 7409297 7485396 7392822 7473933 7448168 7457829 7724732 7692257 7614974 7533291 7429137 7522433
15964 7522433 7584874 7393021 7354508 7274021 7326232 7385327 7486662 7423418 7527994 7546283 7616634
15953 7616634 7548132 7421419 7597829 7538532 7535945 7466553 7594718 7627073 7469359 7594218
15943 7594218 7495570 7580721 7658529 7545116 7542666 7566989 7590628 7572162 7705448 7598407 7562482
15932 7562482 7533618 7445505 7699729 7629956 7327863 7483786 7547488 7543710 7460164 7393889 7480584
15921 7480584 7552885 7403653 7627174 7555563 7599068 7666827 7561870 7528611 7503241 7657461
15911 7657461 7676025 7506990 7395023 7431493 7496672 7634147 7650159 7636215 7641077 7502461 7379977
15900 7379977 7429269 7459139 7425992 7420920 7501573 7603311 7709944 7627116 7575491 7593507 7413067
15889 7413067 7490899 7603501 7588603 7640775 7600563 7561561 7537363 7507168 7499337 7591502 7631657
15878 7631657 7465230 7335471 7647998 7927294 7689225 7522412 7497741 7441334 7515818 7509406
15868 7509406 7450270 7387006 7311345 7292625 7408438 7580859 7574585 7404028 7366414 7324824 7334371
15857 7334371 7369189 7526105 7537210 7439811 7459552 7520284 7699641 7683065 7722488 7610726 7489841
15846 7489841 7464220 7499745 7627349 7495192 7435150 7497648 7415898 7369565 7510341 7662575
15836 7662575 7608646 7591512 7615033 7595632 7676940 7410192 7420207 7662196 7593246 7594210 7546818
15825 7546818 7550035 7744627 7598095 7701621 7572057 7493191 7550001 7673763 7767700 7712866
15815 7712866 7692055 7453790 7528886 7420271 7465404 7480629 7446608 7684507 7719874 7541484
15805 7541484 7642723 7677187 7747621 7646188 7616056 7594862 7559075 7498292 7304080 7510084
15795 7510084 7611909 7595552 7536210 7471991 7543491 7615945 7608240 7543246 7526686 7541491 7590325
15784 7590325 7645717 7722986 7699935 7598921 7575833 7527226 7608687 7736433 7656113 7682360 7685409
15773 7685409 7719344 7551268 7709970 7778595 7728484 7631770 7812297 7614436 7388592 7549806
15763 7549806 7530842 7637011 7662220 7712497 7686200 7615400 7662142 7634132 7620965 7667927 7610372
15752 7610372 7646200 7754746 7612131 7611737 7731456 7681419 7696929 7744809 7820387 7608718 7516186
15741 7516186 7511558 7661189 7397600 7537594 7557281 7596675 7751249 7686643 7623958 7703634 7700823
15730 7700823 7591766 7659534 7791903 7776066 7752586 7614848 7599174 7599054 7532965 7717306 7775774
15719 7775774 7766788 7683005 7667360 7755393 7657762 7629378 7704444 7718943 7621393 7403020 7458513
15708 7458513 7626164 7593380 7662486 7654020 7573424 7642506 7705218 7667550 7611898 7650070 7717109
15697 7717109 7695208 7748465 7615849 7655140 7661512 7592954 7729929 7715699 7798525 7730988 7589878
15686 7589878 7525528 7564210 7642783 7653842 7668147 7658827 7637837 7815492 7875161 7657106 7607075
15675 7607075 7642322 7696572 7682448 7624985 7749381 7783773 7896764 7845687 7740001 7677031 7750265
15664 7750265 7727439 7725562 7646461 7798669 7665473 7680578 7684378 7694280 7753894 7663389 7763487
15653 7763487 7770043 7790206 7783215 7562656 7683662 7801141 7798823 7703952 7616434 7679301 7783868
15642 7783868 7840033 7831042 7881838 7800154 7754204 7752635 7654572 7745775 7713495 7734946 7830989 7721359
15630 7721359 7709419 7631699 7831486 7711034 7651511 7793146 7693852 7738529 7693067 7587253
15620 7587253 7607384 7547726 7674796 7795813 7758622 7643309 7785915 7901648 7742255 7681340
15610 7681340 7578593 7760604 7797813 7617404 7760957 7642382 7653222 7649582 7810969 7856711
15600 7856711 7719068 7839457 7814521 7714966 7851001 7704945 7727090 7690598 7728090 7730039 7764738
15589 7764738 7782238 7793191 7790128 7780170 7777568 7683134 7706644 7697442 7746729 7684623 7717756 7848465
15577 7848465 7759698 7689834 7695344 7738061 7781052 7814685 7668140 7708459 7742910 7728712 7769365
15566 7769365 7689288 7768655 7696640 7796746 7811933 7926838 7940318 7824127 7761455 7687197 7693045
15555 7693045 7721050 7706239 7777047 7701687 7718688 7759570 7781319 7775717 7787118 7898233 7879147
15544 7879147 7913657 7790300 7700824 7642641 7749757 7935270 7753758 7632658 7733855 7775876
15534 7775876 7768198 7781572 7652787 7843976 7927565 7699555 7684601 7808542 7647193 7611512
15524 7611512 7715849 7737118 7591908 7705096 7704334 7817686 7963225 7956470 8013505 7959454 7727475
15513 7727475 7804538 7930190 8012781 7757006 7565003 7732758 7715651 7835983 7785377 7788120
15503 7788120 7977109 7804934 7802785 7949317 7916281 7914059 7701815 7726185 7852054 7712195
15493 7712195 7798920 7763388 7876403 7974289 7792558 7547407 7587600 7825121 7803296 7840799
15483 7840799 7804673 7907875 7960880 7786939 7712013 7959963 7884842 7878479 7732154 7785609 7935766
15472 7935766 7830045 7765146 7811465 7844749 7827816 7840789 7876207 7751786 7881222 7894658 7704122
15461 7704122 7744259 7722208 7773327 7830643 7871384 8003974 7843002 7722067 7737881 7824185 7837420
15450 7837420 7952832 7790249 7803418 7867671 7924265 7881307 7747732 7696807 7686561 7697396 7779707
15439 7779707 7890552 8038836 7981336 7934560 7997036 7969915 8004041 7994552 8065008 7935796 7825408
15428 7825408 7888492 7961793 7960165 7969254 7940224 7875468 7823168 7779537 8008064 7966320 7929300
15417 7929300 7914551 7851652 7874070 7775797 7830103 7902540 7950476 7886916 7769407 7936266 8137839
15406 8137839 8026818 8048647 8099606 8047884 7845825 7863360 7793615 7891529 7784827 8063923
15396 8063923 7999528 7900755 7852437 7877686 7914142 7884715 7955207 7809560 7857232 7862382 7765392
15385 7765392 7744024 7824044 7865727 8028984 8033009 7861986 7886711 8044735 8019312 7964602 7859564
15374 7859564 7768171 7885846 8049946 7909993 7827843 7927222 7873466 7873469 7970327 7926846 7990374
15363 7990374 8195477 8133935 8082312 8071804 7817300 7718951 7881685 7942782 7916796 7975777 8035513
15352 8035513 7868118 7894640 7934255 8017730 8108189 8050555 8048876 7893849 7871007 7929264 7875215
15341 7875215 7863021 7917382 8024415 7870572 7889402 7925878 7984865 7980957 7875672 8015497 7893122
15330 7893122 8014592 8183501 8047443 8040424 7992056 7829953 7786004 7840907 7894703 7796935 7869855
15319 7869855 7926546 7924964 7989625 7981631 7992155 7919834 8057657 8007071 7901171 7922941 7888130
15308 7888130 7925606 7951672 7928222 8024295 8010594 7863243 7912980 7990315 8055841 8009919 7912946
15297 7912946 7940641 7858932 7826528 7965915 8025222 7956103 7941321 8047192 7937567 7899494 7944774
15286 7944774 8037554 8132845 7913562 7709087 7817088 7788409 7806126 7885682 8014198 7987674
15276 7987674 7988554 8024879 8075566 8041034 8082856 8002099 7934372 7992917 8054986 8046330 8178833 8192730
15264 8192730 8050196 7987134 8012611 8026341 7897903 7941396 7907735 8064406 8137640 8023419
15254 8023419 7887472 7886488 7918444 8029910 8139863 7984648 7962922 7903693 7893255 7978118 7970866
15243 7970866 7973662 8106980 8173423 8013076 7914901 7886563 7962058 7983592 8056294 8066091 8031490
15232 8031490 7988865 7864587 7924466 7981580 8058476 8087994 8130070 8059090 8039558 7931915 7994355
15221 7994355 8046253 8026889 7981203 7883396 7956476 8133269 8133251 8124412 8101459 7999826 8067540 8007685
15209 8007685 8014967 8055343 8031047 7965795 8019817 7979132 8057561 8192202 8051063 8029092 7911317
15198 7911317 8055496 8059900 8083545 8174088 8187731 8152340 8082653 8130737 7994811 8147683 8235188
15187 8235188 8099253 7989475 8099354 8050430 8050537 8077327 8210656 8221836 8232336 8114060 7981099
15176 7981099 7950714 7985094 8109030 8205975 8135408 8113628 8013270 8007271 8218193 8178808 8127402
15165 8127402 8124237 8104119 8172413 8255726 8160053 8154355 8167531 7949684 8211934 8338768 8347192
15154 8347192 8245518 8139812 8148135 8075880 8046911 8120089 8147820 8140338 8118569 8023756 7911799
15143 7911799 7924082 8041322 8118738 8020215 8016534 8175245 8161637 8074815 7972389 8146595 8205773
15132 8205773 8248797 8257180 8211620 8208978 8169624 8174658 8052757 8126884 8152434 8278321 8263019
15121 8263019 8173701 8150515 8265907 8340753 8279770 8278637 8106182 8190924 8162719 8217324 8185184
15110 8185184 8177140 8190150 8225486 8160314 8131025 8055453 8228537 8194305 8103201 8129096 8202030
15099 8202030 8285439 8313752 8312266 8272847 8213990 8078421 8213060 8303452 8138491 8161673 8171246
15088 8171246 8061137 8064899 8139426 8117523 8143542 8288910 8234011 8143373 8144432 8166663 8317502
15077 8317502 8152836 8108386 8124430 8094749 8197760 8214365 8276125 8277548 8259928 8208236 8154709
15066 8154709 8052335 8078615 8202622 8344751 8498613 8329181 8097034 8069772 8253378 8370001
15056 8370001 8284314 8211716 8198864 8422718 8369703 8320584 8349735 8348394 8462942 8428421 8337354
15045 8337354 8322266 8166464 8236814 8251940 8104120 8004118 7951233 8045871 8171966 8229383
15035 8229383 8269341 8259908 8137628 8211751 8232597 8079327 8220928 8170062 8287584 8304983 8292589
15024 8292589 8288709 8428519 8398055 8304357 8412056 8264636 8278339 8159721 8264092 8249107
15014 8249107 8205175 8005296 7964814 8048405 8166047 8245301 8208587 8205048 8275187 8179175 8272190
15003 8272190 8255789 8158319 8230180 8283802 8246409 8110517 8109636 8056899 8144465 8357179 8403831
14992 8403831 8265406 8326213 8268234 8401134 8314777 8259299 8358667 8241595 8126378 8056015
14982 8056015 8185156 8244609 8135627 8102773 8124164 8105803 8106873 8253722 8276636 8145756 8272342
14971 8272342 8332627 8285326 8334983 8315915 8258441 8229536 8198898 8148713 7932187 8064064 8082445
14960 8082445 8156453 8328320 8271576 8445343 8324569 8202497 8181004 8141365 8030678 8033459
14950 8033459 8161416 8295199 8278874 8361555 8310720 8228326 8224816 8205511 8257849 8195236 8236068
14939 8236068 8341817 8216551 8275178 8306138 8292896 8167989 8138826 8237616 8161213 8183883 8163567
14928 8163567 8161462 8246195 8347079 8234454 8257002 8307373 8302882 8278667 8299249 8166571 8268601
14917 8268601 8413276 8379325 8375553 8221696 8156242 8117513 8183997 8240616 8202135 8419856 8549251
14906 8549251 8402439 8434714 8443357 8410039 8323540 8455280 8443237 8405513 8395406 8392040 8375865
14895 8375865 8329741 8290698 8349089 8313516 8128598 8268553 8148427 8217244 8390527 8555540
14885 8555540 8378954 8287249 8197961 8227637 8312952 8270172 8392478 8474285 8474473 8332919 8209321
14874 8209321 8286904 8339975 8443428 8605861 8355732 8250687 8298569 8309875 8428663 8476623
14864 8476623 8301102 8308972 8446915 8464729 8284049 8342643 8324546 8360077 8314234 8408458 8569044
14853 8569044 8424733 8287363 8311255 8421785 8407212 8537620 8393356 8370988 8301970 8368640
14843 8368640 8348468 8383538 8380514 8318661 8314805 8233895 8150253 8163525 8240850 8442852 8341735
14832 8341735 8251385 8434785 8491072 8527111 8426609 8355884 8249655 8401118 8408165 8385461 8482715
14821 8482715 8440067 8411958 8270873 8295242 8336057 8411087 8450221 8428606 8384595 8265158 8363378
14810 8363378 8434482 8423398 8460170 8426673 8241473 8209859 8336842 8264052 8341848 8566599 8418569
14799 8418569 8298683 8357400 8456495 8472468 8477792 8413791 8379055 8412458 8325974 8400172 8475601
14788 8475601 8385346 8322536 8152540 8275631 8471337 8446560 8380616 8361910 8320893 8434153
14778 8434153 8449754 8460547 8336725 8468782 8601444 8523463 8495878 8413697 8524401 8609352
14768 8609352 8523539 8519028 8530604 8632154 8658150 8546046 8377674 8265774 8293759 8347725 8379075
14757 8379075 8333340 8501346 8430969 8380306 8487742 8528416 8456238 8388898 8458529 8503363 8403678
14746 8403678 8339812 8313954 8381061 8389545 8418436 8455451 8480332 8394451 8421206 8571939 8524008
14735 8524008 8514953 8600685 8478680 8392282 8322195 8389281 8448102 8359415 8479215 8449256 8519177
14724 8519177 8484800 8415026 8367169 8324017 8409165 8524634 8559271 8653144 8605500 8572575 8566870
14713 8566870 8505215 8595950 8561631 8455435 8543454 8605401 8487867 8575614 8487072 8497604 8410225
14702 8410225 8392205 8459072 8377785 8457779 8386678 8426403 8462147 8510009 8506855 8731707 8591951
14691 8591951 8466738 8638704 8445806 8493192 8552152 8500243 8429538 8371265 8632325 8706092
14681 8706092 8537653 8520781 8516202 8560938 8428929 8481500 8472646 8378269 8547529 8528194 8329183
14670 8329183 8371832 8428203 8549735 8567084 8500669 8591097 8608955 8540400 8463534 8568421 8760353
14659 8760353 8741742 8681707 8514785 8608005 8596233 8573922 8469149 8358351 8407934 8468072 8497393
14648 8497393 8511977 8402961 8588318 8521846 8471924 8578407 8529976 8595409 8608194 8534669 8537677
14637 8537677 8500014 8313627 8563417 8871267 8882270 8654743 8429017 8623330 8494497 8473879
14627 8473879 8638896 8610756 8588064 8581000 8769696 8726817 8770022 8645466 8525972 8528596 8724487
14616 8724487 8611855 8616083 8643400 8758596 8743509 8834100 8699098 8712678 8575513 8446699
14606 8446699 8533157 8552355 8435803 8558800 8596544 8556609 8598194 8631783 8549838 8580125 8516004
14595 8516004 8393511 8355215 8430601 8681248 8718166 8706197 8621474 8686285 8659828 8719819 8680563
14584 8680563 8554588 8530996 8437134 8508140 8703703 8754669 8684524 8676118 8854423 8720074 8632434
14573 8632434 8678943 8788241 8821210 8664833 8576848 8630360 8521508 8493521 8569546 8566037 8658938
14562 8658938 8773330 8668844 8577106 8480792 8615085 8620914 8690166 8814768 8729903 8584923
14552 8584923 8614998 8634952 8783431 8692386 8771958 8746270 8610868 8801438 8811050 8847961 8824643
14541 8824643 8727333 8775137 8783196 8652421 8749815 8699941 8713774 8874123 8930245 8841790 8620607
14530 8620607 8703977 8661546 8741672 8710952 8682965 8706117 8677579 8679821 8723066 8574800 8683383
14519 8683383 8720084 8659109 8708295 8693200 8755364 8750341 8857914 8720959 8732322 8717178 8767940
14508 8767940 8712778 8766827 8608016 8612448 8621425 8583382 8501846 8540833 8640936 8543605 8528735
$$ [...]
##END NTUPLES=NMR SPECTRUM
##END=
