##TITLE=1H_EC-3253(IV-1)
 CDCl3, 8 sc, 
 29.06.2021
##JCAMPDX= 6.0         $$ Bruker NMR JCAMP-DX V2.0
##DATA TYPE= NMR SPECTRUM
##DATA CLASS= NTUPLES
##ORIGIN= UXNMR, Bruker Analytische Messtechnik GmbH
##OWNER= root
$$ XWIN-NMR		Version 3.5
$$ Tue Jun 29 10:18:36 2021 Russian Standard Time (UT+4h)  she@DPX200
##.OBSERVE FREQUENCY= 200.131506
##.OBSERVE NUCLEUS= ^1H
##.ACQUISITION MODE= SIMULTANEOUS
##.ACQUISITION SCHEME= undefined
##.AVERAGES= 8
##.DIGITISER RES= 18
##SPECTROMETER/DATA SYSTEM= spect
##.PULSE SEQUENCE= zg30
##.SOLVENT NAME= CDCl3
##.SHIFT REFERENCE= (INTERNAL, CDCl3, 0, 17.502)
##AUDIT TRAIL= $$ (NUMBER, WHEN, WHO, WHERE, WHAT)
$$ ##TITLE= Audit trail, XWIN-NMR		Version 3.5
$$ ##JCAMPDX= 5.01
$$ ##ORIGIN= Bruker BioSpin GmbH
$$ ##OWNER= she
$$ F:/spectra/data/she/nmr/H-F/1/pdata/1/auditp.txt
$$ ##AUDIT TRAIL=  $$ (NUMBER, WHEN, WHO, WHERE, WHAT)
(   1,<2021-06-29 10:17:24.64 +0400>,<she>,<DPX200>,
      <created by zg, POWCHK disabled, PULCHK disabled
       configuration hash MD5:
       00 E9 B6 7A A2 85 ED C7 34 08 36 98 17 FE 4E 26
       data hash MD5: 16K
       39 37 68 26 08 3E 93 40 80 30 41 14 C8 C5 09 8A>)
(   2,<2021-06-29 10:17:27.45 +0400>,<she>,<DPX200>,
      <Start of raw data processing
       efp BC_mod = 2 LB = 0.24 FT_mod = 6 PKNL = 1 PHC0 = -11918.55 PHC1 = 4.801007 SI = 16K 
       data hash MD5: 16K
       73 B5 FD 41 38 44 C1 B4 A8 46 CE 84 95 15 B5 0F>)
(   3,<2021-06-29 10:17:46.73 +0400>,<she>,<DPX200>,
      <pk PHC0 = -2.582139 PHC1 = 8.2 
       data hash MD5: 16K
       91 93 D9 83 3B A3 B2 03 5E 67 46 86 C7 87 00 DE>)
(   4,<2021-06-29 10:17:49.98 +0400>,<she>,<DPX200>,
      <abs ABSG = 5 
       data hash MD5: 16K
       D1 3D 06 8C 1A 0C 4B A6 B5 2E 66 4A E8 EC AF 9C>)
$$ ##END=
$$ 
$$ hash MD5
$$ D4 2F 5C 89 E0 73 54 27 34 DB 40 EA 17 37 F0 21
##$RELAX= 
##$RELAX= 
##$RELAX= 
##$RELAX= 
##$RELAX= 
##$RELAX= 
$$ Bruker specific parameters
$$ --------------------------
##$DU= <F:/spectra>
##$EXPNO= 1
##$NAME= <H-F>
##$PROCNO= 1
##$TYPE= <nmr>
##$USER= <she>
##$AMP= (0..31)
100 100 100 100 100 100 100 100 100 100 100 100 100 100 100 100 100 100 
100 100 100 100 100 100 100 100 100 100 100 100 100 100 
##$AQSEQ= 0
##$AQ_mod= 1
##$AUNM= <au_zg>
##$AUTOPOS= <>
##$BF1= 200.13
##$BF2= 200.13
##$BF3= 200.13
##$BF4= 200.13
##$BF5= 200.13
##$BF6= 200.13
##$BF7= 200.13
##$BF8= 200.13
##$BYTORDA= 1
##$CFDGTYP= 0
##$CFRGTYP= 5
##$CHEMSTR= <none>
##$CNST= (0..31)
1 1 145 1 1 1 1 1 1 1 1 1 1 1 1 1 1 1 1 1 1 1 1 1 1 1 1 1 1 1 1 1 
##$CPDPRG= <>
##$CPDPRG1= <>
##$CPDPRG2= <>
##$CPDPRG3= <>
##$CPDPRG4= <mlev>
##$CPDPRG5= <mlev>
##$CPDPRG6= <mlev>
##$CPDPRG7= <mlev>
##$CPDPRG8= <mlev>
##$CPDPRGB= <>
##$CPDPRGT= <>
##$D= (0..31)
0 1.2 0 0 0 0 0 0 0 0.06 0 0.03 0 0 0 0 0.0002 0 0 0 0 0 0 0 0 0 0 0 0 
0 0 0 
##$DATE= 1624947444
##$DBL= (0..7)
120 120 120 120 120 120 120 120 
##$DBP= (0..7)
150 150 150 150 150 150 150 150 
##$DBP07= 0
##$DBPNAM0= <>
##$DBPNAM1= <>
##$DBPNAM2= <>
##$DBPNAM3= <>
##$DBPNAM4= <>
$$ [...]
##$SUBNAM3= <"">
##$SUBNAM4= <"">
##$SUBNAM5= <"">
##$SUBNAM6= <"">
##$SUBNAM7= <"">
##$SUBNAM8= <"">
##$SUBNAM9= <"">
##$SW= 20.0188882624521
##$SWIBOX= (0..15)
0 0 2 0 0 0 0 0 0 0 0 0 0 0 0 0 
##$SW_h= 4006.41025641026
##$TD= 16384
##$TD0= 1
##$TE= 0
##$TE2= 300
##$TE3= 300
##$TEG= 300
##$TL= (0..7)
0 120 120 120 120 120 120 120 
##$TP= (0..7)
150 150 150 150 150 150 150 150 
##$TP07= 0
##$TPNAME0= <>
##$TPNAME1= <>
##$TPNAME2= <>
##$TPNAME3= <>
##$TPNAME4= <>
##$TPNAME5= <>
##$TPNAME6= <>
##$TPNAME7= <>
##$TPOAL= (0..7)
0.5 0.5 0.5 0.5 0.5 0.5 0.5 0.5 
##$TPOFFS= (0..7)
0 0 0 0 0 0 0 0 
##$TUNHIN= 0
##$TUNHOUT= 0
##$TUNXOUT= 0
##$USERA1= <user>
##$USERA2= <user>
##$USERA3= <user>
##$USERA4= <user>
##$USERA5= <user>
##$V9= 5
##$VALIST= <valist>
##$VCLIST= <CCCCCCCCCCCCCCC>
##$VD= 0
##$VDLIST= <DDDDDDDDDDDDDDD>
##$VPLIST= <PPPPPPPPPPPPPPP>
##$VTLIST= <TTTTTTTTTTTTTTT>
##$WBST= 1024
##$WBSW= 4
##$XGAIN= (0..3)
0 0 0 0 
##$XL= 0
##$YL= 0
##$YMAX_a= 448006
##$YMIN_a= -747591
##$ZGOPTNS= <>
##$ZL1= 120
##$ZL2= 120
##$ZL3= 120
##$ZL4= 120
##$ABSF1= 17.50933
##$ABSF2= -2.509708
##$ABSG= 5
##$ABSL= 3
##$ALPHA= 0
##$AQORDER= 0
##$ASSFAC= 0
##$ASSFACI= 0
##$ASSFACX= 0
##$ASSWID= 0
##$AUNMP= <proc_1d>
##$AZFE= 0.1
##$AZFW= 0.1
##$BCFW= 0
##$BC_mod= 2
##$BYTORDP= 0
##$COROFFS= 0
##$CY= -3
##$DATMOD= 1
##$DC= 0
##$DFILT= <>
##$DTYPP= 0
##$F1P= 0
##$F2P= 0
##$FCOR= 1
##$FTSIZE= 16384
##$FT_mod= 6
##$GAMMA= 0
##$GB= 0
##$INTBC= 1
##$INTSCL= 1.334414e-10
##$ISEN= 128
##$LB= 0.24
##$LEV0= 0
##$LPBIN= 0
##$MAXI= 10000
##$MC2= 0
##$MEAN= 0
##$ME_mod= 0
##$MI= 1.114404
##$NCOEF= 0
##$NC_proc= -6
##$NLEV= 6
##$NOISF1= 3.799351
##$NOISF2= 2.8
##$NSP= 0
##$NTH_PI= 0
##$NZP= 0
##$OFFSET= 17.502
##$PC= 1
##$PHC0= -11921.13
##$PHC1= 13.00101
##$PH_mod= 1
##$PKNL= yes
##$PPARMOD= 0
##$PSCAL= 0
##$PSIGN= 0
##$REVERSE= no
##$SF= 200.130006530269
##$SI= 16384
##$SIGF1= 3
##$SIGF2= 2
##$SINO= 5.538805
##$SIOLD= 16384
##$SREGLST= <1H.CDCl3>
##$SSB= 0
##$STSI= 16384
##$STSR= 0
##$SW_p= 4006.41025641026
##$SYMM= 0
##$S_DEV= 0
##$TDeff= 16384
##$TDoff= 0
##$TI= <>
##$TILT= no
##$TM1= 0
##$TM2= 0
##$TOPLEV= 0
##$USERP1= <user>
##$USERP2= <user>
##$USERP3= <user>
##$USERP4= <user>
##$USERP5= <user>
##$WDW= 1
##$XDIM= 16384
##$YMAX_p= 351683937
##$YMIN_p= -226828
$$ End of Bruker specific parameters
$$ ---------------------------------
##NTUPLES= NMR SPECTRUM
##VAR_NAME=  FREQUENCY,     SPECTRUM/REAL,   SPECTRUM/IMAG
##SYMBOL=    X,             R,               I
##VAR_TYPE=  INDEPENDENT,   DEPENDENT,       DEPENDENT
##VAR_FORM=  AFFN,          ASDF,            ASDF
##VAR_DIM=   16384,         16384,           16384
##UNITS=     HZ,            ARBITRARY UNITS, ARBITRARY UNITS
##FACTOR=    0.24454680195387, 1,            1
##FIRST=     3502.67553614107, 0,            0
##LAST=      -503.73472026919, 0,            0
##MIN=       -503.73472026919, -226828,      0
##MAX=       3502.67553614107, 351683937,    0
$$ Real data points
##PAGE= N=1
##DATA TABLE= (X++(R..R)), XYDATA
$$ [...]
8544 350871 407064 486272 400410 336880 468658 494261 378810 387003 374088 375115 334625 359091
8532 359091 437830 400753 405236 392283 419793 463533 432459 338356 285721 341480 404265 441195
8520 441195 312553 319581 381521 376054 358814 380446 318847 352288 320645 351490 381339 397752
8508 397752 393471 317398 312338 424372 427613 413376 442401 462973 478154 476254 492326 433776
8496 433776 395209 377065 472308 418036 378901 351875 405251 375558 386614 326763 365192 421321
8484 421321 497839 465413 429849 473943 504975 421314 391899 379521 377068 336942 368163 402176
8472 402176 396248 413077 409441 476661 512727 551001 496397 543444 493593 466184 497862 484873
8460 484873 506388 510538 494336 579100 532640 516229 617756 628716 564938 671389 752190
8449 752190 788200 656879 659247 745425 852379 963679 933904 995715 1037146 1173145 1295697
8438 1295697 1507269 1529440 1534528 1423791 1305515 1164511 1025621 969205 899056 839776 804674
8427 804674 832010 737819 749648 734703 754496 757632 757854 765389 716274 615658 650237 785844
8415 785844 730313 721852 670466 681791 797775 779065 811290 797079 728971 784905 780075 778560
8403 778560 745647 742493 805695 767830 703547 619575 589888 650151 643146 610804 652549 662123
8391 662123 658180 623275 610797 625680 630855 624593 597718 696042 717860 713935 755806 665709
8379 665709 628681 687067 767881 772995 798610 853113 921692 960801 904188 957359 922557 1002028
8367 1002028 1115013 1101926 1076632 1063612 1095946 1117932 1161051 1147686 1134771 1132293 1157276
8356 1157276 1154467 1185351 1252194 1194513 1187204 1273429 1265798 1243563 1346783 1373245 1382822 1375508
8344 1375508 1483794 1492530 1472603 1473751 1525325 1529480 1563302 1646917 1655244 1609872 1493899 1544707
8332 1544707 1578995 1572830 1552840 1572301 1580697 1575694 1607876 1662904 1578310 1654227 1682265 1652188
8320 1652188 1648702 1674664 1781389 1720107 1676426 1747027 1739551 1694244 1685136 1729672 1685358 1794457
8308 1794457 1687778 1729700 1754283 1685256 1676334 1636525 1556211 1639362 1644471 1755813 1717133
8297 1717133 1723759 1663100 1657200 1670892 1662395 1691517 1711466 1700132 1700536 1710816 1692014 1751904
8285 1751904 1730218 1667187 1720338 1671472 1604934 1672026 1645011 1568034 1609141 1735926 1665051
8274 1665051 1662109 1617336 1693767 1637035 1752235 1824921 1819515 1801725 1809376 1791857 1794466 1830639
8262 1830639 1861309 1880504 1942230 1874041 1934685 1904836 1981063 2084919 2140828 2170989 2227108
8251 2227108 2274119 2341595 2384694 2410211 2476380 2475144 2496257 2638479 2686765 2746457 2855243
8240 2855243 2905518 2867251 2912301 2890847 2949826 3009820 3121982 3104505 3253174 3294152 3399328
8229 3399328 3372543 3435887 3601344 3645185 3643493 3769988 3807582 3808590 3804807 3817072 3916484 4090171
8217 4090171 4127029 4142167 4328390 4490357 4590036 4664607 4905161 5052598 5149232 5351347
8207 5351347 5711704 5991530 6242300 6629171 7156554 7591836 8274835 9007105 9749699 10254183
8197 10254183 10774736 11012426 11327667 11221560 11566694 8954759 8278140 9294686 9121823
8188 9121823 9267237 8828584 8636683 8222645 7852535 7517710 7439420 7291851 7366458 7387466
8178 7387466 7499790 7560364 7869184 8142871 8600849 9058496 9634221 10117954 10903568 11807977
8168 11807977 12771829 13489450 13623251 13436673 13326361 13212258 13244945 13284692 13005776 12680723
8158 12680723 12159502 11422646 10869484 10157848 9655544 9264639 9077654 8904953 8674660
8149 8674660 8614517 8561206 8516537 8593550 8564516 8548471 8702973 8809977 9021449 9184906 9420597
8138 9420597 9612436 9839172 10007049 10342482 10677796 10988012 11374708 11868441 12399323 13032500
8128 13032500 13685026 14354631 15224365 16232589 17392115 18849772 20526500 22601718 25057770
8119 25057770 27619704 29902128 31802776 33299459 34159876 34483752 34350792 33851734 32798924
8110 32798924 31746865 30934743 29766624 28143716 26300222 24461674 22909520 21699598
8102 21699598 20868880 20427067 20086435 20138762 20341620 20723810 21299695 22050860 23127477
8093 23127477 24580556 26278360 28357844 31039145 34178444 37598708 40798077 43008181
8085 43008181 43941503 43760444 43503179 43177278 42701700 41886530 40758867 38719608 35818958
8076 35818958 32755131 29890591 27455612 25554775 24162451 23111462 22200546 21600270
8068 21600270 21137615 20778425 20684520 20567894 20585753 20657060 20764520 21039149 21375778 21847742
8058 21847742 22521279 23158905 23773427 24683346 25625418 26801626 28243227 29996401 31979962
8049 31979962 34433806 37041605 39397093 41325796 43072444 44545119 45552567 46542906
8041 46542906 47424522 47709696 47127420 45990581 44263480 42639133 41265535 40398597 40046108
8032 40046108 40154945 40271807 40576169 40809824 41319129 42221437 43688791 45523179 47835814
8023 47835814 50856556 54880491 59473249 65141064 71865652 80299120 90153572 101462038
8015 101462038 113536880 128312276 146598253 170015708 198591462 221199201 213965268
8008 213965268 189095590 164430802 136283797 113664347 97642982 85907201 76804911
8001 76804911 69588957 63392777 58175693 53170737 48475767 44165635 40611185 37531820
7993 37531820 35024893 32867976 31057338 29331259 27866233 26626823 25592916 24686216
7985 24686216 23966377 23220774 22542407 21986755 21360288 20896469 20521872 20143918 19712760
7976 19712760 19291757 19044774 18831878 18559314 18280942 18071428 17798041 17465239 17128835
7967 17128835 16955327 16828133 16800414 16634241 16529614 16387513 16278700 16160151 16112124 16030666
7957 16030666 15898136 15831611 15582573 15384185 15297631 15099319 15026902 15029806 14963031 14983945 15189756
7946 15189756 15446928 15736851 16021880 16223403 16652527 17056345 17559358 18084443 18707784
7937 18707784 19328346 20142947 21253129 22410408 23407020 24334852 25348293 26498593 27779064
7928 27779064 29250771 30832999 31887489 32006578 31541306 31073495 30803108 30885076 31006878
7919 31006878 30430385 29368489 28056629 26877843 25923064 25464173 25332039 25370582 25563702
7910 25563702 26055015 26877768 27821060 29209245 30846108 32531336 34126939 35607781 37265460
7901 37265460 39309136 42039694 45297266 48384584 50504881 51008075 50350999 49381262 48377005
7892 48377005 47682315 46901144 45352050 43439774 41398616 39211826 37130230 35195545
7884 35195545 33631537 32577335 31819750 31439079 31325939 31500249 31990069 32770699 34002107
7875 34002107 35541522 37336330 38924966 40106457 40992838 42126763 43903458 46516799
7867 46516799 49669980 52693941 54320945 54206503 53604598 53184830 53815880 55894426 58260348
7858 58260348 59502225 58222690 55719494 53055735 50742389 49580703 48726469 46948378
7850 46948378 43680801 40400169 37043021 34355369 32499017 31728516 31509431 30961088 30732177
7841 30732177 30412552 30103090 29888904 29794544 30018993 30386225 30575344 30819719 31291952 32260056
7831 32260056 33946954 36089124 38261149 39812935 40515402 40078909 39324537 38855963 38345765
7822 38345765 37267393 34855031 31611371 28253947 25188311 22864833 21226609 20018261
7814 20018261 19211664 18506546 17909348 17400197 16887240 16446654 16109054 15741959 15472224
7805 15472224 15208664 15070586 15139065 15428493 15906892 16766238 17605152 17916113 17596482 17160795
7795 17160795 16617172 16132230 15494286 14512064 13375299 12057295 10851257 9947996 9266275
7786 9266275 8706348 8209516 7819947 7574528 7304116 7045750 6743029 6505669 6211780 6000450
7776 6000450 5874165 5642526 5550861 5525063 5289525 5165708 5037763 4966392 4934023 4789982
7766 4789982 4663191 4494366 4312092 4207980 4083369 3965139 3896787 3780072 3728432 3586268
7756 3586268 3528101 3467764 3402185 3309757 3189634 3116621 3132245 3082419 2992086 2982612 2907631
7745 2907631 2870258 2751762 2747773 2654725 2559898 2606473 2567807 2459060 2492299 2459740 2438806
7734 2438806 2341884 2361220 2332255 2258955 2276604 2229543 2271093 2207688 2260075 2280094 2191648
7723 2191648 2189028 2206788 2177689 2302571 2440620 2453791 2385722 2321421 2312327 2208491 2228871
7712 2228871 2157471 2177368 2155986 2107187 2027266 1968872 1886741 1884152 1919176 1952228 1883093 1823515
7700 1823515 1825461 1836794 1863327 1926855 1964634 1976899 2016736 2033629 1945292 1996749 2063492 1938097
7688 1938097 1951769 1950612 1916798 1950224 2009908 1887902 1907176 1999003 2014284 2002544 1997805 1983215
7676 1983215 1943410 1901114 1804503 1914889 2035709 1966698 1942218 1861973 1956535 1904208 1851371
7665 1851371 1782593 1810163 1745573 1807006 1833672 1744646 1804341 1695295 1706727 1718425 1748405
7654 1748405 1701235 1627739 1724802 1847139 1867420 1887158 1915625 1939628 1932813 1816205 1812133
7643 1812133 1838821 1784578 1741777 1628925 1619060 1645299 1592935 1621040 1608147 1589056 1634814
7632 1634814 1611828 1650370 1678697 1647541 1698882 1707583 1743244 1731698 1747089 1780075 1819652 1881199
7620 1881199 1883704 1814953 1873740 1873288 1887320 1975423 1993656 1978161 2055602 2102452 2128787 2120816
7608 2120816 2032888 2068423 2057494 2170517 2106594 2104610 2055688 2134309 2254182 2202334 2263061
7597 2263061 2303688 2276142 2311735 2277409 2328393 2392420 2401550 2503069 2523027 2533369 2620743
7586 2620743 2562407 2601377 2780975 2904960 3013718 3266672 3533444 3688521 3541936 3467328
7576 3467328 3414636 3215525 3203716 3226817 3279263 3234556 3282037 3412547 3506637 3631334 3708926
7565 3708926 3719557 3758413 3702704 3564131 3337148 3209616 3132617 3125887 3017963 2949475 2852583
7554 2852583 2823610 2712770 2643417 2649538 2672173 2740569 2730368 2717281 2876878 2878018 2889099
7543 2889099 2999146 3173383 3292131 3468942 3637157 3858642 4083656 4206769 4243341 4188734
7533 4188734 4132308 3922220 3553289 3210494 3004871 2795700 2714936 2515150 2376188 2405973
7523 2405973 2303181 2258923 2221164 2314314 2243681 2141052 2220137 2264250 2345015 2297272 2333435
7512 2333435 2275374 2384738 2494911 2550854 2726975 2781876 2735816 2648568 2651553 2648330 2467339
7501 2467339 2314705 2123936 1955325 1832178 1748977 1604517 1472974 1452587 1478658 1475708
7491 1475708 1446303 1444754 1481395 1507116 1530956 1486265 1446564 1346819 1418986 1346283 1361884 1295667
7479 1295667 1349673 1392122 1414627 1389811 1292327 1351506 1372458 1252608 1133812 1149453 1147095
7468 1147095 1112030 1000396 1016785 1006491 975111 958218 972034 1016829 1018180 1056871 973440
7457 973440 1032839 1072465 1101067 1154918 1070010 1102088 1106163 1192031 1180712 1165911 1073202 950686
7445 950686 912955 869481 768179 801201 841521 787823 816026 826937 767107 763724 770128 774462
7433 774462 706723 733857 791645 786104 801975 856948 820265 841575 947886 915354 941222 985284
7421 985284 1026297 1017654 948476 962222 1003885 1072372 1034822 919783 892169 834379 833192 731259
7409 731259 782752 793693 781225 732068 646180 719934 748798 683659 628643 613774 547591 543850
7397 543850 503423 543051 615029 623308 572426 551923 635049 588571 573474 578551 563893 499286
7385 499286 512939 452607 325424 427489 494442 554723 580508 586318 493508 583440 554671
7374 554671 553157 536914 502272 634591 653409 574622 599299 599613 619312 635126 693216 746695
7362 746695 749775 761601 744596 738155 762413 759095 758715 774278 753153 817065 817001 802225 803705
7349 803705 814611 885170 968591 929022 1000744 1172856 1232627 1236186 1319648 1515427 1765019
7338 1765019 1903029 2051022 2271056 2472765 2643136 2700926 2879705 2817628 2733150 2561618
7328 2561618 2288334 2108662 1976034 1686889 1500056 1343692 1358619 1318909 1153594 1250308
7318 1250308 1228401 1192648 1175755 1077941 1122687 1138398 1165611 1223154 1296853 1295013 1318512 1513203
7306 1513203 1585207 1728673 1881107 2108737 2309492 2455842 2461713 2410590 2304770 2241606
7296 2241606 2118259 1983163 1872794 1666481 1440316 1281053 1133299 1123656 1113882 1048954
7286 1048954 1012532 948619 820963 769335 654343 659634 675230 546204 557367 566954 542577
7275 542577 483933 509263 479510 414004 442987 421891 377057 399724 407518 391455 445924 396718
7263 396718 420195 356358 387830 442225 474153 529865 557114 565234 492012 440217 460628 435094
7251 435094 382799 314743 253989 322760 315379 247342 289049 332829 283533 348853 354943 328866
7239 328866 366882 274961 228360 182836 224405 212256 175919 199212 199128 235292 214669 227997
7227 227997 236321 177013 260201 211775 123598 161206 142768 143721 173514 157771 141456 163949
7215 163949 93872 -48199 131368 172582 196193 261466 179365 177316 207467 174396 282612
7204 282612 275112 217909 275213 261087 229754 182614 187866 140148 137709 115565 75284 76193 102418
7191 102418 14471 88318 112099 122655 95635 67161 108610 -4060 -37481 13587 23775
7180 23775 35040 89415 96192 114265 121612 137976 152049 140268 201826 173801 225133 206834
7168 206834 145897 177068 172775 147113 309019 272019 231431 159333 159288 155454 242501 188811
7156 188811 90989 137877 179736 235799 173461 123331 202318 108230 54081 90673 168083 139163
7144 139163 98591 21074 27224 85707 26222 52566 80714 123808 107902 140661 97645 70390
7132 70390 101915 90441 154001 137244 149020 134143 155837 206322 210285 105627 38950 87482
7120 87482 -26799 -90284 -25483 17237 91822 155998 182755 121127 127590 126300 65632 95493
7108 95493 129556 137102 124914 177793 101361 129213 176116 206852 200665 172402 186912 253837
7096 253837 202582 192482 207612 144097 98079 168148 139328 193131 149208 121756 133179 111546
7084 111546 13105 107045 159936 122738 173267 163485 170975 183408 225410 171679 212864 251133
7072 251133 237146 182734 199963 203087 176148 253462 262790 267380 287368 242157 182465 130830
7060 130830 192097 260700 285354 219378 154903 205385 204767 225377 226025 276914 225421 298093
7048 298093 335885 309500 330503 351913 289794 278545 273070 139192 232697 256324 220071 178507
7036 178507 240544 233536 227476 230044 220975 240509 294249 370006 314622 274322 365155 413013
7024 413013 353730 369413 324841 366886 397989 376233 367013 424159 374091 406391 373401 304779
7012 304779 274692 348621 349216 399711 437371 358765 372878 427575 526707 533052 437515 576663
7000 576663 634561 581650 602346 671524 651091 661734 765558 829096 826324 758051 601866
6989 601866 542553 536639 565190 589621 536071 589204 536542 577395 532163 578627 624554 610802
6977 610802 585202 653885 603531 734344 772337 762986 654647 723635 767091 658306 603400
6966 603400 539237 498535 467901 497591 571848 577406 488314 482479 538095 517515 563742 591015
6954 591015 620329 728847 730685 704341 688499 721281 768463 728404 671539 724740 739523 722462
6942 722462 712363 690148 746284 651836 644200 632520 588241 547076 542192 482539 550647 530593
6930 530593 464777 496733 448841 406739 378994 487344 383855 338339 405970 366458 467673
6919 467673 560011 557767 651995 668834 698337 782383 755443 644723 589625 601980 648345 756627
6907 756627 659144 593080 643909 580982 496400 512256 583255 547843 500576 540617 513435 442266
6895 442266 464262 442680 434681 455766 499523 476549 512043 450444 389867 419535 490233 470719
6883 470719 519948 505292 435391 430855 444371 558750 501041 505448 557717 572568 597027 574977
6871 574977 587562 505984 523922 574993 530574 529879 589030 503996 491741 473881 521507 527676
6859 527676 511432 473335 467152 463502 450994 409357 384424 403898 456970 472110 426785 456911
6847 456911 564790 699641 699305 536354 538892 633157 638453 606378 480573 584098 610919
6836 610919 679683 579515 502773 611283 548510 497779 506394 529523 546092 521910 415197
6825 415197 471920 487709 478078 438274 436262 481875 469666 488515 493891 418297 409283 397371
6813 397371 416994 476332 430783 357760 356523 290970 366948 383570 360602 449738 482124 421882
6801 421882 350166 352551 420873 494604 476553 476023 505159 440766 410986 440180 398748 417881
6789 417881 461167 478997 400317 383097 326034 468589 454453 483154 426472 476079 525871
6778 525871 535545 492050 499882 458168 515127 500987 394762 464904 393451 430684 416895 416066
6766 416066 420771 423287 404063 477524 430775 429427 442310 402621 499604 531568 636257 524392
6754 524392 485726 465602 408989 401602 416873 401895 433992 551509 494558 536565 507257 564815
6742 564815 489292 385057 408817 439016 479089 609157 635007 640146 693657 732506 761729
6731 761729 814084 878504 1068712 1202615 1294488 1270666 1310326 1291831 1144226 1062281 929887
6720 929887 810837 820658 892238 817152 748933 774581 734758 838065 917636 905399 1009325
6709 1009325 1147886 1357647 1439800 1513381 1364829 1226029 1047494 839033 829117 820691 824752
6698 824752 879556 802687 854631 913885 933401 892241 811809 784639 856272 760168 731881 789265
6686 789265 742324 734190 698471 724441 756492 851977 854670 836067 997566 919864 790636 799173
6674 799173 880124 966725 987754 1010358 1123587 1161521 1163386 1180117 1180418 1232672 1289829 1308994
6662 1308994 1391509 1349933 1297231 1240125 1242890 1181908 1143246 1194993 1089787 1008983 1019162
6651 1019162 1094780 992480 1004688 967489 988002 857041 810616 823771 842830 900368 892288
6640 892288 835784 836887 808284 803073 868266 765387 792978 889441 864481 892883 936230 947962
6628 947962 958488 921476 955099 1035418 1078579 1093569 1078440 1157650 1269520 1278411 1258469 1293923
6616 1293923 1220674 1267266 1288229 1357341 1285845 1274663 1299041 1379591 1480094 1452626 1527313
6605 1527313 1611171 1624916 1637484 1694607 1616430 1594149 1545844 1491283 1574535 1579542 1555805 1538930
6593 1538930 1564816 1574729 1549269 1594135 1622914 1630018 1608036 1591255 1600123 1589643 1547200 1484121
6581 1484121 1449956 1486201 1470896 1539494 1536797 1526590 1430214 1460549 1558582 1469206 1326548
6570 1326548 1357742 1419277 1496598 1608102 1628643 1656662 1677755 1814592 1809728 1759666 1896227
6559 1896227 1968541 2074572 2093632 2117478 2249991 2244161 2231633 2215623 2180658 2300205 2307278
6548 2307278 2361062 2333212 2363941 2356992 2215062 2291826 2358800 2336472 2368691 2420596 2386676
6537 2386676 2485432 2541493 2488091 2393007 2337679 2385140 2236903 2255922 2187766 2158386 2121972
6526 2121972 2221656 2174137 2063233 2104093 1901742 1866297 1767609 1831366 1790411 1755443 1743687
6515 1743687 1702160 1636098 1735765 1729418 1665045 1607331 1625737 1548758 1576060 1642982 1653890 1704292
6503 1704292 1698407 1711903 1717447 1757206 1701361 1692369 1678153 1715453 1860041 1959233 2003937 2017720
6491 2017720 1949405 1978482 1966181 1997802 2079679 2123659 2163162 2149926 2172263 2180480 2198203 2174496
6479 2174496 2088995 2140146 2173454 2254505 2238751 2226356 2191369 2206726 2276770 2290783 2277044
6468 2277044 2254364 2321633 2312233 2355633 2473119 2480989 2396797 2431857 2551647 2534335 2520140
6457 2520140 2623026 2734329 2855317 2998052 3148494 3358014 3341471 3567347 3776712 3755682
6447 3755682 3786592 3835630 3843354 3692960 3653199 3558145 3389958 3226314 3076628 3021743 2927845
6436 2927845 2813580 2646700 2642109 2604151 2443073 2380898 2265855 2149502 2167924 2117035 2025610
6425 2025610 2060459 2019890 1866578 1800345 1822815 1807698 1788027 1733594 1667731 1635218 1515192
6414 1515192 1498054 1518634 1512298 1443473 1426131 1444817 1383990 1435024 1385888 1363242 1349204 1296276
6402 1296276 1303055 1293518 1300645 1280230 1288053 1268986 1245148 1244348 1268092 1230634 1290409 1354516 1253816
6389 1253816 1276383 1315235 1381513 1356813 1445175 1401079 1394957 1317234 1300842 1285222 1313120 1376311
6377 1376311 1410460 1372395 1281417 1379749 1416663 1374481 1355564 1222462 1200994 1239221 1305708
6366 1305708 1339440 1317056 1393526 1408278 1391857 1448773 1437863 1445027 1588689 1538642 1573804
6355 1573804 1558649 1557966 1587368 1540931 1619557 1606009 1677001 1662137 1783030 1791883 1727659 1764326
6343 1764326 1710243 1797274 1886506 1881872 1751153 1906004 1947208 1989556 1942641 1998861 2053083
6332 2053083 2054878 2088878 2082400 2124495 2179474 2198792 2177669 2198212 2280747 2291159 2237933 2245943
6320 2245943 2260714 2280467 2297960 2395252 2409461 2469108 2436524 2518856 2553863 2495937 2530306
6309 2530306 2648234 2675191 2738925 2724117 2742458 2804350 2891026 2981214 2959316 3067664 3053238
6298 3053238 3019312 3157997 3160085 3213021 3238440 3362739 3437492 3440418 3421454 3475080 3545220
6287 3545220 3565353 3673709 3665743 3752353 3742758 3811296 3887602 3946249 3986218 4057784 4237024
6276 4237024 4305954 4353770 4416925 4411138 4553025 4606644 4715619 4761707 4868573 4917538 5041904
6265 5041904 5232809 5395655 5455272 5471091 5695938 5865521 5992886 6173795 6379058 6516823
6255 6516823 6701521 6835040 6925288 7125810 7367335 7658022 7882733 8122497 8364203 8725060
6245 8725060 9040061 9421769 9774909 10261537 10693681 11099686 11600576 12077657 12614874 13262121
6235 13262121 13952927 14584055 15253785 16133831 16967065 17842906 18683585 19595769 20595507
6226 20595507 21655170 22631572 23559520 24646284 25630772 26669849 27640960 28622593 29653056
6217 29653056 30725968 31696794 32820915 33972917 35238505 36382799 37446398 38606764
6209 38606764 39558982 40299028 40774284 40972333 40807220 40179406 39386591 38090395 36644584
6200 36644584 34991556 33223766 31384171 29598363 28023522 26322891 24692214 23291089
6192 23291089 21959571 20715768 19523918 18392913 17332727 16422504 15513477 14700464 14008790
6183 14008790 13339505 12756812 12153543 11610030 11164906 10806869 10437344 10081786 9740159
6174 9740159 9328640 8979811 8621995 8238423 7918723 7639014 7417328 7235292 6972080 6691608
6164 6691608 6521072 6397525 6208370 6019357 5823640 5625760 5433219 5303121 5188719 5123771
6154 5123771 4978392 4790788 4558939 4439658 4502774 4393998 4224121 4072459 4038522 3939372
6144 3939372 3806035 3688263 3608388 3572656 3492926 3534514 3434844 3272235 3210299 3287222 3237383
6133 3237383 3167956 3146137 3065874 3030953 2970671 2917531 2782285 2697398 2608982 2645960 2586426
6122 2586426 2647536 2589836 2436402 2414385 2359711 2273351 2266863 2236043 2099781 2117921 2120402
6111 2120402 2069736 2048560 1978711 1923879 1873575 1886648 1893110 1856837 1787601 1792566 1793171 1722725
6099 1722725 1631603 1664757 1602474 1602096 1556202 1528291 1565307 1544226 1492139 1484440 1377103 1327853
6087 1327853 1357510 1403103 1473286 1429795 1381742 1360008 1482779 1252623 1223012 1265954 1137790
6076 1137790 1129474 1232628 1225933 1269633 1218277 1154300 1149362 1169965 1227919 1135527 1145684 1116446
6064 1116446 1140124 1098263 1039882 1017391 1029340 1158404 1156621 1042693 1076648 1073635 1010331
6053 1010331 1081544 1114244 1082022 1028955 1011457 1056710 1015557 977705 973642 957287 925463 917694
6041 917694 876092 866210 917761 970440 956890 956116 996121 966068 930859 921197 1049702 1055415
6029 1055415 1048425 1070556 1094255 1122180 1062607 1006885 1103543 1115883 1026493 1051271 1061937 1102550
6017 1102550 1091950 1156706 1116247 1152738 1062678 1040602 1117193 1072590 1118327 1064881 1066477 1118099
6005 1118099 1097469 1048032 1078524 975067 884217 830817 947893 958703 955718 1013723 1063094
5994 1063094 1079820 991968 944316 942373 990835 991101 955533 948960 867085 856765 918385 912696
5982 912696 957364 917779 905528 864658 957407 952123 892115 791711 882440 895091 827908 833452
5970 833452 790136 707602 684685 713353 714499 730044 654280 671415 785749 916811 802632
5959 802632 757208 753573 755393 695024 678204 646615 657675 735837 702592 696478 774032 773256 782063
5946 782063 792525 736195 638706 571231 659214 652543 753206 804401 821845 784201 760228 710214
5934 710214 688165 724218 736937 892311 874233 807522 698393 676576 717503 742657 732500
5923 732500 773085 820037 809087 813585 891622 881463 844737 960913 996462 922439 888037 790183
5911 790183 865839 883878 896999 955641 907846 842517 788747 815161 838464 914156 962381 958731
5899 958731 932960 941832 926133 917219 906525 852513 866173 868511 867275 879771 979487 954819
5887 954819 858312 816124 821332 943683 940821 948657 932483 912402 988891 1027628 959154 942667
5875 942667 1045234 1155136 1173036 1335199 1233182 1230878 1265138 1202609 1239715 1252036 1158778
5864 1158778 1163575 1144076 1091458 1199048 1118529 1125696 1095227 1081815 1152270 1084477 995126 1030874
5852 1030874 1090161 1141028 1090893 1109653 1209420 1230610 1294522 1331230 1334819 1329543 1311554 1355746
5840 1355746 1444224 1430910 1387922 1447354 1361667 1415886 1367546 1241018 1333064 1254948 1258942
5829 1258942 1267635 1228122 1217025 1218628 1270630 1263345 1360758 1267575 1226839 1334333 1257873 1191211
5817 1191211 1260871 1273556 1276322 1311064 1259884 1175502 1200381 1250982 1214463 1217207 1223884 1376324
5805 1376324 1339792 1371696 1395000 1365773 1369865 1502686 1513274 1468504 1516276 1567739 1632215
5794 1632215 1633850 1564831 1560424 1506024 1475376 1406512 1380889 1411189 1395730 1385449 1435742 1377177
5782 1377177 1379293 1424867 1444412 1591969 1559876 1565051 1526139 1535761 1561079 1533359 1619165 1653754
5770 1653754 1607204 1684684 1634240 1633781 1559750 1678035 1764303 1734321 1750618 1806110 1881084 1836980
5758 1836980 1845768 1883878 1881934 1864012 1945475 1943805 1932910 1976961 2094807 2133492 2109574 2165292
5746 2165292 2216926 2289014 2290859 2348143 2447487 2527493 2530879 2548155 2513940 2662984 2766667
5735 2766667 2802841 2753178 2739735 2668378 2635012 2718720 2719383 2788885 2820046 2908596 2898497 2907758
5723 2907758 3011016 3148644 3226097 3275958 3432246 3468545 3632979 3824304 3872658 4032876
5713 4032876 4210475 4318404 4409513 4445681 4593235 4764964 4799670 4705636 4729008 4861029
5703 4861029 4871544 4908756 4920051 4985608 4911346 5014289 5071614 5102573 5195330 5282435 5466616
5692 5466616 5575087 5690519 5790812 5973861 6206643 6451116 6720985 6899686 7198360 7582363
5682 7582363 7943544 8266454 8603545 8875346 9304571 9794978 10220042 10749743 11307142 11871261
5672 11871261 12368325 13088509 13613032 13939098 14138744 14013727 13782483 13438585 13113258
5663 13113258 12757868 12513588 12371287 12315390 12388983 12477653 12684874 12858455 13110132 13417431
5653 13417431 13866254 14423936 15021551 15689645 16520833 17324487 18330054 19437717 20512221
5644 20512221 21745775 22870668 23994055 24893501 25411971 25446506 25073872 24443138 23560793
5635 23560793 22773866 22003544 21458108 20983231 20654148 20593059 20489266 20559136 20853706 21281932
5625 21281932 21827353 22583185 23478589 24719570 26047028 27550788 29434103 31489973 33817615
5616 33817615 36509487 39385819 42429460 45389202 47996000 49538239 49742246 48491008
5608 48491008 46368293 43823511 41155312 38812865 36833461 35252679 34182361 33436570
5600 33436570 32900250 32614158 32783189 33196475 34008153 35194417 36658631 38468808 40752989
5591 40752989 43516065 46593171 50379868 54788243 59601340 64795855 70004864 74258583
5583 74258583 76424485 75532129 71887804 66319812 60071327 54165443 49066346 44953750
5575 44953750 41544833 38735563 36492591 34656119 33175227 31977688 31103474 30514664
5567 30514664 30292624 30408778 30671812 31210222 32095913 33103046 34396378 36087337 37971757
5558 37971757 39813814 41459303 42496197 42494228 41160898 38778130 35759276 32647003 29658073
5549 29658073 27012725 24778588 22864246 21201160 19645675 18331445 17209191 16162426
5541 16162426 15187650 14357964 13712942 13055150 12419843 11838022 11364489 10953754 10616258
5532 10616258 10265055 10003877 9720349 9395464 9215724 8943557 8753237 8536688 8294008
5523 8294008 8077921 7806704 7618211 7429267 7199298 7118022 6876125 6709056 6576789 6467048
5513 6467048 6431022 6299557 6172624 6050558 6017482 6012056 5899011 5749669 5756743 5570014 5485289
5502 5485289 5408014 5344307 5284030 5199166 5121354 5062318 5027436 4984199 4898347 4859699 4805842
5491 4805842 4754305 4750521 4642631 4640260 4619055 4569292 4599452 4482846 4382322 4437871 4456679
5480 4456679 4459470 4406154 4339036 4266741 4253376 4252273 4158229 4055151 4038438 4114086 4073815 4067426
5468 4067426 4073180 4058077 4173218 4129420 4214088 4361108 4334036 4598976 4690903 4774293 4990123
5457 4990123 4965062 5024912 4951075 4769949 4670357 4497075 4472441 4303863 4189977 4093899 3893019
5446 3893019 3842336 3755552 3750927 3637359 3525499 3472502 3442123 3395567 3429893 3357032 3366129
5435 3366129 3312133 3342666 3370334 3426005 3434176 3466165 3475342 3472068 3421368 3461111 3427870 3437399
5423 3437399 3333442 3324906 3276295 3315915 3321346 3173913 3172446 3098615 3108145 3007782 3000358 3008694
5411 3008694 3029210 2958624 2970341 2946034 3003572 3040737 3052929 3027006 2908406 2976215 2947329
5400 2947329 2931183 2940474 2859146 2845330 2879857 2831517 2937101 2892997 2876168 2766670 2777138
5389 2777138 2809783 2816374 2898475 2883432 2850546 2808185 2884017 2907188 2948058 2931775 2985207 2925644
5377 2925644 2946813 2898346 2958416 2989096 3038973 3027603 2963380 2904803 2987826 2994839 2911034 2985492
5365 2985492 2910414 2935047 2995279 3096289 3143018 3069748 3085853 3109371 3121219 3127111 3163901
5354 3163901 3111230 3055074 3122408 3097780 3025578 3095551 3045126 3130342 3158953 3198051 3148075
5343 3148075 3207072 3242572 3174811 3143894 3188540 3281555 3310139 3351038 3334148 3368379 3427594
5332 3427594 3408957 3484443 3531728 3609675 3694911 3766484 3850208 3950786 3996538 4038638 4160584
5321 4160584 4160366 4154602 4154361 4191781 4171325 4078188 4180105 4196963 4083257 4069953 4132713 4099463
5309 4099463 4067015 4006156 4051776 4182263 4190882 4289817 4268667 4267072 4306727 4253865 4307714 4424291
5297 4424291 4364459 4399350 4384754 4386710 4376646 4333649 4317639 4328919 4363169 4473912 4449838
5286 4449838 4469096 4631698 4672750 4615426 4569719 4512548 4625369 4736209 4787179 4816690 4800762
5275 4800762 4773100 4721319 4786566 4692422 4624777 4711574 4679965 4550359 4471789 4468611 4385060
5264 4385060 4363144 4364786 4353872 4354412 4359312 4455699 4455165 4371657 4413960 4458323 4494746 4476882 4486644
5251 4486644 4425881 4374528 4471324 4494916 4539102 4547724 4549236 4538996 4558224 4592481 4559790 4599457
5239 4599457 4531070 4640343 4646232 4634203 4651343 4672133 4634852 4702698 4782828 4811537 4856937
5228 4856937 4883113 4818073 4778951 4847562 4834114 4856753 4797199 4828471 4925618 4931255 4945498 5003210
5216 5003210 4948291 4900511 5162327 5312022 5352964 5380769 5436125 5574207 5808337 5965500
5206 5965500 5955535 6024471 6000171 6030306 6016367 6028203 6056360 6124597 6272961 6398395 6526007
5195 6526007 6550514 6570122 6675961 6748973 6855215 6928785 6969201 7053823 7157411 7356124 7472627
5184 7472627 7563607 7738249 7857050 7951724 8003187 8149735 8304212 8429163 8619898 8747089
5174 8747089 8944657 9298288 9359712 9535884 9644815 9841427 10007995 10171341 10365636 10663549
5164 10663549 10962718 11250867 11497978 11731455 11982739 12261699 12657976 13073190 13301293
5155 13301293 13550152 13857641 14277749 14813656 15275961 15782421 16318152 16863160 17398290
5146 17398290 18003042 18685106 19578505 20541904 21697868 23101546 24478740 25798324 27307486
5137 27307486 29063978 31306473 33856824 36481000 37834297 38189883 38601597 38537447 38104022
5128 38104022 37773882 37776016 38130390 39022196 40326123 41363109 42074847 42892183 43824562
5119 43824562 45075193 46825462 48695356 49922415 51128933 52472633 54283834 56708169
5111 56708169 59509872 62617362 66026943 69893070 73652928 75010583 73020835 70431477
5103 70431477 67458550 64210633 61448228 59298415 57496448 56285999 55565617 54372451
5095 54372451 52730895 51169806 49584305 48384754 47671756 47295124 46768702 46034272 45524240
5086 45524240 45328727 45757840 46650350 47625427 48399671 49100439 49859158 50021730 48514428
5077 48514428 46620088 44796237 43405331 42766701 42528177 42421169 42378235 42650296 43080351
5068 43080351 43831282 44794442 46188028 47637580 49584356 52054926 54723525 57895140
5060 57895140 61601199 65970191 71014150 76732336 82641963 88754213 94836875 100625003
5052 100625003 106040026 110910787 114910827 117607169 118325285 116602103 112834885 107817655
5044 107817655 101998194 95975667 90126090 84171227 78104537 72082392 66133072 60461477
5036 60461477 55242077 50684671 46743585 43332592 40399071 37886941 35689542 33675502
5028 33675502 32007400 30410622 28949471 27796181 26752394 25680734 24770525 24079413
5020 24079413 23474961 22783149 22250601 21756466 21245396 20914064 20802952 20658905 20547658
5011 20547658 20290844 19817353 19245629 18728229 18248366 17741716 17271119 16862350 16476913
5002 16476913 16081448 15645075 15215348 14848233 14446366 14210747 13987972 13676444 13534546
4993 13534546 13302141 13021300 12700265 12480849 12294594 12223183 12199091 12101085 12016556 11963794
4983 11963794 11935075 11723944 11441823 11282194 11230030 11094354 10904410 10741797 10696430 10553927
4973 10553927 10512851 10546985 10482359 10533636 10466957 10318860 10207575 10076610 9872283 9723383
4963 9723383 9689367 9599920 9573440 9449685 9444240 9302141 9160981 9009202 8822254 8669401
4953 8669401 8471317 8446718 8421942 8365047 8338018 8291337 8249518 8205808 8259653 8256840 8122142
4942 8122142 8071714 8024603 7991248 7908318 7709115 7718820 7650432 7511485 7439560 7341643 7300004
4931 7300004 7204944 7102375 6983885 6855890 6734772 6715116 6633202 6577759 6574056 6488066 6483921
4920 6483921 6387103 6393646 6299013 6332757 6226749 6154369 6128377 6056756 6038978 5952357 5906220
4909 5906220 5872935 5863436 5836815 5817186 5836939 5858806 5854798 5795692 5778043 5660253 5616987 5606878
4897 5606878 5554442 5570790 5543110 5583740 5617135 5654040 5544240 5603540 5537931 5469834 5670061
4886 5670061 5655636 5587824 5631707 5685320 5687033 5721253 5732892 5641294 5579348 5650673 5731030 5767152
4874 5767152 5613770 5580372 5494411 5442885 5480360 5334258 5342089 5436162 5489184 5436644 5465497
4863 5465497 5450454 5436119 5552485 5585859 5668503 5760760 5727058 5726988 5690852 5742091 5824560 5872015
4851 5872015 5913814 6028528 6057295 5988665 5849160 5693527 5544717 5509064 5340066 5299614
4841 5299614 5321934 5349552 5357231 5351422 5408427 5503084 5593712 5702114 5689068 5808323 5836327
4830 5836327 5911794 5953150 5911396 6076210 6185579 6282010 6316111 6324955 6351295 6473688 6637449
4819 6637449 6917826 7118420 7467088 7815901 8235089 8822758 9448795 10249544 11287665
4810 11287665 12600042 13940965 14719344 14044764 12990218 11630521 10212187 9426278 8946434
4801 8946434 8662616 8486442 8322269 8100013 7993070 7973757 7860386 7766848 7791343 7761373
4791 7761373 7802205 8028907 8275214 8136916 7759771 7357234 6934542 6573808 6273087 6108691
4781 6108691 6170044 6196227 6342288 6406673 6458718 6402282 6321978 6275062 6109973 5902408 5874322
4770 5874322 5808238 5733801 5689356 5660170 5727632 5713936 5727681 5673462 5453135 5380114 5290871
4759 5290871 5192438 5132096 5186576 5282895 5277166 5270194 5303257 5325841 5516898 5689060 5804611
4748 5804611 5912532 5836030 5861665 5871857 5707924 5444812 5214976 4985830 4678256 4496051
4738 4496051 4343999 4158619 4018403 3945536 3873323 3685106 3651527 3554303 3523600 3468338 3326577
4727 3326577 3296093 3274541 3209920 3153299 3123473 3140083 3112892 3168522 3096636 3008905 2994698
4716 2994698 2865387 2892392 2988337 2962298 2924094 2880700 2932640 2981884 2952776 2934137 2834964
4705 2834964 2864618 2888085 2924123 2979498 3009067 3052074 2946526 2855491 2873615 2839672 2885595
4694 2885595 2921565 2872969 2834329 2857069 2805272 2825829 2752683 2728634 2795329 2718945 2830474
4683 2830474 2835477 2810575 2764094 2826972 2851065 2716371 2745233 2734079 2724329 2791761 2833368 2744646
4671 2744646 2726472 2736921 2792967 2838969 2847757 2790987 2837331 2825529 2787643 2747638 2767592 2767704
4659 2767704 2710042 2686237 2815222 2820246 2821454 2782893 2786738 2859917 2913172 2942327 2949814 2916681
4647 2916681 2919669 2984824 2986524 3062119 3086010 3154747 3052795 3073710 3115268 3153294 3179443 3182415
4635 3182415 3082647 3069428 2956068 2972819 3040845 2959434 2953842 2894128 2903306 2933051 2858215 2876273
4623 2876273 2880530 2887620 2909475 2952348 3002343 3015800 3013657 2878452 2871539 2948659 3015652 3083892
4611 3083892 2995914 3012044 3086866 3096738 3071956 3129247 3105253 3143596 3113757 3083686 3069269 3080731
4599 3080731 3159888 3184848 3254476 3258989 3375074 3393374 3364653 3321895 3383495 3405006 3371159
4588 3371159 3361540 3500689 3628865 3558654 3628380 3637703 3692182 3822352 3824268 3876820 4065087
4577 4065087 4049014 4022465 4057984 4041368 3969147 4032103 4166840 4126735 4091173 4115926 4164197
4566 4164197 4258462 4350220 4426274 4473641 4506037 4377010 4490701 4486749 4419329 4640329 4692672
4555 4692672 4758488 4768401 4865366 4931410 4982208 5059541 5050388 5121811 5116597 5152272 5260524 5255776
4543 5255776 5203171 5472519 5572723 5674766 5793182 5902259 6032646 6213123 6376207 6495789
4533 6495789 6676819 6769303 7038831 7225332 7493231 7662934 8019434 8312956 8674680 9130893
4523 9130893 9551086 9964222 10199274 10234443 10252851 10190119 10144955 10223188 10239874 10443339 10719218
4512 10719218 11087273 11459345 11881027 12490500 13056903 13476639 13802905 14102532 14185888 14120191
4502 14120191 13930962 13715012 13454078 13161150 12978661 12779739 12728307 12811047 12810170 12912294
4492 12912294 12964860 13176949 13429409 13649587 13996013 14347190 14642277 14968570 15421864 15942608
4482 15942608 16436612 17033086 17626538 18332697 18911336 19465348 19983098 20380766 20685978
4473 20685978 21112820 21380724 21532514 21607944 21384365 21049560 20730212 20500741 20398465 20323475
4463 20323475 20341433 20431730 20547200 20616448 20639845 20740664 20965741 21256097 21583186 22050220
4453 22050220 22413081 22969664 23588916 24119928 24651814 25403330 26145575 27051775 27987351
4444 27987351 29066143 30293084 31390701 32571487 33665585 34611840 35457191 36098929 36608764
4435 36608764 36806731 36966361 37113046 37294940 37485278 37723915 37906271 38174966 38538282
4426 38538282 39030798 39662104 40568957 41737716 43145760 44819974 46696991 48742558 50946782
4417 50946782 53235265 55552347 57910736 60191224 62561011 64949723 67272959 69360069
4409 69360069 71158945 72602313 73882154 75208783 76770652 78495405 80355443 82331978
4401 82331978 84414626 86729669 89055970 91375580 93682846 95823738 97660861 99076485
4393 99076485 100159877 101034241 101708720 102474461 103292030 104272433 105497637 106636928 107541335
4384 107541335 107925913 107459430 106026932 103317449 99759795 95409660 90539986 86113103
4376 86113103 82157253 78975657 76876768 75718445 75391291 75927249 76994501 78102294
4368 78102294 78529194 77713590 75142229 71022904 66111902 60972439 56262819 52150971
4360 52150971 48736121 45829627 43490386 41507468 39884528 38523251 37410241 36496929
4352 36496929 35746445 35205649 34653917 34270072 33865935 33253476 32436828 31432492 30378510
4343 30378510 29223210 27962599 26806835 25757881 24869554 24139646 23457069 22752651 22180686
4334 22180686 21629396 21046696 20416638 19808621 19151202 18321383 17555187 16859804 16228323
4325 16228323 15624183 15118589 14661838 14344883 14017178 13650097 13416880 13071240 12786971
4316 12786971 12397698 12120369 11913967 11667826 11442515 11253066 11052731 10769184 10588912
4307 10588912 10511395 10441556 10249836 10027612 9943663 9878885 9888098 9759885 9662750 9642124 9594073
4296 9594073 9644210 9569352 9352916 9279026 9202162 8985103 8918376 8905746 8833006 8737035 8619776
4285 8619776 8574957 8487438 8389191 8422477 8378031 8409116 8454590 8474600 8424842 8423981 8488738 8439085
4273 8439085 8468903 8301508 8297204 8410902 8428751 8453169 8430197 8443728 8439517 8399399 8350428
4262 8350428 8429553 8363070 8333037 8468239 8471161 8363883 8404724 8525290 8503654 8445991 8502044
4251 8502044 8474218 8513568 8598363 8563329 8644097 8648832 8646178 8678840 8620952 8606211 8680973 8635522
4239 8635522 8719801 8784986 8893649 8972899 9244070 9473249 9738713 9915361 10174624 10336385
4229 10336385 10349909 10287447 10059000 9945221 9894309 9844707 9837386 9851487 9868165 9919945 9987935
4218 9987935 10017485 9994792 10083606 10127054 10228979 10331064 10527383 10615321 10800823 10938006
4208 10938006 11112540 11329883 11455794 11715460 12017417 12124071 12314462 12508220 12770039
4199 12770039 12911033 13064103 13300376 13523107 13656559 13908896 14131645 14350024 14579226
4190 14579226 14881544 15118131 15407676 15678171 16054256 16344467 16507467 16759511 16992868
4181 16992868 17382226 17744661 18097747 18446518 18936153 19390462 19871581 20374867 20920120
4172 20920120 21468043 21937095 22625179 23301456 23995517 24795262 25732201 26731539 27871087
4163 27871087 29080354 30381573 31792166 33257950 34995331 36788793 38759891 40894085
4155 40894085 43199750 45785985 48609839 51799749 55457671 59585124 64426641 69843428
4147 69843428 76029977 83215694 91178337 100167112 110645971 122941398 137322839 154035690
4139 154035690 173220757 194332451 215051070 230008071 233020884 222467041 202843913
4132 202843913 179098199 155790719 135932672 120119934 107797068 97960076 90008610
4125 90008610 83446150 77710107 72548839 68047286 63984377 60533707 57633407 55066314
4117 55066314 52975218 51282612 50046142 49056685 48250836 47796155 47491027 47423587 47605098
4108 47605098 47963842 48484700 49298823 50251963 51280703 52491166 53633968 54845570 55837129
4099 55837129 56676019 57451037 58027848 58455487 58838717 59416794 60200750 61510481 63289410
4090 63289410 65315282 67675231 69937028 71567869 72047426 71409942 69738299 67543108
4082 67543108 65410974 63495204 62055904 61273332 61037004 61047282 61442332 62135286 63336417
4073 63336417 64993490 67257894 69901530 72786431 75707097 78634882 81499224 84112274
4065 84112274 86917445 89946719 93610179 97986810 102571045 106434462 108145504 106762356
4057 106762356 102188004 95406942 88050301 81014848 74884611 69835358 65764932 62556715
4049 62556715 60068587 58037098 56507056 55339816 54701393 54650301 54795435 55274967 56134637
4040 56134637 57316896 58463054 59697818 60969340 62317561 63707948 65106202 66378497
4032 66378497 66962582 66539547 64917513 61936024 58195875 54173448 50216445 46662659
4024 46662659 43609605 40984859 38937824 37121381 35637312 34369087 33220010 32269923
4016 32269923 31433917 30951200 30469069 30112181 29859136 29751595 29648023 29528221 29432759 29342281
4006 29342281 29271848 29289118 29448181 29667475 29919134 30309903 30621884 30907606 31131752 31296981
3996 31296981 31627359 31828227 32021958 32383023 32857009 33631637 34631328 35754144 37185957
3987 37185957 38934781 40987338 43508015 46543401 50048231 54245038 59318246 65396595
3979 65396595 72651040 81252262 91069974 100582416 107157865 107639907 102181567 93414578
3971 93414578 83292241 73968466 66591776 60899724 56735405 53658897 51352148 49549016
3963 49549016 48211639 47066923 46222355 45469922 44908860 44394952 43848812 43231104 42564043
3954 42564043 41709531 40729916 39744232 38562336 37388976 36170300 34973983 33652863 32425095
3945 32425095 31283188 30256041 29301398 28593903 27897957 27340007 26980561 26619645 26443323
3936 26443323 26237515 26093640 26122234 26194468 26139083 25942658 25698157 25200857 24764520 24417784
3926 24417784 24111301 23928331 23772944 23801092 23889433 23985541 24309847 24701439 25315241 25906601
3916 25906601 26726288 27678405 28655790 29845250 31229032 32786154 34746014 37000537 39709548
3907 39709548 42866609 46698862 51310279 56884440 63356734 70032495 74737657 75273654
3899 75273654 71257242 64710016 57342161 50466796 44996890 40800531 37580677 35034135
3891 35034135 33053796 31283061 29806847 28635774 27559754 26722390 26055829 25498770 25109476
3882 25109476 24884406 24859296 24898484 25110744 25411590 26002266 26734575 27661820 28598645 29488891
3872 29488891 30233086 30772107 30484098 29676832 28346735 26761150 25376592 24150334 23169701
3863 23169701 22365590 21629630 21073590 20664435 20111553 19518677 18994730 18589349 18302235
3854 18302235 18157683 17886154 17767319 17704243 17691505 17780747 17769907 17653284 17455475 17308850
3844 17308850 17139678 17125678 17102248 17210495 17422179 17734544 18023943 18423380 18917509 19484843
3834 19484843 20139940 20359990 20311568 20030837 19517235 18989449 18545799 18208466 17974127 17842763
3824 17842763 17650109 17602400 17470605 17326986 17244361 17226591 17142620 17145124 17177077 17127364 17301482
3813 17301482 17362035 17490571 17643253 17906222 17988089 18025279 18078493 17923091 17886621 18024207
3803 18024207 18123817 18298091 18637436 18996363 19424140 19789778 20214415 20528376 20745530 20817972
3793 20817972 20756361 20525566 20223104 20109768 20075844 19972582 20027857 20039715 20167083 20412351
3783 20412351 20616944 20819095 21085207 21596047 22110388 22612949 22979384 23178865 23438388
3774 23438388 23682056 23815479 24012730 24340436 24765974 25300966 25789747 26247290 26826007
3765 26826007 27398526 27998648 28614424 29367558 30094155 30854692 31551267 32357527 33193516
3756 33193516 34021245 34894418 35722423 36671038 37625481 38621379 39624538 40680080 41910665
3747 41910665 43044920 44012552 44856310 45517436 46171996 46861749 47619531 48478651 49417453
3738 49417453 50376669 51377975 52466784 53604050 54843980 56028178 57293393 58746795
3730 58746795 60221719 61775714 63400005 65266558 67261631 69360916 71437474 73689243
3722 73689243 76210243 78688426 81241671 84015069 86791931 89631717 92631217 95591303
3714 95591303 98548251 101502195 104655767 107802992 111165042 114542844 118034473 121675366
3706 121675366 125283326 128852058 132511102 136100630 139608902 143095091 146362747 149462534
3698 149462534 152436802 154990878 157220303 159085917 160530172 161766288 162731112 163343673
3690 163343673 163463407 163304954 162916335 162278625 161300407 160077190 158542763 156810148 154867057
3681 154867057 152672475 150033078 146991697 143624710 139931460 135876080 131575150 127273145
3673 127273145 122820480 118331148 114043268 109956944 105955526 102035917 98243708 94534936
3665 94534936 90817811 87118945 83478596 79845632 76380929 73097497 70171240 67442086
3657 67442086 64930806 62706973 60501260 58603202 56833031 55230365 53772750 52472799
3649 52472799 51305561 50318941 49366784 48491709 47662848 46960351 46286852 45733970 45013451
3640 45013451 44319594 43779736 43152751 42656702 42143973 41574438 41083413 40698258 40252624
3631 40252624 39875976 39584238 39120362 38675397 38363828 38107926 37969035 37877980 37840634 37895555
3621 37895555 38053030 38307991 38683894 39050594 39434128 39745242 39973522 40099026 40145809 40265808
3611 40265808 40405920 40590197 40912887 41234072 41644623 42030228 42518806 43046395 43590110
3602 43590110 44188430 44876230 45645450 46637014 47689296 48936396 50373899 51963953 53549580
3593 53549580 55103389 56859997 58843350 61193577 64060895 67217600 69554195 70388890
3585 70388890 70655491 70410328 70079214 70183443 70949172 72529924 74922344 77868138 81047561
3576 81047561 84318870 87507577 90059286 91947376 93784332 95221768 96897473 99115187
3568 99115187 101917403 105303519 109191908 114257069 120723168 128501635 138050987 148278470
3560 148278470 156775731 160826595 162280944 163978442 166223585 170630002 177061547 184754149
3552 184754149 192849795 200860170 209185320 218011911 227386403 237877071 249414702 262279678
3544 262279678 275961843 290574703 305579198 320226407 333466678 343540138 349677214
3537 349677214 351683937 349919642 345297647 339312610 332568140 325089369 317770958 311593145
3529 311593145 305937953 300724951 295188363 288131529 278400518 265717236 250394108 233062672
3521 233062672 214894803 197058287 180454927 165638859 152511254 141069199 131263072
3514 131263072 122649032 115133310 108486764 102440059 97138608 92376576 88086792 84189000
3506 84189000 80713720 77409714 74323979 71465506 68752269 66253378 63930545 61702534
3498 61702534 59798943 58107041 56485816 54932154 53512567 52205418 51007790 49889388
3490 49889388 48806398 47869229 46921340 45989468 45131959 44213863 43500348 42746567 42036690
3481 42036690 41431279 40841960 40268645 39728582 39231582 38823621 38425538 38106179 37853604
3472 37853604 37598296 37463007 37193714 37028020 36982345 36955561 36950774 36837916 36902952 36971755
3462 36971755 37095101 37239661 37468982 37696966 38036825 38429655 38786194 39314923 39877096
3453 39877096 40559819 41204691 42025388 42835766 43797770 44760048 45864922 47134581 48490955
3444 48490955 49925031 51582644 53252467 54930831 56907562 58926866 61090834 63333894
3436 63333894 65620681 67924727 70223547 72565202 74946674 77322630 79591158 81706096
3428 81706096 83828320 85783929 87677191 89604821 91431164 93201957 95027157 96617793
3420 96617793 98054446 99433384 100633102 101441824 101977791 102512234 102909400 103344455 103747072
3411 103747072 104275740 104906131 105664450 106572791 107832497 109268625 110872916 113022798 115350407
3402 115350407 118182192 121488452 125242787 129791618 135035325 141063441 147850231 155514234
3394 155514234 163777876 172593103 181969290 191914732 202494474 213757067 225495025 237454324
3386 237454324 248866207 259052046 267513269 274371328 280047076 285084333 290035573 295194829
3378 295194829 300548755 306139374 311405930 315867527 318730446 319223088 316985467 311821111
3370 311821111 304091754 294583624 283961516 272802550 261672016 251112719 241189592
3363 241189592 231891335 222915405 214094857 205191704 195577304 185184558 174090448 162540362
3355 162540362 150837734 139763823 129586043 120346871 112142299 104968401 98548643 92768740
3347 92768740 87731665 83218444 79063491 75296023 71793651 68620547 65727163 63140985
3339 63140985 60792098 58593051 56391729 54422455 52655120 50885054 49311901 47713954
3331 47713954 46310487 44825796 43424893 42232489 41025853 39882681 38786900 37747996
3323 37747996 36718959 35677760 34788720 33964917 33038597 32131033 31296107 30549631 29784634
3314 29784634 29088981 28439552 27868044 27185726 26605785 25996194 25461296 24896634 24418114
3305 24418114 23988134 23423983 22939107 22437250 21970800 21469528 21159179 20820261 20416729
3296 20416729 20072409 19780814 19491517 19083540 18789304 18466052 18193440 17874896 17627698
3287 17627698 17370219 17090055 16834672 16460896 16218886 15992433 15753095 15566868 15289747
3278 15289747 15071601 14847008 14686245 14496745 14305333 14060186 13840393 13642436 13398704
3269 13398704 13114006 12954335 12813058 12566832 12459290 12303246 12072125 11906225 11737373
3260 11737373 11520694 11331098 11099423 10972716 10894300 10742808 10502965 10364647 10171762 10065617
3250 10065617 10001693 9940345 9921480 9900644 10030111 10026578 10095035 10048152 10105559 10007778 9811946
3239 9811946 9408796 9056061 8740293 8398373 8124244 7881165 7725639 7554341 7323227 7158057
3229 7158057 7113760 6978168 6990894 6944701 6793297 6650397 6496166 6430991 6310494 6241035
3219 6241035 6209147 6105371 5941596 5805896 5783449 5734933 5698956 5650176 5753997 5650707
3209 5650707 5493756 5439107 5384553 5231140 5273147 5239070 5186839 5112419 5051158 5052490 5045788
3198 5045788 5081173 5039011 4974071 4899832 4891221 4841057 4774230 4721722 4652516 4597097 4540995 4576484
3186 4576484 4602663 4526486 4593004 4599323 4512023 4523100 4519444 4531319 4468311 4509208 4466503 4508172
3174 4508172 4548153 4568647 4553504 4488932 4460648 4499799 4460437 4466896 4595303 4562103 4552920 4577715
3162 4577715 4587310 4531152 4428548 4445274 4518736 4589715 4535873 4540077 4433122 4405534 4482699
3151 4482699 4513019 4505069 4596646 4598834 4603850 4592557 4560179 4612496 4631365 4773805 4719987 4733606
3139 4733606 4824129 4831282 4875605 5007619 5016680 5097764 5235946 5288924 5386621 5463485 5460520 5553399
3127 5553399 5629008 5670772 5797763 5956447 6016726 6077730 6187311 6295964 6477416 6520449
3117 6520449 6524080 6722335 6888926 6891590 6884328 6982667 7191442 7382406 7468511 7566628 7737661
3106 7737661 7876429 8034008 8318572 8615462 8855144 9037226 9218388 9526353 10023727 10457653
3096 10457653 10887863 11469582 12088273 12784862 13601736 14331028 15202925 16099396 16696949
3087 16696949 17114619 17154471 16682066 15795956 14672568 13407419 12270582 11258308 10387021
3078 10387021 9699251 9062600 8554998 8165132 7832666 7496500 7169036 6915172 6784881
3069 6784881 6617268 6357415 6157904 6040317 5919981 5885230 5766024 5749169 5731416 5738660
3059 5738660 5661943 5741001 5687506 5707359 5775322 5955999 6155761 6124091 5895381 5609851 5345423
3048 5345423 5008235 4850635 4679911 4461375 4317632 4260327 4277025 4271408 4269847 4340612 4347510
3037 4347510 4359137 4433199 4425809 4601706 4678537 4762932 4893693 4996776 5155603 5333891 5595437
3026 5595437 5923273 6415993 6808552 6835325 6398881 5876954 5310225 4901615 4488816 4252437
3016 4252437 4161816 3955409 3779392 3707949 3619510 3576956 3531700 3450527 3304975 3431780 3496960
3005 3496960 3568734 3617983 3609193 3765957 3795606 3741335 3884761 4037711 4111178 4296111 4422337
2994 4422337 4400256 4137413 3905353 3775345 3584345 3392168 3314871 3326778 3218133 3210633
2984 3210633 3242543 3281406 3292700 3420387 3551092 3670403 3949246 4218240 4477624 4448738
2974 4448738 4346633 4117690 3899356 3684167 3328291 3266026 3261411 3155091 3163748 3180711 3125448
2963 3125448 3152181 3144677 3203291 3263041 3247380 3335143 3460018 3586084 3657721 3848294 3940976
2952 3940976 4002137 4186497 4328448 4557635 4803982 5237842 5811217 6259137 6317734 5938234
2942 5938234 5476397 4864303 4265844 3882918 3612824 3446400 3310524 3144799 3051422 3083454
2932 3083454 3074160 2891796 2821787 2864870 3022305 3096643 3102272 3020148 3078714 3131178 2992484
2921 2992484 3108164 3085180 3111196 3242203 3298156 3403293 3622132 3720644 3756329 3498100
2911 3498100 3185704 2940159 2726082 2494028 2255704 2133584 2126075 1986427 1977468 1931571
2901 1931571 1905314 1782633 1791148 1814000 1758310 1698381 1636876 1585810 1540985 1596863 1564377
2890 1564377 1473824 1447351 1536990 1415393 1377400 1416123 1447551 1456739 1518636 1417047 1490758
2879 1490758 1486000 1379866 1340700 1474762 1509863 1606062 1548041 1558761 1588358 1528548 1556442
2868 1556442 1517117 1438800 1393920 1358673 1339809 1384671 1423266 1337053 1330613 1261088 1235213 1304117
2856 1304117 1267451 1302478 1426501 1413923 1353198 1366238 1411419 1489989 1502703 1590544 1650227
2845 1650227 1604101 1656335 1751897 1792244 1859727 1874211 1845581 1891927 1882098 1781095 1669743
2834 1669743 1696399 1739941 1731400 1764894 1809723 1834210 1830887 1863651 1857294 1939898 2045832 2052531
2822 2052531 1974145 2085685 2068411 1991886 1939528 1880360 1877358 1991967 2063934 2039383 2004472
2811 2004472 2027351 2103629 2196910 2348833 2335596 2401494 2453457 2468463 2374717 2521885 2634394
2800 2634394 2735978 2799406 2888437 2976240 2878658 2993000 2927767 2959492 2975000 3074386 3173511
2789 3173511 3321899 3320862 3292479 3337977 3382742 3425535 3440675 3583297 3735390 3731496 3670590
2778 3670590 3627614 3546275 3497897 3440110 3424363 3462943 3604061 3708841 3878760 3933005 3921362
2767 3921362 3920860 3800054 3810290 3814863 3722914 3635437 3475073 3466142 3524327 3531673 3526568 3521570
2755 3521570 3571708 3519382 3398579 3341401 3259157 3118713 2981642 2836445 2612532 2415396
2745 2415396 2299625 2189201 2237200 2265698 2144658 2086449 2043203 1976098 1980373 1926800 1775892
2734 1775892 1709373 1663800 1601201 1534657 1410266 1341631 1319254 1352209 1257002 1192288 1214496
2723 1214496 1159854 1037547 1001358 1071360 1075697 1005321 1018889 981966 945116 951739 959855 941911
2711 941911 992943 1016011 1031117 916441 958169 944201 946302 940041 870489 889798 820325 791573
2699 791573 774751 776869 667447 655590 717519 675760 719413 717680 700506 680602 628070 682291
2687 682291 636611 618678 601146 622675 638636 629399 689962 576350 598302 637566 592788 672206
2675 672206 635394 675279 569915 587292 565823 522182 558598 501915 500049 535219 582956 496811
2663 496811 458664 521784 498217 510184 523065 623993 549698 428038 425833 532631 456034
2652 456034 484592 475241 386498 343088 428036 463292 394823 396311 453708 498129 473192 542671
2640 542671 538428 456579 428276 437367 435647 355856 409202 534226 537956 436893 391535 515443
2628 515443 497956 491051 538286 500040 553641 492387 460504 549346 470793 486103 512000 501824
2616 501824 549317 546042 499322 553404 568176 557342 565061 550789 637045 724756 707651 833127
2604 833127 895274 976805 974472 945932 901459 799961 866305 874783 932355 970773 1056745 1158695
2592 1158695 1213851 1397588 1479482 1530562 1537076 1446575 1421836 1392817 1352107 1365125 1417420
2581 1417420 1505814 1434782 1469342 1545326 1569616 1611972 1684964 1645614 1662987 1748779 1728587
2570 1728587 1673126 1627976 1645197 1644605 1600846 1583419 1517078 1521364 1547435 1597162 1668181 1795754
2558 1795754 1858292 1898904 1916656 1778601 1648182 1583430 1516801 1439605 1360080 1310406 1354263
2547 1354263 1371598 1417140 1464515 1416656 1326966 1254143 1163718 1061256 1048645 1044825 987841
2536 987841 893303 827689 858588 896906 797164 698061 720800 829175 839628 782964 744741
2525 744741 757073 675792 693075 743495 691552 620689 533091 501907 607432 589392 541550
2514 541550 542143 491162 443529 412640 497223 438538 519466 511991 650883 710314 672705 535545
2502 535545 576521 554721 537047 627370 746529 693980 590566 521146 446631 408445 477605
2491 477605 526026 466572 449489 402114 426276 416683 410633 446111 399990 400075 380548 380172 358102
2478 358102 352165 366621 380632 442885 364022 463121 490945 395547 388900 449180 450348 378706
2466 378706 411730 426067 385601 417299 420630 415548 326755 262391 274245 407505 292462 254631
2454 254631 270826 224035 313185 353733 337290 248619 204666 176540 213165 277543 172854
2443 172854 156742 131966 232301 293016 276624 203382 176954 232817 219511 135926 214235
2432 214235 195444 179868 168621 116526 53724 147113 241535 186493 212699 242003 225075 174400
2420 174400 165379 139233 153408 144463 74111 91358 129016 133073 138776 187628 203716 131973
2408 131973 136997 78499 189038 153341 97033 -927 125264 137317 217774 173364 40681
2397 40681 12193 23400 114502 121416 130748 96649 94867 62669 141651 113980 66552 73488 150964
2384 150964 146095 137352 138760 36882 72426 65514 157870 139102 92590 79936 49760 10499
2372 10499 -66058 35929 137487 76852 78586 137916 132559 62889 6394 -38100 6215 56001
2360 56001 57724 37955 14351 -53339 -1038 87636 90689 73098 30529 50507 47330 59364
2348 59364 92959 91320 87149 85388 -16683 30983 -78404 -32058 59500 95294 84077 89935
2336 89935 150538 125994 25709 103137 165517 113890 31069 53315 95152 94019 43678 94407
2324 94407 79576 20036 132515 140215 115019 99289 81048 110312 52282 22800 16244 -63911
2312 -63911 -61359 10019 16715 8651 76951 169092 103194 107794 118452 109636 159511 99149 132056
2299 132056 187222 198556 179231 154014 123576 117881 112059 59249 -9874 88154 119866 108453
2287 108453 76684 77015 60309 83615 103378 113354 82578 53803 9485 34748 45496 82288
2275 82288 61652 79508 79868 91671 162999 171165 112353 117876 126067 104038 35623 -12336 -52229
2262 -52229 -2479 46273 45105 -50214 -81713 51253 24846 50511 85715 67579 -13872 -32488
2250 -32488 22650 18533 -74151 34844 30656 -43253 42427 187197 157535 89004 88963 201631
2238 201631 166913 -4166 102681 176788 146806 70293 5824 -6482 -10086 21151 36068
2227 36068 42383 24997 50009 84446 100534 24208 82901 122769 142185 106759 153718 113669
2215 113669 42804 -1920 36659 51226 59544 85489 68909 103500 32149 55856 23216 32030
2203 32030 163665 108881 78337 76943 20356 113925 28678 109114 145463 178554 209268 138619
2191 138619 92583 121309 85417 122953 125310 151131 246289 225138 107081 49153 150240
2180 150240 204225 77114 63849 75739 107556 91348 66679 57781 125701 79495 135960 195953
2168 195953 175138 167726 111652 98555 121265 167552 162002 125925 148307 164769 154542 204508
2156 204508 103676 84271 132068 166646 207797 195541 203084 260666 281294 296465 197326 254315
2144 254315 281880 293810 270589 305462 260452 271575 232570 329853 301455 389359 490274
2133 490274 344853 431468 408447 452502 469535 402911 399425 305851 385045 333325 416036 485946
2121 485946 547479 642748 636477 642630 665045 654769 681391 709031 650549 638777 655605 682177
2109 682177 729603 690035 689087 762897 848442 886960 868979 834593 834792 825576 889765 868129 864789
2096 864789 904662 974057 1104655 1157182 1106504 1197016 1256571 1205060 1386977 1519224 1724195
2085 1724195 1723930 1790232 1850615 2052300 2107800 2274983 2462476 2601572 2737229 3059763 3459745
2074 3459745 3798076 4112671 4421355 4874466 5370589 5937584 6709869 7603449 8876190
2065 8876190 10325555 12189428 14533784 17622307 21255337 23448530 21664092 18560192
2057 18560192 15384496 11930121 9684212 8079115 7008040 6191847 5567095 5029844 4698979
2048 4698979 4312478 3969336 3684719 3423281 3032119 2787792 2513393 2366685 2191327 2127345
2038 2127345 2094522 1908241 1731212 1763601 1650954 1512880 1566132 1468566 1432901 1424320 1383052
2027 1383052 1317391 1157976 1144766 1117163 1003038 1036104 1020253 895824 837145 793657 775852
2016 775852 782536 711936 676933 681515 694545 690171 680853 708883 702317 634530 510118 454512
2004 454512 482742 516225 546660 506842 463934 361845 388904 430602 436781 395003 393911 394459
1992 394459 387706 416397 410330 408245 424981 496673 447808 402855 317662 206578 306511 363903
1980 363903 329825 319315 326021 304455 272301 288484 281713 217375 176076 184426 255614 254676 197352
1967 197352 160167 196580 229026 267885 217892 164774 192512 79517 111910 94693 45245
1956 45245 -1579 38003 108686 150358 153412 166932 193503 153572 152148 180477 196288 122164
1944 122164 112567 128064 215329 226094 216663 193916 34347 15158 107085 112934 149433 110024
1932 110024 94937 58245 63109 10275 100134 77358 54990 81941 64294 47326 89124 135152
1920 135152 40735 108747 94842 101980 11291 81966 82363 98789 90213 172933 57490 93539
1908 93539 76373 -28610 -2017 126136 120330 86544 54469 65611 56726 40455 31403 7602
1896 7602 40581 57700 78767 -4089 11755 45702 107019 43090 -42164 -47431 7356 49208
1884 49208 61627 60507 88887 23146 60127 50665 44762 20441 63402 115048 133353 148279
1872 148279 150515 194380 127390 29518 -54882 -19194 85066 155981 69743 16478 77342 2072
1860 2072 -20642 40006 124502 40764 27845 62322 -31466 -4445 76997 51014 138376 87356
1848 87356 43142 17485 88794 30413 -3283 16426 -5878 -7697 5751 21048 40299 57700
1836 57700 21453 -40961 -84946 30032 80612 74624 -2822 15930 41219 62019 52213 -14223
1824 -14223 103771 131209 132773 102025 77319 41688 139581 199507 81762 26358 81650 -56867
1812 -56867 38044 93003 38734 77735 51867 -6769 80679 134441 -6708 26946 66726 -14506
1800 -14506 -79966 -25361 -49070 -32233 -4429 77549 34945 65185 27627 -17835 35348 -1024
1788 -1024 46470 59468 -39317 11002 54980 52153 -57969 -3701 28922 65118 88114 -49966
1776 -49966 13835 58780 3661 -7541 -47791 -64894 -67567 22272 -2827 9327 53702 -31302
1764 -31302 -23081 10819 440 -39327 -88300 -55545 -60530 12264 33672 84865 16930 -135981
1752 -135981 -70627 30045 -49864 29353 74851 104513 76545 84924 30218 -13473 -33595 -80230
1740 -80230 -26529 16887 40056 -72816 -145655 -86556 -18618 -25616 -82752 20231 101565 100577
1728 100577 23144 7108 -26798 -18859 51315 -10715 55014 70577 58070 -3473 37558 -30487
1716 -30487 -19684 22665 86820 75508 34634 -15582 -14775 89 -1095 30389 96449 78690
1704 78690 76667 77036 53461 42807 10045 -56059 -41020 6770 40131 -16008 4634 5863 66846
1691 66846 114902 77051 11405 -8252 -1992 -57629 -66219 -15905 41836 -18615 -11494 13767
1679 13767 -4086 -6740 57895 -31632 -106650 -65787 41023 -20076 -33256 -70711 -102392 -12070
1667 -12070 25629 -4320 -20804 -43182 -43402 56430 67032 -1522 -111453 -83527 -17672 -34272
1655 -34272 -68164 33415 -24367 -89150 -79515 -51740 -150100 -90552 45512 -9507 -4570 34583
1643 34583 -19230 1310 -13429 -69263 -79720 -112443 -47609 -73040 -40722 -25030 60705 35391
1631 35391 17074 16912 62334 40646 19979 60679 -5400 9982 38009 74023 -2060 40294
1619 40294 1255 15457 36462 50400 35140 -7456 -8261 3637 -34825 -26608 -49545 -13056
1607 -13056 38437 -8710 -7450 57388 -2632 -119734 7090 -10579 -104184 -87941 -32741 -57618
1595 -57618 -67845 17675 74785 88252 60519 -28444 -31497 -51550 58833 105576 120793 58988
1583 58988 50514 -35517 -5015 61668 -28739 -54034 -120219 -32032 3936 -26200 -65761 -20962
1571 -20962 45460 8540 271 -41757 -48337 -70273 3733 20314 12411 -6348 83908 79171 47563
1558 47563 -33732 -55132 17348 23334 -12226 -120697 1552 95980 68757 -21960 -31561 43052
1546 43052 19972 18529 71611 46212 -58589 43518 -40721 -37401 8785 -31121 -6788 -15976
1534 -15976 -32277 22641 -45432 -94178 57739 52995 -48286 -66841 -21082 -57657 -89676 -61234
1522 -61234 -485 -39338 -110684 -112623 -33299 29940 31664 -61811 -65249 -44507 -4384 38126
1510 38126 24041 54120 -470 -8553 88795 21203 -11310 -40583 87690 64802 17938 -60680
1498 -60680 41107 60886 -25829 -118396 -201 -29648 -20129 26155 -4987 -21233 -110858 -97245
1486 -97245 35374 39253 -14488 -12580 -25752 -10102 -15961 29949 37698 -15903 -42148 -26047
1474 -26047 -123 -11007 -34902 -35582 66 34718 -3358 -20189 -11737 -18343 -97329 -13306 23437
1461 23437 7736 -28559 78053 64537 -7101 63482 48800 -9184 -4357 -58545 -62961 -109866
1449 -109866 -59836 43063 43314 5692 17246 33341 -18198 -27424 17890 -67907 -142268 -36206
1437 -36206 66245 -32450 -10552 7467 -31141 -99762 -109622 -43513 -77331 -8158 61963 -33321
1425 -33321 -34176 -30247 -41313 -103390 -179357 -75583 13077 -41194 117925 24069 -65841 -29260
1413 -29260 43575 66332 23283 74960 18112 -75847 -9863 58840 -32338 28270 68100 30557
1401 30557 28654 98692 30531 -56177 -56494 -61317 -31895 13689 -1462 27645 15983 13397 26110
1388 26110 84195 100084 64673 32196 -52866 -23195 5204 43115 -33036 -5563 -5295 -77724
1376 -77724 2699 6088 60689 -26091 -72917 -37590 7373 -34774 -52525 -67313 20722 32006
1364 32006 11068 -33513 -90405 -8682 12505 37349 37269 63544 14491 33265 -12981 38704
1352 38704 96115 -5935 -7242 34718 38509 -13289 38964 -4811 -13792 37094 40853 -83901
1340 -83901 -81183 -128979 -99206 -58788 -31571 -60917 13590 -12895 -63750 -584 44311 107785
1328 107785 -38790 -63590 40116 88958 -86974 -31399 -27661 -77090 -51875 -13747 12176
1317 12176 -126106 -68460 -3461 -55576 -45117 55316 17796 3698 -34066 -65019 -29449
1306 -29449 61813 81975 -18549 39508 51471 -28519 -10756 -4696 -80765 -97396 -36479 -79806
1294 -79806 -113788 -55060 -112274 -140218 -114242 -88778 -25865 32533 -57207 4093 134172 63073
1282 63073 78841 29215 41324 14922 -104864 -41324 24247 -51545 -48541 -43082 -32747 25403
1270 25403 61092 26916 -4906 -42440 -56067 -26833 -66865 18791 26089 27993 -25543 -39021
1258 -39021 -58207 -6837 20429 50934 26000 -31293 -47362 -23621 -38660 -67716 -87495 -6928
1246 -6928 -25407 -37764 -47310 -83599 -89366 18569 811 -46451 -9746 -42337 6241 -118857
1234 -118857 -150697 -99739 -85287 -68969 -90629 -26147 -32930 -103819 31248 -8626 -24265 -34308
1222 -34308 -55648 147 -1515 -8287 -41712 37100 23634 20490 -61048 -63145 -46378 -42262 -47040
1209 -47040 -81446 -157429 -43885 -46398 -42634 -122051 -19813 65316 2550 -46622 -30499 -55060
1197 -55060 -97451 -31236 -14088 -6885 16752 -45860 -108875 4959 29456 -73966 -52566 44622
1185 44622 -56876 -2361 -60386 12418 -7411 5670 -73129 -81347 48384 38971 55714 93847
1173 93847 83031 49959 4880 37050 36413 384 5104 37654 -34675 -30195 -32108 -55021 -73898
1160 -73898 -52296 -23002 -32887 -44387 68636 51872 -18922 16387 47824 -24095 -92151 -67907
1148 -67907 -44390 14798 92095 16143 -48275 -16408 12987 -71335 13455 32830 -8617 -89800
1136 -89800 -70739 -49244 -9035 44177 46388 15684 -2955 -37329 -108478 -46154 11096 59710
1124 59710 47942 3518 106565 35493 19500 55721 -30340 -108179 -72612 12050 -18223 -85115
1112 -85115 -104717 -35658 -38076 -84136 -49397 11850 -72025 -74314 -76748 4951 53474 140523
1100 140523 60157 19353 10844 -69856 -53489 1660 -35088 10472 40099 138594 84688 21954
1088 21954 -14109 -5630 -116051 -107219 -29236 -24816 29052 -14297 -43167 5645 -7386 -32829
1076 -32829 -48362 -10885 21755 -58904 -71453 -39817 -7245 35471 -15312 -26247 -94572 -24771
1064 -24771 -14475 -63023 8428 -18710 -35725 -27654 -63607 -43015 -7366 31576 1851 -54417
1052 -54417 -508 34450 4894 -18737 -41678 -145184 -62702 -43272 -73019 -69522 -25685 -83494
1040 -83494 -75898 -88679 -16021 46500 53292 55688 -115646 -92222 -22040 9921 -15804 -65964
1028 -65964 33370 -7601 -19435 22971 -19378 -4557 8779 11832 9931 14497 -41524 45632
1016 45632 11069 -19647 -223 24690 -9456 -157207 -77697 -22255 -72031 -7238 15984 -13002
1004 -13002 -96543 -109997 -96606 14170 41357 -30002 -13998 14402 27294 27975 -86298 -94641
992 -94641 -78039 -74625 -50574 -35728 29957 -43679 -22171 -84829 -4650 97501 13686 -9203
980 -9203 8292 -34849 -94483 -76736 -87302 -98801 -49916 63373 100602 30942 30937 -19724 13281
967 13281 32034 24425 39682 27685 12532 -33564 -34316 -20808 25550 73267 -6827 561 34633
954 34633 54087 51767 80322 -71 -41747 29533 91811 57825 70862 -45566 -90454 -85453
942 -85453 -72345 -56085 -95915 -16336 -41452 28929 86571 864 62165 36117 -8925 25520
930 25520 94022 38592 -64483 -33877 -43 37569 69224 84065 -17596 -87398 -46785 -23828
918 -23828 -44836 -20517 -21818 -8446 58140 -72788 -102625 -23231 30572 19887 11033 99691
906 99691 72938 63511 23319 -61302 52735 33908 -15379 -29462 5043 51282 13737 13881
894 13881 279 -20330 -12526 -27206 837 -21834 19053 7585 -48857 29973 70002 89981
882 89981 42864 -52797 -31183 -107848 -8723 27029 -43281 -4457 12400 12712 -28941 43291
870 43291 -75789 27302 -26267 -62155 -29857 45113 12935 22099 22860 -66401 41032 38002
858 38002 11296 48095 2725 48065 43986 74741 36373 -35846 -2210 -25827 11169 -2061
846 -2061 17303 6617 57277 67834 -15119 14011 8806 -62642 -90399 -2753 49718 48611 -76439
833 -76439 -1656 -22354 -59064 -60945 -2920 -7104 -25661 -40115 8380 32270 58555 -61612
821 -61612 -153043 -31337 14405 50555 -16250 -1830 -36444 4990 73920 64709 52887 52690
809 52690 70438 21207 40749 -15220 96530 37769 -33608 56849 26603 -12091 -11519 -15608
797 -15608 -41895 30696 46109 -66788 -9086 39613 -24648 -35087 -37368 17621 -19389 -103532
785 -103532 -2772 6837 -28429 -23631 -79304 -59052 -61731 36821 35910 -41929 -34148 14316 95807
772 95807 34443 -31980 4739 -68042 6106 -62181 -61830 -90875 -72217 -112999 -54959 78290
760 78290 49150 40003 43468 -14837 17381 -11197 -20720 -39518 11124 -23649 -16584 12842 30852
747 30852 47441 79628 -118174 -88928 71356 36327 55892 41230 -46536 -107258 -65968 -47174
735 -47174 -34337 -27437 -40353 5968 -43118 -31294 39216 96941 -26813 -25004 65684 -27556
723 -27556 -48379 -147119 -72973 -43687 -13629 -51311 -78089 -39450 29142 58815 18821 -21748
711 -21748 -23405 -24223 -65230 -96532 -73536 -118805 -72003 -7697 3286 20035 -36153 -24358 -122568
698 -122568 -42505 15584 100279 103407 -12907 -715 59438 -8292 -683 29525 6686 8492
686 8492 66006 68514 8793 12435 34495 100477 45885 89205 38479 45585 15121 49359 -7457
673 -7457 -30785 -62446 -50705 -15656 17944 5811 20404 20720 52034 122314 114189 41713 -55084
660 -55084 -12921 3487 28316 28687 23202 3062 37657 98748 65679 32260 32985 52716 -49012
647 -49012 -15386 -50629 -39996 46742 4423 -13677 37997 -4611 24523 49617 29547 52267
635 52267 9958 105340 51779 14850 44394 -48685 14086 54160 124222 7314 29721 51876
623 51876 17116 24317 62192 25260 -85184 -43565 -67251 -28150 22870 -23257 -84010 -54001
611 -54001 -106970 -68396 31141 -27323 -26386 -26184 86827 54014 -6654 74734 60172 47644 50598
598 50598 57143 13927 -39951 -34127 4986 45221 -26889 -85968 -111483 -51417 -15444 -30581
586 -30581 -26883 -18747 -65516 -10143 20485 -24771 4621 -39313 -97386 -74941 7796 47914
574 47914 121885 -49272 -70771 -57685 1775 18079 65544 98304 88907 70960 118316 139102
562 139102 37869 -70725 49193 488 -13112 -4038 23327 92618 71383 64619 25437 6516
550 6516 94776 124330 89334 -15498 -20235 40786 104527 20944 -17737 55438 33551 11511
538 11511 -6409 -1918 -23225 -22702 -38519 28250 56695 -9838 55110 69194 2965 -10213 -34751
525 -34751 -56243 -25151 -15675 10862 11311 -17831 14038 17243 46408 25507 9592 34945 11777
512 11777 70766 87609 -9565 -38019 -37908 14823 -34457 -34595 27304 70248 19044 61344 42098
499 42098 -1378 -25942 -29769 -80798 -85902 -42741 -762 25958 81594 69368 -2380 -17578
487 -17578 5265 15744 -61276 8138 24807 -13150 -50136 -43329 -52616 3491 5127 90599 70935
474 70935 15424 77890 86781 126813 96883 -51304 -48238 30913 -116122 -31225 -35703 -120229
462 -120229 -7391 7249 -53323 -64373 -35342 19336 -18338 15693 1411 19136 -44668 24281
450 24281 101053 83194 22896 9363 -48945 -14865 1987 -2982 -42184 -108630 -22750 -67295
438 -67295 -61769 -6144 87699 31738 7047 9632 44320 -43512 6104 142205 47736 -50148
426 -50148 -808 -30567 -103761 -8334 -3909 -1641 -42812 -37761 -69359 3977 82812 59432 -27031
413 -27031 -20669 96184 29700 -70621 -32135 95692 11168 -98712 -133959 1605 71694
402 71694 6209 -4703 -56336 -25943 88425 36704 31471 34701 -70602 -66402 -23533 -9436
390 -9436 -50486 11119 6491 -1068 -30488 -48213 -10018 47211 27008 31205 10242 -102356 10690
377 10690 92838 49376 112912 55604 24382 -9175 -2422 37468 15717 -59872 -45061 -41691
365 -41691 -39563 -32747 30045 28085 -66351 -35480 36712 17550 -30491 -26557 6889 -30239 -44828
352 -44828 -36222 -42582 -27513 9368 7958 -22458 -7366 -92357 -57299 -55743 49291 18917 114316
339 114316 45259 -27169 -106230 -84004 20825 56637 29115 100680 86556 58726 50802 14713
327 14713 -28734 38531 45282 -18056 -23586 11623 -62253 -29835 -122743 -67059 12808 35662
315 35662 22665 -30010 -33876 25148 47882 -48250 -52203 10825 24024 9125 51852 -14218
303 -14218 17860 68433 37829 16377 91831 31739 23882 -17357 43522 4262 -1634 -70495
291 -70495 -57937 -64308 30963 54434 92681 111227 4513 -25466 17898 -22671 -46853 -7046
279 -7046 32144 21077 -31251 -41614 -118515 -85409 -53936 29056 36471 75551 29389 76023
267 76023 71332 -18304 29579 -41809 -62786 -80769 26735 58152 101888 48300 22087 -34206
255 -34206 -34326 -120061 -69429 -80705 -62461 -29632 -86693 -19801 -12387 -10803 -30625 -64191 -96154
242 -96154 -82238 -46927 -49932 -33504 -32010 -29312 49007 35128 -13103 -44864 18398 -33873 -11893
229 -11893 98852 19284 27854 64993 98052 55607 58612 140746 47506 -52175 -15535 18001
217 18001 5482 50925 12680 -35021 62634 67089 29262 -43451 -17940 12366 -43422 -89215
205 -89215 -82143 41250 -38813 -47018 -124398 -137585 -147205 -71151 -60057 -113361 57430 51388
193 51388 85 43689 -47217 -74288 -40193 27410 83442 38480 -62251 17562 57060 -30680
181 -30680 -18352 92870 45657 -31597 13260 66582 128507 96328 37677 -48642 -44008 4921
169 4921 56887 119471 27558 -34493 -50025 -31581 -50100 35369 61720 14595 12626 -27053
157 -27053 -56930 -21212 35002 13397 15960 120544 84675 45386 24748 3111 37756 36929
145 36929 -29937 -78014 23731 19281 16846 -59428 -75769 17198 63073 106807 -6753 -65719
133 -65719 -75640 -36821 -2986 5110 -55127 -41836 37904 -2327 -15469 -65107 -24119 -26236 65534
120 65534 55765 76251 90744 -46088 -12111 -1074 -30162 14980 7833 37239 46073 39375 -10358
107 -10358 -81679 -17886 26334 76849 67300 40283 30458 23618 101979 103416 22865 -36999 -16196
94 -16196 36719 -54819 -62645 -29417 -28955 -19850 -38633 -30671 -24453 -4538 -45614 -55280 -46955 -20294
80 -20294 -18582 27452 -28583 -58748 -34719 -12687 34610 5684 -49669 3149 8197 -36823 -12640
67 -12640 22858 -21373 -30324 -44355 -74220 -4304 39153 34173 -10580 -22730 12643 558 25377
54 25377 -7234 -15545 12411 28187 -5841 -46820 -21481 8583 38134 51032 42777 821 -16079
41 -16079 -30355 -35596 -60106 -7725 42855 43989 17894 -4770 -30646 8846 56884 31408 31791
28 31791 35404 13342 -56356 -12038 -13939 -9008 87087 14798 30859 62311 -7759 34495 40810
15 40810 21217 7077 -28303 -8150 -20972 -49613 -19346 15189 -31506 -1088 -5682 -4042 10673
2 10673 21525 -16963
0 -16963
$$ Imaginary data points
##PAGE= N=2
##DATA TABLE= (X++(I..I)), XYDATA
16383 -2536820 -2436116 -2393493 -2381465 -2421200 -2385053 -2335974 -2314125 -2273758 -2211698 -2214275 -2204243
16372 -2204243 -2129557 -2093729 -2093939 -2012214 -1938532 -1931367 -1901291 -1903910 -1845092 -1746577 -1713480 -1694076
16360 -1694076 -1604775 -1648073 -1621118 -1580175 -1555010 -1486985 -1456238 -1433244 -1387548 -1294353 -1270325
16349 -1270325 -1259662 -1229186 -1112744 -1099792 -1115194 -1065017 -1004881 -1008424 -918068 -857485 -806231
16338 -806231 -803849 -797676 -780310 -774756 -686940 -681374 -639453 -598137 -572828 -520430 -482252 -519192
16326 -519192 -471270 -412392 -348025 -328503 -333584 -294494 -253955 -262718 -188699 -128939 -118210 -163724
16314 -163724 -144307 -94903 11721 16718 38760 101817 143043 127819 114793 169664 182310
16303 182310 240742 320778 355964 399831 332412 438067 482285 480200 523762 546153 593466
16292 593466 611584 680024 663140 660728 707394 683662 734999 836207 848145 842943 896730 991936
16280 991936 1000810 998534 977326 1018447 1081107 1091751 1129930 1155479 1128634 1163597 1161976 1182518
16268 1182518 1204621 1266624 1287417 1356999 1376879 1331549 1314629 1326982 1350122 1480348 1526909
16257 1526909 1518414 1521735 1561968 1599447 1580214 1585844 1594578 1614129 1660567 1663016 1772915 1768435
16245 1768435 1813584 1845290 1798530 1791858 1814527 1872279 1896628 1933532 1941205 1904497 1920100 1928863
16233 1928863 1964246 2051122 1963335 1950631 2064112 2064868 2087021 2150724 2148899 2175629 2210129 2260769
16221 2260769 2191566 2262232 2284030 2357279 2316564 2369208 2318136 2325384 2330861 2322334 2380883 2412031
16209 2412031 2381923 2378642 2380446 2417313 2549070 2532584 2521361 2516353 2531824 2535030 2628815 2528166
16197 2528166 2558074 2626437 2530357 2571650 2680723 2674323 2627513 2686919 2685606 2642420 2670953
16186 2670953 2712283 2752930 2754882 2720383 2651474 2719527 2761397 2732810 2736067 2781339 2801140 2857590
16174 2857590 2851408 2856101 2892514 2879629 2847443 2903864 2942124 2944900 2831234 2797442 2847397 2967749
16162 2967749 3040468 3002875 2951528 2942769 2923223 2962601 2991583 3042045 3052572 3008808 3009106 2965071
16150 2965071 3048144 3039911 3055889 3085219 3041804 3088325 3115102 3111726 3033641 3018942 3140570
16139 3140570 3130668 3069903 3126283 3174292 3169682 3150235 3149949 3165476 3145923 3192437 3170628 3191411
16127 3191411 3148426 3178477 3207376 3129246 3150177 3224299 3128478 3132109 3200281 3151818 3112543
16116 3112543 3132894 3146530 3219961 3232695 3206755 3120934 3147390 3268381 3231832 3214294 3176315
16105 3176315 3303720 3350212 3267348 3280828 3261908 3206642 3263544 3267645 3134265 3241015 3246756
16094 3246756 3173640 3240546 3309660 3298126 3336020 3405610 3327798 3231354 3231956 3283805 3260845 3202122
16082 3202122 3275709 3339613 3222774 3291361 3307849 3309590 3346894 3341863 3310432 3298623 3360960
16071 3360960 3371116 3405377 3314900 3308412 3422253 3446308 3347379 3323646 3248130 3263039 3360484
16060 3360484 3360488 3344840 3320408 3264019 3324280 3363765 3384750 3330249 3302822 3436866 3376111 3352041
16048 3352041 3430129 3364934 3276718 3249386 3338995 3338475 3331324 3341215 3341196 3332627 3361973 3386030 3284441
16035 3284441 3291738 3372664 3363229 3373704 3463580 3347921 3307454 3357134 3369891 3371079 3326449 3314047
16023 3314047 3356422 3324806 3387236 3335541 3360939 3424964 3414147 3398108 3454367 3360543 3436772
16012 3436772 3428578 3442441 3420314 3372208 3445379 3464043 3529399 3407324 3315907 3416343 3412025
16001 3412025 3347579 3429717 3401413 3389307 3409636 3355414 3302383 3321346 3287405 3320963 3305825
15990 3305825 3439545 3439889 3323308 3348880 3307204 3366101 3416580 3415523 3333842 3375567 3333197
15979 3333197 3270446 3372406 3381508 3385328 3314548 3423718 3384133 3390113 3407480 3397310 3410840
15968 3410840 3375680 3450567 3375075 3310981 3369814 3422989 3369826 3352688 3353500 3322425 3339074 3342577
15956 3342577 3396589 3475474 3460441 3460649 3439304 3354888 3325720 3401113 3384748 3350807 3336445 3303319
15944 3303319 3406299 3413558 3355439 3327855 3385884 3460819 3408085 3393810 3433180 3453346 3414988
15933 3414988 3336898 3293919 3332011 3401104 3416685 3422186 3415152 3358145 3374428 3457710 3556697 3570461
15921 3570461 3540020 3460230 3480425 3512170 3486326 3448277 3380564 3308021 3356601 3417102 3494174
15910 3494174 3508733 3534254 3486890 3407499 3437819 3479402 3486287 3425431 3409410 3417869 3509143 3397558
15898 3397558 3302454 3313068 3368506 3462716 3470137 3410960 3420082 3502112 3440994 3353751 3380072 3420126
15886 3420126 3438451 3423305 3446228 3484988 3499620 3515026 3477776 3423258 3371375 3280056 3280475 3293211
15874 3293211 3427111 3439146 3435374 3414064 3468344 3405597 3404756 3406553 3365986 3445530 3379022 3390657
15862 3390657 3408317 3395544 3404182 3399866 3391889 3379643 3335671 3425720 3444730 3442543 3342260 3376805
15850 3376805 3488885 3458184 3446151 3423537 3386008 3472584 3435046 3476381 3466476 3414167 3442462
15839 3442462 3374132 3323379 3416614 3426161 3348758 3433565 3378153 3430077 3449824 3462741 3457115 3463953
15827 3463953 3388302 3470352 3487705 3381983 3478839 3454515 3394035 3404095 3364092 3425264 3381706
15816 3381706 3409731 3457697 3496319 3457445 3437936 3451669 3373078 3462375 3545259 3441947 3482678
15805 3482678 3496570 3533843 3539265 3515068 3496527 3406564 3422226 3422743 3495264 3419861 3377505 3316408
15793 3316408 3400309 3423147 3371377 3389662 3377990 3331102 3328659 3402025 3451023 3309801 3427914
15782 3427914 3442488 3488828 3414632 3490679 3452261 3462303 3443844 3394081 3411347 3424292 3424861 3406667
15770 3406667 3466703 3473592 3419920 3419872 3490151 3469551 3396148 3380864 3423873 3413226 3534470 3432825
15758 3432825 3453489 3465550 3452332 3485716 3479081 3342095 3431440 3416624 3397648 3361022 3417840
15747 3417840 3434849 3442441 3419908 3359793 3466633 3474090 3499874 3490347 3430862 3353787 3357920 3474704
15735 3474704 3478019 3516375 3467627 3440045 3406695 3467714 3501528 3464600 3444498 3478902 3551717
15724 3551717 3473765 3447624 3509976 3517529 3498851 3510027 3484828 3531351 3465986 3496228 3490385 3414555
15712 3414555 3392593 3543698 3492152 3399936 3366847 3413399 3415922 3448777 3434082 3490443 3571243
15701 3571243 3529932 3428533 3473648 3560125 3532909 3475262 3489690 3538423 3556895 3516726 3402987
15690 3402987 3491561 3503136 3475514 3539281 3561101 3510124 3568036 3484992 3376504 3442840 3528544
15679 3528544 3581158 3530226 3481214 3453483 3466010 3509006 3543766 3582283 3532748 3544158 3438550
15668 3438550 3426782 3446389 3410369 3393469 3470861 3508350 3520201 3406236 3381939 3501870 3392551
15657 3392551 3418678 3482714 3543666 3553153 3456659 3435566 3428978 3569338 3550048 3541493 3550966 3549732
15645 3549732 3523646 3525338 3502347 3464148 3439879 3405254 3436985 3468287 3512964 3493977 3494924 3455965
15633 3455965 3417642 3416145 3474865 3554168 3383311 3421821 3451792 3385709 3349478 3427340 3492804
15622 3492804 3449086 3523522 3553784 3480609 3412701 3529794 3512411 3577008 3632141 3671942 3601165
15611 3601165 3563214 3493031 3518132 3549045 3547466 3494121 3512991 3534150 3456663 3474101 3491082
15600 3491082 3482103 3475370 3562732 3536874 3482680 3508562 3436889 3369043 3477208 3517429 3511981 3570519
15588 3570519 3541955 3506024 3606992 3533878 3441908 3413106 3442080 3488633 3520229 3522825 3458559
15577 3458559 3508168 3536840 3623899 3552416 3560966 3538231 3442978 3428015 3466068 3480926 3527657
15566 3527657 3535489 3530444 3675136 3602173 3526178 3489670 3536415 3588213 3553772 3497852 3544060
15555 3544060 3555370 3552967 3561241 3602594 3578274 3606323 3603910 3550089 3502745 3421223 3508168 3540877
15543 3540877 3570516 3590537 3653654 3556678 3558890 3575768 3559963 3560866 3652166 3701771 3555015 3512071
15531 3512071 3538504 3585937 3537701 3479635 3450317 3494741 3492646 3396553 3516650 3549625 3464885
15520 3464885 3419772 3536554 3577811 3451734 3421104 3512890 3559817 3524817 3545225 3561540 3537657
15509 3537657 3503532 3527838 3571534 3642333 3658827 3534591 3503070 3489243 3532887 3576308 3519589
15498 3519589 3491234 3468306 3581511 3590407 3568257 3476496 3516549 3545201 3562334 3511410 3577216
15487 3577216 3644485 3600222 3546065 3458446 3486571 3533760 3484128 3541728 3596175 3514940 3547333
15476 3547333 3569052 3636159 3592870 3536123 3545097 3626430 3613227 3586287 3626900 3611497 3538671
15465 3538671 3593650 3631474 3605988 3614813 3587375 3566135 3507817 3513692 3541670 3571934 3524711 3523037
15453 3523037 3585175 3575890 3652090 3644587 3616145 3602500 3634204 3531978 3434094 3484298 3501517
15442 3501517 3569302 3616223 3615210 3527297 3511232 3470201 3495902 3571769 3627823 3609225 3621151
15431 3621151 3560995 3595271 3622833 3585135 3621120 3671436 3594758 3553279 3614438 3545088 3578957
15420 3578957 3607802 3561339 3566963 3608584 3574382 3586423 3640258 3556816 3624423 3624568 3553424 3538647
15408 3538647 3527822 3520302 3527924 3391939 3442682 3451026 3518739 3549656 3507528 3570018 3572849 3593188
15396 3593188 3500127 3466703 3503689 3547802 3553063 3645588 3599123 3535052 3672339 3681051 3553777
15385 3553777 3511703 3628877 3666772 3558434 3568275 3581614 3545595 3487212 3499488 3453155 3480931
15374 3480931 3577254 3628570 3594948 3636523 3535062 3539664 3549458 3540673 3559801 3641402 3557790 3501823
15362 3501823 3542818 3638409 3605426 3596631 3560158 3592293 3656270 3654275 3591506 3541324 3598973 3557325
15350 3557325 3651131 3576677 3504970 3579930 3575390 3536922 3635610 3644537 3600622 3528095 3606560 3631041
15338 3631041 3659619 3657912 3650393 3717265 3598249 3551589 3522136 3609542 3620708 3606760 3508907
15327 3508907 3509953 3549920 3585610 3639968 3674320 3709507 3673633 3702094 3657752 3624931 3724288
15316 3724288 3740462 3669334 3601464 3482482 3463081 3483638 3580560 3556309 3606153 3670196 3681836
15305 3681836 3628722 3631635 3621678 3603605 3570331 3651745 3726995 3700398 3635093 3598556 3584015 3637497
15293 3637497 3623233 3728371 3656766 3562367 3573782 3625056 3647754 3650358 3690016 3653702 3642879
15282 3642879 3639419 3670840 3663129 3660779 3741089 3718092 3664265 3649452 3644634 3579067 3634208 3787559
15270 3787559 3775030 3703220 3671042 3738423 3689068 3706074 3680222 3661461 3598403 3646451 3659591
15259 3659591 3639972 3537909 3589381 3700168 3645623 3696898 3702568 3714112 3612794 3658154 3594892
15248 3594892 3568183 3714195 3621630 3602200 3618187 3583323 3664798 3678711 3653162 3729410 3649190
15237 3649190 3690191 3668261 3709454 3663648 3676771 3664617 3749871 3712700 3568282 3675845 3659281
15226 3659281 3579754 3531825 3582514 3570969 3551012 3471918 3568180 3600753 3634704 3668254 3661271
15215 3661271 3621478 3627545 3649815 3598045 3624216 3655014 3577215 3597287 3681325 3585952 3626637
15204 3626637 3583286 3575320 3657420 3636367 3505024 3545180 3630608 3617350 3503453 3550775 3591709
15193 3591709 3577591 3640960 3728284 3749266 3652036 3583231 3643950 3615584 3639310 3620534 3612228
15182 3612228 3676519 3609976 3614401 3684074 3767055 3713444 3668475 3634692 3651576 3599414 3560872
15171 3560872 3519530 3647346 3706328 3697691 3688081 3707868 3726440 3699875 3680984 3756458 3776173
15160 3776173 3732010 3646753 3653884 3608134 3626560 3691861 3728784 3780543 3712547 3720125 3712454 3684151
15148 3684151 3707587 3748987 3721721 3665944 3662920 3632233 3664546 3693310 3751893 3709773 3711362 3729572
15136 3729572 3740919 3717000 3678905 3676846 3631618 3657161 3719455 3665150 3796570 3770540 3729015
15125 3729015 3743551 3669906 3759539 3741922 3723547 3588428 3589677 3662090 3769073 3774940 3730401
15114 3730401 3695850 3739932 3746615 3756101 3715351 3661122 3721418 3773733 3738829 3780251 3734353 3691315
15102 3691315 3747746 3780804 3718475 3678835 3684130 3712876 3741759 3604347 3517880 3574165 3657996
15091 3657996 3710091 3690471 3720652 3705043 3650218 3699635 3725308 3720759 3796382 3763979 3703544
15080 3703544 3658633 3639920 3630882 3678215 3714756 3688223 3800667 3789848 3745170 3733016 3735311
15069 3735311 3777711 3711587 3611928 3640232 3682200 3643370 3719766 3745385 3789861 3761689 3745966
15058 3745966 3820944 3708392 3768413 3748632 3720470 3673508 3663338 3812963 3728433 3676947 3773111
15047 3773111 3716948 3701880 3747196 3603080 3558079 3679346 3732972 3712361 3640297 3651821 3671420
15036 3671420 3653952 3580414 3594701 3662161 3657740 3685281 3672909 3624950 3626542 3664151 3708514 3640156
15024 3640156 3639736 3738248 3745495 3730556 3705687 3748987 3638176 3717293 3757490 3808395 3786356 3734449
15012 3734449 3764102 3681824 3644505 3694072 3740469 3770305 3779861 3790745 3783829 3779099 3766318 3756087
15000 3756087 3763115 3721371 3737675 3696192 3683752 3660321 3695039 3689461 3816480 3736985 3678150
14989 3678150 3662218 3691687 3716265 3732628 3705170 3699451 3718691 3692408 3682189 3661840 3722779
14978 3722779 3839831 3805170 3824455 3823602 3701690 3684248 3728940 3765919 3769372 3792547 3741700
14967 3741700 3738357 3647861 3628222 3770738 3764518 3747681 3654818 3754144 3696485 3675986 3770540
14956 3770540 3754399 3719692 3753259 3814911 3746653 3801435 3762329 3719510 3706415 3783598 3725271
14945 3725271 3692728 3701745 3694981 3696639 3781941 3835934 3738949 3618325 3696093 3809223 3775118
14934 3775118 3667789 3754592 3762183 3645000 3670035 3797003 3801033 3722837 3711061 3697271 3679071
14923 3679071 3649033 3739436 3840768 3752302 3803443 3810559 3821354 3810696 3751240 3687628 3751436
14912 3751436 3812245 3810967 3704943 3748139 3751943 3677558 3698723 3584148 3620514 3717426 3792645
14901 3792645 3715374 3755326 3772155 3788113 3761100 3800772 3791652 3740560 3795491 3783040 3731997
14890 3731997 3771398 3723562 3761355 3789368 3830684 3823466 3810697 3847325 3787809 3777142 3738189
14879 3738189 3721420 3660846 3781664 3809580 3801999 3816505 3815872 3818846 3786012 3709288 3768228 3799758
14867 3799758 3764018 3816324 3877701 3849370 3815760 3829111 3779195 3729456 3788161 3778504 3722082
14856 3722082 3729568 3713758 3773279 3748997 3813178 3871195 3887151 3899734 3902670 3799016 3799405 3773424
14844 3773424 3840681 3814777 3831365 3774639 3746837 3750578 3652555 3707093 3720518 3714850 3705869 3751939
14832 3751939 3819245 3796949 3770050 3832213 3845052 3828091 3731498 3679311 3728742 3750044 3762837
14821 3762837 3713553 3743605 3800802 3763779 3768196 3789602 3767092 3809026 3943117 3974392 3809413
14810 3809413 3777061 3797354 3742048 3817023 3869395 3857277 3771653 3846661 3867979 3839457 3817934
14799 3817934 3877942 3861957 3830309 3793789 3795994 3857845 3853319 3846968 3838029 3857881 3803831 3802288
14787 3802288 3726721 3781925 3881026 3922768 3857629 3831929 3804629 3699166 3658218 3679805 3828407
14776 3828407 3806386 3856765 3707032 3719076 3717718 3798390 3838631 3823365 3713496 3687906 3821200
14765 3821200 3917411 3883963 3862898 3751759 3658451 3751223 3733693 3826218 3786157 3829208 3902602
14754 3902602 3882397 3853701 3860766 3888864 3849042 3867562 3835352 3751556 3835908 3822572 3796501
14743 3796501 3825381 3846525 3893378 3922093 3815725 3755331 3768093 3804943 3808894 3859650 3824834
14732 3824834 3833820 3847775 3848001 3791689 3833784 3865435 3902099 3863710 3816294 3759265 3817695 3812278
14720 3812278 3795647 3853973 3828352 3775523 3883545 3888019 3885530 3842307 3804592 3819799 3776042
14709 3776042 3768926 3806317 3840455 3745430 3849550 3851401 3871261 3838810 3784489 3862967 3882406
14698 3882406 3833412 3848028 3834520 3872535 3859930 3821145 3838005 3791772 3831976 3831113 3827007 3981755
14686 3981755 4038987 3919005 3935315 3883684 3839863 3852313 3823193 3857737 3927563 3915362 3841326
14675 3841326 3787945 3778409 3848190 3880137 3881192 3807647 3820041 3806764 3740772 3743126 3774598 3797143
14663 3797143 3811430 3872933 3861365 3802588 3843785 3856181 3931689 3912406 3990990 3864046 3739337
14652 3739337 3755410 3884459 3836904 3811147 3918014 3951566 3906972 3891850 3927229 3899593 3907927
14641 3907927 3856477 3874046 3904570 4008786 4010958 3880753 3907988 3823301 3911628 3912236 3877203
14630 3877203 3912805 3890605 3875847 3889772 3905279 3928130 3997003 3883248 3855045 3808088 3801897
14619 3801897 3816889 3828874 3870767 3955425 3972646 3846047 3884902 3961166 3926374 3910060 3819319
14608 3819319 3829543 3872463 3857571 3834847 3796484 3768331 3792992 3840815 3890561 3882391 3963245
14597 3963245 3894264 3835836 3794348 3880967 3849353 3878627 3857001 3806573 3822648 3859235 3810705
14586 3810705 3771581 3803355 3860143 3862547 3882702 3896690 3856420 3867357 3920323 3853132 3858109 3893789
14574 3893789 3838206 3912235 3881565 3915798 3893355 3854991 3805871 3802354 3853947 3848492 3913990 3962834
14562 3962834 3999112 3928506 3907021 3944192 3907243 3862500 3873479 4013881 3945479 3924099 3884138
14551 3884138 3941362 3980153 3997415 3932938 3819757 3932148 3947692 3815748 3878968 3971504 3956010
14540 3956010 3855827 3942387 3940905 3905329 3876419 3934016 3886344 3884618 3904376 3933606 3949813
14529 3949813 3866703 3947449 3959312 3981880 3991686 3963712 3980784 3948250 3998066 3993932 3918507 3847317
14517 3847317 3826587 3932758 3988015 3983008 4026235 4047955 3912289 3906012 3920988 3887165 3836706
14506 3836706 3876663 3850202 3836224 3910602 3907275 3960233 3968180 3955546 3934133 3957873 4054095 3941375
14494 3941375 3970311 4030563 3973033 3948888 3916172 3940556 3909034 3861327 3923114 3935263 3983330
14483 3983330 4026869 3975492 3900561 3925246 3933461 3957135 3974409 3954540 3847884 3901958 3992810
14472 3992810 3939480 3947774 3968046 3969446 3994234 3901281 3938880 3925873 3885977 4017272 3913154
14461 3913154 3926708 4003023 3917279 3849460 3814759 3872069 3933949 3984705 3961670 3951620 3901168
14450 3901168 3893023 3912618 3902620 3972537 3932754 4028940 3992207 3994162 3939964 3941955 4000034 3961150
14438 3961150 3955182 3955941 4038803 4056209 4008261 3895347 3925903 3934003 3972669 4023985 4031805 4008960
14426 4008960 3822042 3828497 3886564 3890984 3996055 4020145 3990560 4004033 4069055 4033424 3997071
$$ [...]
##END NTUPLES=NMR SPECTRUM
##END=
