##TITLE=1H_EC-3253(II-3)
 CDCl3, 8 sc, 
 14.05.2021
##JCAMPDX= 6.0         $$ Bruker NMR JCAMP-DX V2.0
##DATA TYPE= NMR SPECTRUM
##DATA CLASS= NTUPLES
##ORIGIN= UXNMR, Bruker Analytische Messtechnik GmbH
##OWNER= root
$$ XWIN-NMR		Version 3.5
$$ Fri May 14 11:44:05 2021 Russian Standard Time (UT+4h)  she@DPX200
##.OBSERVE FREQUENCY= 200.131506
##.OBSERVE NUCLEUS= ^1H
##.ACQUISITION MODE= SIMULTANEOUS
##.ACQUISITION SCHEME= undefined
##.AVERAGES= 8
##.DIGITISER RES= 18
##SPECTROMETER/DATA SYSTEM= spect
##.PULSE SEQUENCE= zg30
##.SOLVENT NAME= CDCl3
##.SHIFT REFERENCE= (INTERNAL, CDCl3, 0, 15.9668)
##AUDIT TRAIL= $$ (NUMBER, WHEN, WHO, WHERE, WHAT)
$$ ##TITLE= Audit trail, XWIN-NMR		Version 3.5
$$ ##JCAMPDX= 5.01
$$ ##ORIGIN= Bruker BioSpin GmbH
$$ ##OWNER= she
$$ F:/spectra/data/she/nmr/H-F/1/pdata/1/auditp.txt
$$ ##AUDIT TRAIL=  $$ (NUMBER, WHEN, WHO, WHERE, WHAT)
(   1,<2021-05-14 11:42:48.81 +0400>,<she>,<DPX200>,
      <created by zg, POWCHK disabled, PULCHK disabled
       configuration hash MD5:
       00 E9 B6 7A A2 85 ED C7 34 08 36 98 17 FE 4E 26
       data hash MD5: 16K
       0C A0 15 89 3E DA 55 5A 7A EB 1C 27 77 FD D2 E5>)
(   2,<2021-05-14 11:42:52.09 +0400>,<she>,<DPX200>,
      <Start of raw data processing
       efp BC_mod = 2 LB = 0.24 FT_mod = 6 PKNL = 1 PHC0 = -11140.72 PHC1 = 27.201 SI = 16K 
       data hash MD5: 16K
       7E 36 E3 80 07 72 2A A5 15 40 B2 F7 C6 E4 97 30>)
(   3,<2021-05-14 11:43:12.90 +0400>,<she>,<DPX200>,
      <pk PHC0 = 11.0971 PHC1 = -17.00001 
       data hash MD5: 16K
       4A CF 5B 80 F7 95 76 91 81 5A 49 98 AD 44 34 1F>)
(   4,<2021-05-14 11:43:16.12 +0400>,<she>,<DPX200>,
      <abs ABSG = 5 
       data hash MD5: 16K
       29 5A 81 5A 2D AE 15 BB 8F 27 F3 04 71 CD 4C 38>)
$$ ##END=
$$ 
$$ hash MD5
$$ C5 8E AB E0 6D 26 D7 A3 5B 46 D9 E5 54 9B DA 18
##$RELAX= 
##$RELAX= 
##$RELAX= 
##$RELAX= 
##$RELAX= 
##$RELAX= 
$$ Bruker specific parameters
$$ --------------------------
##$DU= <F:/spectra>
##$EXPNO= 1
##$NAME= <H-F>
##$PROCNO= 1
##$TYPE= <nmr>
##$USER= <she>
##$AMP= (0..31)
100 100 100 100 100 100 100 100 100 100 100 100 100 100 100 100 100 100 
100 100 100 100 100 100 100 100 100 100 100 100 100 100 
##$AQSEQ= 0
##$AQ_mod= 1
##$AUNM= <au_zg>
##$AUTOPOS= <>
##$BF1= 200.13
##$BF2= 200.13
##$BF3= 200.13
##$BF4= 200.13
##$BF5= 200.13
##$BF6= 200.13
##$BF7= 200.13
##$BF8= 200.13
##$BYTORDA= 1
##$CFDGTYP= 0
##$CFRGTYP= 5
##$CHEMSTR= <none>
##$CNST= (0..31)
1 1 145 1 1 1 1 1 1 1 1 1 1 1 1 1 1 1 1 1 1 1 1 1 1 1 1 1 1 1 1 1 
##$CPDPRG= <>
##$CPDPRG1= <>
##$CPDPRG2= <>
##$CPDPRG3= <>
##$CPDPRG4= <mlev>
##$CPDPRG5= <mlev>
##$CPDPRG6= <mlev>
##$CPDPRG7= <mlev>
##$CPDPRG8= <mlev>
##$CPDPRGB= <>
##$CPDPRGT= <>
##$D= (0..31)
0 1.2 0 0 0 0 0 0 0 0.06 0 0.03 0 0 0 0 0.0002 0 0 0 0 0 0 0 0 0 0 0 0 
0 0 0 
##$DATE= 1620978168
##$DBL= (0..7)
120 120 120 120 120 120 120 120 
##$DBP= (0..7)
150 150 150 150 150 150 150 150 
##$DBP07= 0
##$DBPNAM0= <>
##$DBPNAM1= <>
##$DBPNAM2= <>
##$DBPNAM3= <>
##$DBPNAM4= <>
$$ [...]
##$SUBNAM3= <"">
##$SUBNAM4= <"">
##$SUBNAM5= <"">
##$SUBNAM6= <"">
##$SUBNAM7= <"">
##$SUBNAM8= <"">
##$SUBNAM9= <"">
##$SW= 16.9725357007746
##$SWIBOX= (0..15)
0 0 2 0 0 0 0 0 0 0 0 0 0 0 0 0 
##$SW_h= 3396.73913043478
##$TD= 16384
##$TD0= 1
##$TE= 0
##$TE2= 300
##$TE3= 300
##$TEG= 300
##$TL= (0..7)
0 120 120 120 120 120 120 120 
##$TP= (0..7)
150 150 150 150 150 150 150 150 
##$TP07= 0
##$TPNAME0= <>
##$TPNAME1= <>
##$TPNAME2= <>
##$TPNAME3= <>
##$TPNAME4= <>
##$TPNAME5= <>
##$TPNAME6= <>
##$TPNAME7= <>
##$TPOAL= (0..7)
0.5 0.5 0.5 0.5 0.5 0.5 0.5 0.5 
##$TPOFFS= (0..7)
0 0 0 0 0 0 0 0 
##$TUNHIN= 0
##$TUNHOUT= 0
##$TUNXOUT= 0
##$USERA1= <user>
##$USERA2= <user>
##$USERA3= <user>
##$USERA4= <user>
##$USERA5= <user>
##$V9= 5
##$VALIST= <valist>
##$VCLIST= <CCCCCCCCCCCCCCC>
##$VD= 0
##$VDLIST= <DDDDDDDDDDDDDDD>
##$VPLIST= <PPPPPPPPPPPPPPP>
##$VTLIST= <TTTTTTTTTTTTTTT>
##$WBST= 1024
##$WBSW= 4
##$XGAIN= (0..3)
0 0 0 0 
##$XL= 0
##$YL= 0
##$YMAX_a= 258841
##$YMIN_a= -283535
##$ZGOPTNS= <>
##$ZL1= 120
##$ZL2= 120
##$ZL3= 120
##$ZL4= 120
##$ABSF1= 15.97195
##$ABSF2= -1.000712
##$ABSG= 5
##$ABSL= 3
##$ALPHA= 0
##$AQORDER= 0
##$ASSFAC= 0
##$ASSFACI= 0
##$ASSFACX= 0
##$ASSWID= 0
##$AUNMP= <proc_1d>
##$AZFE= 0.1
##$AZFW= 0.1
##$BCFW= 0
##$BC_mod= 2
##$BYTORDP= 0
##$COROFFS= 0
##$CY= -3
##$DATMOD= 1
##$DC= 0
##$DFILT= <>
##$DTYPP= 0
##$F1P= 0
##$F2P= 0
##$FCOR= 1
##$FTSIZE= 16384
##$FT_mod= 6
##$GAMMA= 0
##$GB= 0
##$INTBC= 1
##$INTSCL= 1.334414e-10
##$ISEN= 128
##$LB= 0.24
##$LEV0= 0
##$LPBIN= 0
##$MAXI= 10000
##$MC2= 0
##$MEAN= 0
##$ME_mod= 0
##$MI= 1.114404
##$NCOEF= 0
##$NC_proc= -7
##$NLEV= 6
##$NOISF1= 3.799351
##$NOISF2= 2.8
##$NSP= 0
##$NTH_PI= 0
##$NZP= 0
##$OFFSET= 15.96678
##$PC= 1
##$PHC0= -11129.62
##$PHC1= 10.20099
##$PH_mod= 1
##$PKNL= yes
##$PPARMOD= 0
##$PSCAL= 0
##$PSIGN= 0
##$REVERSE= no
##$SF= 200.130008938234
##$SI= 16384
##$SIGF1= 3
##$SIGF2= 2
##$SINO= 5.538805
##$SIOLD= 16384
##$SREGLST= <1H.CDCl3>
##$SSB= 0
##$STSI= 16384
##$STSR= 0
##$SW_p= 3396.73913043479
##$SYMM= 0
##$S_DEV= 0
##$TDeff= 16384
##$TDoff= 0
##$TI= <>
##$TILT= no
##$TM1= 0
##$TM2= 0
##$TOPLEV= 0
##$USERP1= <user>
##$USERP2= <user>
##$USERP3= <user>
##$USERP4= <user>
##$USERP5= <user>
##$WDW= 1
##$XDIM= 16384
##$YMAX_p= 370058117
##$YMIN_p= -799282
$$ End of Bruker specific parameters
$$ ---------------------------------
##NTUPLES= NMR SPECTRUM
##VAR_NAME=  FREQUENCY,     SPECTRUM/REAL,   SPECTRUM/IMAG
##SYMBOL=    X,             R,               I
##VAR_TYPE=  INDEPENDENT,   DEPENDENT,       DEPENDENT
##VAR_FORM=  AFFN,          ASDF,            ASDF
##VAR_DIM=   16384,         16384,           16384
##UNITS=     HZ,            ARBITRARY UNITS, ARBITRARY UNITS
##FACTOR=    0.207333158178282, 1,           1
##FIRST=     3195.43176584943, 0,            0
##LAST=      -201.307364585363, 0,           0
##MIN=       -201.307364585363, -799282,     0
##MAX=       3195.43176584943, 370058117,    0
$$ Real data points
##PAGE= N=1
##DATA TABLE= (X++(R..R)), XYDATA
$$ [...]
5245I06027l86794n5289J27962M7907K37093P7736o2223j56481j24092J71451
5235G83297L0927K2646Q584J35231P5898N9091J22539k25449k14045M78J48946
5224I48143k09831P9108K19793j66439o5257n7298p5142J5327K62221j7824j6677
5213I16124K4115k70445n8899M47222l04926J9977l531n9183j03504J32373K46868
5202I86191K308J30939n4500k04584m4119J83206J3956J53823j79109l46288o4658
5191E77165K29289M2744j55870J03522Q8926J18448Q3925m9348K3019j73054j62101
5180G26665j9553Q3670r01N4834O5916L7405m6037L9416J00381J65264k25084
5169I81976K17694j7006j3823J32809l4570j00982j61439J51283J48474N9901
$$ plain form
5245 906027 519233 463944 591906 639813 876906 954642 892419 735938 611846 783297
5235 783297 814224 836870 845454 980685 1056583 1115674 1238213 1012764 798719 799197 948143
5224 948143 738312 817420 1037213 870774 805517 748219 673077 688404 950625 932801 916124
5213 916124 940239 669794 610895 1058117 753191 773168 769637 710454 606950 739323 986191
5202 986191 988499 1119438 1064938 860354 816235 999441 1013397 1167220 988111 641823 577165
5191 577165 806454 849198 693328 796850 885776 1004224 1088149 1038801 1061820 888766 726665
5180 726665 707112 790782 789881 844715 910631 948036 901999 941415 1041796 1207060 981976
5169 981976 1199670 1182664 1168841 1301650 1267080 1166098 1004659 1155942 1304416 1364317
5159A364317O0452n232j10238J11840q3204J11103Q4745m80823k23070K95478
5149A125368J83745M71037o6814n16245R0996J34578j27078N4673J64031o5198
5139A449093k2616j3983J23636L70229O2014j07021l97680k00005L09660J39163
5129A712490L15269J50279m01021j41324j06819k4599L71191m4162j45467J29703
5119A815540K115k20734r4684k28682L14233j24558J94327K33632K4809J35092
5109B051090j11431m40344n1619J95353Q8169N32997L74831j26527r1058o4894
5099B356567m13888J47783J72818m9657L41932J96093M748J63895q5166l49997
5089B485128j61870J88229k0739J01078M43734O8450l37709n1212j30271k5515
$$ plain form
5159 1364317 1424769 1419537 1309299 1421139 1337935 1449038 1533783 1052960 829890 1125368
5149 1125368 1309113 1780150 1713336 1197091 1288087 1422665 1295587 1350260 1514291 1449093
5139 1449093 1426477 1412494 1536130 1906359 1968373 1861352 1463672 1263667 1573327 1712490
5129 1712490 2027759 2178038 1777017 1635693 1528874 1504275 1875466 1831304 1685837 1815540
5119 1815540 1817655 1596921 1502237 1273555 1587788 1463230 1657557 1891189 1915998 2051090
5109 2051090 1939659 1499315 1447696 1643049 1731218 2264215 2639046 2512519 2421461 2356567
5099 2356567 1942679 2090462 2263280 2213623 2555555 2751648 2756396 2920291 2835125 2485128
5089 2485128 2323258 2511487 2490748 2591826 3035560 3104010 2766301 2715089 2584818 2559303
5079B559303J48954j5043J23527L57675J4329J84970J21912l75803k32890K35011
5069C121945O3176L15845L52887j80429j76218K08600K209P5305K02403Q5491
5059D071214M7357q4269P649K50853P3890l00300q408M52987K75249j09401J10860
5048D787681R7682l6926J27669K7217K79767N25796M0828J0623K83411K18945
5038F362693K08108J93664q283K22682L15969L25536M26524N92412M79469K61581
5028I380355N62009M73403M54112O38059O33636P16167Q24460P53464Q42121Q33357
5018A6111143R96395Q89885K80476l9730j82625n44717q72014n63627l77408m84063
5008A5213715l38978k52225k78910m84585l55668J78812N78512r3192K67793N73503
$$ plain form
5079 2559303 2708257 2693214 2816741 3174416 3188745 3373715 3495627 3119824 2886934 3121945
5069 3121945 3185121 3500966 3853853 3673424 3497206 3705806 3708015 3783320 3985723 4071214
5059 4071214 4118571 4034302 4041951 4292804 4366694 4066394 4057986 4510973 4786222 4676821 4787681
5048 4787681 4885363 4848437 4976106 5003323 5283090 5808886 5849714 5860337 6143748 6362693
5038 6362693 6570801 6764465 6756182 6978864 7294833 7620369 8046893 8639305 9118774 9380355
5028 9380355 9942364 10415767 10869879 11507938 12141574 12857741 13682201 14435665 15277786 16111143
5018 16111143 17107538 17997423 18277899 18238169 18055544 17510827 16638813 16075186 15697778 15213715
5008 15213715 14874737 14622512 14343602 13859017 13503349 13682161 14260673 14167481 14435274 15008777
4998A5008777M30602Q13098P27112M60392O66720P29198O85151J002464J173548
4989B1697062J390729R39441J209991J044348J152933J025847O58807O01117L02879
4980C0023154j35011j5139j64126q76688j190851j230643r58984j046134p72929
4971B3632649o00915o36191n95528m73203o3151k12396j11075J20196L0447K77339
4961B1368172R04560M52381N50501J089043P51124R68315J291823J392156J602505
4952C0370580J862681J912037J799765J795902J500716P03045J34033q77629j917936
4943C7283194j919062k185766k366465j886752j789697j654734j043306p74965
4935B3662447m14657n96446n73807l04583j76694K38201L89311L31708N58214
$$ plain form
4998 15008777 15439379 16252477 16979589 17439981 18106701 18835899 19521050 20523514 21697062
4989 21697062 23087791 24027232 25237223 26281571 27434504 28460351 29119158 29720275 30023154
4980 30023154 29888143 29873004 29708878 28832190 27641339 26410696 25451712 24405578 23632649
4971 23632649 23031734 22395543 21800015 21326812 21263661 21051265 20940190 21060386 21090833 21368172
4961 21368172 22272732 22725113 23275614 24364657 25115781 26084096 27375919 28768075 30370580
4952 30370580 32233261 34145298 35945063 37740965 39241681 39944726 40078759 39201130 37283194
4943 37283194 35364132 33178366 30811901 28925149 27135452 25480718 24437412 23662447
4935 23662447 23247790 22651344 22077537 21772954 21596260 21834461 22223772 22555480 23113694
4926B3113694P57563O90565Q67987J423110J625069J405507J498380J700367J968467
4917C5050709K286871J786193J284226J004748k1669p65900j416622j961944k687324
4908C4559288k962805k453404k502248k179215j449519j535395j383753r78687
4900A9114262j030990r29637l79617l36126l08871l01270j28602R681j97534L31633
4890A5842929L10367K19330O62602N91122P76435R80346O41398P33424R13755
4881B1671708Q88836Q85857L33959j00915p83705j560751j904608j766803j584138
4872A6079440j439978j276619j208364q44287o80733q92305m36752m86319r97139
4863G816944m44453l01448m58038j11213l33548k69450k4736k75470k05941n4204
$$ plain form
4926 23113694 23871257 24561822 25429809 26852919 28477988 29883495 31381875 33082242 35050709
4917 35050709 37337580 39123773 40407999 41412747 41391078 40625178 39208556 37246612 34559288
4908 34559288 31596483 29143079 26640831 24461616 23012097 21476702 20092949 19114262
4900 19114262 18083272 17153635 16774018 16437892 16129021 15827751 15699149 15708830 15511296 15842929
4890 15842929 16153296 16372626 17035228 17626350 18402785 19383131 20024529 20757953 21671708
4881 21671708 22560544 23446401 23780360 23679445 22895740 21334989 19430381 17663578 16079440
4872 16079440 14639462 13362843 12154479 11310192 10629459 9737154 9300402 8814083 7816944
4863 7816944 7372491 7071043 6613005 6501792 6168244 5898794 5874058 5598588 5392647 5338443
4853E338443n25812K6002j05816k43888J48836K9643p4556J56415K17630k01811
4843D765086m99870k29165k86258k611K30952L5887l2504L8727l02888l11617
4833C405739k05270m19049p6393K80137J00956l49209K39685K7737k70824K0118
4823B753627j26253m11795J19891L4932P3205j42412j46895j36978J8575J54436
4813B190333J03009O4944N8673j08263k01713k12450j13589R7735K64177J35811
4803B278667j3155k88921J59417K31181m02922o974J23974k38368j50038L54417
4793B047278J28928j81040k04702k3432j60384J26730l84745j96978M20017J4321
4783A585993j13763R5997l3549j97679Q7611J11402K11837J7292J94962K92247
$$ plain form
4853 5338443 4812631 4838633 4732817 4488929 4637765 4667408 4592852 4749267 4966897 4765086
4843 4765086 4265216 4036051 3749793 3747182 3978134 4014021 3981517 4020244 3717356 3405739
4833 3405739 3200469 2781420 2705027 2985164 3086120 2736911 2976596 3004333 2733509 2753627
4823 2753627 2627374 2215579 2335470 2370402 2443607 2301195 2154300 2017322 2035897 2190333
4813 2190333 2293342 2358286 2416959 2308696 2106983 1894533 1780944 1878679 2142856 2278667
4803 2278667 2265512 1976591 2136008 2367189 1964267 1957293 2081267 1842899 1692861 2047278
4793 2047278 2176206 1995166 1790464 1767032 1606648 1733378 1348633 1151655 1571672 1585993
4783 1585993 1472230 1568227 1534678 1336999 1424610 1536012 1747849 1765141 1960103 2252350
4773B252350J2519q7381m82677m39792P8821J69783J9020J41564K63150Q1907
4763B009264l36483k46562k070j06113M4520J1090r3901L7949J68009n9419Q8205
4752A514489Q3595o0739k43574J90945N7874k08429J32565K38510K19973J10655
4742B035864L3625J59441l35123m51448j49166r8138L60141R8093K98231J67539
4732B119059k59147j40959k17834L2311J11702k30657l3605j17844m4362K17298
4722A435962K46308j09578J38504p5198m79676K83316J87433j76151k3451Q7748
4712A515217j02077O2049J34118j66123l3384o2969p3050J64614k0591m0287J79017
4701A556534k9321O6490K92002J7530j74722j98809j90503J03718n6821K26412
$$ plain form
4773 2252350 2264869 2177488 1694811 1255019 1333840 1503623 1522643 1664207 1927357 2009264
4763 2009264 1672781 1426219 1424149 1318036 1362556 1373646 1279745 1317694 1485703 1426284 1514489
4752 1514489 1598084 1537345 1293771 1484716 1542590 1334161 1466726 1705236 1925209 2035864
4742 2035864 2069489 2228930 1893807 1442359 1293193 1195055 1555196 1653289 1951520 2119059
4732 2119059 1859912 1718953 1501119 1533430 1645132 1414475 1380870 1263026 1218664 1435962
4722 1435962 1682270 1572692 1711196 1635998 1156322 1439638 1627071 1450920 1427469 1515217
4712 1515217 1413140 1475189 1609307 1443184 1409800 1346831 1273781 1438395 1417804 1377517 1556534
4701 1556534 1527213 1593703 1885705 1903235 1728513 1529704 1339201 1442919 1386098 1612510
4691A612510J00478j25818O5185r614J29595J75785q247N5921L9103k39393L3322
4680A828827N8839L3690L840J51860J45820k35348R0220l6320k17506q2319N7537
4669A799140K361L4787K64579N1052m1594r8137l12882k72295p9212L39427n1528
4658A635698k682K72946j3590k2097K9530J15663j25182n9668k16939j90148L02471
4647A726002J62656J99339J39413j29190j74445p8553j10363K091K52544L26278
4637B315772K79409J78408k0796k87791k90377Q106k10207l14650J05336L17127
4627B080337K66489J29438K7870K3291O8075K17241K21673j66551j9123j01837
4617B746903J1214L34948L48752N9897O9816J10305j98035j4740O6190j48774
$$ plain form
4691 1612510 1712988 1587170 1652355 1642741 1772336 1948121 1939874 1995795 2034898 1795505 1828827
4680 1828827 1887666 1921356 1925196 2077056 2222876 1987528 2077748 2041428 1823922 1741603 1799140
4669 1799140 1801501 1836288 2100867 2151919 2110325 2012188 1699306 1427011 1347799 1687226 1635698
4658 1635698 1633016 1905962 1892372 1870275 1899805 2015468 1890286 1830618 1613679 1423531 1726002
4647 1726002 1888658 2087997 2227410 2098220 1923775 1845222 1734859 1736950 1989494 2315772
4637 2315772 2595181 2773589 2752793 2465002 2174625 2182731 1972524 1657874 1763210 2080337
4627 2080337 2346826 2476264 2504134 2527425 2595500 2812741 3034414 2867863 2848740 2746903
4617 2746903 2758117 3093065 3441817 3501714 3571530 3681835 3483800 3469060 3535250 3386476
4607C386476l4753J47057J51428j26079J17072J73320k00417N3738Q025J9731
4597C695598J37091J28599j22686J46890M31163M6666K75785j9911K12305j35628
4587D795872J11701L38825j30640J0675j35782Q4788K42788J63066J98203J07375
4577E786871O1795j5528K60749j7272j09078K68607L15309L02989M59627K39633
4567G553702J44919J4871j1176J42174L03117M05425M36536M40818P5231K5183
4557I530800J69162J95907K59004L28247M22474M20779M50753M42599J29076K43265
4547A2592066L95427Q10322J050154Q56493R73315J130102J121950J186625J374780
4538B1491234J707162J757777K094583K429841K692817K936896K807414K967372
$$ plain form
4607 3386476 3351723 3498780 3650208 3524129 3641201 3814521 3614104 3667842 3675867 3695598
4597 3695598 3832689 3961288 3838602 3985492 4416655 4463321 4739106 4719195 4931500 4795872
4587 4795872 4907573 5246398 5115758 5126433 4990651 5075439 5318227 5481293 5679496 5786871
4577 5786871 5848666 5833138 6093887 6076615 5967537 6236144 6551453 6854442 7314069 7553702
4567 7553702 7698621 7713492 7702316 7844490 8147607 8553032 8989568 9430386 9505617 9530800
4557 9530800 9699962 9895869 10154873 10483120 10905594 11326373 11777126 12219725 12348801 12592066
4547 12592066 12987493 13797815 14847969 15704462 16677777 17807879 18929829 20116454 21491234
4538 21491234 23198396 24956173 27050756 29480597 32173414 35110310 37917724 40885096
4530D0885096L571020L509094L130041L047639K798444K587710K172884J445827
4522F3147755R88803J28476j203794k621581l364513l587258l422599l062634
4514D7002655l056098l258097l064840l075185l027329k693897k533114k342605
4506B3951490j721525j217211j117725j268728j258406o58542n32766q52866n43245
4497A4780476p92382o78303n86524m80001n33431q09787m82399l47076n50412
4488I520161k74223k75551l45912j29301j97937m40705l13659m48899j62180J61818
4478G093612j17831m39670o7761J38038j69177k05393k51936k36726j32651L14118
4468E924623j84154k32442K554J18794K28989R8080R5765j15889l41687j22377
$$ plain form
4530 40885096 44456116 47965210 51095251 54142890 56941334 59529044 61701928 63147755
4522 63147755 64136558 64265034 63061240 60439659 57075146 53487888 50065289 47002655
4514 47002655 43946557 40688460 37623620 34548435 31521106 28827209 26294095 23951490
4506 23951490 22229965 21012754 19895029 18626301 17367895 16709353 16176587 15323721 14780476
4497 14780476 13988094 13309791 12723267 12243266 11709835 10900048 10417649 10070573 9520161
4488 9520161 9245938 8970387 8624475 8495174 8297237 7856532 7542873 7093974 6931794 7093612
4478 7093612 6975781 6536111 6468350 6606388 6437211 6231818 5979882 5743156 5610505 5924623
4468 5924623 5740469 5508027 5510581 5629375 5858364 5956444 6052209 5936320 5594633 5472256
4458E472256k97656k59409M7692K0516q4306J59684j86079k71694j07227j18074
4448D375703k86305r4421k04605L8785M39088J54612j48163j77450j2628j01238
4438C983378P6895K80520K58161J16009K737n4199R6540K30266n9061r7693Q6530
4427D920083k54199m59691j9531k8291l7702j9506k17896J54755Q7376r1442j40751
4416C893205l5622k0836J60990p8851q0475j06335m83500N4259K57374J62590
4406C722799L25591q7577k74417O0819J1377Q7540j39511J88386Q4402k80393
4396C699016k80116k26790p9061M1647j22455j63115j6480N7984Q7770M6595j00176
4385B944819m4185K3722j23416O6902l0756q8461p5580K06763J10695l58604l77612
$$ plain form
4458 5472256 5174600 4915191 4962883 4983399 4899093 5058777 4872698 4601004 4493777 4375703
4448 4375703 4089398 3994977 3790372 3829157 4268245 4422857 4274694 4097244 4084616 3983378
4438 3983378 4060273 4340793 4598954 4714963 4717700 4663501 4760041 4990307 4931246 4833553 4920083
4427 4920083 4665884 4206193 4186662 4158371 4120669 4101163 3883267 4038022 4125398 4033956 3893205
4416 3893205 3857583 3836747 3997737 3918886 3838411 3732076 3248576 3302835 3560209 3722799
4406 3722799 4048390 3960813 3686396 3747215 3758592 3846132 3706621 3895007 3979409 3699016
4396 3699016 3418900 3192110 3113049 3154696 3032241 2869126 2852646 2910630 2998400 3044995 2944819
4385 2944819 2900634 2924356 2800940 2867842 2837086 2748625 2673045 2879808 2990503 2631899 2254287
4374B254287j50513J17042J91838J54871M8871r9388j58615m3443q6988j5997
4364B211965q7654q2911q3317k04150L08262J97391L1416N7058l01280l42997
4354A703783J1963o6439K26435J98396j48047J8289J73243J64787J20107J2712
4344B415229m52782k58959J82232J60068m0454K89820j0127k46470j21336k19490
4334A697731L02745J13126l24918k72326l7336k18742k9674K93937K62753j30958
4324A656338j75820r8224j96429O8437j1478K45423L30644P1744k51250j49041
4314A490344N9193J1266j15346j31402J07374J3408k942N9350J09282J23050k18218
4303A505359j98299J60762J92025J3575j18263j51143J14430n0059k0327R827
$$ plain form
4374 2254287 2103774 2220816 2412654 2567525 2616396 2517008 2358393 2314950 2227962 2211965
4364 2211965 2124311 2041400 1958083 1753933 2062195 2259586 2291002 2348060 2046780 1703783
4354 1703783 1715746 1649307 1875742 2074138 1926091 1944380 2117623 2282410 2402517 2415229
4344 2415229 1962447 1703488 1885720 2045788 2005334 2295154 2285027 2038557 1917221 1697731
4334 1697731 2000476 2113602 1788684 1516358 1479022 1260280 1230606 1524543 1787296 1656338
4324 1656338 1480518 1382294 1185865 1254302 1242824 1488247 1818891 1890635 1639385 1490344
4314 1490344 1549537 1560803 1445457 1314055 1421429 1434837 1431895 1491245 1600527 1723577 1505359
4303 1505359 1307060 1467822 1659847 1673422 1555159 1404016 1518446 1468387 1448060 1457887
4293A457887J22728J37703p9252j64019l0347j08071j82856K56351L82935K74187
4283B067246n30241M2134K71491R7870j83920L25001J81283N257K02475J93271
4273B671867J61128J82084M62652r5633J47979J15457j64844k98706J06074m38999
4263B849059o28386k28815P6362O5450k6201k78678l60593J24123M2843q5617
4253A549547p4989m2032p7695J10288J36342j28511J07444Q9457q7983k40204
4243A341664m7714r7813J1759N06642q4211R2544R1727R0951K58970k21854m40726
4232A501939J04925K0970J0245L09544O7249j20063j76935j58316l354j44999
4222A411205P1276J62936k18606m6059J2589M3621n0684M5617O6505n8786Q338
$$ plain form
4293 1457887 1580615 1718318 1639066 1475047 1444700 1336629 1153773 1410124 1793059 2067246
4283 2067246 1537005 1579139 1850630 1948500 1764580 2089581 2270864 2276121 2478596 2671867
4273 2671867 2832995 3015079 3477731 3382098 3530077 3645534 3480690 3181984 3288058 2849059
4263 2849059 2220673 1991858 2068220 2133670 2107469 1828791 1468198 1592321 1635164 1549547
4253 1549547 1474558 1432526 1354831 1465119 1601461 1472950 1580394 1669851 1581868 1341664
4243 1341664 1293950 1196137 1207896 1714538 1630327 1722871 1814598 1905549 2164519 1942665 1501939
4232 1501939 1606864 1627834 1638079 1947623 2014872 1894809 1717874 1559558 1556204 1411205
4222 1411205 1482481 1645417 1426811 1380752 1393341 1436962 1386278 1431895 1498400 1439614 1447952
4211A447952M6624J27037J36874j15665j67356L12822M94825K25175k12671n45463
4201A750154j06296Q5852j6814j3463K08674P4539L8534k04111J58863o088k97912
4190A671932j9747j39085J67150J39546K54156K94399j58678k80849l68611j2383
4180A547830N14994K32773k94052l40227J97495m5118q9717j2782m9973r2236
4170A568987P4461K56579K39112m5745l69576k85722J58790N0014j31800L98144
4160A913244N0593p0209j75403P9347Q0747o6453O3324l31818K674K61216J3889
4149A821151K0045K8536j14323L1626L5689R9801K15116j45421j50445K45152
4139B086927K11006R251r4516p9435q9804j430K97492r4349J49254J54895k40214
$$ plain form
4211 1447952 1494576 1621613 1758487 1642822 1475466 1788288 2283113 2508288 2295617 1750154
4201 1750154 1643858 1729710 1712896 1699433 1908107 1982646 2021180 1817069 1975932 1969844 1671932
4190 1671932 1652185 1513100 1680250 1819796 2073952 2368351 2209673 1928824 1560213 1547830
4180 1547830 2062824 2295597 2001545 1661318 1858813 1813695 1723978 1711196 1661223 1568987
4170 1568987 1643448 1900027 2139139 2093394 1723818 1438096 1596886 1646900 1515100 1913244
4160 1913244 1963837 1893628 1718225 1797572 1878319 1811866 1875190 1543372 1546046 1807262 1821151
4149 1821151 1841196 1869732 1755409 1787035 1822724 1922525 2137641 1992220 1841775 2086927
4139 2086927 2297933 2307184 2212668 2133233 2043429 2041999 2339491 2245142 2394396 2549291 2309077
4128B309077n6530M0739r4033M22868J83862q4637K9919l42238j66473M6801R2446
4117B381801k72091J60244J39770j86884L71801J08663l33648o5325N9402j75292
4107B188441J78165J15125K3330K83816M5317j16474m00544n560n6199J40016
4097B395433L61137J34725j7764L95880R8230J08354L03272j90283j03413J48127
4087C633698l3258l61041r6595r0880L9990k12788j40461n2394J46199N5865k50294
4076B638041o7930q5842L6709L4672k014M9169J74444P4537j7791M5297M7128
4065B926420j85479N8147J72585R8301M77764L20545J1678J8505j23328n02617
4055C272521M1856J11386R0582R3417k47437l91842k98779P7455J79159Q4672
$$ plain form
4128 2309077 2252547 2293286 2199253 2622121 2805983 2721346 2751265 2409027 2242554 2289355 2381801
4117 2381801 2109710 2269954 2409724 2222840 2594641 2703304 2369656 2304331 2363733 2188441
4107 2188441 2366606 2481731 2505061 2788877 2834194 2717720 2317176 2311616 2255417 2395433
4097 2395433 2756570 2891295 2873531 3269411 3367641 3475995 3779267 3588984 3485571 3633698
4087 3633698 3600440 3239399 3142804 3051924 3091914 2879126 2738665 2686271 2832470 2888335 2638041
4076 2638041 2570111 2484269 2520978 2555650 2553636 2602805 2777249 2851786 2833995 2879292 2926420
4065 2926420 2740941 2799088 2971673 3069974 3547738 3868283 3879961 3898466 3775138 3272521
4055 3272521 3314377 3425763 3516345 3609762 3362325 2970483 2671704 2749159 2928318 3012990
4045C012990P5425j62046l32718K24137p4643q3439K05150r7654K688O1554J18344
4034B949788K49682J50514k33771l07677k25440R5749M24530r1308L86821K14184
4024C613072l04164m0269m3291q8202m0515K7376L95499M716o4923j20938k85305
4013C053056k16910j34408j36867j9538N19042J7014O7348m1371n11591l38038
4003B257737L46853j39627p045J86018k5389o230L14494Q5856j88909O0022m14688
3992B469092k17028K17341N53561J89635O324N0930k01574k58538j12022J82021
3982B879742J90905p0055q0918M1256q0105O2037Q7063l12082P7057r7319l60260
3971B337321K55954L90527R411K06896l11124q9885J14658j73231n8531J72991
$$ plain form
4045 3012990 3088415 2926369 2593651 2817788 2743145 2659706 2864856 2767202 2769890 2831444 2949788
4034 2949788 3199470 3349984 3116213 2808536 2583096 2678845 3103375 3012067 3398888 3613072
4024 3613072 3308908 3268639 3225348 3137146 3096631 3124007 3519506 3524222 3459299 3338361 3053056
4013 3053056 2836146 2701738 2564871 2545333 3064375 3081389 3148737 3107366 2595775 2257737
4003 2257737 2604590 2464963 2457918 2643936 2618547 2612317 2926811 3012667 2823758 2883780 2469092
3992 2469092 2252064 2469405 3022966 3212601 3218925 3269855 3068281 2809743 2697721 2879742
3982 2879742 3070647 3000592 2919674 2960930 2880825 2942862 3029925 2717843 2794900 2697581 2337321
3971 2337321 2593275 2983802 2993213 3200109 2888985 2799100 2913758 2740527 2681996 2854987
3961B854987K62747k21241Q902K06652k44511K9548K83503j46475j54738L49743
3951C229117J24205j78787J46670k29810k87795J15315J54362L04322R7831M6755
3941C522185q0861k02049j01491R1189J59277j79118K39669N741Q9397q9862m8221
3930C405856K05337n6350j91038L47340K55486M8504J10891q4348k66596R301
3920C784383K54835K41509L618L59133L75547l40123k50651L1513o4342K11579
3910D607001L48939J50456J09423j73299j01393K85626L7738L8132J59647O0851
3900E523121N9125K52828K4596k7516O4921M4593L10861N5251J62632L27312J92197
3889F989921N6823J81331R6675K37400L50623O6351J18916O3650L99414O16691
$$ plain form
3961 2854987 3117734 2896493 2905395 3112047 2867536 2897084 3180587 3034112 2879374 3229117
3951 3229117 3353322 3174535 3321205 3091395 2803600 2918915 3073277 3377599 3475430 3522185
3941 3522185 3441324 3239275 3137784 3228973 3388250 3209132 3448801 3454542 3543939 3454077 3405856
3930 3405856 3611193 3554843 3363805 3711145 3966631 4015135 4126026 4041678 3775082 3784383
3920 3784383 4039218 4280727 4284345 4643478 5019025 4678902 4428251 4459764 4395422 4607001
3910 4607001 4955940 5106396 5215819 5042520 4941127 5226753 5264491 5302623 5462270 5523121
3900 5523121 5582246 5835074 5859670 5832154 5897075 5941668 6252529 6307780 6470412 6797724 6989921
3889 6989921 7046744 7228075 7324750 7562150 7912773 7979124 8098040 8161690 8561104 9177795
3879I177795N05833M89233L74007M32668P12685L07567N78883Q66196P80483J380968
3869A5606318J125761L97861K32059k5542p46537l16880j85795n81619m40318
3860A5065308k86547m90294m91217k36236j45029K86896L51127k38139p9519J81041
3850A3917391M01894P15899P29996j12641L43751M63554K08460K01317O82879
3841A7552500K88827N21353Q97285M81568N05240L24325J97124K69181P34233
3832B1771636K60926K52318L38431K15052Q057k93232l26583j17877J17997l66612
3822B1860113n94200o09170l60175m92692k67794l1946K92443K23511J61454K98839
3812B0480383J60629j80112j73636k5593m6789N0410k17089N5851K12575L45848
$$ plain form
3879 9177795 9683628 10172861 10546868 10979536 11692221 11999788 12578671 13444867 14225350 15606318
3869 15606318 16732079 17129940 17361999 17336457 16589920 16273040 16087245 15505626 15065308
3860 15065308 14778761 14288467 13797250 13561014 13415985 13702881 14054008 13815869 13736350 13917391
3850 13917391 14319285 15035184 15765180 15652539 15996290 16459844 16668304 16869621 17552500
3841 17552500 17841327 18362680 19259965 19741533 20246773 20571098 20768222 21037403 21771636
3832 21771636 22032562 22284880 22623311 22838363 22846420 22553188 22226605 22108728 22226725 21860113
3822 21860113 21265913 20656743 20296568 19803876 19536082 19504136 19796579 20020090 20181544 20480383
3812 20480383 20641012 20460900 20287264 20261671 20214882 20265292 20048203 20104054 20316629 20662477
3802B0662477O685K64537K65472K87726K57444P0262L70006O93271P27345O07974
3792B4213199Q50228J045857J149398J148963R45365M67280K29800j3007m34097
3783B9602986m58197o01269j070280j366888n04525k46077j91895k07095l08216
3774B4648544l97606m077m3843O7273M31894K30718K95371K09518M80642N87283
3764B6505717N95852Q43900P12926R45564R75285J559786J484549J518133J203872
3755C6345584O02516J344401J760466J415099J350430J809273J294320J532204
3747D7454293J638656J478368J504728J570862J466296J762041K157025K148477
3739F1180746K421040K459220K310485K395939K517535K382154K287465J665397
$$ plain form
3802 20662477 20669162 20933699 21199171 21486897 21744341 21814603 22184609 22877880 23605225 24213199
3792 24213199 25063427 26109284 27258682 28407645 29353010 29820290 30050090 30037083 29602986
3783 29602986 29144789 28543520 27473240 26106352 25601827 25355750 25163855 24956760 24648544
3774 24648544 24250938 24246861 24203018 24270291 24702185 24932903 25228274 25437792 25918434 26505717
3764 26505717 27101569 27945469 28658395 29603959 30579244 32139030 33623579 35141712 36345584
3755 36345584 36948100 38292501 40052967 41468066 42818496 44627769 45922089 47454293
3747 47454293 49092949 50571317 52076045 53646907 55113203 56875244 59032269 61180746
3739 61180746 63601786 66061006 68371491 70767430 73284965 75667119 77954584 79619981
3731G9619981J260587J074057Q72693J45457m02302j182870k497870k863377l765625
3722G2260731m178281l861122l827775l658470k245343j591268r22273l74833
3714E1601366n49565m80263n25484j044116k107569k405919k990832l491924l097057
3705C4908637k477178k210033j721384j634892j261680j022222j033514o86457
3697B2861277p27701m22392q20910m63123j68230l96604l33159m26688l24269
3688A8778201j40475m79995p15773l46177n76908n99391k51877n19660l85051
3679A4762894p0250m28518k26335j03999o38776p08174k14484n2179j71816l21731
3669A1826632j63286j79229l33087m11817q0020P1914k40894o10653k44292k00152
$$ plain form
3731 79619981 80880568 81954625 82827318 82972775 82570473 81387603 78889733 76026356 72260731
3722 72260731 68082450 64221328 60393553 56735083 54489740 52898472 51976199 51601366
3714 51601366 51051801 50571538 50046054 49001938 46894369 44488450 41497618 38005694 34908637
3705 34908637 32431459 30221426 28500042 26865150 25603470 24581248 23547734 22861277
3697 22861277 22133576 21711184 20890274 20427151 20258921 19862317 19529158 19102470 18778201
3688 18778201 18637726 18157731 17441958 17095781 16518873 15919482 15667605 15147945 14762894
3679 14762894 14692644 14264126 14037791 13933792 13295016 12586842 12372358 12320179 12148363 11826632
3669 11826632 11663346 11484117 11151030 10739213 10659193 10731107 10490213 9879560 9635268 9435116
3659I435116m7579o9263j1503l27076l32194k90542k01421Q688j35592j09147
3649G919487j11037J58132J83688P921m33840J32471o327k34830J17815K25751
3639G959231j48014k5744j67543k36372L63417M5544q5348p1449J0805k42759
3629G401768J27588L16163j24513l42500M9288J10040n0664K49167m74786o0419
3619G201132k421J80415j23198K39597l2767j36817R0594K72845N12413K18842
3609H420635n9860n7350j57232q7582O13051L71485K06274n9212l28593j49879
3599H711737M93111K27138j16601J2392M333k32618j24995O5302p6356m4982K16200
3588I134661J22646K40553L15016k65454J5843M95638j05328L27899L92851J18151
$$ plain form
3659 9435116 9387537 9318274 9306771 8979695 8647501 8356959 8155538 8164226 8028634 7919487
3649 7919487 7808450 7966582 8150270 8158191 7724351 7856822 7850495 7615665 7733480 7959231
3639 7959231 7811217 7785473 7617930 7381558 7744975 7790519 7705171 7633722 7644527 7401768
3629 7401768 7529356 7845519 7721006 7378506 7427794 7537834 7487170 7736337 7261551 7201132
3619 7201132 7198711 7379126 7255928 7495525 7462758 7325941 7416535 7689380 8201793 8420635
3609 8420635 8360775 8303425 8146193 8058611 8671662 9043147 9249421 9190209 8861616 8711737
3599 8711737 9204848 9431986 9315385 9327777 9332110 9099492 8974497 9039799 8963443 8918461 9134661
3588 9134661 9257307 9497860 9812876 9547422 9563265 10058903 9953575 10281474 10674325 10792476
3578A0792476n3302O6149n8993L87555O19791J58951J14295m7682k4621J95215
3568A2149834M76297K41093J80081M46766M67299J82120N59618L70165M54027
3559A5527300M90609M47186L47698M89106R24761N24862N32928N47654P61168
3550B0593272J324049R26368J143751R64306Q24030Q68127N89291O84638O18946
3541B8536778j10351k00370k26391m00428r7745L13323N88824M65431M20387N89801
3531B9879259Q08846Q38786J246088R68511J227054J240296J427080J651193J956013
3522D1243126J823844J687349J739963J314013R68955O14069L22594N65626R01586
3513E1181125J062121J154951O96673M26366j39662j088235j618889j937589j757788
$$ plain form
3578 10792476 10739174 10805323 10746330 11133885 11753676 11912627 12026922 11979240 11954619 12149834
3568 12149834 12626131 12867224 13047305 13494071 13961370 14143490 14703108 15073273 15527300
3559 15527300 16017909 16465095 16812793 17301899 18226660 18751522 19284450 19832104 20593272
3550 20593272 21917321 22843689 23987440 24951746 25775776 26643903 27233194 27917832 28536778
3541 28536778 28426427 28226057 27999666 27599238 27501493 27814816 28403640 28869071 29289458 29879259
3531 29879259 30688105 31526891 32772979 33741490 34968544 36208840 37635920 39287113 41243126
3522 41243126 43066970 44754319 46494282 47808295 48777250 49391319 49713913 50279539 51181125
3513 51181125 52243246 53398197 54094870 54521236 54381574 53293339 51674450 49736861 47979073
3504D7979073j285422o84547o83122r2990N2912M70251P95123P24400R37979J076300
3494D9289957J169505J376304J580480J938195K574990K296734K802005K266079
3486F5294249J169354N75988m81852j608324k237860k444582k185322j454382
3478E6627269j345525j018132j285567j508826j591342j632998j102391o64688
3470D6477800m38817m61295j97931n5922M19833M53540Q14095J156598J206369
3461D9374270J183600J468977J943915K307287K833504K949167L365276L728709
3453F9154705L384923L304698L712281L357563L596661M407101N122677O732960
3445A02773569P870871Q270043Q461659Q226041O024941J738489m874366j2432034
$$ plain form
3504 47979073 46693651 46009104 45325982 45232992 45285904 45756155 46551278 47275678 48213657 49289957
3494 49289957 50459462 51835766 53416246 55354441 57929431 60226165 63028170 65294249
3486 65294249 66463603 67039591 66557739 64949415 62711555 60266973 58081651 56627269
3478 56627269 55281744 54263612 52978045 51469219 49877877 48244879 47142488 46477800
3470 46477800 46038983 45577688 45379757 45323835 45743668 46197208 47011303 48167901 49374270
3461 49374270 50557870 52026847 53970762 56278049 59111553 62060720 65425996 69154705
3453 69154705 72539628 75844326 79556607 82914170 86510831 90917932 96040609 102773569
3445 102773569 110644440 118914483 127376142 135602183 141627124 143365613 138491247 126059213
3437A26059213j6336084j4843280j2368700j0071767p412265o233932m757240
3430E4035945l532276l200799k834418k208833k480389k643124j988049j480423
3422C3667634j269551j314826r61114j065240j023543r04708q25844q73686p79698
3413B4649424o10476m05825k87231j52203o03581o33942o99582o06818k67961
3404B0381805l97274k60725l24944m30053o5829p8561l28418k55346j53117k90019
3394A7797519n5282R3883j53710L3710p4278L40517L21799O4924L64333N9225
3384A8792640j76316j01290K34722P77433L25348L74854N17409N17789M12356
3375B1674945Q06171O12138N39134P27624P44016R97318R01117J043453O60199
$$ plain form
3437 126059213 109723129 94879849 82511149 72439382 65027117 58793185 54035945
3430 54035945 50503669 47302870 44468452 42259619 39779230 37136106 35148057 33667634
3422 33667634 32398083 31083257 30122143 29056903 28033360 27128652 26302808 25429122 24649424
3413 24649424 24038948 23633123 23345892 23193689 22590108 21956166 21256584 20649766 20381805
3404 20381805 19984531 19723806 19398862 18968809 18902980 18824419 18496001 18240655 18087538 17797519
3394 17797519 17742237 17836120 17682410 17716120 17641842 17982359 18304158 18369082 18733415 18792640
3384 18792640 18616324 18515034 18749756 19527189 19852537 20227391 20744800 21262589 21674945
3375 21674945 22481116 23093254 23632388 24360012 25104028 26101346 27002463 28045916 28706115
3366B8706115K53923o0841l1068n20319j003120j250015j008685o26190n97187
3357B3862613o46965j41740k15144m66578L253K6203L52976L16026L10552J69671
3347B3570867K55761L58619K39713j23156K50328K28540J83495M73700O42408
3338B6080275L67084j88258j56703m02132n3166q2830L54409L27342N20459O00775
3328B7367255L58939M15447N10306J93094j51915O6752m3382k87577k60534n94073
3318B7574312n64954n75690n99155k52984N6114q8758n07787o02558o46737l20028
3308B3471775j04408R5162j63197k5132K43523L033j81399K1303k44642K04859
3298B3320877J04678k3179K50289J24913M7227K70471M33707M43768N30613N93950
$$ plain form
3366 28706115 28960038 28899197 28868129 28347810 27344690 26094675 25085990 24459800 23862613
3357 23862613 23215648 23073908 22858764 22392186 22395439 22421642 22774618 23090644 23401196 23570867
3347 23570867 23826628 24185247 24424960 24301804 24552132 24780672 24964167 25437867 26080275
3338 26080275 26447359 26259101 26102398 25700266 25647100 25564270 25918679 26246021 26766480 27367255
3328 27367255 27726194 28141641 28651947 28845041 28693126 28759878 28716496 28428919 28168385 27574312
3318 27574312 27009358 26433668 25834513 25581529 25637643 25548885 25041098 24438540 23791803 23471775
3308 23471775 23367367 23462529 23299332 23274200 23517723 23520756 23339357 23360660 23116018 23320877
3298 23320877 23425555 23402376 23652665 23777578 23824805 24095276 24528983 24972751 25503364 26097314
3288B6097314O57698P41135O44600M46146J01696j47957n25440q79897o19539
3279B6515756o81598n79237l93746n02543m25607l35910j46269k392L74073L60887
3269B4183414N77885M06800M22517M17366N77448N10027N55034O97982P02101
3260B9050574R08474Q78960J325771R89279J122851J515918J682946K274791K466271
3251D2215835K303945K743886L393218L653804L865973M553571M866000N923790
3243G3520022P016890P979945R851209J1376208J2274510J2683056J2283579J0963477
3235A57948896O843579n27518j0240076j6965223j8159914j5595464j2749493
3228I0554787r807675p148775n671905l848776k299882j474708j498219j275402
$$ plain form
3288 26097314 26755012 27496147 28140747 28586893 28688589 28540632 28015192 27135295 26515756
3279 26515756 25834158 25254921 24861175 24358632 23933025 23597115 23450846 23448454 23822527 24183414
3269 24183414 24761299 25168099 25590616 26007982 26585430 27095457 27650491 28348473 29050574
3260 29050574 29959048 30838008 32163779 33153058 34275909 35791827 37474773 39749564 42215835
3251 42215835 44519780 47263666 50656884 54310688 58176661 62730232 67596232 73520022
3243 73520022 80536912 88516857 98368066 109744274 122018784 134701840 146985419 157948896
3235 157948896 164792475 164264957 154024881 137059658 118899744 103304280 90554787
3228 90554787 80747112 73598337 67926432 64077656 61777774 60303066 58804847 57529445
3220E7529445p22287o66559j132624q03385n98284l45549k11071l64942o35402
3211E2049342p48271q30544j166115r34404r13406j170876j214473q48895o91052
3202D3531306q60101p60944p71942o09906k43694k65433n20169j10707k38404
3193C9150006j246441p95368r20011j017624m19257l52887m88576J08649O7624
3184C4086115J83210K20283L90288J72067k8122N05722P21279R96093J021594
3175C8268529J300883J233709J850291J717505J930387K915794L083264L378826
3167E5679188L863117L896245M737181N841296O518560P745190Q411273Q755541
3159A05447591Q427642O880373L206135k938275j0609896j3669652j1536248q882675
$$ plain form
3220 57529445 56807158 56140599 55007975 54204590 53606306 53260757 53049686 52684744 52049342
3211 52049342 51301071 50470527 49304412 48370008 47456602 46285726 45071253 44222358 43531306
3202 43531306 42671205 41910261 41138319 40528413 40284719 40019286 39499117 39388410 39150006
3193 39150006 37903565 37108197 36188186 35170562 34751305 34398418 33909842 34018491 34086115
3184 34086115 34269325 34489608 34879896 35051963 35023841 35529563 36250842 37246935 38268529
3175 38268529 39569412 40803121 42653412 44370917 46301304 49217098 52300362 55679188
3167 55679188 59542305 63438550 68175731 74017027 80535587 88280777 96692050 105447591
3159 105447591 113875233 120755606 123961741 121023466 110413570 96743918 85207670 76324995
3151G6324995n971635m141754k773721j703394j603118j489348j843251k421178
3143E4377596k549530k944521l252225k324348j893841k136240j068810o12002
3135C7596079n75216l99748q26989m39380L14204L19804O18240K26563L41225
3126C7174782N85212N30219M43541L26708M09478L06827P88877J608670K127235
3117D4301549K240663K381456K824807K921396K736655J585648j171884m837740
3109E2982550o659752n731927l481876k783074k337237j673467j390336j425454
3101B7499427n89876o30395q72526n07796l38945j85283j77777k18227o3780l15138
3091B3599684m10277o0388k41044J96338p1966l45170k61323j77247j96988j33294
$$ plain form
3151 76324995 70353360 66211606 63437885 61734491 60131373 58642025 56798774 54377596
3143 54377596 51828066 48883545 45631320 43306972 41413131 39276891 38208081 37596079
3135 37596079 37020863 36621115 35794126 35354746 35668950 35988754 36606994 36833557 37174782
3126 37174782 37759994 38290213 38733754 39060462 39469940 39776767 40565644 42174314 44301549
3117 44301549 46542212 48923668 51748475 54669871 57406526 58992174 57820290 52982550
3109 52982550 46322798 40590871 37108995 34325921 31988684 30315217 28924881 27499427
3101 27499427 26909551 26279156 25406630 24898834 24559889 24374606 24196829 23978602 23914822 23599684
3091 23599684 23189407 23129019 22887975 23084313 23012347 22667177 22405854 22228607 22031619 21898325
3081B1898325r9932m4993J58495L1510j07273N32843L57949K79485N86711P43602
3071B4336722O60119O02502P32652J003285J345403J570310J826304J920270K380250
3062C6377817K392296K230663K831735K370302J546947j84306k475251l435842
3054D1654361l433153k956133k032295j747070j299225r23778m98627r0402j36459
3045B8537219l52919l18217m39721m52807p6306K89077M04607L83256L87389K1915
3035B8383493K44931O63390N05210O36903J096704Q74869J136288J356380J357445
3026C6255613J457970R93313O09568j97951p73485r79132j575870j619298j796416
3017C2374312j531748j050578j011620o72918k66657o7664q6631O1123K02978
$$ plain form
3081 21898325 21798393 21753400 21911895 21943405 21836132 22368975 22726924 23006409 23593120 24336722
3071 24336722 24996841 25599343 26331995 27335280 28680683 30250993 32077297 33997567 36377817
3062 36377817 38770113 41000776 43832511 46202813 47749760 47565454 45090203 41654361
3054 41654361 38221208 35265075 33232780 31485710 30186485 29262707 28764080 28673678 28537219
3045 28537219 28184300 27866083 27426362 26973555 26897249 27186326 27590933 27974189 28361578 28383493
3035 28383493 28628424 29291814 29797024 30433927 31530631 32405500 33541788 34898168 36255613
3026 36255613 37713583 38706896 39316464 39118513 38345028 37365896 35790026 34170728 32374312
3017 32374312 30842564 29791986 28780366 28107448 27840791 27773127 27686496 27747619 27950597
3008B7950597K35630L31664L25849M37493J32853L96297L98436L52280O41495
2999C1202594O16112P36692M75294P56883P59477Q51910J064693J057307J016606
2990C8537568J105284J064450J006421J692821J224100J239604J716875J739942
2982D9327065J964206J731234J560287J654970J684491J802324K193426K091840
2974F4009843K549505K228352J813082K008068K093932K177895K332267K502517
2966H1715461K328172K268972K190103K210529K291973K031738J952078J868389
2958I8857415K172053K209032J465192J591839J573707J280245J314796J431573
2950A11895852J253412J131576M10462J02803N26212K21359j22112J96585k15956
$$ plain form
3008 27950597 28186227 28517891 28843740 29281233 29414086 29810383 30208819 30561099 31202594
2999 31202594 31818706 32555398 33030692 33787575 34547052 35398962 36463655 37520962 38537568
2990 38537568 39642852 40707302 41713723 43406544 44630644 45870248 47587123 49327065
2982 49327065 51291271 53022505 54582792 56237762 57922253 59724577 61918003 64009843
2974 64009843 66559348 68787700 70600782 72608850 74702782 76880677 79212944 81715461
2966 81715461 84043633 86312605 88502708 90713237 93005210 95036948 96989026 98857415
2958 98857415 101029468 103238500 104703692 106295531 107869238 109149483 110464279 111895852
2950 111895852 113149264 114280840 114691302 114794105 115320317 115541676 115419564 115616149 115400193
2941A15400193o27467o42802q37071o43465r99746j373644j542266j830444j704247
2932A05199041j814919k079611k156622j892011k245827k467645k294236k411579
2924H7836591k357302k690187k585715k458326k524953k341239k849373k448662
2916F7580834k025213k565664k380626j995885k365153k200746j716795k110355
2908E0220397k272478j908363k093299j743705j535550j656657j627707j419863
2900C5962775j442339j399322j425669j311289j099139j056770p89471q50440
2892B6588336q62028m25369q68195r45043p82886r31737K2741k88304m84340m39426
2882B0583749l96810m87600k40369k02088m97100l65168m25808k38826J50046
$$ plain form
2941 115400193 114772726 114129924 113292853 112649388 111649642 110275998 108733732 106903288 105199041
2932 105199041 103384122 101304511 99147889 97255878 95010051 92542406 90248170 87836591
2924 87836591 85479289 82789102 80203387 77745061 75220108 72878869 70029496 67580834
2916 67580834 65555621 62989957 60609331 58613446 56248293 54047547 52330752 50220397
2908 50220397 47947919 46039556 43946257 42202552 40667002 39010345 37382638 35962775
2900 35962775 34520436 33121114 31695445 30384156 29285017 28228247 27438776 26588336
2892 26588336 25726308 25300939 24432744 23487701 22704815 21773078 21795819 21507515 21023175 20583749
2882 20583749 20186939 19699339 19458970 19256882 18759782 18394614 17968806 17729980 17880026
2873A7880026p8806M5785J3686J2534N7401n8188J53081L2851J99767R9019J01337
2862A8458493J35929L39493J32136M6034L97730K83669M55887P57519M41644M20544
2852B1869078M89776L42942O62326N57927K80164J55109K146J37974o3787K2196
2842B4455851j67742m77567l12004R6557m9450j47484K41171j1300K05358K89580
2832B4122970K44422L80124N60904M25398N14007P90528R24836J017008J134997
2823C0115194R20925J107832J087771J330298J512265J673014J730240J571485
2815D1049024J591541J159702O64247L68129M6760l59669n24174r05558j241190
2806D1848812j271373j535174j457487p19506p69905n29677j62484k68260K15417
$$ plain form
2873 17880026 17801220 17847005 17860691 17873225 17930626 17872438 18025519 18058370 18258137 18357156 18458493
2862 18458493 18594422 18933915 19066051 19112085 19509815 19793484 20249371 21006890 21448534 21869078
2852 21869078 22358854 22701796 23364122 23922049 24202213 24357322 24359468 24497442 24433655 24455851
2842 24455851 24288109 23810542 23498538 23595095 23545645 23398161 23639332 23628032 23833390 24122970
2832 24122970 24367392 24747516 25308420 25733818 26247825 27038353 27963189 28980197 30115194
2823 30115194 31036119 32143951 33231722 34562020 36074285 37747299 39477539 41049024
2815 41049024 42640565 43800267 44464514 44832643 44879403 44519734 43995560 43090002 41848812
2806 41848812 40577439 39042265 37584778 36865272 36095367 35565690 35403206 35134946 35350363
2797C5350363k63926l78686J95361N64815Q82273R21675J351547J095010Q66395
2788D0584827Q93218R56237J468263J791085K215328K075671J761051J416614
2780E3162294J163518J045883L16445m07558q59385j444560j506853k040006k335781
2771D7093997k435434k171927k074179j563933j093491j564727p68123n42012
2763C4880171m98067n75088m34770l16233K9059J97770K81192K83236M67331O11250
2753C4925851O39032N30128J003772P71960P68259J193078P81985Q81818O51227
2744D2147110L82551j98023p08895j157051j426576j290092j637655j869341j822575
2735C2419453j518341j301790j298050o27709p02270p93242l69347n62807l27943
$$ plain form
2797 35350363 35086437 34707751 34903112 35467927 36350200 37271875 38623422 39718432 40584827
2788 40584827 41478045 42434282 43902545 45693630 47908958 49984629 51745680 53162294
2780 53162294 54325812 55371695 55688140 55280582 54421197 52976637 51469784 49429778 47093997
2771 47093997 44658563 42486636 40412457 38848524 37755033 36190306 35422183 34880171
2763 34880171 34382104 33807016 33372246 33056013 33085072 33282842 33564034 33847270 34314601 34925851
2753 34925851 35564883 36095011 37098783 37870743 38639002 39832080 40614065 41495883 42147110
2744 42147110 42529661 42331638 41622743 40465692 39039116 37749024 36111369 34242028 32419453
2735 32419453 30901112 29599322 28301272 27673563 26971293 26178051 25808704 25245897 24917954
2726B4917954m39118o85839j81143l752J89246M1923J21104k0545k54951j00872
2716B3584007l3829L01832R624K80746L97102K6723n611j00626k45529m80604
2706B3733835n05432o25178o47670m9401k90386j77991l54625m01092k62872l63662
2696B0055526q2514j95061J71132L45598R3707J28070J2238j0153P0252K91761
2686B0880556K43007K6216N1689J61666K95077L5164Q9703K82285p7085J59971
2676B2148249j69957J65992M30281N43836M60692j19602k9077J76972L19479K72093
2666B4198958K04010M19279K55928J55750K95895J34345J13960J7419M03171M58875
2656B6657590O17203P44903M51957J17388M72258L82135N03722O99947R86380
$$ plain form
2726 24917954 24478836 23792997 23611854 23608102 23797348 23839271 23960375 23939830 23684879 23584007
2716 23584007 23550178 23852010 23861634 24142380 24539482 24566205 24560594 24459968 24214439 23733835
2706 23733835 23228403 22603225 21955555 21906154 21615768 21437777 21083152 20682060 20419188 20055526
2696 20055526 19973012 19777951 19949083 20294681 20388388 20516458 20528696 20518543 20588795 20880556
2686 20880556 21123563 21149779 21201468 21363134 21658211 21693375 21783078 22065363 21988278 22148249
2676 22148249 21978292 22144284 22574565 23118401 23579093 23459491 23430414 23607386 23926865 24198958
2666 24198958 24402968 24822247 25078175 25233925 25529820 25664165 25778125 25795544 26198715 26657590
2656 26657590 27274793 28019696 28471653 28589041 29061299 29443434 29947156 30647103 31633483
2647C1633483Q86156O26006N21686N99151M21313P60411R45125J063641J319889
2638C8776861J306891J406047J129958J174606J426781J226265J596424J957521
2630E0001354K169496J984378K077729K205152J745826J701274J780070J575232
2622F5240511J694343J440641J243905J249618J217412Q40886P11396Q59224R52014
2613G5449950J070077R45571P73381P39072P38801M82148j23661K45873m3337
2604H0277875p04947l16528l70063m69262m19935m83608m56257l42317k25432
2595G6489526j60945l7388K6707J15329L06292O05441O27624L76854N54146P01348
2585G9604934O04211P54316Q89017J145623J027322J136992J668325J635655K106378
$$ plain form
2647 31633483 32519639 33145645 33667331 34266482 34687795 35448206 36393331 37456972 38776861
2638 38776861 40083752 41489799 42619757 43794363 45221144 46447409 48043833 50001354
2630 50001354 52170850 54155228 56232957 58438109 60183935 61885209 63665279 65240511
2622 65240511 66934854 68375495 69619400 70869018 72086430 72927316 73638712 74497936 75449950
2613 75449950 76520027 77465598 78238979 78978051 79716852 80199000 80075339 80321212 80277875
2604 80277875 79572928 79256400 78886337 78417075 77997140 77513532 77057275 76714958 76489526
2595 76489526 76328581 76291193 76317900 76433229 76739521 77344962 77972586 78349440 78903586 79604934
2585 79604934 80209145 80963461 81852478 82998101 84025423 85162415 86830740 88466395 90572773
2576I0572773K131826K324042K405135K897410K757844L286252L372937L319041
2568A13067260L949864M124066M312835M572358M541106M629560M780228N051718
2560A49028995M915043M948886N244015N261130N191642M807313N077827M835363
2552A89310214M432715M635711M535800M675505M479403M235475M282158M515962
2544B25102943M030840L574051L354941L291843K988994K739398K969969K567310
2536B50620289K504454K696290K444607K564907L186443K920571K807294L155360
2528B72900215L056103L225679L292806L485520L766140M307998M406244M999610
2520C03440315N332607N502387N733648N671587N241793N005419M379949L630453
$$ plain form
2576 90572773 92704599 95028641 97433776 100331186 103089030 106375282 109748219 113067260
2568 113067260 117017124 121141190 125454025 130026383 134567489 139197049 143977277 149028995
2560 149028995 153944038 158892924 164136939 169398069 174589711 179397024 184474851 189310214
2552 189310214 193742929 198378640 202914440 207589945 212069348 216304823 220586981 225102943
2544 225102943 229133783 232707834 236062775 239354618 242343612 245083010 248052979 250620289
2536 250620289 253124743 255821033 258265640 260830547 264016990 266937561 269744855 272900215
2528 272900215 275956318 279181997 282474803 285960323 289726463 294034461 298440705 303440315
2520 303440315 308772922 314275309 320008957 325680544 330922337 335927756 340307705 343938158
2512C43938158L145582K686324K212068J447836J450737J372305J555207K021445
2504C59829662K569292K303498K275491J796197R54459L29518j361758l068535
2496C65627824n107681p467550q782159r507229j0744578j0922787j0595749j0230648
2488B92269443r614666r132050q410187q060950p910495q048459p958355q424002
2480B24710279q846616r807474j0194021j0636759j0396386r943141r437808q531610
2472A46916464p775230p470091o860811n188298m466178m371366l957612l748489
2464A03078389l871435l108606k772252k580065k256589k429084k421984k023726
2456H1614648k223489k589875k255135k582175k169241j825236j933806j887446
$$ plain form
2512 343938158 347083740 349770064 351982132 353429968 354880705 356253010 357808217 359829662
2504 359829662 362398954 364702452 366977943 368774140 369728599 370058117 368696359 365627824
2496 365627824 360520143 353052593 344270434 334763205 324018627 313095840 302500091 292269443
2488 292269443 282654777 273522727 265112540 257051590 249141095 241092636 233134281 224710279
2480 224710279 215863663 206056189 195862168 185225409 174829023 164885882 155448074 146916464
2472 146916464 139141234 131671143 124810332 119622034 115155856 110784490 106826878 103078389
2464 103078389 99206954 96098348 93326096 90746031 88489442 86060358 83638374 81614648
2456 81614648 79391159 76801284 74546149 71963974 69794733 67969497 66035691 64148245
2448F4148245j849174j862893k495773j886857j230902j463030j445725j793156
2440E0120735j661889j555936j321255j252560j228079j421872j550799j250819
2432C8877526j168362j418533j207323j256730r04903o35648p97194q72541r25749
2423B9690543q18653p91396o76366n15069l03789l08947n98272o13874n70822
2414B4493355m02798j34302k12580k73124m35649l95941l35584l90868k79600
2405B1632909j88583m95607o85574l34301l94437k48437j54135j73240l15775
2396A8642820n35325l05631k86821p2518k25456l36774m55431j57488j10778j15467
2386A6041131m03037o33466l09757k48332j34151K45323R0497m49721n41665j54445
$$ plain form
2448 64148245 62299071 60436178 57940405 56053548 54822646 53359616 51913891 50120735
2440 50120735 48458846 46902910 45581655 44329095 43101016 41679144 40128345 38877526
2432 38877526 37709164 36290631 35083308 33826578 32921675 32286027 31488833 30616292 29690543
2423 29690543 28871890 28080494 27404128 26889059 26585270 26276323 25678051 25064177 24493355
2414 24493355 24090557 23956255 23743675 23470551 23034902 22638961 22303377 21912509 21632909
2405 21632909 21444326 20948719 20263145 19928844 19534407 19285970 19131835 18958595 18642820
2396 18642820 18107495 17801864 17515043 17442525 17217069 16880295 16424864 16267376 16156598 16041131
2386 16041131 15638094 15004628 14694871 14446539 14312388 14557711 14648208 14198487 13656822 13502377
2376A3502377R8947k40263j87890j01836m92454k65787r6951j44881p7905O4468
2366A2057825j51904k20772j05684j08128j46745j03392l03813j01422j0054O1034
2356A0866945p6773j15019l64181l72972j15909j04710n6865N7090K29445j33661
2346I813390l15059k77658j67643K9006q2164O3006n4950l07781J22822N7151
2336H880120l45735j2195o9399j81241j11128j91716l4604Q1086k6064j47795
2326G841329l0399n3961j65338k50802j04584J05875K12541J85738r7554j09710
2316G533135k48661k47151K84650O6446p6538J5936p7014M0240k52044j79738
2306F859261l8211l590p0382j15227K03227n1199J5248k02368k76563o5776K0940
$$ plain form
2376 13502377 13601324 13361061 13173171 13071335 12578881 12313094 12216143 12071262 11993357 12057825
2366 12057825 11905921 11685149 11579465 11471337 11324592 11221200 10917387 10815965 10805911 10866945
2356 10866945 10790172 10675153 10310972 9938000 9822091 9717381 9660516 9717606 9947051 9813390
2346 9813390 9498331 9220673 9053030 9082036 8999872 9062878 9007928 8700147 8822969 8880120
2336 8880120 8534385 8522190 8452791 8271550 8160422 7968706 7934102 8015188 7989124 7841329
2326 7841329 7810930 7756969 7591631 7340829 7236245 7342120 7554661 7740399 7642845 7533135
2316 7533135 7284474 7037323 7321973 7388419 7311881 7327817 7250803 7291043 7038999 6859261
2306 6859261 6821050 6817460 6747078 6631851 6835078 6783879 6799127 6596759 6320196 6254420 6275360
2295F275360Q5617n1219m6089l5936n5729l25485M9676j28408j29703j4687J00590
2284E723987K3177J00132j59947k4817q3242j16036J80618K7830K57445j07388
2274E821759l09285k70356N4156M8076J77155J4796l07119j0707J34518R251k2248
2263E339996k576l31846K656K27597J35163J99127N8675K5550j84608J12533p1190
2252E511077j8500k07924Q4178Q5989J68585K11933Q7641q912j45017m28746M45504
2241E785808J13180j71458L736o5326k2023r808o6634O1137J25628j15798r1423
2230E547019r3835K54045j18514k23507J50872J6892J43905l137n0618j61720
2220E461402J37784q0569r5527Q8513J6935J15889N2609L30099q62j86121k19895
$$ plain form
2295 6275360 6360977 6309758 6263669 6227733 6172004 5846519 5896195 5767787 5638084 5623397 5723987
2284 5723987 5747164 5847296 5687349 5662532 5579290 5463254 5643872 5671702 5929147 5821759
2274 5821759 5512474 5242118 5296274 5344350 5521505 5536301 5229182 5218475 5352993 5362244 5339996
2263 5339996 5337420 5005574 5008230 5235827 5370990 5570117 5628792 5654342 5469734 5582267 5511077
2252 5511077 5492577 5284653 5368831 5454820 5623405 5835338 5922979 5914067 5769050 5340304 5785808
2241 5785808 5898988 5727530 5731266 5665940 5643917 5634109 5567475 5628612 5754240 5638442 5547019
2230 5547019 5453184 5707229 5588715 5365208 5516080 5532972 5676877 5673740 5623122 5461402
2220 5461402 5599186 5518617 5423090 5511603 5528538 5644427 5697036 6027135 6026273 5840152 5620257
2209E620257J57234j00525J39162J63395j96016l5955p8987n114J54244O5717
2199E883412k73761J90862l4133o1106M19933K39616K3188r0553j44642j67315
2189E985501J5140J78579J57709m35861M9422R1475r9343J29547J62216l74004
2179E860381n4685j49141j67951J09342k8055M6848J03788j25935l70853j66372
2169E057367r9968m77563k52430J42241J68738q1665J37100R9352r1040r5925
2159D506207k44126m99816p8008k3209k05073K29575L34557l6195k86123j25153
2149C572636J75746n8476J36663J86122J24432K97493J19037Q3461L08677J76428
2139E122219k98110k19874k06943k59151j42789m01500j03008K3781l38363j42727
$$ plain form
2209 5620257 5777491 5676966 5816128 5979523 5783507 5747552 5668565 5663451 5817695 5883412
2199 5883412 5609651 5800513 5766380 5705274 6125207 6364823 6388011 6297458 6152816 5985501
2189 5985501 6000641 6179220 6336929 5901068 5950490 6041965 5942622 6072169 6234385 5860381
2179 5860381 5805696 5656555 5488604 5597946 5569891 5616739 5720527 5594592 5223739 5057367
2169 5057367 4957399 4479836 4227406 4369647 4538385 4456720 4593820 4693172 4602132 4506207
2159 4506207 4262081 3762265 3684257 3661048 3455975 3685550 4020107 3983912 3697789 3572636
2149 3572636 3748382 3689906 3826569 4012691 4137123 4434616 4553653 4637114 4945791 5122219
2139 5122219 4824109 4604235 4397292 4138141 3995352 3593852 3490844 3514625 3176262 3033535
2129C033535J84259k7628j76321l33851M876J98215l12225j24744J01183k2445
2119B524854Q5933J19846j76310M6440l8474L3067K20711K09831R309p9287j01134
2108B854786J63170J60883j46188l3960J08001k0916k11046k44276r6207r6983
2098B437264j15125m6242J25076r5306q9130j66576R5524P3345K8368N3128j13623
2087B186703k09015P7822J01838n5561J26977m6072k59934k6613p4297j81224
2077A640624o8199K38592K47336q6171j55188P8076o1228k48864o7881J37074
2067A654171m6P0506J13363K64652p0332k09488O481J10206k07860k85109K44543
2056A691087K27270K08508K86172p5992l38363k17840k45384j80042j7110J53158
$$ plain form
2129 3033535 3217794 3190166 3013845 2679994 2684870 2883085 2570860 2446116 2547299 2524854
2119 2524854 2610787 2730633 2554323 2600763 2562289 2595356 2816067 3025898 3035207 2955920 2854786
2108 2854786 3017956 3178839 3032651 2998691 3106692 3085776 2874730 2630454 2534247 2437264
2098 2437264 2322139 2275897 2400973 2305667 2216537 2049961 2145485 2218830 2247198 2300326 2186703
2087 2186703 1977688 2055510 2157348 2101787 2228764 2182692 1922758 1896145 1821848 1640624
2077 1640624 1572425 1811017 2058353 1972182 1816994 1895070 1833842 1584978 1517097 1654171
2067 1654171 1654125 1724631 1837994 2102646 2032314 1822826 1829307 1939513 1731653 1446544 1691087
2056 1691087 1918357 2126865 2413037 2337045 1998682 1780842 1535458 1355416 1338306 1491464
2046A491464k96780K19346K45007l4064k4779l4834m5218P610J00806l124K09340
2035A834774J12534m11125m1209L25614K8178j02809J50193r1291j87339L8435
2025A655955j51996k70690O6182R6625k59194K82538K88473r7424k60761r0744
2015A258964J1383r309k3460L2421j22760J32089J81918J53086R7733l02570K2247
2004A431742p3757N4749K22670j08095j84171J33918j37373k7472k20481r6430
1994I95300J54349O8961R3605j52627l7365k16448K9984j58530k1145J59761K60603
1983A176448P959j47910N9724j47256J0608N1362r395J71951j49780m2896K20023
1972A200838P4332J52055j50439p8107j9979n7070j51405J36179m8615Q828M0319
$$ plain form
2046 1491464 1194684 1414030 1659037 1624973 1600194 1565360 1520142 1527752 1628558 1625434 1834774
2035 1834774 1947308 1536183 1494974 1820588 1848766 1745957 1896150 1804859 1617520 1655955
2025 1655955 1503959 1233269 1299451 1396076 1136882 1419420 1707893 1610469 1349708 1258964
2015 1258964 1270347 1261038 1237578 1269999 1147239 1279328 1461246 1614332 1712065 1409495 1431742
2004 1431742 1357985 1412734 1635404 1527309 1343138 1477056 1339683 1312211 1091730 995300
1994 995300 1149649 1218610 1312215 1159588 1122223 905775 935759 777229 756084 915845 1176448
1983 1176448 1184407 1036497 1096221 948965 959573 1010935 1001540 1173491 1023711 980815 1200838
1972 1200838 1275170 1427225 1276786 1198679 1178700 1121630 970225 1106404 1057789 1066617 1106936
1961A106936j28520M8762Q8654k52031r2001J58501J3446j02891K07921O8173
1951A116950k43555k5838q2865J68686J36417J07076J2078m9092k1466j33479
1941I84912n3589J53328M8178j09727Q6992j96132j29072J92987J12443r8008
1931I92312o9811l11623j54999J05967j2321K32527J27527L36961m6745k76317
1921I23478j33325l9974J16818j26649J4509j3538J4149K15507O287j14434j09961
1910G52867k3539k2048K10237J15955k02140l41817j84321K49184J05977K11285
1900H71640J44219j19177J39219j87901q1388K13287k77921k08704K43774K05730
1890I42778P6204J38621j22048k08447m2350k8651J5074l52551l7634O9483j07850
$$ plain form
1961 1106936 978416 1027178 1115832 863801 771800 930301 943747 840856 1048777 1116950
1951 1116950 873395 847557 764692 933378 1069795 1176871 1188949 1139857 1118391 984912
1941 984912 931323 1084651 1132829 1023102 1110094 913962 784890 977877 1090320 992312
1931 992312 922501 610878 455879 561846 549525 782052 909579 1246540 1199795 923478
1921 923478 790153 750179 866997 740348 754857 741319 755468 970975 977262 862828 752867
1910 752867 729328 707280 917517 1033472 831332 489515 305194 554378 660355 871640
1900 871640 1015859 896682 1035901 848000 766612 979899 701978 493274 737048 942778
1890 942778 1018982 1157603 1035555 827108 784758 756107 771181 418630 380996 450479 342629
1879C42629L22115R1715j49731R521p291K389J04939J41572j14269j33212p529
1868F02848J4834K40140Q7464p0157L32611J30399k88266q8558j28902L5947l9748
1857H28612J82896M14432m9485j93529l8162j64086j61357K03547p4386M5383
1847I93865P4607j16675m2168M7471l4350k81721J2949J02500Q1890L3809j21492
1836G50685j32281J9082p0568J19619J53767K08147j68602j64117J93009R3101
1826A001842O3551L5243j15008p8087K04458m22467r7760K33456N5966j77365
1816G03829k02465R4240m1832j28780K75436J15241k76759j13162J7158O3079
1806E05985K20138j09330l5114O7802p9662J64988J87933L3288q6344j59678o7885
$$ plain form
1879 342629 664744 756459 606728 616249 608958 611347 716286 857858 743589 610377 602848
1868 602848 617682 857822 945286 875129 1207740 1338139 1049873 961315 832413 868360 828612
1857 828612 1011508 1425940 1376455 1182926 1144764 980678 819321 1022868 948482 993865
1847 993865 1068472 951797 909629 957100 922750 641029 653978 756478 838368 872177 750685
1836 750685 618404 637486 566918 686537 840304 1048451 879849 715732 908741 1001842
1826 1001842 1065393 1100636 985628 907541 1111999 689532 591772 825228 881194 703829
1816 703829 501364 595604 553772 424992 700428 815669 538910 425748 442906 505985
1806 505985 726123 616793 581679 649481 569819 734807 922740 956028 869684 710006 642121
1795F42121j44318N1986K92978n5029J64582n8902j77793o8381j82605R326K1691
1784D95656K86898L3178j95961j60979l6384J47020J18672J27422q3647k23575
1774E08300j21216k4043l2791K11756M4493j57073K08760J49764j90888N1036
1764F48098j84856m4740p9814J5790P9450Q8205J02123l36525j69470N4121K49604
1753D21986k1981j35563n3096j72793o0383K22229L15513L82285k37783m73288
1743A87126J45274j50501n0172J95314K64184j96628j73810K3897N0865J33119
1733D28668K07872k76622m09217L26443J60405o4197l2791k3170l13833j72873
1723a69315J68111K77120J05709k00776k06350J89644K12528J4523M3060k38268
$$ plain form
1795 642121 497803 549789 842767 787738 952320 893418 715625 647244 464639 473965 495656
1784 495656 782554 815732 619771 458792 422408 569428 688100 815522 731875 508300
1774 508300 387084 363041 330250 542006 586499 429426 638186 787950 597062 648098
1764 648098 463242 418502 338688 354478 433928 522133 624256 287731 118261 172382 421986
1753 421986 400005 264442 211346 38553 -21830 200399 515912 898197 660414 187126
1743 187126 332400 181899 131727 327041 591225 394597 220787 244684 295549 428668
1733 428668 636540 359918 -49299 277144 437549 373352 340561 317391 3558 -169315
1723 -169315 -1204 275916 381625 180849 -25501 164143 376671 391194 434254 195986
1713A95986L6815J39335o6760M1191j38900m4741n9232Q3905M3938J18588j08289
1702B41836j7114K441k27861J06346K36107l22023K03339K34409K8225K6257k93603
1691B18359n1841l25179o0859L75548L40742J49455j48582j96195J23905L7667
1681D63020k28551j55964k05967n8016J97792O4291J40375L6291n9806P812J00298
1670C01575R1930j27216k05581q773P4323Q852q6862J31562k00025R1718J92188
1659B63691p7215L65691k3854m08524k69541J08454J36302K44760K23964j13587
1649D50141j37964j54922l43714q5258K40013n80101l944K73355L77360L44026
1639C78992J74646k07462m43301j08569N1744K38415J72250o9715k46886j30960
$$ plain form
1713 195986 232801 372136 305376 346567 207667 162926 103694 187599 231537 350125 241836
1702 241836 224722 227163 -698 105648 341755 19732 223071 457480 485705 511962 218359
1691 218359 166518 -158661 -219520 156028 496770 646225 497643 301448 425353 463020
1681 463020 234469 78505 -127462 -185478 12314 76605 216980 253271 193465 201277 301575
1670 301575 393505 266289 60708 51935 126258 135110 48248 179810 -20215 71503 263691
1659 263691 186476 552167 528313 119789 -149752 -41298 95004 339764 563728 450141
1649 450141 312177 157255 -186459 -271717 -31704 -611805 -615749 -342394 34966 378992
1639 378992 553638 346176 -97125 -205694 -153950 84465 256715 187000 -59886 -190846
1629a90846J13406J86676r9398l762P2237o5551J13676K38215l63967l07846k49676
1618e56836P3915K64939J67776P9046j37611k8530k63389K0L35794J61514M2802
1607A39440R4509K90357M4831j20015l71811m04584l724L12912M52889K33682
1597F68486q5449m69233n10472R1696P1172J61076K43405j06939l158J43914Q6639
1586B91137j1560j11830p2822k97242J8572J53542Q3288O9451K58214q1991k71937
1575B6822q4442K41677o353m1254K7500l15885J82337J68361q9829N7120j27852
1564C8202m84046L4710L73303L92757N6387j33224K4362r9944P368p0849j26489
1553A2537J31201K30271k11737j1196j734k07870j44164j31926K1374J43484L42236
$$ plain form
1629 -190846 -77440 109236 9838 6076 78313 12762 126438 364653 686 -307160 -556836
1618 -556836 -482921 -217982 -50206 28840 -108771 -137301 -400690 -400670 -64876 96638 139440
1607 139440 233949 524306 569137 449122 77311 -327273 -330997 -18085 434804 668486
1597 668486 583037 113804 -396668 -304972 -233800 -72724 170681 63742 60584 204498 291137
1586 291137 279577 167747 94925 -202317 -183745 -30203 53085 122536 380750 298759 26822
1575 26822 -57620 184057 177704 136450 163950 -151935 30402 198763 108934 166054 38202
1564 38202 -445844 -411134 -37831 354926 411313 278089 302451 202507 209875 139026 12537
1553 12537 143738 374009 162272 151076 149342 -58528 -202692 -334618 -313244 -169760 172476
1542A72476n5534k51347l1834N5337J1108K17950Q8528j36299q2820o8601Q6411
1531E375n2699L18139K8041p4302K31410l1571K15411l8795k48235j87539j36678
1520B8557p4088M8980m4679J8439O445j91922l6034K57273j03954J63621l4552
1509C8086p2315j68537R5924K35951J87841Q0646l22389j63761J47775L13590
1499C72811k53156L2446K47934l31105j9719L14889M4020Q6217j39946p58923
1489d04532j64387M15902Q6693Q5046L3472m72343m3771K44046J40976Q1038j75709
1478a73569k1182J42315J8599J30212k52356j34045Q858m7670L92815L16597j84122
1467A96452j40296j59953o3578K08734J67665R1585j73766k42810j78122J57167
$$ plain form
1542 172476 116942 -134405 -166239 -110902 -99794 118156 206684 70385 -12435 -81036 5375
1531 5375 -47324 270815 298856 224554 455964 424393 639804 601009 352774 165235 28557
1520 28557 -45531 3449 -41230 -22791 -16346 -208268 -244302 12971 -90983 72638 38086
1509 38086 -34229 -202766 -106842 129109 316950 397596 75207 -88554 59221 372811
1499 372811 119655 152101 400035 68930 49211 364100 408120 494337 354391 -404532
1489 -404532 -568919 -153017 -66324 18722 52194 -420149 -463920 -219874 -78898 2140 -173569
1478 -173569 -194751 -52436 -33837 96375 -155981 -290026 -281168 -328838 63977 380574 196452
1467 196452 56156 -103797 -167375 41359 209024 300609 126843 -115967 -294089 -136922
1457a36922K57348K79230l36703k80415k33893m6445j604L94275J69748j64533
1447i9914J7376K01861k63679r097k21797k10604L60147J49892R6311N5315J65740
1436B41551j68220n3562L03372J20172L3306K2817m78858m76729J85465L1604
1426b39082L50533L49219j72653k56649O814L6021n6177o9882j19909J27839r4467
1415a38393J97271R0092j06398p9273j62063j92462J59402k4588O0544O5207m3680
1404a74341K24309K51847J70179j84062j76560k01935k05406K01243J91313r8625
1394b038q2967L1847j87703k6395Q7371j85117j91909M78022n6791J32669n8364
1383f1375l35208J32357J43790r1444J9514P5267j86629K45532p8350J65967K17499
$$ plain form
1457 -136922 120426 399656 62953 -217462 -451355 -497800 -499404 -105129 64619 -99914
1447 -99914 -82538 119323 -144356 -153453 -375250 -585854 -225707 -75815 20496 75811 241551
1436 241551 73331 19769 323141 443313 476619 499436 20578 -456151 -270686 -239082
1426 -239082 111451 460670 288017 31368 38182 74203 18026 -51856 -171765 -43926 -138393
1415 -138393 58878 148970 42572 -36701 -198764 -391226 -231824 -256412 -195868 -130661 -174341
1404 -174341 49968 301815 471994 287932 111372 -90563 -295969 -94726 96587 -2038
1394 -2038 -85005 -53158 -240861 -267256 -179885 -365002 -556911 -78889 -135680 -3011 -61375
1383 -61375 -396583 -264226 -120436 -211880 -192366 -117099 -303728 -58196 -136546 29421 246920
1372B46920j06189r3988M7572k68941L6221Q5066L4677J19329k17899J02638j65021
1361a79615P973J63719K3205P7144K0473J42274k67452q5294l11358J22193J77180
1350a09558K80823J50175k7664k38297r5667N0124M640L6827l9737r6537j17268
1339b02139l2772m5358J16072q4210L12800j10911J88450K9870k63087j58164
1329b49449j21918J10260M69662J44881J7662L5648n98311l05554J36091l2301
1319c93329N9320K85978m3044J45653l6682l64757J41427K0805j00073K5145J88794
1308g0763O287m8705o8838m8132Q8450j95803J88996J50027L5744o2749K3484
1297b002J31018J55115l38983p6367J22605J14125L89800k07754k6086j18766
$$ plain form
1372 246920 140731 46743 94315 -174626 -138405 -53339 -18662 100667 -117232 -14594 -179615
1361 -179615 -171642 -7923 15282 92426 112899 255173 -12279 -97573 -408931 -286738 -109558
1350 -109558 171265 321440 293776 55479 -40188 9936 14576 51403 11666 -84871 -202139
1339 -202139 -234911 -280269 -164197 -248407 64393 -46518 141932 171802 -91285 -249449
1329 -249449 -371367 -261107 208555 353436 371098 406746 -191565 -497119 -361028 -393329
1319 -393329 -334009 -48031 -91075 54578 17896 -346861 -205434 -184629 -284702 -259557 -70763
1308 -70763 -64476 -113181 -182019 -230151 -141701 -337504 -148508 1519 37263 -25486 -2002
1297 -2002 129016 284131 -54852 -131219 -8614 105511 495311 287557 261471 142705
1287A42705j47281o9486L32307l24569O3188K3028q9871R3307j27266k53198j28478
1276d85614K43788N6979k6815q6995J73243p0066n2084m4825q857J86971K39321
1265A25046O3973J17395J74496p5983j48049j09012k4340P6197L36156J13535
1255F49414q9791k94315k35312J46629m9895K91475p0621l52569j2918o272n6655
1244h0830j2754L082P2226J5654r0257p1637j6437J9663Q447j05636K05841K03512
1232A50874o1072J15696k05883j68728R7028J12751J49931j37193n1080j75353
1222a73029J9432J01815L03651n1016L6620j70136j20137j27948K6804J28912
1212b5032j33205R2916j69114k13570O1466N3969J9779l9224p4714L41433J33914
$$ plain form
1287 142705 -4576 -74062 258245 -66324 -3136 19892 -69979 23328 -103938 -357136 -485614
1276 -485614 -241826 -184847 -211662 -298657 -125414 -195480 -247564 -292389 -301246 -114275 125046
1265 125046 189019 306414 480910 404927 256878 147866 123526 199723 535879 649414
1255 649414 559623 265308 29996 176625 126730 418205 347584 -4985 -17903 -24175 -80830
1244 -80830 -93584 -90502 -18276 -2622 -92879 -164516 -180953 -161290 -152843 -258479 -52638 150874
1232 150874 89802 205498 -385 -169113 -72085 40666 190597 53404 2324 -173029
1222 -173029 -153597 -51782 251869 200853 237473 67337 -52800 -180748 -153944 -25032
1212 -25032 -158237 -65321 -234435 -448005 -386539 -332570 -312791 -352015 -426729 -85296 48618
1201D8618R0080j9107n2647j4363J04048P5162J31877l2181j13323l8368K39349
1190D19145L493n3996K5349o9365j65888J28560J85184l62786K1514j73075k90041
1179c31906K45732J96360k29659j25462J13568j52165K96842L09925k82982J8463
1169E8716L01491l15778K3794L19085k10916p3010J99342m3300P27R593l30839
1158f1095j89621K97843J90367L0186J17735J41307k04114k57639p1323j0264
1148a6618P3131J30094N218O621k0174n6224p1525k3612K49055q0048M1709R6547
1136C34174l4032l17066M7272J44110j30220J31347J4779j04005J56956K61999
1126E05314l41293l12819K03706J47346L15411L32855K8515j67528l51834k30479
$$ plain form
1201 48618 138698 119591 66944 52581 156629 231791 363668 331487 218164 179796 419145
1190 419145 422638 368642 393991 324626 158738 287298 472482 109696 131210 -41865 -331906
1179 -331906 -86174 110186 -119473 -244935 -131367 -283532 13310 323235 40253 58716
1169 58716 360207 44429 68223 387308 176392 103382 302724 259424 260151 269744 -61095
1158 -61095 -250716 47127 237494 267680 385415 526722 322608 64969 -6354 -16618
1148 -16618 56513 186607 191825 198446 178272 122048 50523 26911 275966 195918 237627 334174
1136 334174 300142 -16924 30348 174458 44238 175585 190364 86359 243315 505314
1126 505314 164021 -148798 54908 202254 517665 850520 879035 711507 359673 129194
1116A29194j2511J78154J17795k5211m3361p2022K34835J21432j33954j72058
1106C22293l54651k9148Q6397K13934K12759k09940j48314L8200J41461j61324
1096A11667J06186K52603j4010P7224L67124l5037M501J69002r0836l21420J98784
1085H25788k785j30672j0320k53847n1967K11598o8661J11661J80273p1295O5637
1074H05410J84449j3901k23133J08944j73837j85431L54742L30129j21455p9583
1064I86334k48494J0983K09420P2891P4740p1050O6955L25626l0026k14523p2791
1053A110065J7808k18602J31198J35540J59726J44353j3420l61569K2919K8808
1043A156826o5110J66484J16676r8888J52121O7802l8728J98863j79816l78665
$$ plain form
1116 129194 116683 294837 412632 387421 344060 272038 506873 628305 494351 322293
1106 322293 -32358 -61506 24891 238825 451584 241644 93330 131530 272991 111667
1096 111667 217853 470456 456446 533670 900794 865757 870258 1039260 948424 627004 825788
1085 825788 823003 692331 682011 428164 376197 587795 519134 630795 811068 739773 805410
1074 805410 989859 975958 752825 861769 687932 502501 857243 1187372 1065917 986334
1064 986334 737840 748823 958243 1031134 1105874 1034824 1101779 1427405 1397379 1182856 1110065
1053 1110065 1127873 909271 1040469 1176009 1335735 1480088 1466668 1105099 1128018 1156826
1043 1156826 1091716 1258200 1374876 1275988 1428109 1495911 1457183 1656046 1476230 1097565
1033A097565J30888O37619N5158k66582L34165l3656k07024L32824L4593m08808
1023A706742j3450K42931J53627K32413J46549k10380j09248K1701O1686j78834
1013B053737K56436L00585Q8466P7868J33616J70423M7886n9631K7050M88200
1003C584636M06998N8238K18674J81209j94306K45793M89643O10398L05288J28778
993F035349K90539J84616M79294O87249M28731J084164J246121R34656L67472
984A1738191P98877Q43286J117692J511409J899140K291866K673332L636670M572674
975C1083137M374769M645614N677327N410455N027545J674434j0884447j2690122
967C4318712p861627n221325l013597k592725j832143j527306r07432j125105
$$ plain form
1033 1097565 1228453 1866072 1921230 1654648 1988813 1955157 1748133 2080957 2115550 1706742
1023 1706742 1693292 1936223 2089850 2322263 2468812 2258432 2149184 2170885 2232571 2053737
1013 2053737 2310173 2610758 2699224 2777092 2910708 3081131 3129017 3069386 3096436 3584636
1003 3584636 3991634 4049872 4268546 4449755 4255449 4501242 4990885 5601283 5906571 6035349
993 6035349 6325888 6510504 6989798 7677047 8105778 9189942 10436063 11370719 11738191
984 11738191 12537068 13380354 14498046 16009455 17908595 20200461 22873793 26510463 31083137
975 31083137 35457906 40103520 45780847 51191302 56218847 57893281 47008834 34318712
967 34318712 26457085 21235760 18222163 15629438 13797295 12269989 11362557 10237452
959A0237452q45581n87817k25377n28005j03570n12803p50944l22855m20704o03248
949E336548r1351l58918n06837o5580k67799k64763l5341k96883K5439l13812
939C160703k81745k85044J1047J68515l74001j74680J85083o4431P3733k91170
929B128010m66241l06023k18958k4044M59293M2133m8540n9569k41833J21247
919A385475P8679m51862j3819K89669K40177j65513j7323q3694k22226j06754
909I32809l34665q2873Q5573o3420J79181K03302j6141k29722j06228K26318r3618
898G00516l5591J10434P0016J1701j24963j63683K33466j03356k55214J00429
888E43755j25493J54971L72357k97650j3149J22504j49720q5884J52411r6744
$$ plain form
959 10237452 9391871 8804054 8578677 8050672 7947102 7434299 6683355 6360500 5939796 5336548
949 5336548 5245197 4886279 4379442 4313862 4046063 3781300 3745959 3449076 3474515 3160703
939 3160703 2878958 2593914 2604961 2773476 2399475 2224795 2409878 2345447 2419180 2128010
929 2128010 1661769 1355746 1136788 1112744 1572037 1614170 1565630 1506061 1264228 1385475
919 1385475 1464154 1012292 998473 1288142 1528319 1362806 1345483 1261789 1039563 932809
909 932809 598144 515271 600844 537424 716605 919907 903766 674044 567816 794134 700516
898 700516 664925 775359 845375 857076 732113 568430 801896 698540 443326 543755
888 543755 418262 573233 945590 647940 634791 757295 607575 521691 674102 577358
878E77358l22568j83918J72751Q2546J97250j54925l91638K73522J04951k81052
868G4277J52636K09024l64310J53153Q3569j66281K23220N0291k29948N3365J71621
857D10617m5588J07085j6643j38580j28553p0223K58815J57894k30332j21069
847A83423k36365l2125q694L7731K84981j12847m8387m6119n0233o268J35091
836A00188m0632k4803M8954R2901L14022k45037L8169J88271k35721m9937J00430
825B86805j04915K9698j4157J8765J25525k52420k88126j6856K3297p6504N36689
814B67801R1120j07598L4019j38032J08555k68200q348R6636O6168J36456J91623
803D70200l05210r9939M2410j80804L6767J47017k19600N7684j14764j49834K83826
$$ plain form
878 577358 254790 70872 243623 326169 523419 368494 -23144 250378 355329 74277
868 74277 226913 435937 71627 224780 308349 142068 365288 415579 185631 238996 410617
857 410617 365029 472114 455471 316891 188338 118115 376930 534824 304492 183423
847 183423 -52942 -85067 -93761 -56030 228951 116104 67717 21598 -28635 -34903 100188
836 100188 59556 34753 83707 176608 490630 245593 283762 472033 236312 186375 286805
825 286805 181890 211588 197431 216196 341721 89301 -198825 -215681 -192384 -268888 267801
814 267801 358921 251323 285342 147310 255865 -12335 -20683 75953 142121 278577 470200
803 470200 164990 65051 107461 -73343 -36576 110441 -109159 -51475 -166239 -316073 -32247
792c2247J3114R4832k09184l08148N94K67916L068J3040j03993J41429J73072
781E3493j97362L19577K26460l25861r7044R5687K4554N5815j33040j15107k00455
770b93283J68284J57897l05912j7167O0806k9350L2090R4889m4672n8521j25037
759c59976k89025K86822O9570n5982L64810J19939k43635J66046M4132j10380
749g679J48287Q8279K6067N6777P1200j43646k28658j46063J93759J08314O6935
738B33572j0537k41461j44275l22779j44266K44997q9719K1727M63491r6414j95157
727b80821K43381j95589k29325K66446j9688J53604L70042J25377M8352k44264
717B37515j13518j13156J70581j20688J00024J27764j55221j30013K37615J01336
$$ plain form
792 -32247 -19133 75699 -133485 -441633 -441039 -173123 -170055 -157015 -261008 -119579 53493
781 53493 -143869 175708 402168 76307 -20737 74950 99504 155319 22279 -92828 -293283
770 -293283 -124999 32898 -273014 -290181 -229375 -258725 -226635 -131746 -176418 -234939 -359976
759 -359976 -649001 -362179 -292609 -348591 16219 136158 -107477 58569 102701 -7679
749 -7679 140608 228887 254954 311731 382931 239285 10627 -135436 58323 166637 233572
738 233572 223035 -18426 -162701 -485480 -629746 -384749 -474468 -452741 10750 -85664 -280821
727 -280821 -37440 -233029 -462354 -195908 -215596 -61992 308050 433427 481779 237515
717 237515 123997 10841 181422 60734 160758 288522 133301 3288 240903 342239
707C42239m68089k83521j22120J4254L78571J34583j90405m5907l8486Q2359j32099
696c28621l3726M17267p4548r5086J37920L91847j0027J33146q3102j38251k7197
685B89622j47861K0222l6304J43986L94584j93776k83415k31482k73869J598k12381
674e29076L20841K21414J36172J0798N5996m5097m42556o9726l5421Q3534J04558
663a88563J66077M3586j90508J16116k7282R6254l6124o2649J76761R9858J42101
652C35627L8753l41029j91258j61307j22576J31998L35163J9971P7239j52837
642c0256j57146j28531o0991K16133j61367k568M24054j02445o6010K5046j15744
631a59825j51962N1421m2466l8836L09768J38997j82083K50454o7099j14275K18924
$$ plain form
707 342239 -125850 -409371 -531491 -517237 -138666 -4083 -194488 -240395 -278881 -196522 -328621
696 -328621 -362347 54920 -19628 -114714 23206 415053 405026 538172 455070 316819 289622
685 289622 141761 161983 125679 269665 664249 470473 187058 -44424 -318293 -316695 -529076
674 -529076 -208235 13179 149351 160149 216145 171048 -271508 -341234 -376655 -293121 -188563
663 -188563 -22486 21100 -169408 -53292 -80574 15680 -20444 -83093 93668 193526 335627
652 335627 374380 33351 -157907 -319214 -441790 -309792 25371 45342 122581 -30256
642 -30256 -187402 -315933 -376924 -160791 -322158 -324726 99328 -3117 -69127 -44081 -159825
631 -159825 -311787 -260366 -302832 -341668 -31900 107097 -74986 175468 108369 -5906 213018
620B13018m1482r6023k6498R5588r5009R977n6773k25424j94134J41375K00176
609g5209N5816k6120m6270j80864O6981p1431n8657J9348J22627L02247L904J07750
597B20122k41381k64524q5055J30725N7066J99287K95353j17470r4180j5968j95382
586a11407J02019J62228j5049k1339j38601l924l68247K5748p8193q4646L70454
575a60957J53782M0768o2974o1694J6327j09846o5753k13540J69583L50441K8805
564H4942o4639n3386k39692r0152L6006N2929J39397J89536J06470J5311O2966
553B39688P5200j38522k04572j45835J3040J19502k04946J23703J99116k37388
543a61014N41P2453j89609K47888M2303k36802O6516K76649N556r3292j67476
$$ plain form
620 213018 171536 75513 49015 144603 49594 59571 2798 -222626 -416760 -275385 -75209
609 -75209 -19393 -45513 -91783 -272647 -205666 -277097 -335754 -316406 -193779 108468 112372 220122
597 220122 -21259 -285783 -370838 -240113 -183047 16240 311593 194123 99943 83975 -111407
586 -111407 -9388 152840 137791 116452 -22149 -26073 -394320 -368572 -446765 -531411 -160957
575 -160957 -7175 33593 -29381 -91075 -74748 -184594 -250347 -463887 -294304 56137 84942
564 84942 20303 -33083 -272775 -362927 -326921 -273992 -134595 54941 161411 176722 239688
553 239688 314888 176366 -28206 -174041 -161001 -41499 -246445 -122742 76374 -161014
543 -161014 -160473 -88020 -277629 -29741 12562 -224240 -157724 118925 124481 31189 -136287
532a36287k79356p970J31403J96731K14111m4992k02640m474P7604j15737l4608
521b06215J36418m0831j8772J31925j61078j13799K06313o8798o0245p4457p752
510b77291J62804l6998j13458L9982K77168j2799P5099J98675l74511k72518J01291
499b32556n5721Q7105P8376j31627m2031K45279l211o647k3650j67755J51154
488a01284R842N8123j8076J84572M137j14903R8209M1835k35103k479j38226k50419
476d63772K79563L65982J69779n2541j35043l96399p4966K41001P3676j30896
466a23616j28445J66524J13170Q3280j03626m8264l0252j3992K5491n832q8536
455a54098k09578K27423L84324J25260M3431k64200l65081L9041k10037N4974
$$ plain form
532 -136287 -415643 -423613 -292210 -95479 118632 73640 -129000 -133474 -55870 -171607 -206215
521 -206215 -69797 -110628 -129400 2525 -158553 -272352 -66039 -134837 -195082 -269539 -277291
510 -277291 -114487 -151485 -264943 -224961 52207 39408 114507 313182 -61329 -333847 -232556
499 -232556 -288277 -201172 -122796 -254423 -296454 -51175 -54386 -61033 -84683 -252438 -101284
488 -101284 -91442 -33319 -51395 133177 137314 22411 120620 162455 -72648 -75127 -213353 -463772
476 -463772 -184209 181773 351552 299011 163968 -232431 -307397 -66396 7280 -123616
466 -123616 -252061 -85537 27633 110913 7287 -40977 -71229 -85221 -59730 -65562 -154098
455 -154098 -363676 -136253 248071 373331 416762 152562 -212519 -173478 -383515 -328541
445c28541K8639n013K24865n9304j320Q4266K4320k45504j89137J46270Q6374
434b34085p6832q3359J30166J6422J25893J77987k33431J35301J83228m71049
424c29759j01142M00331p6195q3767M06044p2074Q1706O2012l82071R9300k7990
413b3605j06418j26539l3433J35012M4257L15320P3570k65847j0634r4896j35548
402b28761L4874R8546o0887L89014K40216q6921r0504k95248k12936j28139K5359
391c15387L01627K02969k41983J39005l888j98633Q8238K08775j31849j05097
381e6223j20138k33476Q3162j0755J12770K7653N0051J83020k7489k2285j99182
370b12892M9610K24529O7858j39698k56001p3011J82370M86538k665k72810j53182
$$ plain form
445 -328541 -299902 -304915 -80050 -139354 -140674 -56408 -32088 -277592 -466729 -320459 -234085
434 -234085 -310917 -394276 -264110 -247688 -121795 56192 -177239 -41938 141290 -329759
424 -329759 -430901 -30570 -106765 -190532 215512 143438 225144 287156 -94915 4385 -23605
413 -23605 -130023 -256562 -289995 -154983 -110726 204594 278164 12317 1683 -93213 -228761
402 -228761 -193887 -95341 -156228 232786 473002 386081 295577 329 -212607 -340746 -315387
391 -315387 -13760 189209 -52774 86231 82343 -116290 -28052 180723 48874 -56223
381 -56223 -176361 -409837 -326675 -337430 -224660 -197007 -146956 36064 8575 -13710 -212892
370 -212892 -163282 61247 129105 -10593 -266594 -339605 -157235 329303 326638 53828 -99354
359i9354j73552L70967q3263l06529J31420J09249L2933M3648j49608Q6064P9036
348D1011k17743n4584J18007K18647J31187r905j8423M1365j91039j15645K06353
337A49231K35072Q6941k48388j31573M8109q9253j59417o507J04577M9853K0146
326E8791j33142N0258M976l38476R902j13792J03707M79590o3307K06841l5751
315B29597n39720j22837M46878K4199m9093J81135q1028o1835j11954k21976J2904
304b93730K17209O2533k04173M04090n0826m11516J47289R7268n7441l7943L6671
293i0569l9202J55520J37532l21191O650J24142l8063P4747O9025J34276j65018
282D7849k59530K8640K78209L3888P713j63378k40864l2467P4530K66309K95810
$$ plain form
359 -99354 -272906 98061 14798 -291731 -160311 -51062 -18129 25519 -124089 -38025 41011
348 41011 -176732 -231316 -113309 105338 236525 226620 208197 249562 58523 -57122 149231
337 149231 384303 471244 222856 91283 139392 50139 -109278 -115785 -11208 38645 58791
326 58791 -74351 -24093 -19117 -357593 -347691 -461483 -357776 121814 58507 265348 229597
315 229597 -310123 -432960 13918 38117 -10976 170159 89131 27296 -84658 -306634 -293730
304 -293730 -76521 -13988 -218161 185929 135103 -276413 -129124 -31856 -89297 -127240 -90569
293 -90569 -129771 25749 163281 -157910 -151260 -27118 -65181 9566 78591 212867 47849
282 47849 -211681 -183041 95168 129056 136769 -26609 -267473 -299940 -225410 40899 336709
271C36709p4284k81243k09896p7929J54598O8499K58842M3676j78633Q1590j37721
260a5792j55680M614k8421m5806R1064J11029K3799L2265N783r6443j40071N3965
248a59694R1083j292J23029N7131J73K47799r7276j6135j61357k81296j13560
237c11395K18401K42012n5285K7834L3970k87184k08256k130N476J64511r395
226a81441J21694k18317K76187J61765k29125j59079J33677J37777N2557J49884
216B45579n8458p6222j51129n157J38442j37347j62102J1319Q4614k961l01377
205d14799J6640o2796J89341K05665R0785K80505l67314j80607Q664Q4669J24610
194b4637j73918k3444J21198K07332l12202j62527L50565J10580j70285o9607
$$ plain form
271 336709 262425 -18818 -228714 -306643 -152045 -83546 175296 218972 40339 121929 -15792
260 -15792 -171472 -166858 -195279 -241085 -150021 -38992 -15193 17072 22855 -73588 -213659 -159694
248 -159694 -68611 -69903 53126 110257 110430 358229 260953 244818 83461 -197835 -311395
237 -311395 -92994 149018 93733 121567 155537 -131647 -339903 -342033 -336557 -172046 -181441
226 -181441 -59747 -278064 -1877 159888 -69237 -228316 -94639 43138 95695 245579
216 245579 187121 110899 -40230 -45387 93055 -44292 -206394 -195075 -110461 -113422 -414799
205 -414799 -398159 -460955 -271614 -65949 24836 305341 -61973 -242580 -233916 -149247 -24637
194 -24637 -198555 -221999 -100801 106531 -205671 -368198 -17633 92947 -77338 -146945
184a46945O6686k16793P6544J89435j7499J92199l10620j54127L40806J17401
174A37087M9006M3162o9838q6920K9564j37304j19970K98241l3034l84840P2437
163b02409K84587Q2526j54683k40569j74242n8401L26607M39198J15918k91394
153A27138k12623j00250j77820K18789m9328L4875l5033R4508L75296N8723r5405
142B38870k63559k22087J30232L0561R2979N5224K8508o2313k0995k2700p141
131b2421r1661k92853l9207Q678J48486J85836K21451J38561j24817j54974j03193
120a26114j04750r6469K8482J46567k6233J47411L26785p4779j01547k8357j99183
109a08187o5635O3341J73111n5563o6936N5376J39181J12960k51040j11456N8961
$$ plain form
184 -146945 -80259 -297052 -220508 -31073 -48572 143627 -166993 -321120 19686 137087
174 137087 186093 229255 159417 72497 102061 -35243 -155213 143028 109994 -274846 -202409
163 -202409 82178 164704 10021 -230548 -404790 -463191 -136584 302614 418532 127138
153 127138 -85485 -185735 -363555 -144766 -194094 -159219 -194252 -99744 275552 334275 238870
142 238870 -24689 -246776 -116544 -85983 6996 62220 90728 28415 7420 -15280 -22421
131 -22421 -114082 -406935 -446142 -437464 -288978 -103142 118309 256870 132053 -22921 -126114
120 -126114 -230864 -327333 -298851 -152284 -178517 -31106 295679 220900 119353 90996 -108187
109 -108187 -173822 -110481 62630 7067 -59869 -4493 134688 247648 -3392 -114848 -55887
98e5887k21108o3003K09861N4342l2507Q3215j87836N855j7096j15232p2869p1983
86d84248J59196K35290m9094K13457J07106j39776j94170O6343P1038k334J1163
75f029J38465j86760n4160J47592N409O6228J7566K1891k12591M6144m3215j14626
63a74086P4498J71481o2056J89979k1435k82907Q6432j56321j22457P0297M5049
52a81526M6713J44978R2431l12086m535K20865k7250j26183J85202j43085j27662
41b32138N1642r3193K52526J80431q6018n7557j13421J3952k1964j57388p9644
30c42772O9975J16489J25637O9059j43085j92594j60112K37636J28536p3270K3752
19a40749r9127P1216N1862O7223j59883q8709m2039P8837K11866K18158Q6287
$$ plain form
98 -55887 -276995 -339998 -130137 -75795 -108302 -25087 -212923 -207068 -224164 -339396 -412265 -484248
86 -484248 -325052 -89762 -138856 74601 181707 41931 -152239 -85896 -14858 -17192 -6029
75 -6029 132436 -54324 -108484 39108 44517 110745 128311 150202 -62389 -16245 -59460 -174086
63 -174086 -99588 71893 9837 199816 178381 -104526 -18094 -174415 -296872 -226575 -181526
52 -181526 -134813 10165 102596 -209490 -214025 6840 -20410 -146593 38609 -104476 -232138
41 -232138 -180496 -273689 -21163 159268 73250 15693 -97728 -83776 -105740 -263128 -342772
30 -342772 -272797 -156308 -30671 38388 -104697 -297291 -457403 -219767 -91231 -164501 -140749
19 -140749 -239876 -168660 -116798 -49575 -209458 -298167 -340206 -261369 -49503 168655 254942
8B54942r4953j22797j67958K8409j2754J12336N2554P3070
0A22849
$$ plain form
8 254942 159989 37192 -130766 -102357 -115111 -2775 49779 122849
0 122849
$$ Imaginary data points
##PAGE= N=2
##DATA TABLE= (X++(I..I)), XYDATA
16383d185617J54195K42271r418q0206J19631N9495K46032P4007q8131q1451j16877
16372c666069N9667Q253K06830K02134q4214m0749N1537j0079L76604M189K3419
16361b868478M0862J4817O7514L1085q8806j01247M3285J91968M61659O8829n9479
16350b197991j45581j77381O8708k4003L5353L58457J96132j85662M0873K0123
16340b010972j43589J5592J51035j59189J27822J42223K74144J19184m3358L4939
16330a492169k17712K24894K5223m2488J54837J81770j21348l7315N5030j35103
16320a404381J0935P5042k6192J14283M8341K2396J61713L775J0898q7307J08855
16309i61642Q9902o868K14768J29255N729m4706J8509n6057J42268L7158J2291
$$ plain form
16383 -4185617 -4031422 -3789151 -3798569 -3878775 -3759144 -3699649 -3453617 -3379610 -3467741 -3549192 -3666069
16372 -3666069 -3606402 -3598149 -3391319 -3189185 -3273399 -3314148 -3262611 -3272690 -2896086 -2891897 -2868478
16361 -2868478 -2827616 -2812799 -2745285 -2714200 -2803006 -2904253 -2860968 -2669000 -2207341 -2138512 -2197991
16350 -2197991 -2343572 -2520953 -2452245 -2476248 -2440895 -2082438 -1886306 -2071968 -2031095 -2010972
16340 -2010972 -2154561 -2138969 -1987934 -2147123 -2019301 -1877078 -1602934 -1483750 -1527108 -1492169
16330 -1492169 -1709881 -1484987 -1459764 -1502252 -1347415 -1165645 -1286993 -1324308 -1269278 -1404381
16320 -1404381 -1393446 -1318404 -1344596 -1230313 -1181972 -1159576 -997863 -994088 -983190 -1070497 -961642
16309 -961642 -871740 -878608 -663840 -534585 -528856 -573562 -555053 -611110 -468842 -431684 -419393
16298d19393O5429q0142J89690N0599j93534K86954M6956j68177j64004j72985
16288e58607K85236K00613J31647n3304N269p2843q654L3133n7114K21472r4191
16277C2657J33933P8363J27333K79619q0603l9350J32230j63489j31769J77177
16267E46101N2128k61543j58754L1931K54441K76480p367Q655j81195o4191P7331
16256E74017r200J71632O8195j27578q7522J42409r121K11588R3246j57084J29640
16245A000222p140K8569K91064J80764m3689j78945j4297J63294o9981J1958r1830
16234A269989m9488J31816o0797j4663K72061j1528k08582k4081R2751R9231J25313
16223A622022K7794R5755j15928k34909J7938R1402L33324J77174k05125r6443
$$ plain form
16298 -419393 -353964 -434106 -244416 -193817 -387351 -100397 -53441 -221618 -385622 -558607
16288 -558607 -273371 -72758 58889 5585 10854 -61989 -70643 -37510 -94624 126848 32657
16277 32657 166590 244953 372286 651905 571302 531952 664182 500693 368924 546101
16267 546101 598229 336686 177932 209863 464304 740784 733417 742072 560877 496686 574017
16256 574017 564817 736449 804644 677066 589544 731953 722832 934420 1027666 870582 1000222
16245 1000222 993082 1021651 1312715 1493479 1449790 1270845 1256548 1419842 1349861 1361819 1269989
16234 1269989 1220501 1352317 1291520 1276857 1548918 1537390 1328808 1304727 1397478 1496709 1622022
16223 1622022 1649816 1745571 1629643 1394734 1412672 1504074 1837398 2014572 1809447 1713004
16213A713004j16331K5661L4842J83984Q1609k3066q4552j05693j6421J11887
16203A804924J51967k61320J42876O6598j10741O7734M3602p2627Q7938K4795
16193A945746j86438J96077L17507n8916j45680o9033j62991L6302p1404O8537
16183A869707K80225J65626J9900L419M427j57109q586O5818L1799J36846R800
16172B421872k0282j19109M8306p2123j8713J40118J23923M1502k71238j6695
16162B257561K32176K53007j60278j21569K26749j26101n1263j19916j38903r1198
16152B160265J89313K33838J593K47836j09635M208l628q7149j42866R443j95245
16141B307973J2477n8944l3061J77692K76802K08798j22074k6891j95710k31559
$$ plain form
16213 1713004 1596673 1622334 1657176 1841160 1922769 1899703 1815151 1709458 1693037 1804924
16203 1804924 1956891 1695571 1838447 1905045 1794304 1862038 1905640 1833013 1920951 1945746
16193 1945746 1759308 1955385 2272892 2213976 2068296 1999263 1836272 1872574 1801170 1869707
16183 1869707 2149932 2315558 2335458 2338877 2343304 2186195 2177609 2243427 2275226 2412072 2421872
16172 2421872 2401590 2282481 2330787 2258664 2239951 2380069 2503992 2545494 2274256 2257561
16162 2257561 2489737 2742744 2582466 2460897 2687646 2561545 2510282 2390366 2251463 2160265
16152 2160265 2349578 2583416 2585009 2832845 2723210 2727418 2723790 2636641 2493775 2503218 2307973
16141 2307973 2320450 2261506 2228445 2406137 2682939 2891737 2769663 2742772 2547062 2315503
16131B315503N2432K23863r9488K9867J65343m0680R962J38179l53563j67868
16121B273550q2572K02706K68573O8417k0762J6642n5839j53477M5435M8354J13531
16110B724558k23098k09790l58j0475J41911R5799n0536N5687K11153R1791j21593
16099B705049j03535k04265j93223K61047L87736M7622J31795j112l46828j58132
16089B526154J24857R7590m9508O7691R6143j2256L34017R7181k42633K0126n4898
16078C004464k62529J0638j00094l9157n332J30347Q3100K09059J59451k45224
16068B944723j02836J64407p1252P8946L9818l12676L1190R012r0297j28580j93413
16057B369042m7432M3460J37177J97837P6388k9665J2328p3649Q0121r0378J19929
$$ plain form
16131 2315503 2367935 2591798 2492310 2522177 2687520 2646840 2656802 2794981 2441418 2273550
16121 2273550 2190978 2393684 2662257 2730674 2709912 2726554 2670715 2517238 2562673 2611027 2724558
16110 2724558 2501460 2291670 2291312 2280837 2422748 2518547 2468011 2523698 2734851 2826642 2705049
16099 2705049 2601514 2397249 2204026 2465073 2852809 2900431 3032226 3031114 2684286 2526154
16089 2526154 2651011 2748601 2699093 2766784 2862927 2850671 3184688 3281869 3039236 3059362 3004464
16078 3004464 2741935 2752573 2652479 2613322 2607990 2738337 2821437 3030496 3189947 2944723
16068 2944723 2841887 3006294 2935042 3013988 3053806 2741130 2772320 2781332 2691035 2562455 2369042
16057 2369042 2321610 2365070 2502247 2700084 2776472 2746807 2759135 2685486 2765607 2675229 2795158
16046B795158J29723j95069j49436L3646L32676J20304L2117j61918p0309j99787
16036B667105J70189L21790j73918k47344j38567k3852j27056K73120N4439k83306
16026B492600j47096n7549J46236L40891L86160j0470O5933j21477j46776k55087
16016B693365J04749j3585J7119o2681J26780J86829P7621j6271l26007O2828
16006B850747P4017J57521L3349p6396j81375k51737J72628N0799r0236p5760
15996B663557p8626j7318l0216O5455K8827n1854P2923J31005L5554J48913j3885
15985B954335q7724l33080K4853l0456j104K03210J72591k9462j68744j5529k3955
15974B664935J96666J03545R9195j86492j28572j37149L3568M49620K52415j62173
$$ plain form
16046 2795158 2924881 2729812 2580376 2614022 2946698 3067002 3099119 2937201 2866892 2667105
16036 2667105 2837294 3159084 2985166 2737822 2599255 2575403 2448347 2721467 2775906 2492600
16026 2492600 2345504 2287955 2434191 2775082 3161242 3150772 3216705 3095228 2948452 2693365
16016 2693365 2798114 2784529 2801648 2738967 2865747 3052576 3130197 3113926 2787919 2850747
16006 2850747 2924764 3082285 3115634 3039238 2857863 2606126 2778754 2829553 2739317 2663557
15996 2663557 2584931 2567613 2537397 2602852 2631679 2579825 2652748 2783753 2819307 2968220 2954335
15985 2954335 2866611 2533531 2558384 2527928 2526824 2730034 2902625 2873163 2704419 2688890 2664935
15974 2664935 2861601 2965146 3064341 2877849 2749277 2612128 2645696 3095316 3347731 3185558
15964C185558j54175k86344j92723K97051J83625P4438o6022M4841j96877m6648
15954B842724r7036k29856N1019O6139J64639L05986R6007j05403l04332k68178
15944B521709P9406K14305M02715O8564j56477j7008n4755L1225P5330M3799j04846
15933C103967o2747k75478r7105Q2460j39090Q3012K29000J49487k75792j22126
15923B675588P8947j60547j61240J31696J77733J87381J34357j19778j03568k09214
15913B631355J7383P7695J10818K4300K61185j07020j6215J57241k06273r1340
15903B859129j27333q4350j16842J34367l2534L12093J44406k72571p4702J16257
15893B857920m24834j66215L19631M9075J09001L13690Q5255j05700J13530l71708
$$ plain form
15964 3185558 3031383 2745039 2552316 2849367 3032992 3107430 3041408 3086249 2889372 2842724
15954 2842724 2745688 2515832 2566851 2632990 2797629 3103615 3199622 3094219 2789887 2521709
15944 2521709 2601115 2815420 3218135 3286699 3130222 3113214 3058459 3089684 3165014 3208813 3103967
15933 3103967 3041220 2765742 2668637 2751097 2612007 2695019 2924019 3073506 2797714 2675588
15923 2675588 2754535 2593988 2432748 2564444 2742177 2929558 3063915 2944137 2840569 2631355
15913 2631355 2648738 2726433 2837251 2861551 3122736 3015716 2999501 3156742 2950469 2859129
15903 2859129 2731796 2647446 2530604 2664971 2632437 2944530 3088936 2816365 2741663 2857920
15893 2857920 2433086 2266871 2586502 2635577 2744578 3058268 3143523 3037823 3151353 2779645
15883B779645j77530L0414J54681m585K98925K52260j83342l81931j30205L7884
$$ plain form
15883 2779645 2602115 2632529 2787210 2782625 3081550 3333810 3150468 2768537 2638332 2676216
$$ [...]
##END NTUPLES=NMR SPECTRUM
##END=
