##TITLE=1H_EC-3253(II-2)
 CDCl3, 8 sc, 
 14.05.2021
##JCAMPDX= 6.0         $$ Bruker NMR JCAMP-DX V2.0
##DATA TYPE= NMR SPECTRUM
##DATA CLASS= NTUPLES
##ORIGIN= UXNMR, Bruker Analytische Messtechnik GmbH
##OWNER= root
$$ XWIN-NMR		Version 3.5
$$ Fri May 14 11:49:44 2021 Russian Standard Time (UT+4h)  she@DPX200
##.OBSERVE FREQUENCY= 200.131506
##.OBSERVE NUCLEUS= ^1H
##.ACQUISITION MODE= SIMULTANEOUS
##.ACQUISITION SCHEME= undefined
##.AVERAGES= 8
##.DIGITISER RES= 18
##SPECTROMETER/DATA SYSTEM= spect
##.PULSE SEQUENCE= zg30
##.SOLVENT NAME= CDCl3
##.SHIFT REFERENCE= (INTERNAL, CDCl3, 0, 15.9626)
##AUDIT TRAIL= $$ (NUMBER, WHEN, WHO, WHERE, WHAT)
$$ ##TITLE= Audit trail, XWIN-NMR		Version 3.5
$$ ##JCAMPDX= 5.01
$$ ##ORIGIN= Bruker BioSpin GmbH
$$ ##OWNER= she
$$ F:/spectra/data/she/nmr/H-F/1/pdata/1/auditp.txt
$$ ##AUDIT TRAIL=  $$ (NUMBER, WHEN, WHO, WHERE, WHAT)
(   1,<2021-05-14 11:48:15.81 +0400>,<she>,<DPX200>,
      <created by zg, POWCHK disabled, PULCHK disabled
       configuration hash MD5:
       00 E9 B6 7A A2 85 ED C7 34 08 36 98 17 FE 4E 26
       data hash MD5: 16K
       4C 2D DC 7B 03 E2 18 0D E4 34 87 E8 9B F7 7D 49>)
(   2,<2021-05-14 11:48:31.96 +0400>,<she>,<DPX200>,
      <Start of raw data processing
       efp BC_mod = 2 LB = 0.24 FT_mod = 6 PKNL = 1 PHC0 = -11129.62 PHC1 = 10.20099 SI = 16K 
       data hash MD5: 16K
       5A 95 71 C8 A3 7C D6 E1 17 12 D3 42 42 30 D5 6C>)
(   3,<2021-05-14 11:48:53.64 +0400>,<she>,<DPX200>,
      <pk PHC0 = 2.041377 PHC1 = -1 
       data hash MD5: 16K
       CE BA BE F1 BA 31 BD B0 F0 46 93 59 6A 86 5B EF>)
(   4,<2021-05-14 11:48:56.78 +0400>,<she>,<DPX200>,
      <abs ABSG = 5 
       data hash MD5: 16K
       3E 1D 7B DB 99 C7 BE 72 8F 5C 49 CE 51 A2 24 CB>)
$$ ##END=
$$ 
$$ hash MD5
$$ 50 6B FC 84 F5 49 35 BA 87 6A 1D 0B 88 E3 9C 67
##$RELAX= 
##$RELAX= 
##$RELAX= 
##$RELAX= 
##$RELAX= 
##$RELAX= 
$$ Bruker specific parameters
$$ --------------------------
##$DU= <F:/spectra>
##$EXPNO= 1
##$NAME= <H-F>
##$PROCNO= 1
##$TYPE= <nmr>
##$USER= <she>
##$AMP= (0..31)
100 100 100 100 100 100 100 100 100 100 100 100 100 100 100 100 100 100 
100 100 100 100 100 100 100 100 100 100 100 100 100 100 
##$AQSEQ= 0
##$AQ_mod= 1
##$AUNM= <au_zg>
##$AUTOPOS= <>
##$BF1= 200.13
##$BF2= 200.13
##$BF3= 200.13
##$BF4= 200.13
##$BF5= 200.13
##$BF6= 200.13
##$BF7= 200.13
##$BF8= 200.13
##$BYTORDA= 1
##$CFDGTYP= 0
##$CFRGTYP= 5
##$CHEMSTR= <none>
##$CNST= (0..31)
1 1 145 1 1 1 1 1 1 1 1 1 1 1 1 1 1 1 1 1 1 1 1 1 1 1 1 1 1 1 1 1 
##$CPDPRG= <>
##$CPDPRG1= <>
##$CPDPRG2= <>
##$CPDPRG3= <>
##$CPDPRG4= <mlev>
##$CPDPRG5= <mlev>
##$CPDPRG6= <mlev>
##$CPDPRG7= <mlev>
##$CPDPRG8= <mlev>
##$CPDPRGB= <>
##$CPDPRGT= <>
##$D= (0..31)
0 1.2 0 0 0 0 0 0 0 0.06 0 0.03 0 0 0 0 0.0002 0 0 0 0 0 0 0 0 0 0 0 0 
0 0 0 
##$DATE= 1620978495
##$DBL= (0..7)
120 120 120 120 120 120 120 120 
##$DBP= (0..7)
150 150 150 150 150 150 150 150 
##$DBP07= 0
##$DBPNAM0= <>
##$DBPNAM1= <>
##$DBPNAM2= <>
##$DBPNAM3= <>
##$DBPNAM4= <>
$$ [...]
##$SUBNAM3= <"">
##$SUBNAM4= <"">
##$SUBNAM5= <"">
##$SUBNAM6= <"">
##$SUBNAM7= <"">
##$SUBNAM8= <"">
##$SUBNAM9= <"">
##$SW= 16.9725357007746
##$SWIBOX= (0..15)
0 0 2 0 0 0 0 0 0 0 0 0 0 0 0 0 
##$SW_h= 3396.73913043478
##$TD= 16384
##$TD0= 1
##$TE= 0
##$TE2= 300
##$TE3= 300
##$TEG= 300
##$TL= (0..7)
0 120 120 120 120 120 120 120 
##$TP= (0..7)
150 150 150 150 150 150 150 150 
##$TP07= 0
##$TPNAME0= <>
##$TPNAME1= <>
##$TPNAME2= <>
##$TPNAME3= <>
##$TPNAME4= <>
##$TPNAME5= <>
##$TPNAME6= <>
##$TPNAME7= <>
##$TPOAL= (0..7)
0.5 0.5 0.5 0.5 0.5 0.5 0.5 0.5 
##$TPOFFS= (0..7)
0 0 0 0 0 0 0 0 
##$TUNHIN= 0
##$TUNHOUT= 0
##$TUNXOUT= 0
##$USERA1= <user>
##$USERA2= <user>
##$USERA3= <user>
##$USERA4= <user>
##$USERA5= <user>
##$V9= 5
##$VALIST= <valist>
##$VCLIST= <CCCCCCCCCCCCCCC>
##$VD= 0
##$VDLIST= <DDDDDDDDDDDDDDD>
##$VPLIST= <PPPPPPPPPPPPPPP>
##$VTLIST= <TTTTTTTTTTTTTTT>
##$WBST= 1024
##$WBSW= 4
##$XGAIN= (0..3)
0 0 0 0 
##$XL= 0
##$YL= 0
##$YMAX_a= 451640
##$YMIN_a= -479636
##$ZGOPTNS= <>
##$ZL1= 120
##$ZL2= 120
##$ZL3= 120
##$ZL4= 120
##$ABSF1= 15.96678
##$ABSF2= -1.005882
##$ABSG= 5
##$ABSL= 3
##$ALPHA= 0
##$AQORDER= 0
##$ASSFAC= 0
##$ASSFACI= 0
##$ASSFACX= 0
##$ASSWID= 0
##$AUNMP= <proc_1d>
##$AZFE= 0.1
##$AZFW= 0.1
##$BCFW= 0
##$BC_mod= 2
##$BYTORDP= 0
##$COROFFS= 0
##$CY= -3
##$DATMOD= 1
##$DC= 0
##$DFILT= <>
##$DTYPP= 0
##$F1P= 0
##$F2P= 0
##$FCOR= 1
##$FTSIZE= 16384
##$FT_mod= 6
##$GAMMA= 0
##$GB= 0
##$INTBC= 1
##$INTSCL= 1.334414e-10
##$ISEN= 128
##$LB= 0.24
##$LEV0= 0
##$LPBIN= 0
##$MAXI= 10000
##$MC2= 0
##$MEAN= 0
##$ME_mod= 0
##$MI= 1.114404
##$NCOEF= 0
##$NC_proc= -6
##$NLEV= 6
##$NOISF1= 3.799351
##$NOISF2= 2.8
##$NSP= 0
##$NTH_PI= 0
##$NZP= 0
##$OFFSET= 15.96263
##$PC= 1
##$PHC0= -11127.58
##$PHC1= 9.20099
##$PH_mod= 1
##$PKNL= yes
##$PPARMOD= 0
##$PSCAL= 0
##$PSIGN= 0
##$REVERSE= no
##$SF= 200.13000976836
##$SI= 16384
##$SIGF1= 3
##$SIGF2= 2
##$SINO= 5.538805
##$SIOLD= 16384
##$SREGLST= <1H.CDCl3>
##$SSB= 0
##$STSI= 16384
##$STSR= 0
##$SW_p= 3396.73913043479
##$SYMM= 0
##$S_DEV= 0
##$TDeff= 16384
##$TDoff= 0
##$TI= <>
##$TILT= no
##$TM1= 0
##$TM2= 0
##$TOPLEV= 0
##$USERP1= <user>
##$USERP2= <user>
##$USERP3= <user>
##$USERP4= <user>
##$USERP5= <user>
##$WDW= 1
##$XDIM= 16384
##$YMAX_p= 372512065
##$YMIN_p= -321340
$$ End of Bruker specific parameters
$$ ---------------------------------
##NTUPLES= NMR SPECTRUM
##VAR_NAME=  FREQUENCY,     SPECTRUM/REAL,   SPECTRUM/IMAG
##SYMBOL=    X,             R,               I
##VAR_TYPE=  INDEPENDENT,   DEPENDENT,       DEPENDENT
##VAR_FORM=  AFFN,          ASDF,            ASDF
##VAR_DIM=   16384,         16384,           16384
##UNITS=     HZ,            ARBITRARY UNITS, ARBITRARY UNITS
##FACTOR=    0.207333158178282, 1,           1
##FIRST=     3194.60135224639, 0,            0
##LAST=      -202.137778188398, 0,           0
##MIN=       -202.137778188398, -321340,     0
##MAX=       3194.60135224639, 372512065,    0
$$ Real data points
##PAGE= N=1
##DATA TABLE= (X++(R..R)), XYDATA
$$ [...]
5345A58841n8901K9363J2057m4600n3559l1837P1350Q6780N5710j6367o7727K2902
5333A64012K3451j9378j6161O7180K6890m9436n850l4369r742k67N1436J2260
5321B10026m894O0161R993K3997K2490m6656m7460L240k8148K0765q8715k296
5309A32503M2417J1817K5290m3888N7469m9334q435j8449L1444J4984K4604j2129
5297B08293N4053m8496K1102L1860J6026m0074k5085O480K5562n6786J8942m4177
5285A67700m689P9302O553p8095o598O8845l4469R2281K2742J0262n0287j3432
5273B60115p3941K0105O0178N7899p5173O9307K2410j132J9793N2215l4227M3057
5261D20606J4821k3089J1320j2234m6772l1627P9447K264n4653j885m5287J8999
$$ plain form
5345 158841 99940 129303 141360 96760 43201 11364 82714 169494 225204 208837 141110 164012
5333 164012 187463 168085 151924 219104 245994 196558 190708 156339 146597 146330 197766 210026
5321 210026 205132 265293 275286 299283 321773 275117 227657 230897 202749 223514 134799 132503
5309 132503 174920 186737 212027 168139 225608 176274 167839 149390 180834 195818 220422 208293
5297 208293 262346 213850 234952 266812 282838 242764 217679 224159 249721 192935 211877 167700
5285 167700 163011 242313 248866 170771 164173 233018 198549 290830 313572 323834 273547 260115
5273 260115 186174 206279 266457 324356 249183 318490 340900 339768 359561 411776 377549 420606
5261 420606 435427 412338 423658 411424 364652 333025 412472 414736 360083 358198 312911 331910
5249C31910K8900m7518r0008l5873L0261N18N5921K4848M1330P2614r145m0863
5237C62895L1575N2176l367j01534j5439Q1362P047K8708O6518r783J8366p319
5225E11205k5152Q937l60m662l7115k2844n4912j8044k3912k0434K0976j6326
5213C17357M3059l9112J4033K9922O254K745k9152j7012K7694K9007K9172L6261
5201D50228R4400K1994L9410r1990K2501M4301o2141q7334M0287N4341L2743M4451
5189F03191l2618n7027R419J1050L2909l4641n1131P3105L2028j1998r2520L3867
5177E15634L2110k1122M3817k242K118m7857n0446L7972k2155k4835m4477K1123
5165D39640N1400K8172Q7926M6999q0565m0390M8260J4496q0782M0137N2518l251
$$ plain form
5249 331910 360810 313292 223284 187411 217672 218190 274111 298959 340289 412903 403758 362895
5237 362895 394470 446646 443279 341745 326306 407668 414715 443423 509941 500158 518524 511205
5225 511205 486053 494990 494630 489968 452853 430009 375097 357053 333141 312707 333683 317357
5213 317357 360416 321304 335337 365259 371513 374258 345106 328094 355788 384795 413967 450228
5201 450228 544628 566622 606032 514042 536543 580844 518703 431369 471656 525997 558740 603191
5189 603191 570573 513546 522965 534015 566924 532283 481152 554257 586285 574287 481767 515634
5177 515634 547744 526622 570439 568197 570315 522458 472012 509984 487829 462994 418517 439640
5165 439640 491040 519212 607138 654137 573572 533182 581442 595938 515156 555293 607811 604560
5153F04560L3072M1935O4773k3839l6561k4790k1667L9188P57P8620Q530j7374
5141G47204m2876O1509J9263r7389q575m9205L4237R1263J15324j4330m4095p0249
5129G42081K9111M0117M5726J7206n1242L8182l1045J0444M3716J04154k1416
5118I67034P162N7342o237O4435j7140j0714M3131J10160k8350n9852m323k7157
5106A095491K1625k307j9769N6787J11495l0059l3430l4012P3072J6028n1784
5095A203137p318O6371N4969J0962N9905p466M1164J6553M0214L9300K9183K6326
5083A573300O1060L0086P0499Q4846N1744L1666K63J8683k2262J4814M8862l916
5071A959645n9975J9785M7190O73Q7007M6341L7473R7754L9061L5652O7606Q7267
$$ plain form
5153 604560 637632 679567 744340 720501 683940 659150 637483 676671 677428 756048 764578 747204
5141 747204 704328 765837 785100 687711 679136 629931 664168 755431 870755 856425 812330 742081
5129 742081 771192 811309 857035 874241 822999 861181 830136 840580 884296 988450 967034
5118 967034 974196 1031538 1025301 1089736 1072596 1061882 1105013 1215173 1186823 1126971 1122648 1095491
5106 1095491 1117116 1114809 1095040 1151827 1263322 1233263 1199833 1165821 1238893 1254921 1203137
5095 1203137 1195819 1262190 1317159 1328121 1388026 1380560 1421724 1438277 1478491 1517791 1546974 1573300
5083 1573300 1634360 1664446 1734945 1819791 1871535 1903201 1903464 1922147 1899885 1914699 1963561 1959645
5071 1959645 1899670 1919455 1966645 1967318 2054325 2100666 2138139 2235893 2274954 2310606 2378212 2465479
5059B465479k9858M9978J07359J19515J9501R2405K4285M1799J20046J01816L4409
5048C146734J31245Q8509N8425j6132J31885K09020J28243J77463J67578J49989
5038D372959K31587K29763J52468K72784J79706K23783K65759L88922M28336M80841
5028G226908M12981N38966M90305M76571M64784L15261K17919n4372n8183k22960
5018I808180k85279l01996m18070k82598j82051k52058q2330L1985m5215O7506
5008H058074M4776O4176K5662J77455K46981L77800K81542K86383N21483M26717
4998A0511049N11412M92033N38700O09195N57628N22444O16852O33325M58078
4989A5450716M57103L26542J20174O0642j32792j49853k47420l98748m17660m37535
$$ plain form
5059 2465479 2435621 2485599 2592958 2712473 2731974 2824379 2848664 2890463 3010509 3112325 3146734
5048 3146734 3277979 3366488 3424913 3408781 3540666 3749686 3877929 4055392 4222970 4372959
5038 4372959 4604546 4834309 4986777 5259561 5439267 5663050 5928809 6317731 6746067 7226908
5028 7226908 7639889 8178855 8669160 9145731 9610515 9925776 10143695 10089323 10031140 9808180
5018 9808180 9522901 9220905 8802835 8520237 8338186 8086128 8003798 8035783 7990568 8058074
5008 8058074 8102850 8167026 8192688 8370143 8617124 8994924 9276466 9562849 10084332 10511049
4998 10511049 11022461 11514494 12053194 12662389 13220017 13742461 14359313 14992638 15450716
4989 15450716 15907819 16234361 16354535 16415177 16282385 16132532 15885112 15486364 15068704 14631169
4979A4631169l66127n18719m39710m50364l22405l27016l21265j74571j88521
4970A1522471p8290P452m2287k073J26083J48161K43192L28034K75299L74258
4960A2902300L99900M28806N18136N53169N70060P93895O29875O03567O28229
4951A8027937N83966M58210K70811K34462J14000K13052L10985M08136N84472
4942B1206031P43609J013108J197385J276217J522864J453219J376532J205957
4934C0994922P02419K56019m25690j024238j490410j579440j507066j306298j050196
4925B3570022q42583o10373m72959l14960k46795n5796l4129K50172M42213N28172
4915B2212984O29415R05112R69324J226818J388142J724788J953096K123406K448982
$$ plain form
4979 14631169 14265042 13746323 13306613 12856249 12533844 12206828 11885563 11710992 11522471
4970 11522471 11444181 11451633 11409346 11407273 11533356 11681517 11924709 12252743 12528042 12902300
4960 12902300 13302200 13731006 14249142 14802311 15372371 16166266 16796141 17399708 18027937
4951 18027937 18611903 19070113 19340924 19575386 19689386 19902438 20213423 20621559 21206031
4942 21206031 21949640 22962748 24160133 25436350 26959214 28412433 29788965 30994922
4934 30994922 31697341 31953360 31527670 30503432 29013022 27433582 25926516 24620218 23570022
4925 23570022 22727439 22117066 21644107 21329147 21082352 21026556 20992427 21242599 21684812 22212984
4915 22212984 22842399 23747511 24716835 25943653 27331795 29056583 31009679 33133085 35582067
4906C5582067K623711K731281K674790K528616K353570J855502J223719Q2866
4898E1656122q59546j894788k844441l189846l398578l209181k955304k547360
4890C0757078k205414j852423j581551j364501j121738r22295p92984o05161m09594
4881A9901417k77881n5127k7701J49483M04110L98944N87525O72196R65940R95251
4871B3714157J172724J274962J172050J223765Q82674M66319O222m53671j402618
4862B8056584j888527k148912k365564k057441j845042j503210j273306j100430
4854A3874152j042922q22152p36019o78643o20528n37250l88635m50203l56921
4845H240879k69746l36072m14047j83391k23027l23502k37641j39086k29207k56935
$$ plain form
4906 35582067 38205778 40937059 43611849 46140465 48494035 50349537 51573256 51656122
4898 51656122 50796576 48901788 46057347 42867501 39468923 36259742 33304438 30757078
4890 30757078 28551664 26699241 25117690 23753189 22631451 21709156 20916172 20311011 19901417
4881 19901417 19623536 19568409 19540708 19690191 20094301 20493245 21080770 21752966 22718906 23714157
4871 23714157 24886881 26161843 27333893 28557658 29440332 29906651 29912873 29459202 28056584
4862 28056584 26168057 24019145 21653581 19596140 17751098 16247888 14974582 13874152
4854 13874152 12831230 12009078 11273059 10594416 9973888 9436638 9048003 8597800 8240879
4845 8240879 7971133 7635061 7221014 7037623 6814596 6491094 6253453 6114367 5885160 5628225
4835E628225j12332o2597j76465k11345j23910k13720k06819j06834j17501j31200
4825D165502j74070o9816j43130k08500n5256n6972o6383j81224p9593o3858n4215
4814C012485n4682p0729l8355j13473j10154j09733o2950k4110J032j65688m6329
4803B217314J2950p2174K2769j2131m4039m8958R470q3312m4071k7315m6418j9424
4791A864661R511l2598Q532P9424l9166m8706K9500k986j04557j15820K7659j1512
4779A663942l5732o4055r933m6931l7039j0972M3999O634Q285K6660q9247j23700
4767A331911J5141O5615q7501J3103L6834p5989K9108j6310k0295M0041K5420
4756A357078o895j8459l8506r4337M3277P3741n014l1998j5491J3734l9466o2387
$$ plain form
4835 5628225 5515893 5453296 5276831 5065486 4941576 4727856 4521037 4414203 4296702 4165502
4825 4165502 3991432 3921616 3778486 3569986 3514730 3457758 3391375 3210151 3130558 3066700 3012485
4814 3012485 2957803 2887074 2848719 2735246 2625092 2515359 2452409 2428299 2429331 2263643 2217314
4803 2217314 2230264 2158090 2180859 2168728 2124689 2075731 2085201 2001889 1957818 1930503 1884085 1864661
4791 1864661 1874172 1841574 1850106 1929530 1890364 1841658 1871158 1868172 1763615 1647795 1675454 1663942
4779 1663942 1628210 1564155 1554222 1507291 1470252 1459280 1503279 1509913 1518198 1544858 1455611 1331911
4767 1331911 1347052 1412667 1325166 1338269 1375103 1299114 1328222 1311912 1291617 1331658 1357078
4756 1357078 1350183 1331724 1293218 1198881 1242158 1315899 1310885 1278887 1263396 1277130 1237664 1175277
4744A175277P454O9223n9705K750l3787j5390M2192J2377l1959Q404j1895L3574
4732A198515L0963r4348L0050K3580l645j6309K7258n0797K3101P0782J9311R739
4720A268200n9519o4166M5972o818j0230j06279J8917O7140j9183M2756n4019
4709A122771N8506K6262o563k707K868p730R0065r1078L8252J8916o5195J0091
4697A194458J5634m226k9507J21501r2024L5830r39m0042R3126k6952j04621P7141
4685A239379M6551r388l0298Q4667k9148l353N388P3768m360J5672m8600j5356
4673A324922O1905m8063P1875P271k069N9920k6668k6847L5998N5634J1757K7723
4661A553358K8292Q553k1839N5469M0265O745O4316K0536j8348L5213L161o094
$$ plain form
4744 1175277 1182731 1251954 1192249 1194999 1161212 1145822 1188014 1200391 1168432 1176836 1164941 1198515
4732 1198515 1229478 1135130 1165180 1188760 1185115 1168806 1196064 1145267 1168368 1239150 1258461 1268200
4720 1268200 1208681 1144515 1190487 1183669 1173439 1067160 1086077 1153217 1134034 1176790 1122771
4709 1122771 1181277 1207539 1200976 1198269 1201137 1193407 1283472 1192394 1230646 1249562 1184367 1194458
4697 1194458 1210092 1205866 1176359 1297860 1205836 1241666 1240727 1200685 1293811 1266859 1162238 1239379
4685 1239379 1285930 1276542 1246244 1330911 1301763 1298410 1303798 1377566 1373206 1388878 1340278 1324922
4673 1324922 1386827 1338764 1410639 1417910 1415841 1475761 1449093 1422246 1458244 1513878 1525635 1553358
4661 1553358 1581650 1590203 1568364 1623833 1664098 1670843 1735159 1755695 1737347 1772560 1775721 1769627
4649A769627J5316K9450L3004j0867N6767q3209l6310L2824q2553L7129L4800
4638A795978k7380J0584P9031L0287L8767L3516K2958L6753N7365N8356M7275
4627B183490L364K1161Q4729J21424L7971O7799K2851K1976J05623J15049Q4907
4616B870344l1860M8953N4870P8061O7509L4223K4500r33J0953J17253J0711K2821
4604C307405M3794J05863k1279R8620Q9982J12232K7845J4621j4783J75107Q8833
4593D028240N4869J34083K1660J3719N5793J50224J39929R5413L6999P3166K01064
4582E005159O2797J46836J45749L6913L3567J60467J50078P3891J75792J59092
4572F150341J40511Q7364J49629J37916J67424K08148J76922J65736J39136K59200
$$ plain form
4649 1769627 1784943 1814393 1847397 1836530 1893297 1810088 1773778 1806602 1724049 1761178 1795978
4638 1795978 1768598 1779182 1858213 1888500 1927267 1960783 1983741 2020494 2077859 2136215 2183490
4627 2183490 2186854 2208015 2292744 2414168 2452139 2519938 2542789 2564765 2670388 2785437 2870344
4616 2870344 2838484 2887437 2942307 3020368 3087877 3122100 3146600 3145667 3156620 3273873 3284584 3307405
4604 3307405 3351199 3457062 3435783 3534403 3624385 3736617 3764462 3779083 3764300 3939407 4028240
4593 4028240 4083109 4217192 4238852 4252571 4308364 4458588 4598517 4693930 4730929 4804095 5005159
4582 5005159 5067956 5214792 5360541 5397454 5431021 5591488 5741566 5815457 5991249 6150341
4572 6150341 6290852 6378216 6527845 6665761 6833185 7041333 7218255 7383991 7523127 7782327
4562G782327J54645K16563L38803K72055L02003K83546M02235L53783M16808M73388
4552A0996156M46962N45563O13171N54984N17974O50846P49145P55084R28597
4543A6758482R08189Q68880R56514J100365J323232J486832J679403K034484K131489
4534B9247870K378451K571321L020062L323725L688952M123530M188743M476616
4526E7019270M570424M463575M266266M072906L501165K911255K144246R65606
4518H3914713k02624j637253k985176m090408m545197m668368m469748m356951
4510E6958988m223819m224351m176682l939839l637958l151120k834032k557482
4502B8213705k282677j885003j699444j469003j227851j064997j017554q97003
$$ plain form
4562 7782327 7936972 8153535 8492338 8764393 9066396 9349942 9752177 10105960 10522768 10996156
4552 10996156 11443118 11988681 12601852 13156836 13674810 14325656 15074801 15829885 16758482
4543 16758482 17666671 18535551 19492065 20592430 21915662 23402494 25081897 27116381 29247870
4534 29247870 31626321 34197642 37217704 40541429 44230381 48353911 52542654 57019270
4526 57019270 61589694 66053269 70319535 74392441 77893606 80804861 82949107 83914713
4518 83914713 83712089 82074836 79089660 74999252 70454055 65785687 61315939 56958988
4510 56958988 52735169 48510818 44334136 40394297 36756339 33605219 30771187 28213705
4502 28213705 25931028 24046025 22346581 20877578 19649727 18584730 17567176 16670173
4494A6670173p26956q91028p38121p45236p51178n98254n50114m81908n13314
4485A0674064m51207l81221l21760l79165l62276l42351l29747k74241l09793
4476G522303k36269l06579j41172k16543k03657j03970j66201p5141j22301j24486
4466E825984j00224k3125n0941j7811o9278m1251j1623k0629k09570l53311j51113
4455D777108k16438j55256j05453j63695j18141r9314p5302m4726R004j54168
4445C653619l5631l1540l1219p2461n3888j7352q8633j42952K1240o5392o4052
4434C071739K7428j6897j33528l0816L589o9009l9310m6586n8524l8455L8585
4423B708216j08851r9121l1376m9567j00368l7379j4854j1761l9256k9409k18
$$ plain form
4494 16670173 15943217 15052189 14314068 13568832 12817654 12219400 11669286 11187378 10674064
4485 10674064 10222857 9841636 9519876 9140711 8778435 8436084 8106337 7832096 7522303
4476 7522303 7286034 6979455 6838283 6621740 6418083 6314113 6147912 6072771 5950470 5825984
4466 5825984 5725760 5702635 5651694 5633883 5564605 5523354 5511731 5491102 5281532 4928221 4777108
4455 4777108 4560670 4405414 4299961 4136266 4018125 3918811 3843509 3798783 3807787 3653619
4445 3653619 3617988 3586448 3555229 3482768 3428880 3411528 3322895 3179943 3201183 3135791 3071739
4434 3071739 3099167 3082270 2948742 2917926 2921515 2852506 2813196 2766610 2708086 2669631 2708216
4423 2708216 2599365 2500244 2468868 2419301 2318933 2281554 2266700 2254939 2215683 2186274 2186056
4412B186056l0009K8679O8042k505j28586j16880K2248j4254q10q5916j6122q810
4400A901133j31123K0764K1181q9549J5928n5038K2656K2566m690L8811l5493
4389A727146L6429l2499n4857l2669m3225j3062J9510k9860k3613L1260K2452
4378A607012K6115j34381O202J7309Q2657J7096j40086O2102N3618M2804l7348
4367A603100n0004J8995J3577n8574j4388m1799j19163J05042o4667o6937P3618
4356A398800K660q8607R977n1875n7024J2662O0160N0355o4023J4903n858k4826
4344A257304q1392m5536m8466r658P0395L7856o6252r9395k504L168j10253P6998
4332I82265O4640M2025p4127K6520k6962k8729L4351r0698j1397l9867m0807O2047
$$ plain form
4412 2186056 2156047 2184726 2252768 2250263 2121677 2004797 2027045 2012791 2011981 1926065 1909943 1901133
4400 1901133 1770010 1790774 1811955 1722406 1738334 1683296 1705952 1728518 1723828 1762639 1727146
4389 1727146 1763575 1731076 1676219 1643550 1600325 1587263 1606773 1576913 1553300 1584560 1607012
4378 1607012 1633127 1498746 1504948 1522257 1604914 1622010 1481924 1544026 1597644 1640448 1603100
4367 1603100 1553096 1572091 1585668 1527094 1512706 1470907 1351744 1456786 1392119 1325182 1398800
4356 1398800 1401460 1312853 1322830 1270955 1213931 1226593 1286753 1337108 1273085 1287988 1282130 1257304
4344 1257304 1175912 1130376 1081910 1072252 1142647 1180503 1114251 1014856 1012352 1015520 905267 982265
4332 982265 1046905 1088930 1014803 1041323 1014361 985632 1019983 929285 917888 878021 837214 899261
4320H99261K0144l4835l3469M421j08968R868P6618j4003j9954j620M4799n829
4308H36433M002j5248p523Q07r2510M1301J26222J6443m3449q915N6419k3276
4296H90706j8032L4871k2443N5736p988j8027j6740P0491j9103j44247M7148N66
4284H52938O8134j10248K2604l819k3806Q0816j0108L1402m4324k7539O0904o565
4272H90389j3588l1680N2650N6888L8599k4268m1438O5977j3168p2095K5855N4691
4260I88812J5547J5456K3690O305n6422P9531j1880k247k7121q838n8134q9016
4248H75683P4732O232j5845P41Q9050J3938k98K5116Q3017L0712M1693R581L7124
4235A271476Q8134N4992R8262Q1584J60579L2132P5512N0502J38936J15018J14352
$$ plain form
4320 899261 919405 884570 851101 855522 746554 756422 833040 819037 799083 797463 842262 836433
4308 836433 840435 825187 817664 818471 725961 767262 893484 909927 866478 857563 913982 890706
4296 890706 872674 907545 885102 940838 932850 914823 898083 968574 949471 805224 852372 852938
4284 852938 921072 810824 833428 829609 805803 886619 876511 907913 863589 836050 896954 890389
4272 890389 876801 845121 897771 954659 993258 968990 927552 993529 980361 908266 934121 988812
4260 988812 1004359 1019815 1043505 1049810 993388 1072919 1061039 1058792 1031671 1022833 964699 875683
4248 875683 950415 956647 940802 941543 1030593 1044531 1044233 1069349 1152366 1183078 1224771 1234352 1271476
4235 1271476 1359610 1414602 1512864 1594448 1755027 1787159 1862671 1913173 2052109 2167127 2281479
4224B281479K33602R0137K65876K82349J63223P8000l5735k40623m53137m69225
4214B195946l36400q0537j32965j55795l0782l5017m076l5803l634K5518k2971
4203A383484l1032K5977R8029R759j10932Q0314K5991k7733l3392J3091k2938
4192A410618R672l6108l8777j22596p2248O1597k0800k9790k4670m3264j3019
4181A080615n7398L0863J072r2792L7617l639m4777K0829k7434n7282Q2500N0282
4169A020456l4998n9464o7366M8534N3160l6764k185j3673N4726q0734n0049n426
4157H26217M2665j02466o730Q5204P2371j5352m4646j1814j360j275p090p3537
4145G62187L0209j0125K6821N2226R235J5449j03149m2664O6735j5224N9479J9208
$$ plain form
4224 2281479 2515081 2605218 2871094 3153443 3316666 3394666 3358931 3118308 2665171 2195946
4214 2195946 1859546 1779009 1646044 1490249 1459467 1424450 1420374 1384571 1380937 1406455 1383484
4203 1383484 1352452 1378429 1476458 1486217 1375285 1455599 1481590 1453857 1420465 1433556 1410618
4192 1410618 1420290 1384182 1345405 1222809 1150561 1212158 1191358 1161568 1136898 1093634 1080615
4181 1080615 1023217 1054080 1055152 962360 999977 996338 951561 972390 944956 887674 970174 1020456
4169 1020456 985458 925994 858628 907162 960322 923558 921373 907700 962426 881692 831643 826217
4157 826217 868882 766416 759686 844890 917261 901909 857263 845449 844089 842814 835724 762187
4145 762187 792396 782271 809092 861318 870553 886002 782853 740189 806924 791700 851179 870387
4133H70387J7098M1279k0667O1402O35k8494n941j5700l7786N2256j1154p4855
4121H48460l5272K5225m9768j5446J1252L6669M0226j3053q541O1494m7075O5811
4109I19982l0148j20733J2314Q7923r910j7107j5115R6725o3808J20551J44270
4098A124944p470J3958N1113j3847n0911N6988O9766l7160o1188k812l111l3211
4086A107059m6056r804o6314P7139P1175k2210n3068J13200k6985M9482L1744
4075A225362J5605m8362j5943M338L6747K5484n6765l7804k8471M8182N6895J7663
4063A242931o3989O2213M9859M8655M0755k9996Q6005l4412R5299J418j17001
4052A381737q2426Q1826j7418j8689l9872k6017m1472M3155M7329k9410j1938
$$ plain form
4133 870387 887485 928764 908097 969499 970134 941640 935699 919999 882213 934469 923315 848460
4121 848460 813188 838413 788645 773199 784451 821120 861346 848293 839752 901246 854171 919982
4109 919982 889834 769101 781415 869338 859428 842321 827206 923931 860123 980674 1124944
4098 1124944 1117474 1131432 1182545 1168698 1117787 1174775 1244541 1207381 1146193 1143381 1140270 1107059
4086 1107059 1061003 1051199 984885 1062024 1133199 1110989 1057921 1171121 1144136 1193618 1225362
4075 1225362 1240967 1192605 1176662 1181000 1217747 1243231 1186466 1148662 1120191 1168373 1225268 1242931
4063 1242931 1178942 1241155 1291014 1339669 1380424 1350428 1436433 1402021 1497320 1498738 1381737
4052 1381737 1299311 1381137 1363719 1345030 1305158 1279141 1237669 1280824 1328153 1298743 1286805
4041A286805L8365R2228K3330m7814k8041p643j9383l0937J37271N0043K7327
4030A521551J21469n4909k8026L7579P800o3312L4007q5358o8775O1734M2021
4019A525781l5970l1722l047m1082r5218N6507O083J05660m2764O3613J4404q2546
4007A439699j7472O6585k1637l6709k5959P4992l3354K8182J1509m8723k0706
3996A416407j3080k1831p669J428R8243n2463p9609K9604J7744P8316P3880m9472
3984A491498p1349L3406J6374L0203J4276O918l8998n730l1216P0763R1656j5417
3972A592384p8742L5268L5016m231o869l6525o6548K4902N8911N6954K7883m719
3960A633684R14j0056r922j9747n9877q0756J11815P9542q4667J28133J4119J02706
$$ plain form
4041 1286805 1325170 1417398 1440728 1392914 1364873 1357230 1337847 1306910 1444181 1494224 1521551
4030 1521551 1643020 1588111 1560085 1597664 1605464 1542152 1576159 1490801 1422026 1483760 1525781
4019 1525781 1489811 1458089 1455042 1413960 1318742 1375249 1381332 1486992 1444228 1507841 1522245 1439699
4007 1439699 1422227 1488812 1467175 1430466 1404507 1479499 1446145 1474327 1485836 1437113 1416407
3996 1416407 1403327 1381496 1373827 1375255 1473498 1421035 1341426 1371030 1388774 1467090 1540970 1491498
3984 1491498 1420149 1453555 1469929 1500132 1514408 1521326 1482328 1476598 1445382 1516145 1607801 1592384
3972 1592384 1513642 1548910 1583926 1579695 1572826 1536301 1469753 1494655 1553566 1610520 1638403 1633684
3960 1633684 1634598 1624542 1614620 1594873 1534996 1454240 1566055 1645597 1560930 1689063 1703182 1805888
3948A805888l0792n8111R379J386j5172M6305J15731o4375J9488R5878O01M6453
3936A972659N4325J9612K418J4551J8062k4907j238N2413j0634l7938M1202P1214
3924B171739J03572J09089j3731k0636L5931J1044o435L1641J25101m0556J9411
3913B526170K8689j237O4056P092J06499J84349P9529M5914P5882M8899N5265
3902C221107M4385J1512J8460J32424J82515J04064L560L2981O7130Q0659J69287
3891D068084J53491K23910R1107J49306K29985J80087K23237K62782K11188K52989
3881F046166L01785L63649M19896M32581N28749M70946M06646L30698L33956K24342
3871I859414J08344p1043j32136k10021k63493l01064k19991j83870j39893j04724
$$ plain form
3948 1805888 1775096 1716985 1726364 1727750 1712578 1758883 1874614 1810239 1829727 1925605 1926206 1972659
3936 1972659 2026984 2046596 2049014 2063565 2081627 2056720 2055482 2107895 2097261 2059323 2100525 2171739
3924 2171739 2275311 2384400 2370669 2350033 2385964 2397008 2390573 2422214 2547315 2506759 2526170
3913 2526170 2554859 2553622 2617678 2624770 2731269 2915618 2995147 3041061 3116943 3165842 3221107
3902 3221107 3265492 3277004 3295464 3427888 3610403 3714467 3718027 3751008 3818138 3898797 4068084
3891 4068084 4221575 4445485 4536592 4685898 4915883 5095970 5319207 5581989 5793177 6046166
3881 6046166 6347951 6711600 7131496 7564077 8092826 8563772 8970418 9301116 9635072 9859414
3871 9859414 9967758 9896715 9764579 9554558 9291065 8990001 8770010 8586140 8446247 8341523
3861H341523o9107K8350J10137J05917M7047N6317J47972K68958K21593K78191
3851I536898K67049J86288K07111Q8830J84360L31445L10148L47526K84838L69735
3841A2114228L12169K33161K01230J09366K13061K69977J54311J77160J42307
3832A3926970M6752j04084j63772o5496k05553k35402q4957o4688q3598o7566
3822A2898606R2945J60624J39685N9523J79387J32533j8622M6555K0160Q7107
3812A3798503j2278L7520O3356O1195J37553Q0016L1364J83501J58589O6135J37894
3801A4743348M11114L52332M18217N55844O13553O87596O62661O62880O38917
3792A9746462M45406L47609K85760K9243j41162l07884k44580l56180l00738k01590
$$ plain form
3861 8341523 8272416 8300766 8410903 8516820 8563867 8620184 8768156 9037114 9258707 9536898
3851 9536898 9803947 9990235 10197346 10286176 10470536 10801981 11112129 11459655 11744493 12114228
3841 12114228 12426397 12659558 12860788 12970154 13183215 13453192 13607503 13784663 13926970
3832 13926970 13973722 13869638 13705866 13640370 13434817 13199415 13114458 13049770 12966172 12898606
3822 12898606 12991551 13152175 13291860 13351383 13530770 13663303 13644681 13691236 13711396 13798503
3812 13798503 13786225 13823745 13887101 13948296 14085849 14165865 14197229 14380730 14539319 14605454 14743348
3801 14743348 15154462 15506794 15925011 16480855 17094408 17782004 18444665 19107545 19746462
3792 19746462 20191868 20539477 20825237 20854480 20713318 20405434 20160854 19804674 19503936 19302346
3782A9302346j01694K0777N9455J36691K45699J99277K11636L32857L58487K88131
3772B1053662K70114K36461L42679L57663K71788M67403N81309N51520M80532
3763B4613131O74134P02126P24455Q18156Q81187J067873J042012J239222J377012
3754C3139308J487711J550132J691309J819658J898702K054409K056077K104295
3746D7801601K220289K156967K268313K322057K531472K606412K684835K665577
3738F7257523K687614K710876K764619K905789L183120L610771L791803L901647
3730I2813762M042453M173592M035079L702636L240742K692303J851009R26879
3722A17478455K9322j086240k266258l357297m466903n269626n458020n507865
$$ plain form
3782 19302346 19200652 19221429 19280884 19417575 19663274 19862551 20074187 20407044 20765531 21053662
3772 21053662 21323776 21560237 21902916 22260579 22532367 22999770 23581079 24132599 24613131
3763 24613131 25287265 25989391 26713846 27532002 28413189 29481062 30523074 31762296 33139308
3754 33139308 34627019 36177151 37868460 39688118 41586820 43641229 45697306 47801601
3746 47801601 50021890 52178857 54447170 56769227 59300699 61907111 64591946 67257523
3738 67257523 69945137 72656013 75420632 78326421 81509541 85120312 88912115 92813762
3730 92813762 96856215 101029807 105064886 108767522 112008264 114700567 116551576 117478455
3722 117478455 117507777 116421537 114155279 110797982 106331079 101061453 95603433 90095568
3714I0095568n093279m096142l183397k463709j941840j569762j575753k008209
3706F8163477k516041l334047m088924m478908m399239m083174l565297l008070
3698C8689777k465676k126125j960221j586861j351251j145790j107000q92591
3690B6054262q23198p97220o80159m99130n50737n39748n26445m64392m75623
3681B0697610n17083o82854o46584o68024p32696n66854n02115m80065m15157
3672A5486178l69423m64782l39077l36652l53710k88245k52511l12300l78617
3663A2390861k87530k53354k37195k99323l01116m21157l06156k75216k09964
3654I799850k24327k53127k28824j80417j70737j51609j39259j36696j21600o9111
$$ plain form
3714 90095568 85002289 80906147 77722750 75259041 73317201 71747439 70171686 68163477
3706 68163477 65647436 62313389 58224465 53745557 49346318 45263144 41697847 38689777
3698 38689777 36224101 34097976 32137755 30550894 29199643 28053853 26946853 26054262
3690 26054262 25231064 24433844 23753685 23254555 22703818 22164070 21637625 21173233 20697610
3681 20697610 20180527 19497673 18851089 18183065 17450369 16883515 16381400 15901335 15486178
3672 15486178 15116755 14651973 14312896 13976244 13622534 13334289 13081778 12769478 12390861
3663 12390861 12103331 11849977 11612782 11313459 11012343 10591186 10285030 10009814 9799850
3654 9799850 9575523 9322396 9093572 8913155 8742418 8590809 8451550 8314854 8193254 8124143
3644H124143j26067p0418j08050j88067o4843p9200j11667j13008j1333r1798
3634G159692j38148N179j41352j09186j9901L2819P5769q8622q6065j23348p1514
3623F495323j2393Q2456o0356k1058O4551r033r073j8582k328J4668P9273P0660
3611F674108J9573o025n8952M3351k7183m2426M7987M5424r65J00331N6742J8275
3599F870240M1046Q2188K16644J02364J62877J3915J44879J27046Q9171J12678
3589G963048R5103K22253Q0530R0727R1628J44300J49350O9420J72127K94822
3579I373308J31191J78289K23729K80076K49531K87076L03805K58406L89434M00160
3569A2075005L62838N57143M96072N26251O38908O60698O70612O43528N81516
$$ plain form
3644 8124143 7998076 7927658 7819608 7631541 7566698 7487498 7375831 7262823 7251490 7159692
3634 7159692 7021544 7026723 6885371 6776185 6756284 6789103 6864872 6776250 6690185 6566837 6495323
3623 6495323 6482930 6565386 6505030 6483972 6548523 6539490 6530417 6511835 6509507 6524175 6603448 6674108
3611 6674108 6693681 6687656 6628704 6672055 6644872 6602446 6650433 6695857 6694892 6795223 6851965 6870240
3599 6870240 6911286 6993474 7210118 7312482 7475359 7489274 7634153 7761199 7850370 7963048
3589 7963048 8058151 8280404 8360934 8451661 8543289 8687589 8836939 8906359 9078486 9373308
3579 9373308 9504499 9682788 9906517 10186593 10436124 10723200 11027005 11285411 11674845 12075005
3569 12075005 12437843 12994986 13491058 14017309 14656217 15316915 15987527 16631055 17212571
3560A7212571L82165K64207J76892N5668j6744j15973k00129j89416m6916K6540
3550A7548865O3887K13444K83172K78752M43664M21364L66507N35134P15042Q12156
3540B1681987R02809R65261J164970J298475J483809J549912J903551J978675
3532C2929449K256273K505013K590998K705827K496001K125376J544333Q06682
3524D9959952j33269j175982k002184k340420k382961k202360j843224j455934
3516C6423618j108341q16042n26636l50052j77373M7422L1101L35368M99717O99660
3506C5058442Q00529J096654J274516J439634J722381J875075K133923K531276
3498D7932430K773384L047988L433132L521315L405582L139422K472343J485592
$$ plain form
3560 17212571 17594736 17858943 18035835 18091503 18074759 17958786 17758657 17569241 17522325 17548865
3550 17548865 17612752 17826196 18109368 18388120 18831784 19253148 19619655 20154789 20869831 21681987
3540 21681987 22584796 23550057 24715027 26013502 27497311 29047223 30950774 32929449
3532 32929449 35185722 37690735 40281733 42987560 45483561 47608937 49153270 49959952
3524 49959952 49826683 48650701 46648517 44308097 41925136 39722776 37879552 36423618
3516 36423618 35315277 34499235 33972599 33622547 33445174 33492596 33523697 33859065 34358782 35058442
3506 35058442 35858971 36955625 38230141 39669775 41392156 43267231 45401154 47932430
3498 47932430 50705814 53753802 57186934 60708249 64113831 67253253 69725596 71211188
3490G1211188J15900j375158k868275l753996m146972m196600l707122l093873
3482D8185092k634406j960881j487724j166181q78528o07022m80105m08291j18630
3473C8443324M0992K11711O24586R00128J077471J138701J251839J549435J703849
3464D6942036J973469K156482K379871K618293K711891K613935K477597K337336
3456F6210910J985630J384668J114141R13923R22025J262852J814150K764539
3448G8372838L740498M856994O133125P698066R305955J0944995J2377499J2724289
3440A46154259J2195530J0702375P671323K893289m831000j3840557j9522553
3433A41422666j9807422j6900638j3442403j0550031q199055o375899n125367
$$ plain form
3490 71211188 71327088 69951930 67083655 63329659 59182687 54986087 51278965 48185092
3482 48185092 45550686 43589805 42102081 40935900 40057372 39450350 38970245 38561954 38443324
3473 38443324 38484316 38696027 39320613 40220741 41298212 42436913 43688752 45238187 46942036
3464 46942036 48915505 51071987 53451858 56070151 58782042 61395977 63873574 66210910
3456 66210910 68196540 69581208 70695349 71609272 72531297 73794149 75608299 78372838
3448 78372838 82113336 86970330 93103455 100801521 110107476 121052471 133429970 146154259
3440 146154259 158349789 169052164 176723487 179616776 174785776 160945219 141422666
3433 141422666 121615244 104714606 91272203 80722172 72523117 66147218 61021851
3426F1021851m282612l709620l360985l114216k822510k510695k206823j978134
3418C7036256j811212j577902j471467j394998j250579j158400r90438j005030
3410B6376230r96197q33123p67730p76846o44366n83284n50354n75752n00130
3401B0148448n29971o31456m81045m41981l97979m73877m15275k99117k10315
3392A6267432k02816j38131j42358k08982J8995L1957j31522m8647R3789J71790
3382A5711507J44295R9347J98098K56777L18874L48656L79529L61519M13775M46291
3372A8678668K89593J63320J45765j4520k03467n21622o83413o86646m44971n22037
3362A6200670m44925l04963k80359j99052j55541l4783p9096n3629n2612o1754
$$ plain form
3426 61021851 56739239 53029619 49668634 46554418 43731908 41221213 39014390 37036256
3418 37036256 35225044 33647142 32175675 30780677 29530098 28371698 27381260 26376230
3410 26376230 25380033 24546910 23779180 23002334 22357968 21774684 21224330 20648578 20148448
3401 20148448 19618477 18987021 18505976 18063995 17666016 17192139 16776864 16477747 16267432
3392 16267432 16064616 15926485 15784127 15575145 15594140 15626097 15494575 15445928 15539717 15711507
3382 15711507 15855802 15955149 16153247 16410024 16728898 17077554 17457083 17818602 18232377 18678668
3372 18678668 18968261 19131581 19277346 19262826 19059359 18537737 17854324 17167678 16722707 16200670
3362 16200670 15755745 15450782 15170423 14971371 14815830 14781047 14701951 14648322 14595710 14533956
3352A4533956k0952j6931L804j0714k24n911J31043J02653P3533M3482P7328Q76
3340A4911943j06019r9829m2685J3181J96163J90797K35568K28033K73831L11900
3330A6112883K78986P9526J504p9338j21092q5305j38022k76084l02598j86589
3320A5283871k17207j95868j73665k23154l96764l29185l10205k19765l0960j09704
3310A3077394o6070k5955j33706k9274j35204m0715r1972M4658L8968J22652J1492
3299A2772268K17239L22262K26598K34557L03470M07403M08411L67136K66328
3290A5525672J93194Q0654l4653q4842k37415l86155m06142l54433j58176j67043
3280A3970661k07971j18381M5870P914n5883P8601R4822J72928K55736K03062
$$ plain form
3352 14533956 14513004 14496073 14499877 14489163 14488939 14483028 14614071 14716724 14790257 14833739 14911067 14911943
3340 14911943 14805924 14706095 14663410 14676591 14872754 15063551 15299119 15527152 15800983 16112883
3330 16112883 16391869 16471395 16472899 16393561 16272469 16187164 16049142 15773058 15470460 15283871
3320 15283871 15066664 14870796 14697131 14473977 14077213 13748028 13437823 13218058 13187098 13077394
3310 13077394 13011324 12985369 12851663 12822389 12687185 12646470 12554498 12599156 12638124 12760776 12772268
3299 12772268 12989507 13311769 13538367 13772924 14076394 14483797 14892208 15259344 15525672
3290 15525672 15718866 15799520 15764867 15680025 15442610 15056455 14650313 14295880 14137704 13970661
3280 13970661 13762690 13644309 13690179 13698093 13642210 13720811 13815633 13988561 14244297 14447359
3270A4447359K88585K41845L78296M18262M02534L35552L76616N28554N86137
3261A8003740M83020M75131O57038O62967P00076Q36293R72071J149841J404666
3252B5344843J584295J761412J979421K115115K381042K847676L289989L785433
3244D5089226M513046N428193O172256O915246P132446O809088O104352M831647
3236I2995500K420969j762913o920123j0398288j0423979q686162o835775n048546
3228D5340683l702059k833080k180587j507075j253087j067769r73505p71641
3220C1051880n68301n83297m05359l89643l79929m25920l40276m44080m43910
3211B7071165n65228p16510p05984p48663p27697o66381o82022p54989o40510
$$ plain form
3270 14447359 14735944 14977789 15356085 15774347 16176881 16512433 16889049 17417603 18003740
3261 18003740 18486760 18961891 19618929 20281896 20981972 21818265 22790336 23940177 25344843
3252 25344843 26929138 28690550 30669971 32785086 35166128 38013804 41303793 45089226
3244 45089226 49602272 55030465 61202721 68117967 75250413 82059501 88163853 92995500
3236 92995500 95416469 93653556 86733433 76335145 65911166 57225004 50389229 45340683
3228 45340683 41638624 38805544 36624957 35117882 33864795 32797026 31823521 31051880
3220 31051880 30483579 29900282 29494923 29105280 28725351 28299431 27959155 27515075 27071165
3211 27071165 26505937 25789427 25083443 24334780 23607083 22940702 22258680 21503691 20863181
3202B0863181o67773p34884p14866n59138m63519n61889m97653l95491j86828
3193A6081140k15506r3126P34j7824M1099n102J43838K3915J36462J91060R0917
3182A6377607K48633K16690J23631K58262L96162M08438M97966O52275O75835
3173A9855499R45630J063854J112313J376252J463883J779814K105540K405121
3165C2107906L017968L567518M209563M689712M603967M449685L937322K897088
3157F3480729J095290k235637o240585p992175p112530n401231m038004l051081
3149B8504776k218743j712973j394403j266404r81137j002763j007909q15717
3141A8104727p66278n85798n18230n04429n04160m08534l07645l66241j88810
$$ plain form
3202 20863181 20195408 19460524 18745658 18186520 17723001 17161112 16663459 16267968 16081140
3193 16081140 15865634 15772508 15773242 15755418 15796517 15791415 15935253 15959168 16095630 16286690 16377607
3182 16377607 16626240 16842930 16966561 17224823 17620985 18029423 18527389 19179664 19855499
3173 19855499 20801129 21864983 22977296 24353548 25817431 27597245 29702785 32107906
3165 32107906 35125874 38693392 42902955 47592667 52196634 56646319 60583641 63480729
3157 63480729 64576019 62340382 56099797 48107622 40995092 35593861 31555857 28504776
3149 28504776 26286033 24573060 23178657 21912253 20931116 19928353 18920444 18104727
3141 18104727 17338449 16752651 16234421 15729992 15225832 14817298 14509653 14143412 13954602
3132A3954602j91421j52079r9234j12083O6728j803l1912M3719M1872r0632L0467
3121A3458224J9831l0364j3128j23518J4351M8930L7648k1941j07199j65927j95908
3110A2920999j74702j76106j68225j16553j28445j14019j3871M2045J91270Q3275
3100A2345668Q5924Q4979J24219J47587J58416K41484J96853J76903J63292L7774
3090A3763099j14057j71459k13616k07056j03296j32262j13848j0998R2375L4621
3080A2823503P0215N1581l7005K0128J0505J13129J25676J30875K30525J78242
3070A3717374L60103K94710L73509M17656N88913N92911N59934P04606P04408
3061A8314124N06469N32058K96056K7025m36464p87391o94901n87148m34716l23501
$$ plain form
3132 13954602 13763181 13611102 13511868 13399785 13466513 13464710 13432798 13476517 13518389 13427757 13458224
3121 13458224 13478055 13447691 13434563 13311045 13325396 13374326 13411974 13390033 13282834 13116907 12920999
3110 12920999 12746297 12570191 12401966 12285413 12156968 12042949 12029078 12071123 12262393 12345668
3100 12345668 12431592 12516571 12640790 12788377 12946793 13188277 13385130 13562033 13725325 13763099
3090 13763099 13649042 13477583 13263967 13056911 12953615 12821353 12707505 12696507 12788882 12823503
3080 12823503 12893718 12945299 12908294 12928422 12938927 13052056 13177732 13308607 13539132 13717374
3070 13717374 14077477 14372187 14745696 15163352 15752265 16345176 16905110 17609716 18314124
3061 18314124 18820593 19352651 19648707 19675732 19239268 18451877 17756976 17169828 16735112 16411611
3051A6411611k32026k22539j20299j38700J3395J06063J01487J2757O0355N0001
3041A6042105J65405J36553J90963J90012J83797K20863J94899J51626L02497
3032A7778720L49896L86466K66492L42734M77501N19524M05431L87642L56027
3023B1270433L16730O0429m7048k08323r4359j54351k27536n3992O3730J43356
3013B1069069J96593J93983K30536K90000L21965L45119L36857K60432M32978
3004B3677532N07383M59217N99431N81006N25166N90905N69789P30422P63490
2995B9004341O70484P38860Q57905R27172R80374J012514J072143J222570J192991
2986C7679354J283167J199529J279350J454542J533689J615453J733250J645719
$$ plain form
3051 16411611 16179585 15957046 15836747 15698047 15711442 15817505 15918992 15931749 15992104 16042105
3041 16042105 16207510 16344063 16535026 16725038 16908835 17129698 17324597 17476223 17778720
3032 17778720 18128616 18515082 18781574 19124308 19601809 20121333 20526764 20914406 21270433
3023 21270433 21587163 21647592 21600544 21392221 21297862 21143511 20915975 20861983 20925713 21069069
3013 21069069 21265662 21459645 21690181 21980181 22302146 22647265 22984122 23244554 23677532
3004 23677532 24184915 24644132 25243563 25824569 26349735 26940640 27510429 28240851 29004341
2995 29004341 29674825 30413685 31271590 32198762 33179136 34191650 35263793 36486363 37679354
2986 37679354 38962521 40162050 41441400 42895942 44429631 46045084 47778334 49424053
2978D9424053J800119J918136J896675J987412K092767K098871K199091K177036
2970F5594160K226868K258552K306811K302479K372104K379201K293260K306308
2962H4039743K247118K271339K203718K233060K237133K116546J948163J841820
2954A01138640J815031J655609J600045J426689J252797J075225R54527Q78549
2946A11797112O57486N20533M74586L65042J36988M952j44028m47259n60798q58282
2936A11946332j030772j237621j442167j489902j491988j685091j728587j850288
2928I9989916j951527j924869j961477k144185k221675k295018k335478k417195
2920H2738492k448537k423816k438901k444626k421311k361846k122119k142047
$$ plain form
2978 49424053 51224172 53142308 55038983 57026395 59119162 61218033 63417124 65594160
2970 65594160 67821028 70079580 72386391 74688870 77060974 79440175 81733435 84039743
2962 84039743 86286861 88558200 90761918 92994978 95232111 97348657 99296820 101138640
2954 101138640 102953671 104609280 106209325 107636014 108888811 109964036 110918563 111797112
2946 111797112 112454598 112975131 113449717 113814759 113951747 113956699 113812671 113365412 112804614 111946332
2936 111946332 110915560 109677939 108235772 106745870 105253882 103568791 101840204 99989916
2928 99989916 98038389 96113520 94152043 92007858 89786183 87491165 85155687 82738492
2920 82738492 80289955 77866139 75427238 72982612 70561301 68199455 66077336 63935289
2912F3935289k210415k054711k168152k011112j975654j847292j851147j792399
2904D8024407j790640j589046j362893j460200j314821j246504j223919j117713
2896C6918671r65947r45847r26128p68965p27618p16218p01852n79772n05654
2887C0080670m68089l80660l71703k39371k99634j59244j11326j25575p0195N6490
2877B7911363L0073P3883K9915J0654J33070R6283K35448K44614L13728J50963
2867B9229994L39188L47150K23272O2886N562r5010j61929j48342k35138j83651
2857B9383982j18310j5620J19276J30579J60175K40280M26968L80592L72646M89193
2847C1569761O47479O98798P85114P58183P71495Q61688Q28578Q25911Q60821
$$ plain form
2912 63935289 61724874 59670163 57502011 55490899 53515245 51667953 49816806 48024407
2904 48024407 46233767 44644721 43281828 41821628 40506807 39260303 38036384 36918671
2896 36918671 35952724 35006877 34080749 33311784 32584166 31867948 31166096 30586324 30080670
2887 30080670 29612581 29231921 28860218 28620847 28321213 28161969 28050643 27925068 27854873 27911363
2877 27911363 27941436 28015319 28045234 28055888 28188958 28285241 28520689 28765303 29079031 29229994
2867 29229994 29569182 29916332 30139604 30202490 30208052 30113042 29951113 29802771 29567633 29383982
2857 29383982 29265672 29250052 29369328 29499907 29660082 29900362 30327330 30707922 31080568 31569761
2847 31569761 32217240 32916038 33701152 34459335 35230830 36092518 36921096 37747007 38607828
2838C8607828R58737R59871J010051J138548J131801J039039Q47169O05667K49082
2829D6547793j76590n91540r54444j175849j169789j182395j105724p96952o22183
2820C8772327m93385l04118j37605l9067J77344K76275L77265N11053O08416O71465
2810D0419970P41837P73963Q86845Q86322R65276J036945J160907J173821J252298
2801D9298184J207571J213430J091680Q10158N18624k0978o08769j248589j784330
2792E0476981k142885k206937k092633j903309j726313j583134j286694j041639
2784C6493437r53063p84717n55678n32857k70189j80561j04752j1310J07515K49406
2774C3457231J57243L41773L56481M59790M72560L67363M77301N22362M53492
$$ plain form
2838 38607828 39566565 40526436 41536487 42675035 43806836 44845875 45693044 46298711 46547793
2829 46547793 46371203 45779663 44825219 43649370 42479581 41297186 40191462 39394510 38772327
2820 38772327 38278942 37974824 37837219 37798152 37975496 38251771 38629036 39140089 39748505 40419970
2810 40419970 41161807 41935770 42822615 43708937 44674213 45711158 46872065 48045886 49298184
2801 49298184 50505755 51719185 52810865 53621023 54139647 54118669 53509900 52261311 50476981
2792 50476981 48334096 46127159 44034526 42131217 40404904 38821770 37535076 36493437
2784 36493437 35540374 34755657 34199979 33667122 33396933 33216372 33111620 33100310 33207825 33457231
2774 33457231 33614474 33956247 34312728 34772518 35245078 35612441 36089742 36612104 37065596
2765C7065596M19427L05662Q0560j94145m69921q48863j227730j445144j535256
2756C2150186j591621j575269j438277j229464j040158r66004q28869o67144o91577
2747B2121803n11891l91003m36295l91603l05932k22409k46986k38843o6844j51503
2737A9158494j22543j40341j18489p6037r0461j12803q801k5837j52509j10314
2727A8200359j61578k84836l20991m08817m29639l89171m83270l90858l16493
2718A5014706k87876k60879j19482k25976k23278j18331j94369o2415j32044j30232
2708A3259824j35433j56178j35485j15417p0654n4500p9217j01973j18664m7104
2698A2245199n356n9144J25489p207l2884m4240Q332J76871N3045M0039R4440
$$ plain form
2765 37065596 37485023 37790685 37871245 37677100 37207179 36358316 35130586 33685442 32150186
2756 32150186 30558565 28983296 27545019 26315555 25275397 24309393 23480524 22813380 22121803
2747 22121803 21609912 21218909 20782614 20391011 20085079 19862670 19615684 19376841 19309997 19158494
2737 19158494 19035951 18895610 18777121 18701084 18610623 18497820 18489019 18463182 18310673 18200359
2727 18200359 18038781 17753945 17432954 17024137 16594498 16205327 15722057 15331199 15014706
2718 15014706 14726830 14465951 14346469 14120493 13897215 13778884 13584515 13522100 13390056 13259824
2708 13259824 13124391 12968213 12832728 12717311 12646657 12592157 12512940 12410967 12292303 12245199
2698 12245199 12239843 12180699 12306188 12298981 12266097 12221857 12230189 12407060 12460105 12500144 12594584
2687A2594584m222P2689K7151J24960J32412J12111J42586J59022M1603Q3848
2677A3486744R3739Q0037J39530J13898J38042J12746M2100J50270J67420J14286
2667A4638812K14442J04624Q2527J53621J52468K25336K11595K55690K21446K58127
2657A6518688L00136K76511L10775K63720L56236L48067L55997M00222K91771
2648A9422123M16447M28944L91797M75707L55882M31879M24760M93606M72634
2639B3313779N35308M41235M86330N96444N49863O60979O38664O47291P72443
2630B8642336Q14425P98925Q53164Q75399R16461R36872R92610R90903J006426
2621C6827521J020969J075191J242351J114156J193461J107538J068304J101019
$$ plain form
2687 12594584 12590362 12663051 12690202 12815162 12947574 13059685 13202271 13361293 13402896 13486744
2677 13486744 13580483 13660520 13800050 13913948 14051990 14164736 14206836 14357106 14524526 14638812
2667 14638812 14853254 14957878 15040405 15194026 15346494 15571830 15783425 16039115 16260561 16518688
2657 16518688 16818824 17095335 17406110 17669830 18026066 18374133 18730130 19130352 19422123
2648 19422123 19838570 20267514 20659311 21135018 21490900 21922779 22347539 22841145 23313779
2639 23313779 23849087 24290322 24776652 25373096 25922959 26583938 27222602 27869893 28642336
2630 28642336 29456761 30255686 31108850 31984249 32900710 33837582 34830192 35821095 36827521
2621 36827521 37848490 38923681 40166032 41280188 42473649 43581187 44649491 45750510
2613D5750510R59791J024543R41664R00035Q20121Q81774Q85628Q88277Q69868
2604E3922211P87310P58531P19859O71634O11018M62705M32831M24427K90662
2595E9081188K11439L43731L19200L68791N01648M82090N61016N28053O61433
2586F3058589P83036Q85341Q87984R15860J035117J161827J260011J421178J625943
2577G3034886J805940K000203K021087K279331K429472K614170K778659L017909
2569I1981657L206271L409358L662644L777454M035744M380795M681666M634739
2561A23770328M887764N098580N182402N316777N332698N443824N541521N439360
2553A66013254N668742N602085N662139N919637O105326O297944O529384O769866
$$ plain form
2613 45750510 46710301 47734844 48676508 49576543 50396664 51278438 52164066 53052343 53922211
2604 53922211 54709521 55468052 56187911 56859545 57470563 57933268 58366099 58790526 59081188
2595 59081188 59292627 59636358 59955558 60324349 60825997 61308087 61869103 62397156 63058589
2586 63058589 63841625 64726966 65614950 66530810 67565927 68727754 69987765 71408943 73034886
2577 73034886 74840826 76841029 78862116 81141447 83570919 86185089 88963748 91981657
2569 91981657 95187928 98597286 102259930 106037384 110073128 114453923 119135589 123770328
2561 123770328 128658092 133756672 138939074 144255851 149588549 155032373 160573894 166013254
2553 166013254 171681996 177284081 182946220 188865857 194971183 201269127 207798511 214568377
2545B14568377O863464P043824P048555O942897O716771O444197N857570N373566
2537B66859221M778713M093915L630437L142843K927363K640399K554049K534668
2529B93161608K742800L014724L210577L354467L588801L771716M101763M366699
2521C21313155M510401M795428N092051N207355N529033N537414N359684M995290
2513C62339811M338220L254158J997145N82731j098473k727172m086813n114826
2505C59484781n911816o205862o220711n980267n783110n594831n679472o278912
2497C11829800p245287q333894r691236j1129350j2675500j3920603j4680685
2490B34153245j5280419j5281484j4640307j3793151j2571944j1474740j0083734
$$ plain form
2545 214568377 221431841 228475665 235524220 242467117 249183888 255628085 261485655 266859221
2537 266859221 271637934 275731849 279362286 282505129 285432492 288072891 290626940 293161608
2529 293161608 295904408 298919132 302129709 305484176 309072977 312844693 316946456 321313155
2521 321313155 325823556 330618984 335711035 340918390 346447423 351984837 357344521 362339811
2513 362339811 366678031 369932189 371929334 372512065 371413592 368686420 364599607 359484781
2505 359484781 353572965 347367103 341146392 335166125 329383015 323788184 318108712 311829800
2497 311829800 304584513 296250619 286559383 275430033 262754533 248833930 234153245
2490 234153245 218872826 203591342 188951035 175157884 162585940 151111200 141027466
2483A41027466q902206p854499o798156n977810n483433m844185m182427l736197
2475I3248553l394863l005197k801469k467175k373487k252490k006054j879739
2467G3068079j774325j662685j584669j427646j394248j282145j163987j156457
2459F1621917j031498j246276j237416j054104j161585j238294j368202j361003
2451E1923539j467327j510329j371396j451058j446179j282753j213126j296203
2443D0885168j222782j195824j082254j044179j079876j109530j084110j196462
2435C1870151j110114j019164j025881r45341j004134r78083r14274p49462q10585
2426B3313113p14003p21720o38581n64125o23081n78598m14051m71208n75268
$$ plain form
2483 141027466 132125260 124270761 117472605 111494795 106011362 101167177 96984750 93248553
2475 93248553 89853690 86848493 84047024 81579849 79206362 76953872 74947818 73068079
2467 73068079 71293754 69631069 68046400 66618754 65224506 63942361 62778374 61621917
2459 61621917 60590419 59344143 58106727 57052623 55891038 54652744 53284542 51923539
2451 51923539 50456212 48945883 47574487 46123429 44677250 43394497 42181371 40885168
2443 40885168 39662386 38466562 37384308 36340129 35260253 34150723 33066613 31870151
2435 31870151 30760037 29740873 28714992 27769651 26765517 25787434 24873160 24123698 23313113
2426 23313113 22599110 21877390 21238809 20674684 20051603 19473005 19058954 18587746 18012478
2417A8012478m95645n15426m14753m28202m69842l74430l35085l16494m15175
2408A4247426l36832k88843l41201k37685l48972k13713k57460k50045k50914
2399A1721761k24018l02109j21354k02557j80190j35159j79652j80406j12854
2390A0083462j57665k53975q4535j45100j54826r7381k03354m2407j06345j82774
2380H655100j19804o3485m7256k23591j03986q1376j06795j18882j31600r7449
2370G560876p0215j7425n0296l4589q5194q5052l4031p5275q1573n2667n1888
2359F922671o6591j40960j47600j21310j20173o2058j00726M5524q0355o9916
2349F058506m544j13169o3421m5263j4430j23780j19174n3980j00421k4567O0368
$$ plain form
2417 18012478 17516833 17001407 16586654 16158452 15688610 15314180 14979095 14662601 14247426
2408 14247426 13910594 13621751 13280550 13042865 12693893 12480180 12222720 11972675 11721761
2399 11721761 11497743 11195634 11074280 10871723 10691533 10556374 10376722 10196316 10083462
2390 10083462 9925797 9671822 9587287 9442187 9287361 9189980 8986626 8944219 8837874 8655100
2380 8655100 8535296 8471811 8424555 8200964 8096978 8015602 7908807 7789925 7658325 7560876
2370 7560876 7490661 7473236 7422940 7388351 7303157 7218105 7184074 7108799 7027226 6974559 6922671
2359 6922671 6856080 6715120 6567520 6446210 6326037 6263979 6163253 6208777 6128422 6058506
2349 6058506 6053962 5940793 5877372 5832109 5817679 5693899 5574725 5520745 5420324 5395757 5456125
2338E456125j10654j23917o4819n3297j05348r134l8426J173k5173j42444m4295
2327D739791N192m0170j43831p4446P550j11999j04842l2775K6177J5760m6331
2316D240076O523r403o4744r1762j1989j6571m9752q0041l6198M5996M6517j12206
2304C866446j24810l7790m6180L8941q1804o7344K957m8853r1442q019J8292l4796
2292C385598m7361o6312n9472p3723l571K7659q4070O1459j4234m1468L2381j16309
2280C000577j8206N9199m918j24028n8086j9391J4521J09660j6846j01946n3840
2269B786696J6014K5199l5363J9703j05526K1821n181n9142m2323K5040j5055
2258B631883j2212J1477J42852j4959p4918L6623M5981J04002j01030m7754K5012
$$ plain form
2338 5456125 5345471 5221554 5156735 5103438 4998090 4988956 4950530 4951703 4926530 4784086 4739791
2327 4739791 4744983 4704813 4560982 4486536 4494086 4382087 4277245 4244470 4270647 4286407 4240076
2316 4240076 4246599 4237196 4172452 4080690 4068701 4052130 4002378 3922337 3886139 3932135 3978652 3866446
2304 3866446 3741636 3703846 3657666 3696607 3614803 3547459 3550416 3501563 3410121 3402102 3420394 3385598
2292 3385598 3338237 3271925 3212453 3138730 3135159 3162818 3078748 3140207 3125973 3084505 3116886 3000577
2280 3000577 2982371 3041570 3036652 2912624 2854538 2835147 2849668 2959328 2942482 2840536 2786696
2269 2786696 2802710 2827909 2792546 2812249 2706723 2728544 2723363 2664221 2621898 2646938 2631883
2258 2631883 2619671 2631148 2774000 2759041 2684123 2720746 2766727 2870729 2769699 2721945 2746957
2247B746957m2581J53229j5949P6562l2460k8803j180K5619J07556P358J0788
2236C007096K4965J22378M3997o2880M8201k5552q9000J4259R172L8922K9272
2225C160830N5147M2110m4418Q4763N4350L8770j9856K3975K9067Q563Q6241L7106
2213C556648l9153M1255Q7619L1698j0691R36R8298L7157j25974r445J9711J5092
2201C703151L2574n552j3n3867R3117j10960K6606R509o1721k8633K5528l8300
2189C591439N414J5582k2358j26267j03283r5547j06547j48617k7024o7685j08433
2178B806674j64744J2045r2635j18699K6653l7857r5828j12035k0206l8974k0949
2167B143445n9652N980q0381m9380R2709j3766K2265L118k8609M606j126R4793
$$ plain form
2247 2746957 2704376 2857605 2841656 2918218 2885758 2856955 2855775 2881394 2988950 2996308 3007096
2236 3007096 3032061 3154439 3198436 3135556 3183757 3158205 3069205 3083464 3092636 3131558 3160830
2225 3160830 3215977 3258087 3213669 3298432 3352782 3391552 3371696 3395671 3424738 3433301 3519542 3556648
2213 3556648 3517495 3558750 3646369 3678067 3667376 3668312 3766610 3803767 3677793 3668348 3688059 3703151
2201 3703151 3735725 3730173 3730160 3676293 3769410 3658450 3685056 3694565 3632844 3604211 3629739 3591439
2189 3591439 3596853 3612435 3590077 3463810 3360527 3264980 3158433 3009816 2982792 2915107 2806674
2178 2806674 2641930 2653975 2561340 2442641 2469294 2431437 2335609 2223574 2203368 2164394 2143445
2167 2143445 2083793 2089773 2009392 1960012 2052721 2038955 2061220 2064338 2035729 2040335 2039209 2134002
2155B134002J91364P0608K2642J75040O8692J6506P7247l5320r7594k55533j25449
2144B242205j75665q1346q8398l1331p0716m8038K29m9818n7414k3224P4717K260
2132A693461l3677K7605j7407l6795Q9642O5645M6176o8114J70567J05678J9325
2121B062106J61860J18643J02498J34296K49694J50972J6955J08646j64250m65397
2111B476023l52929j89729j82990q5413r8613q3647N2921j09048n9711N100m5822
2100A326142N760o0647r189o4594P1496j688K4094j6946j9067J6776j42P253L2225
2087A311473O1777J28950O4637J21502J73778M3573l2648m324j58913k01000q3750
2076A425055n9784j53998N005j57285m0174P8293p0788p3853j3969k667n3030
$$ plain form
2155 2134002 2325366 2395974 2418616 2593656 2662348 2678854 2756101 2720781 2623187 2367654 2242205
2144 2242205 2066540 1985194 1896796 1865465 1794749 1746711 1746940 1697122 1639708 1616484 1691201 1693461
2132 1693461 1659784 1687389 1669982 1633187 1722829 1788474 1834650 1766536 1937103 2042781 2062106
2121 2062106 2223966 2342609 2445107 2579403 2829097 2980069 2997024 3105670 2941420 2476023
2111 2476023 2123094 1933365 1750375 1664962 1566349 1482702 1535623 1426575 1366864 1371964 1326142
2100 1326142 1331902 1271255 1262066 1197472 1268968 1267280 1291374 1274428 1255361 1272137 1271995 1279248 1311473
2087 1311473 1373250 1502200 1566837 1688339 1862117 1905690 1873042 1868718 1709805 1508805 1425055
2076 1425055 1365271 1211273 1216278 1058993 1018819 1097112 1026324 952471 938502 935835 882805
2065H82805o8600j6263J855k3731N113l5949L062K2813J6107j6626m2440L8802
2053G66948l2957j6439R3317o6998K9379P7818N6328j8606n1332n3605K9753j7013
2041G96593l3589L5608k844k3437L6801m7437O2714P455p9129Q735j4008o0759
2029F86703K5181j9138k7325N3293k3914K1534m9859N7106m0377p5631k0070M324
2017E91827L1269k9529Q7093k8819m169N2736m5193Q1235J3833j08181p8634M2291
2005F05759j0282k0525q753Q825J045q8478J47623R8170p4272j10677o5672J06106
1993E88869q1533o5258N905N0699l8335l5655J10764m5140M3433K7090l6483m6761
1981D77595k1339J5584L7305J800l2960j5287O1480p8081m099J00752M274r8195
$$ plain form
2065 882805 814205 797942 799797 776066 781179 745230 748292 771105 787212 770586 728146 766948
2053 766948 733991 717552 810869 743871 773250 851068 907396 888790 837458 783853 813606 796593
2041 796593 763004 798612 795768 772331 809132 761695 824409 831864 752735 761470 747462 686703
2029 686703 711884 692746 665421 718714 694800 716334 666475 723581 683204 607573 587503 591827
2017 591827 623096 593567 680660 651841 647672 700408 655215 736450 750283 642102 563468 605759
2005 605759 595477 574952 566199 575024 576069 487591 635214 733384 659112 548435 482763 588869
1993 588869 507336 442078 447983 498682 460347 424692 535456 490316 533749 560839 524356 477595
1981 477595 456256 471840 509145 510945 477985 462698 524178 446097 441998 542750 547024 448829
1969D48829l7899N6235J6065j25433m8582J09075K5061m5476M4498n0479j203
1958C90691M0579l0212O5314k533r9666j5167n05M7532L5577R468J6479j1376
1946D46181n3127K6068l5939j8510K643N4547m4662l0203j3912N4670J3110m2452
1934C58414r2525R7167N2354o7351l8974j6667M0436m3127O8939N3607j9945k6541
1922C65787j7564J5627J00481o4352p6568p5406R9016K3284l0738n5577k4498
1911B59492J63796K1755m3269P0840m8729l3466J413M501q144l3925r1493P4819
1899C37590M5981J8577j727j6879N1411l2387o768N839j5147j6007o4385j4934
1887B91164k7786P3442K9982k73k4549K0296K2981o4097L0579M7410q1876L3119
$$ plain form
1969 448829 410930 467165 483230 357797 309215 418290 443351 397875 442373 391894 390691
1958 390691 431270 401058 466372 463839 364173 349006 348501 396033 431610 441078 457557 446181
1946 446181 393054 419122 383183 364673 367316 421863 377201 346998 333086 387756 400866 358414
1934 358414 265889 363056 415410 348059 309085 292418 332854 289727 358666 412273 392328 365787
1922 365787 348223 363850 464331 399979 323411 248005 347021 370305 339567 283990 259492
1911 259492 423288 445043 401774 472614 423885 390419 391832 396333 388189 354264 262771 337590
1899 337590 383571 402148 400421 383542 434953 402566 395798 401637 386490 370483 306098 291164
1887 291164 263378 336820 366802 366529 341980 362276 385257 321160 351739 399149 317273 350392
1875C50392m4526q0637O7537L5996j6871l1491K2354K6343j466n4196L0027N5434
1863C58896j4980K2931M0182p757j18331N3550N8675q4531J2704j3503k1131M187
1851B90892M3486o437j3365L6580p679J9348j2841o4972L1686j09250n310K4959
1839B27097L5953k5750N0563N7364j2946M7147r197l2184m6500M0451N9921p8567
1827C13352P3837K1600r0102N4376K0262J7276L2329M3667j15958p0728m9471
1816B50440m6106Q2599j0837K9077L7648M1451k585p0015L6102j03123K7712n3378
1804B18985k7129J6863M1291k2712O092P8322o5471N8121O7881j1395j5364j4396
1792C31088m4026L1309j491M1362j20274m2999J179r151Q8227J9467j8856p7832
$$ plain form
1875 350392 305866 225229 292766 328762 311891 280400 302754 329097 327631 273435 303462 358896
1863 358896 343916 366847 407029 399272 280941 334491 393166 308635 321339 307836 286705 290892
1851 290892 334378 327941 314576 351156 343477 362825 349984 285012 316698 207448 202138 227097
1839 227097 263050 237300 287863 345227 332281 379428 370231 338047 291547 331998 391919 313352
1827 313352 387189 408789 318687 373063 393325 410601 442930 486597 370639 299911 250440
1816 250440 204334 286933 276096 305173 342821 384272 381687 311672 347774 244651 272363 218985
1804 218985 191856 208719 250010 227298 233390 311712 246241 304362 372243 360848 345484 331088
1792 331088 287062 318371 316880 358242 237968 194969 196148 186997 275224 294691 275835 198003
1780A98003k9470J29922m4641q3144M9524k1904K9874K717K4729o4921l8389l1457
1768A20843k5138L6151k61M6357o7666j929l5126R165O2710r0745J3238M3124
1756A10723L517n245l587k7744L8263j5979l7646J9372O2438m1019l9451J5629
1744G9271R732j189j0078L5762m4065j4318O5341R5231j08717l5056j2892L3305
1732I2327j5260j8281J2062m0019N0750k9318l8900k3712j6703j6250N2887L0334
1720C9917j0564P944l009L5512o281l323m2318K9895q5366K4796n100j2517J5571
1707a4843L2375O1275j888p326o36j2197q8959L9518J11763n4880m0576j0571
1695A3055j7396J9445N133O6918M783J27M296o4085N9544p2173m8705J8384k713
$$ plain form
1780 198003 168533 298455 253814 170670 220194 198290 228164 230881 255610 190689 152300 120843
1768 120843 95705 131856 131595 177952 110286 108357 73231 82396 145106 54361 67599 110723
1756 110723 114240 108995 105408 77664 115927 99948 62302 81674 144112 103093 63642 79271
1744 79271 89003 87814 77736 113498 69433 55115 120456 215687 106970 71914 59022 92327
1732 92327 77067 58786 70848 30829 81579 52261 13361 -10351 -27054 -43304 9583 39917
1720 39917 29353 37297 34288 69800 63519 60196 17878 47773 -37593 -12797 -17897 -30414 -14843
1707 -14843 17532 78807 76919 69593 68957 56760 -32199 7319 119082 64202 23626 13055
1695 13055 -4341 15104 20237 87155 91938 92065 96361 32276 91820 19647 -29058 -10674 -13387
1682a3387m333Q3927l5876j3929M7081m8458p6539j1734J52616J6865j5155m5189
1670C5889P046R954j5671p3305P1185P6802q2544q6746K9411N9224Q1754P082
1658A20081q4006p4107K9580J0864K2954m2476M7212J6848p9089j33667L2799
1647a33007J17414K9034K0987N7086J1891j9523L3235k8018q0103L7241p7846
1636c1609Q2368n1904q97L5243m2430J0824p1635L0982K2463m4291Q9574M6618
1624G5306n8296K7300m0091m8006N3577p9938M5375l7386k8726P448Q8350Q2848
1612H7761l8556j7113q8680L9194l238P7589j0554j2451l6848k8842J26002j9909
1600G4355l4762j06490J493j1436k8189P8204k9877Q9590p3570M0004K0608m5941
$$ plain form
1682 -13387 -17720 66207 30331 16402 63483 15025 -61514 -73248 79368 96233 81078 35889
1670 35889 42935 52889 37218 -36087 35098 111900 29356 -57390 -27979 31245 112999 120081
1658 120081 36075 -38032 -8452 2412 25366 -17110 30102 46950 -32139 -165806 -133007
1647 -133007 -15593 13441 34428 91514 103405 83882 117117 89099 8996 46237 -31609
1636 -31609 50759 -1145 -2042 33201 -9229 1595 -70040 -39058 -16595 -60886 28688 75306
1624 75306 17010 44310 4219 -43787 9790 -70148 -24773 -62159 -90885 -83437 4913 87761
1612 87761 49205 32092 -56588 -17394 -20632 56957 46403 33952 -2896 -31738 94264 74355
1600 74355 39593 -66897 -65404 -76840 -105029 -26825 -56702 32888 -40682 -678 19930 -26011
1588b6011j6721j745r1246L0895O6630L8984L3970p981K3777J4791J078o2945
1576C476k9243k0597n7428K8451k4556P9549M8914j8755k6060Q2548k392R236
1564G3143l3983n7728J6089n7782j3897Q9207m6372m4841K6841K3583L2499M6250
1552E3009p4416N985P629K3283k9510l015l737l2308k7857R074M9865j8180n6857
1539i7035N2119N5676q0791K9121p5866j4725k3158p271l4459P0083N1653Q568
1527f6085K5310m2974k2764J16046J8275o4693q670P345K4905J1219N627K3839
1515B7380l3107j0566j0724j1384J2187M258n2671l00N7260q7051J00625M1324
1503C7231n6044K7386K164M8544n0341j17308N974O557O7035k1803j9415N7514
$$ plain form
1588 -26011 -42732 -44477 -135723 -104828 -38198 786 34756 26775 50552 65343 66421 3476
1576 3476 -25767 -46364 -103792 -75341 -99897 -20348 28566 9811 -16249 66299 63907 73143
1564 73143 39160 -18568 -2479 -60261 -74158 15049 -31323 -76164 -49323 -25740 6759 53009
1552 53009 -21407 -15422 -7793 15490 -14020 -17035 -20772 -53080 -80937 -71863 -21998 -40178 -97035
1539 -97035 -44916 10760 -70031 -40910 -116776 -131501 -154659 -161930 -196389 -126306 -74653 -66085
1527 -66085 -40775 -83749 -106513 9533 27808 -36885 -45555 -38210 -13305 -2086 3541 27380
1515 27380 -5727 -16293 -27017 -38401 -26214 -21956 -74627 -74927 -17667 -104718 -4093 37231
1503 37231 -18813 8573 10737 59281 8940 -108368 -102394 -95837 -28802 -50605 -70020 -12506
1491a2506J6991J6158k6623L8170r243Q479J6808o8583j6334O7023m8705l8659
1479e7024n1429n289O4474K0632j042l8419O7952L2727j1312m4523k2842P5788
1467B9693l1742j05607l7083J35962J0680K0702o4616P8234o4233L5840m5844
1456c8014j12485N2813J7772r243N1344N4287j6924k5669M1043K2621p0370J8498
1444a4327l1558K9240L8915j3377j2045Q3828l4481o4704k9549J5970l4256j01187
1432a67531n372M7322R2303R5438k249r3291j0732O3264j3780j8663N6477J195
1420D4381p100o2410k9721J6826L5232j6561k2723J6850K5300j0917k1594L3956
1408A519M6258q703L2984m0597m7001M360M2048j2930o4691M0006l7513L4792
$$ plain form
1491 -12506 4485 20643 -5980 32190 22947 31426 48234 -20349 -36683 30340 -18365 -57024
1479 -57024 -108453 -113742 -49268 -28636 -29678 -68097 -145 32582 21270 -23253 -46095 29693
1467 29693 -2049 -107656 -144739 -8777 1903 22605 -42011 36223 -28010 7830 -38014
1456 -38014 -150499 -97686 -79914 -89157 -37813 16474 -450 -26119 14924 37545 -32825 -14327
1444 -14327 -45885 -16645 22270 8893 -3152 80676 46195 -18509 -48058 -32088 -66344 -167531
1432 -167531 -172903 -125581 -33278 62160 59911 -33380 -44112 19152 5372 -13291 43186 44381
1420 44381 37281 -25129 -54850 -38024 -2792 -19353 -42076 -25226 74 -10843 -32437 1519
1408 1519 47777 39074 72058 31461 -15540 -11180 30868 17938 -46753 -6747 -44260 -9468
1396i468q2000L1652k3274j3129L9140L562p1238M5248j9778K9516K4723j07222
1384a52268j9691N2503M6204K3371K1342N2384N0695j95361J1727J16993o6869
1373e8970q1138j1086Q9541r089J6864p8076j3249j7632l0480L8096O169Q3689
1361f5361l5767n3878K1524L3717p265Q343M8529K1974Q4978n7934K9502P88Q7827
1348A16977q1156j24502q671M315Q6612p4236o8315M0567J4308Q9586M2330o5621
1336b7806P8215m6609j106K803m8084q449k9657k8959N7556l9391N2197P9488
1324D0198j1857o3557L140k1927l0874j7628p989J01711P7055p497j34319R5648
1312B2104L0659j08644n1044k7268O2230N5977J0175j8255m0830p451Q2312J8227
$$ plain form
1396 -9468 -91468 -59816 -83090 -96219 -57079 -53517 -124755 -79507 -99285 -69769 -45046 -152268
1384 -152268 -171959 -119456 -73252 -49881 -28539 23845 74540 -120821 -109094 7899 -58970
1373 -58970 -140108 -151194 -61653 -70742 -53878 -131954 -145203 -162835 -193315 -155219 -149050 -65361
1361 -65361 -101128 -155006 -133482 -99765 -107030 -98687 -50158 -28184 56794 -1140 28362 29150 116977
1348 116977 35821 -88681 -97352 -93037 -6425 -80661 -148976 -108409 -94101 -4515 37815 -27806
1336 -27806 50409 3800 2694 5497 -42587 -51036 -80693 -109652 -52096 -91487 -39290 40198
1324 40198 28341 -35216 -32076 -54003 -84877 -102505 -110494 -8783 68272 60775 -73544 22104
1312 22104 52763 -55881 -106925 -134193 -71963 -15986 -5811 -24066 -64896 -72347 9965 28192
1300B8192r3529L5826j3698M5713N9910o5640O8938n9236O05K4399j3059n5387
1288c6966p130m050N6991l3009m957P120O8424L8448l2123o3575k9162l6699n9176
1275a35864N5485O5806K6261L7776o2176k4129P3541j4775l1533M7634l1777K8959
1263C5208K6397N462L0453l8447p9326R646P3882l0001O177L7724k5137m3895
1251H143K6436M5582K3371r3114m3824o1435N4570O7246r375p4829Q955O7872
1239A9598n3965K0928K3360k4678r854M8842J2630n2101l110k707j7451O1849
1227B3341n4254m5692Q2136K8238k0884l9487j2574p7487N5584M080r572r092
1215g5663J05856p1815m3677L9918J116K1805q2616Q8366o044K5932N2195m5101
$$ plain form
1300 28192 -65337 -29511 -43209 2504 62414 -3226 65712 6476 7081 31480 18421 -36966
1288 -36966 -44096 -48146 8845 -24164 -29121 -22001 46423 84871 52748 -10827 -39989 -76688 -135864
1275 -135864 -80379 -14573 11688 49464 -12712 -36841 36700 21925 -9608 38026 6249 35208
1263 35208 61605 67067 97520 59073 -20253 -10607 63275 33274 39451 77175 52038 8143
1251 8143 34579 80161 103532 10418 -33406 -94841 -40271 26975 17600 -57229 -48274 19598
1239 19598 -34367 -13439 9921 -14757 -24611 24231 36861 -15240 -18350 -21057 -38508 23341
1227 23341 -30913 -76605 5531 33769 12885 -26602 -39176 -116663 -61079 -56999 -66571 -75663
1215 -75663 30193 -41622 -85299 -45381 -44265 -22460 -105076 -16710 -22754 3178 55373 10272
1203A0272q2966M6475M8321r383M5286k7736K0746k3525l3148l0420p584n379
1191d9041j05546M4558N8840J7775l5240O0515O1523p597K6664q6506J5854j279
1179E20r925m6802M9269m8458K4403j5219k0440J04786m2555Q9896k1118n7447
1167F910M4375j0980l0963j9917j22824j8064J13317R060K2006M3773J4563l1057
1155B0199j4329J3841M7283m4878P7003Q3845q1618m4296K8251M4862j0663m7463
1143G2037N049J9258L6642o3896K3619p285m9997o6087K6466L2598p3384O1307
1131A6327L9310j0115J7009M7513o0462l6051M9375J35709j05841K795O0561o8542
1119H7588k0511n2289O228J01691n2091L2878M8031o9313M9466J7524j2839R4150
$$ plain form
1203 10272 -72694 -26219 22102 12719 58005 30269 51015 27490 -5658 -36078 -43662 -49041
1191 -49041 -154587 -110029 -51189 -33414 -68654 -8139 53384 45787 72451 -14055 1799 520
1179 520 -9405 -56207 -6938 -55396 -30993 -46212 -66652 38134 -4421 85475 64357 6910
1167 6910 51285 40305 9342 -10575 -133399 -151463 -38146 -29086 -7080 36693 51256 20199
1155 20199 5870 19711 66994 22116 99119 182964 101346 57050 85301 130163 119500 72037
1143 72037 77086 96344 132986 69090 92709 85424 35427 -30660 -4194 28404 -44980 16327
1131 16327 55637 45522 62531 110044 49582 13531 62906 198615 92774 95569 156130 87588
1119 87588 67077 14788 21016 122707 70616 103494 151525 82212 131678 149202 136363 230513
1107B30513k9873L766k6348M1412M7749J3952l874j7778m6417L4419L8873n6761
1095B29633K7301l3681k2472O0713O4662p9674J3523L3095n6979M6212M2588k9999
1083B94922L6743P785l7592k2937L181J62583k9705r5636J127K8823k1339L2732
1071C60687M7504l7178k0108M5206k1131R154P9384o1083J552l0009O0977N2880
1059D87835L1815k7995k2986J6473K7485p012N7818L9051j3657o6637K257J5177
1047E39624m0980J35705J48258r214O3753L6136L6889l5728Q475N4237k541L7884
1035I72498m7134L1634q0133p2338K70j1507L8409R9866L2054j03490r749L1312
1023H81692N9244J7012l2583O0016L7973K662O4003K7177M8798O2609m4681K7200
$$ plain form
1107 230513 200640 204406 178058 219470 267219 281171 277297 259519 213102 247521 286394 229633
1095 229633 256934 223253 200781 261494 326156 246482 260005 293100 236121 282333 324921 294922
1083 294922 331665 339450 301858 278921 282102 444685 414980 319344 320471 349294 327955 360687
1071 360687 408191 371013 350905 396111 374980 384134 463518 402435 403987 373978 434955 487835
1059 487835 519650 491655 468669 485142 512627 505615 563433 602484 588827 522190 524447 539624
1047 539624 498644 634349 782607 773393 837146 873282 910171 874443 882918 937155 934614 972498
1035 972498 925364 956998 876865 804527 804797 793290 831699 931565 963619 860129 850380 881692
1023 881692 940936 957948 925365 985381 1023354 1026016 1090019 1117196 1165994 1228603 1183922 1211122
1011A211122K6867J35373K37346O9516J20743J07854P4380R8755J24447J66917
1001B373320L2802J26457J09755J36657K21613J49840K61044K17935K61221L45882
991D236526L71161L10048L55171L65597M14450N26591P66751R17156J038069J410318
981A0711838J788198K339480K333858K092213K246285K089588J670653n2736m700287
972B0519090n511612l381557k168138j543953j059243p73080n82542l63301l33046
963D802618k17401l68444k84764k21198k03332k73958j78949l64595k94928k11614
953B183435l4934p1095j24407p8020k5154j98545m6446N0584n5581j24826j29691
942A345320l1752o3888n1139q441m2202j2285j47967M0224k0583j43430n875k5516
$$ plain form
1011 1211122 1237989 1373362 1610708 1680224 1800967 1908821 1983201 2081956 2206403 2373320
1001 2373320 2406122 2532579 2642334 2778991 3000604 3150444 3411488 3629423 3890644 4236526
991 4236526 4607687 4917735 5272906 5638503 6052953 6579544 7346295 8263451 9301520 10711838
981 10711838 12500036 14839516 17173374 19265587 21511872 23601460 25272113 25219377 20519090
972 20519090 15007478 11625921 9457783 7913830 6854587 6081507 5498965 5135664 4802618
963 4802618 4585217 4216773 3932009 3710811 3507479 3233521 3054572 2689977 2395049 2183435
953 2183435 2148501 2077406 1952999 1874979 1849825 1651280 1604834 1655418 1599837 1475011 1345320
942 1345320 1313568 1249680 1198541 1190100 1147898 1135613 987646 1027870 1007287 863857 857982 832466
930H32466l4355p3750j63039J9038m2979r477K8708K783L2232p0366r169J1018
918E23110j5832r0948j3677O2574K7187n8368J5644r17j16716K7657k739l3629
906C23346J5477k9114J8688K8163K7935o8868j6897Q5603P0100q7035m8829L4702
894C53271K6569l5235o2177k9788J368n2208M2177k1045J0398L2488l3479l9945
882A92394k0435J8323N8967j8431K3050q1611n2558o5791m1977M7868N2396l2631
870G9564m675m332J1369J13173L2732n1802m7050K4445n3254R949l4845l432l3168
857C8674o826N8059n9078j1516L970O5259j3355n3279J4734M8179m197J4132K88
844I5044r045J2141j7636J9786j4039M1462n6988o9038M3801M6580j0728k5441
$$ plain form
930 832466 798111 724361 561322 580360 537381 527904 556612 559395 591627 521261 512092 523110
918 523110 507278 416330 402653 465227 492414 434046 449690 448773 332057 359714 356975 323346
906 323346 338823 309709 328397 356560 384495 315627 298730 384333 454433 367398 318569 353271
894 353271 379840 344605 282428 252640 254008 201800 243977 222932 233330 265818 232339 192394
882 192394 171959 190282 249249 230818 253868 172257 119699 53908 11931 59799 112195 79564
870 79564 74889 70557 81926 195099 227831 176029 128979 153424 100170 110119 75274 71842 38674
857 38674 31848 89907 30829 19313 23283 88542 75187 21908 36642 84821 80624 94756 95044
844 95044 85999 98140 80504 100290 86251 127713 70725 1687 45488 92068 81340 55899
832E5899j4875O3218m778N9996k8441p1644M1966J1377L2846l6871l1348k4099
820E3246l7774M4557K1975m785l3478j5325J096k2883L4029N2177k2430M5918
808A16323p3748m1789j6626k97K2416k3898M0062j8784K9326k0548J7487p475
796B2449j692l7687q46N7849j1036L3019N265K9089l350m7553M2168k9687j9383
783C8605L374l898N4668M8799n2199j9405k8211K8500K0121k0325m1283j5489
771A3257l958M6255J0073r2391R3450K0770m0391j8215j1065L6549K6824p3185
759G973m0401J611m7790J7641J11556k6594l5147k9039k9370K6430O1616N5149
747G3635L6465n176k8771q2673J8166k715j4048L6095R690N971p5589O5422m7891
$$ plain form
832 55899 41024 104242 99464 159460 131019 59375 101341 112718 145564 108693 77345 53246
820 53246 15472 60029 82004 77219 43741 28416 29512 6629 40658 92835 70405 116323
808 116323 42575 786 -15840 -16137 6279 -17619 22443 3659 32985 12437 29924 22449
796 22449 20757 -16930 -17776 40073 29037 62056 67321 96410 93060 45507 87675 57988 38605
783 38605 41979 38081 92749 141548 89349 69944 41733 70233 90354 70029 28746 13257
771 13257 9299 55554 65627 -26764 66686 87456 47065 28850 17785 54334 81158 7973
759 7973 -32428 -30817 -78607 -60966 50590 23996 -11151 -40190 -69560 -43130 18486 73635
747 73635 110100 104924 76153 -6520 11646 8931 -5117 30978 40668 46639 -28950 36472 -11419
734a1419q8554J19189M6066L001j21131N174K2658L5729j2901m1081j3272R266
722d7275K5938K252o558m6886J1106p433K1145R7372L9577j12893j7210M7822
710F957N5878J03586l3305m9895K8881K1155j251l6492N3514L5492l2553k4023
698A27944n0819o4888P5029l552n176N7495k6338k8383J3725m6488J63R966k6700
685C1978J8061L6960n531K4913m710l0536n2300L7653P6535n4319j48572O4566
673e302J4597o1194l6414N6330P1259m4935K3071o2930L8169o7989n8344O3111
661g0571O493M8980j5938n0639p822J46633L7922m3621R299r7100N492M3101O2950
648G5179j48463o5845R8266O6227l4113l1252j4430j4962J01393l2279j8369K2346
$$ plain form
734 -11419 -99973 19216 65282 68283 -52848 -47674 -25016 10713 -2188 -43269 -56541 -47275
722 -47275 -21337 -19085 -25643 -72529 -61423 -68856 -47711 49661 89238 -23655 -40865 6957
710 6957 62835 166421 133116 83221 112102 133257 132006 95514 149028 184520 151967 127944
698 127944 77125 12237 87266 83714 78538 136033 109695 81312 95037 48549 48712 58678 31978
685 31978 50039 86999 81468 106381 101671 71135 18835 56488 133023 78704 -69868 -5302
673 -5302 9295 -51899 -88313 -31983 39276 -5659 17412 -45518 -7349 -75338 -133682 -70571
661 -70571 -64078 -15098 -31036 -81675 -89497 57136 95058 51437 60736 -36364 -30872 12229 75179
648 75179 -73284 -139129 -40863 25364 -8749 -40001 -54431 -69393 32000 -279 -18648 3698
636C698r270m8317J1651R3930l2779o133L1445l8546L5126j57612J17002L7252
624C7447j13206M911R2147k6231r2622K2009p352p429m968K0277P5525j7871q4867
611a02230Q3756m0738K8551L2891k9389N0968k6793m9804L2250O4008k3135o3391
599d3056k8536K0714M775m489O0332O1143j9056l8877l9405p1850P1345P1446
587D4486p8371J6573L2692j16238j8676J61156p682k6696N4700r9653k6413m5788
575a09910j4242M1899L3824k9892L25M2321q539m6534M3520K4345m0934L1037
563c2780L1790n1380Q2838N800o1071p5074j2825L9497M4130j6691M5562p810
551h014q7851K1763N6202M443J9971l9208K4247L1975L6862O08l1061j8391Q989
$$ plain form
636 3698 -5572 -53889 -42238 51692 18913 12780 44225 5679 40805 -116807 195 37447
624 37447 -75759 -70848 21299 -4932 -97554 -75545 -82897 -90326 -95294 -75017 508 -17363 -102230
611 -102230 -18474 -59212 -30661 2230 -27159 23809 -2984 -52788 -20538 43470 20335 -43056
599 -43056 -71592 -50878 -46103 -50592 9740 70883 51827 12950 -26455 -98305 -26960 44486
587 44486 -33885 -17312 15380 -100858 -119534 41622 33940 7244 61944 -37709 -64122 -109910
575 -109910 -124152 -82253 -48429 -78321 -77996 -35675 -44214 -90748 -47228 -22883 -63817 -32780
563 -32780 -990 -52370 30468 36268 -24803 -99877 -112702 -73205 -29075 -45766 -204 -8014
551 -8014 -95865 -74102 -17900 -13457 6514 -32694 -8447 23528 60390 60998 29937 11546 20535
538B0535m0813k3627Q093N4183l0082n1782R2676m7433J88K1492j4843o1343p0187
525a42943Q4366l9965r8930P8701M004O2633J5517J1973n1305m240K7243J9301
513c3645L9257J2903K455K8255l2331m5790N5561M4362l4655l3491m9046J0792
501c5373P7530J9970P636M8670r4240L2035n0946K58N498K200k0576k4531Q178
488b3691p5287P0137Q6872k5181K2335o2412l8151N4467L3119j4718k5801K6204
476B7893l3004j0899r059m4598l4181N0745M1928k7392M3243L3514j5301j1677
464A1212p6985J9651k5294k9571K3337R738J11182J3175n7298j5664n0181J3425
452e3273L1087N7129k0810j4718j6147J1307l663k199j2878n0543L2051K4398
$$ plain form
538 20535 -20278 -43905 -35812 18371 -11711 -63493 29183 -18250 -18062 3430 -11413 -72756 -142943
525 -142943 -58577 -98542 -197472 -118771 -114767 -52134 -36617 -24644 -75949 -80189 -52946 -33645
513 -33645 5612 18515 20970 49225 16894 -28896 26665 71027 36372 2881 -46165 -35373
501 -35373 42157 62127 69763 118433 24193 56228 5282 5540 11038 13238 -7338 -31869 -23691
488 -23691 -98978 -28841 58031 32850 55185 -7227 -45378 9089 42208 27490 1689 27893
476 27893 -5111 -16010 -25069 -69667 -103848 -53103 -11175 -38567 4676 38190 22889 11212
464 11212 -65773 -46122 -71416 -100987 -77650 -67912 43270 56445 -853 -16517 -66698 -53273
452 -53273 -22186 34943 14133 -585 -16732 -5425 -9088 -11287 -24165 -74708 -42657 -18259
440a8259K3074O836K5584L2512N06j2423J8947q4679k1567Q1325l7514N7314n8599
427A3057j3061M7532Q0210j56184l8024J48108J3503o525p3847m9037j1233R3071
415D7570J5990j1599J7110r519L476P8297k2949j04964m5223M517p7851k9016
403a34161P7695M5309L6093L201n9677O0385l9910p3356M6211K1557L6265o3278
391d3666J0181N4589m417L6183Q4976K9326j24254N337J1154l408K6617j7210
379F5408P641l5787J8767M6498j7751m3943m3980P454O126O2645K0990J4334k5639
366H2763l6610m7704o359k1471J2690K7677p9681M1926n1642K3242Q8410j2666
354B0575n56J2320k6160k8348o2661N9762M3963j3459k4074j9244L9873O3522
$$ plain form
440 -18259 4815 11651 37235 69747 70253 57830 76777 -7902 -29469 51856 14342 71656 13057
427 13057 -4 47528 127738 -28446 -66470 81638 95141 88616 14769 -34268 -45501 47570
415 47570 63560 51961 69071 59552 63028 141325 118376 13412 -31811 -27294 -105145 -134161
403 -134161 -56466 -11157 24936 28137 -31540 28845 -11065 -84421 -38210 -16653 19612 -43666
391 -43666 -33485 21104 16687 52870 137846 167172 42918 48255 59409 56001 82618 65408
379 65408 73049 37262 56029 102527 84776 40833 -3147 4307 10433 73078 94068 108402 82763
366 82763 46153 -1551 -7910 -29381 -16691 10986 -68695 -26769 -78411 -55169 33241 20575
354 20575 20019 32339 6179 -22169 -84830 -25068 18895 5436 -18638 -37882 1991 65513
342F5513l0142m3653o4480P1555J6222k5135k8597J8116j0291k4190M0305N8532
330D3755l4084n3555J18575r128K87o863m4504q0566L6661l9812O6974O9087m893
317F1934l8298q0248Q919r852r618P0294r442k1701q784q7575J0049k566J07453
304i435q06l7706k7117P088N4453K2316K0133m1006J4057J5344K6503j7714j0312
291A5798K1887K9101j00581o2962N8570J10100l0205M8866K8574o8181M4800m5693
279E0074k4471r85J5470J9283q467L441o7991k400K9318o716N2840k7781M1031
266G2646l2462k6572K0645j9308k2133K3847Q6006q1904q2191L2796N4485p836
254A8019m4572p527P9334m0813K8671M7132l5620L0463J8478j9529r0238L165
$$ plain form
342 65513 35371 -8282 -72762 -1207 15015 -10120 -38717 -20601 -30892 -55082 -14777 43755
330 43755 9671 -43884 74691 65563 65850 58987 14483 -66083 -29422 -69234 -2260 66827 61934
317 61934 23636 -56612 -47693 -57545 -67163 3131 -6311 -28012 -36796 -124371 -114322 -116888 -9435
304 -9435 -10241 -47947 -75064 -67976 -13523 8793 28926 -12080 1977 17321 43824 26110 15798
291 15798 37685 66786 -33795 -96757 -38187 71913 41708 90574 119148 50967 95767 50074
279 50074 25603 24618 40088 59371 50904 54345 -13646 -16046 13272 6556 59396 31615 72646
266 72646 40184 13612 34257 14949 -7184 16663 102669 20765 -61426 -28630 25855 18019
254 18019 -26553 -34080 45254 4441 33112 80244 44624 75087 93565 74036 -16202 -13037
242a3037k0267j03040M2277R6103K0441R5232n0320l0867L2922O8419l8102l5832
230F3929o5303M502N6010Q204r2658m0488K7437l1427l6836J7270J51275k6487
218C5428n9804L1365k0284K7409m4512l2611J18738m5738m8832j540M7657P4449
206H1725r0349J1455L1999K5756P3378j44248p111m516L1422O2388o9985q1265
194g9351N5254p2273l823l5780J31811m364k5024K2694L6882J0997l8302M1440
182D0161J5164J0096K5778p2430n6937p0085l4611K2361l7613J16265O3480L9424
170F1053q5345L5334m9187j8426K9191m4717L4783K7592m1369K8091K2162q302
158i140P883l4021j2171L352N0673k7049o8268Q9973k7298p098l5398k8296J2905
$$ plain form
242 -13037 -33304 -136344 -94067 2036 22477 117709 67389 36522 69444 137863 99761 63929
230 63929 -1374 3128 59138 67342 -25316 -65804 -38367 -69794 -106630 -89360 61915 35428
218 35428 -24376 6989 -13295 14114 -30398 -63009 55729 9991 -38841 -40381 7276 81725
206 81725 -8624 2831 34830 60586 133964 -10284 -17395 -21911 9511 71899 1914 -79351
194 -79351 -24097 -96370 -100193 -135973 -4162 -8526 -33550 -10856 26026 37023 -1279 40161
182 40161 55325 65421 91199 18769 -38168 -108253 -142864 -120503 -158116 -41851 21629 61053
170 61053 -24292 11042 -38145 -56571 -27380 -72097 -37314 -9722 -51091 -23000 -838 -9140
158 -9140 -1257 -35278 -47449 -44097 6576 -20473 -88741 1232 -26066 -33164 -68562 -96858 -83953
145h3953N5710j4193m7656r591R800O2084K8246j7007M3076k5085R909L444o5705
132e0921p1042k1347J17365K901l757J3774k9441k3309l8126Q3395m5190Q9876
120B4178N6161k2012r4744l3367K3566r607N7042j5251l1285o5169l8487n5597
108b04572N2882O526J4556L5908K6516K8383K9419k7342m6286n0509L015M6097
96h5407k2008l0789N1810K865K0024j5249P0728o0363j6938Q358K45K1074m8763
83a04413N0721q8680n6197K7930N7386N336j5433K1703K3626k2448m3872j281
71a45622J127P395j9002k3017k3410K6685K2851M445M1605m6867k9942j1603L0748
58a64607O3188l293j7993m639J806l1492k372Q616l4667J4602l3493k0474N3112
$$ plain form
145 -83953 -28243 -42436 -90092 -99683 -89883 -27799 447 -16560 26516 1431 11340 14784 -50921
132 -50921 -121963 -143310 -25945 -23044 -26801 -13027 -42468 -65777 -103903 -20508 -65698 24178
120 24178 80339 58327 -36417 -69784 -46218 -55825 1217 -14034 -45319 -110488 -148975 -204572
108 -204572 -151690 -145164 -130608 -94700 -68184 -39801 -10382 -37724 -84010 -134519 -131504 -85407
96 -85407 -107415 -138204 -86394 -83529 -63505 -78754 -8026 -68389 -85327 -76969 -76724 -55650 -104413
83 -104413 -53692 -142372 -198569 -170639 -113253 -107917 -123350 -101647 -78021 -100469 -144341 -145622
71 -145622 -144495 -137100 -156102 -179119 -202529 -175844 -152993 -148548 -106943 -153810 -183752 -195355 -164607
58 -164607 -101419 -104712 -122705 -127344 -125538 -157030 -159402 -150786 -185453 -170851 -204344 -224818 -171706
45a71706j6799K6663L2578R891m5205o7714j3651l32O4144j5123o6143K7176M5296
32a90925K6258N036k1507k0888K1724j9879m9618K3018L512K9255R194j2813r279
19b06912j3918N6745k9011m2130l1491l6813Q3921P98l3232k4614k7004j7679
7c21340K3437N2251n7266O4478M0332M2226o3526
0b19408
$$ plain form
45 -171706 -188505 -161842 -129264 -119373 -164578 -232292 -245943 -246275 -182131 -197254 -263397 -236221 -190925
32 -190925 -164667 -159631 -181138 -202026 -180302 -200181 -249799 -226781 -223269 -194014 -184820 -197633 -206912
19 -206912 -220830 -164085 -193096 -235226 -266717 -303530 -219609 -218811 -252043 -276657 -303661 -321340
7 -321340 -297903 -245652 -302918 -238440 -198108 -155882 -219408
0 -219408
$$ Imaginary data points
##PAGE= N=2
##DATA TABLE= (X++(I..I)), XYDATA
16383c234084M031K329P1705J21651J4405L6882P5144L1328j2486O3610K9011
16372b796474M5103K7445n997O0166M4350Q2362O9793o778M8161J729M1158M8925
16360b340057N9992M0214P2591J6248M6538k00J4780N0223K0594m3514L3447l6167
16348b065311O9157Q0493P4319K5556j0497O9590K1404N8017J4776O7708L9029
16337a555759K4569K7709J443J2713N2822P8973M6045k5974N2224P5429L6910
16326a172896O0467q950k191J8444L515J02656j9943L7266Q6353K3571J0784J4148
16314h46776L9895N8666l425j0214j2365J8096M2288O8851L8536N4199N8002K5855
16302d68392M7301l8291P2338P7730K4466j4356J6065J9858J4839O3021N47L2594
$$ plain form
16383 -3234084 -3230053 -3227724 -3156019 -3034368 -3019963 -2983081 -2907937 -2876609 -2889095 -2825485 -2796474
16372 -2796474 -2751371 -2723926 -2729923 -2669757 -2625407 -2543045 -2473252 -2480030 -2431869 -2430140 -2388982 -2340057
16360 -2340057 -2280065 -2239851 -2167260 -2151012 -2104474 -2104674 -2089894 -2039671 -2019077 -2062591 -2029144 -2065311
16348 -2065311 -1996154 -1915661 -1841342 -1815786 -1826283 -1756693 -1735289 -1677272 -1662496 -1594788 -1555759
16337 -1555759 -1531190 -1503481 -1502038 -1489325 -1436503 -1357530 -1311485 -1337459 -1285235 -1209806 -1172896
16326 -1172896 -1112429 -1121379 -1123570 -1105126 -1101611 -998955 -1018898 -981632 -895279 -871708 -860924 -846776
16314 -846776 -806881 -748215 -751640 -761854 -774219 -756123 -713835 -644984 -606448 -552249 -494247 -468392
16302 -468392 -421091 -459382 -387044 -309314 -284848 -299204 -283139 -263281 -248442 -185421 -184874 -152280
16290a52280L8785k318L517Q0541J2708O6832J1517k610J8056M3402N7517N0217
16278B25884K6792o4501N5498L6488P3933M8690o4610K4448J5439P650O581J04168
16266D96460P8727K563j0346N8344J7886p9093K4745O5948K514P8549m4478L826
16254F95645J113L4524M9768k011n307N2577N9190L5984O4361p2611K0334J6797
16242I50364j305P4767J17045J1985k7841l5150J2589J3856l5987L6870M3346
16231A160539L9379L1276p361N8314k6016K1538k8069N1493m6876n191O6159L7883
16219A353068O3072Q981J8536l0479O4226N3507p9180K2754J10226j2666k3307
16208A548738o2781l3330J294O8606Q8042k8892N258L9960O0506O786j3456j5882
$$ plain form
16290 -152280 -113495 -115813 -112296 -31755 -19047 47785 59302 56692 74748 118150 175667 225884
16278 225884 252676 188175 243673 280161 354094 402784 338174 362622 378061 385711 392292 496460
16266 496460 575187 577750 567404 625748 643634 564541 589286 655234 657748 736297 691819 695645
16254 695645 696758 731282 781050 779039 773732 826309 885499 921483 985844 913233 933567 950364
16242 950364 949059 1023826 1140871 1152856 1125015 1089865 1102454 1116310 1080323 1117193 1160539
16231 1160539 1199918 1231194 1223833 1282147 1256131 1277669 1249600 1301093 1254217 1249026 1315185 1353068
16219 1353068 1416140 1425121 1443657 1413178 1477404 1530911 1451731 1474485 1584711 1572045 1548738
16208 1548738 1485957 1452627 1453921 1522527 1610569 1581677 1586935 1626895 1687401 1694187 1680731 1664849
16196A664849J6639Q7506k1189J7553K1105J3525J967M74M6255m080j480n1172
16184A791952L056K8280j4735L0025N3399N8723k964L064o0245k6827M5774K0809
16172A930311R914K0579L3420m9690q1080L4743Q1826R5696P674R175o954k4326
16160B061288K041q9453m2577J07340j2767j9596J07369N546N4933o0062K9417
16149B143479J08191j7471p8711M9450j17174k5861K1199K1519O5009O4920k0044
16138B214506J0856J9937o577J6729k760J5219r207M9611n7877j9823N9712l5094
16126B255232l2007K3247j146J317K4453j6943k0982P9358j50742n036L5570O9876
16114B262197l2272r851K8350j3847O7704k2653j3569m757O48k2297L9713M1515
$$ plain form
16196 1664849 1681488 1768994 1747805 1765358 1786463 1799988 1801955 1802429 1848684 1844604 1843124 1791952
16184 1791952 1795008 1823288 1808553 1838578 1891977 1950700 1947736 1950800 1890555 1863728 1909502 1930311
16172 1930311 1940225 1960804 1994224 1944534 1863454 1898197 1980023 2075719 2083393 2092568 2085614 2061288
16160 2061288 2063329 1973876 1931299 2038639 2025872 2006276 2113645 2119191 2174124 2114062 2143479
16149 2143479 2251670 2234199 2155488 2204938 2087764 2061903 2083102 2104621 2169630 2234550 2214506
16138 2214506 2225362 2245299 2238722 2255451 2252691 2267910 2258703 2308314 2250437 2230614 2290326 2255232
16126 2255232 2223225 2246472 2245326 2246643 2271096 2254153 2233171 2312529 2161787 2156751 2192321 2262197
16114 2262197 2229925 2220074 2248424 2234577 2302281 2279628 2266059 2261302 2261950 2239653 2279366 2320881
16102B320881q6729N0194n4606O0493k8442K909J9673q254N6901n0432J8875l0855
16090B270608N1840N4645n2891q3952J4729Q402k4309L0272J1608O1017L1689
16079B373658j2624o107R847K2899q3803K5647J8826P6186p146m106R1153N5395
16067B559825l9949o0661n3505o4625N754K820n843J9010O4612k6992q6391R132
16055B323187j1188K0301k0457M9779k342K2847O3196q3758M5612J5670J4111
16044B436958m4473j04248J3711J22429M7538l2659K0104l5040r1047k8851L9208
16033B343630m630p8402J21338k5301r901R2120K225n2759O3958m890j1108m4536
16021B391744J3588N5833l8269j6216l2268J23189K1845J2079j9209l0590r1498
$$ plain form
16102 2320881 2234152 2284346 2229740 2290233 2261791 2264700 2284373 2276119 2333020 2282588 2301463 2270608
16090 2270608 2322448 2377093 2324202 2240250 2254979 2263381 2239072 2269344 2280952 2341969 2373658
16079 2373658 2361034 2354927 2364774 2387673 2303870 2329517 2348343 2424529 2417383 2413277 2504430 2559825
16067 2559825 2519876 2459215 2405710 2341085 2346839 2349659 2343816 2362826 2427438 2400446 2314055 2323187
16055 2323187 2311999 2332300 2311843 2361622 2359280 2382127 2445323 2361565 2407177 2422847 2436958
16044 2436958 2392485 2288237 2301948 2424377 2471915 2439256 2459360 2424320 2333273 2304422 2343630
16033 2343630 2339000 2260598 2381936 2356635 2346734 2438854 2441079 2388320 2452278 2447388 2436280 2391744
16021 2391744 2405332 2461165 2422896 2406680 2374412 2497601 2519446 2531525 2512316 2481726 2390228
16010B390228k15o9268j2815J059P0325N5679l9056k8205N689k4281J1751L4532
15998B395423J4830m0079Q2246M0118k9157p7997m6200J01837m4180L583k4326
15987B376098L3537L4098j257q1452k4770K4830N1781M9988m9985J5113J2892
15976B440873N626L8337L4455L2853j7213m3234n1672n6478P913n9957L1280J18469
15964B481252J3243R723L4713L6246k7941j09527j0405J2103K8169K5144n2359
15953B440361l5005n024l1852J1048N7581k6858n319K8963J9565l2711j6322O0982
15941B465409j9353J055k6805k6779j9393k612N0132o4665R2672L6337m5608o3278
15929B377112K4428K3038J4271L1652l8673k0924n9738J9941M5203M8182J4948
$$ plain form
16010 2390228 2390013 2320745 2307930 2308989 2379314 2434993 2395937 2367732 2373421 2349140 2360891 2395423
15998 2395423 2410253 2370174 2452420 2492538 2463381 2385384 2339184 2441021 2396841 2400424 2376098
15987 2376098 2409635 2443733 2442476 2361024 2336254 2361084 2412865 2462853 2412868 2427981 2440873
15976 2440873 2446499 2484836 2519291 2552144 2534931 2491697 2440025 2383547 2391460 2331503 2362783 2481252
15964 2481252 2494495 2504218 2538931 2575177 2547236 2437709 2427304 2439407 2467576 2492720 2440361
15953 2440361 2405356 2400332 2368480 2379528 2437109 2410251 2404932 2433895 2453460 2420749 2404427 2465409
15941 2465409 2446056 2447111 2420306 2393527 2374134 2371522 2421654 2356989 2449661 2485998 2440390 2377112
15929 2377112 2401540 2424578 2438849 2470501 2431828 2410904 2351166 2371107 2416310 2464492 2479440
15918B479440j35986J4381J4854L0101q569L9462J7349K7551k6327p6019L4332
15907B410569j5973O2314k1167j32080N7580p076j9148J10506k4265K9459O7284
15896B518003n5457o4141P7L8410n5477J6335K9778l0093J4786j8912L3467n523
15884B421253J080l2767j9772L9246J0352K582m8648N1476j0J3274k0221j0829
15872B407016J54745o1667o8887o2616O0845o0389R6000J5036l6195n689l1536
15861B406663M1412J20928k0851o4970n0862j3059L2014K3588J7302q613q3707
15850B399845R368l2198n0574J42510m6469K8897l1576M2656p1021J9356k7660
15839B383134P377M4475M9483q99o596O6344k7673n087K2958k4455o3775n2338
$$ plain form
15918 2479440 2343454 2357835 2372689 2402790 2394221 2433683 2451032 2478583 2452256 2376237 2410569
15907 2410569 2394596 2456910 2435743 2303663 2361243 2354167 2335019 2445525 2421260 2450719 2518003
15896 2518003 2462546 2398405 2398482 2436892 2381415 2397750 2427528 2397435 2412221 2393309 2426776 2421253
15884 2421253 2422333 2389566 2369794 2409040 2419392 2421974 2373326 2424802 2424792 2438066 2417845 2407016
15872 2407016 2561761 2500094 2431207 2368591 2429436 2369047 2465047 2480083 2443888 2438199 2406663
15861 2406663 2448075 2569003 2548152 2483182 2432320 2419261 2451275 2474863 2492165 2483552 2399845
15850 2399845 2409213 2377015 2326441 2468951 2422482 2451379 2419803 2462459 2391438 2410794 2383134
15839 2383134 2390511 2434986 2484469 2483570 2476974 2543318 2515645 2510558 2533516 2509061 2445286 2392948
15827B392948J9833Q2476J8384l1001K844j1575J8899P8251J5110p7394n0294
15816B458481r842O993p227N1623L5713k403j382Q8211p4076l6726p748o2506
15804B439111j4305j3083O60p8215N4065J2123M466j0516N5973k6851k8808j6463
15792B378157O7129K3063j2062r3979P8345N5857j10109P2625N77J0748k4455
15781B445896q688k2329L4186J3782j4067M71m8863M0507K8927J2111q978M0784
15769B513739L2380k7471l2170k0530M7826n525p7731N9200m6292R747M328K1428
15757B478929K1714p6033j7484J4835r7653k6514L7443R8823L556L9634Q6019
15746B563269K8688O7642k2072j05313J563j374k4593j5603j7943p857O8412K1341
$$ plain form
15827 2392948 2412781 2495257 2513641 2482640 2485484 2473909 2492808 2571059 2586169 2508775 2458481
15816 2458481 2448639 2455632 2448405 2500028 2535741 2533338 2531956 2620167 2546091 2509365 2501617 2439111
15804 2439111 2424806 2411723 2412383 2334168 2388233 2400356 2404822 2394306 2450279 2423428 2394620 2378157
15792 2378157 2445286 2468349 2456287 2362308 2440653 2496510 2386401 2459026 2459603 2470351 2445896
15781 2445896 2437208 2414879 2449065 2462847 2448780 2449251 2400388 2440895 2469822 2481933 2472955 2513739
15769 2513739 2546119 2518648 2486478 2465948 2513774 2508249 2430518 2489718 2443426 2453173 2457501 2478929
15757 2478929 2500643 2424610 2407126 2421961 2324308 2297794 2335237 2434060 2437616 2477250 2563269
15746 2563269 2591957 2659599 2637527 2532214 2533777 2532403 2507810 2492207 2474264 2466407 2534819 2556160
15734B556160j00229k5274j4004J5954N1435m189j5400j978k4967K4234L6503
15723B498245j342m6260m4785L7400J03036J2430L952q4974K2289o7920M8253
15712B480324N2449p524j7096R4234n3438k1735n1380r4680J5487P7748l931p7861
15700B392597L7261R3561J1995r3196Q383K5157j09809O1791M1584k5016j2440
15689B431868k1495J4968L8588N7772q7224l4171L6868L4704L150L4665k6187
15678B483506k5567M3075O508N4041K5467L0482m8411l2311J9875N4836m4797
15667B566704r7942P8087J0455J5674k9342q7862j5794N6410k9727L1385K4804
15656B522852R6465l8385o4244o145j3025P989k8423o9757M1619K1069N457R3342
$$ plain form
15734 2556160 2455931 2430657 2416653 2432607 2484042 2479853 2464453 2462475 2437508 2461742 2498245
15723 2498245 2496903 2450643 2405858 2443258 2546294 2558724 2562676 2477702 2499991 2432071 2480324
15712 2480324 2532773 2525249 2508153 2602387 2548949 2527214 2475834 2381154 2396641 2474389 2470458 2392597
15700 2392597 2429858 2523419 2535414 2442218 2450601 2475758 2365949 2427740 2469324 2444308 2431868
15689 2431868 2410373 2425341 2463929 2521701 2434477 2400306 2437174 2471878 2475028 2509693 2483506
15678 2483506 2457939 2501014 2507522 2561563 2587030 2617512 2569101 2536790 2556665 2611501 2566704
15667 2566704 2468762 2546849 2557304 2572978 2543636 2455774 2439980 2496390 2466663 2498048 2522852
15656 2522852 2619317 2580932 2516688 2510543 2497518 2505507 2477084 2407327 2448946 2470015 2475472 2568814
15644B568814N9619p3070j06079N2019n7159j6525K3786J37103l7640k0503K421
15633B532786q4047O5434J06668n2359n7757j0936j6181J0636o092L7169k0517
$$ plain form
15644 2568814 2628433 2555363 2449284 2501303 2444144 2427619 2451405 2588508 2550868 2530365 2532786
15633 2532786 2448739 2514173 2620841 2568482 2510725 2499789 2483608 2494244 2488152 2525321 2504804
$$ [...]
##END NTUPLES=NMR SPECTRUM
##END=
