##TITLE=1H_EC-3253(II-1)
 CDCl3, 8 sc, 
 14.05.2021
##JCAMPDX= 6.0         $$ Bruker NMR JCAMP-DX V2.0
##DATA TYPE= NMR SPECTRUM
##DATA CLASS= NTUPLES
##ORIGIN= UXNMR, Bruker Analytische Messtechnik GmbH
##OWNER= root
$$ XWIN-NMR		Version 3.5
$$ Fri May 14 11:37:11 2021 Russian Standard Time (UT+4h)  she@DPX200
##.OBSERVE FREQUENCY= 200.131506
##.OBSERVE NUCLEUS= ^1H
##.ACQUISITION MODE= SIMULTANEOUS
##.ACQUISITION SCHEME= undefined
##.AVERAGES= 8
##.DIGITISER RES= 18
##SPECTROMETER/DATA SYSTEM= spect
##.PULSE SEQUENCE= zg30
##.SOLVENT NAME= CDCl3
##.SHIFT REFERENCE= (INTERNAL, CDCl3, 0, 15.972)
##AUDIT TRAIL= $$ (NUMBER, WHEN, WHO, WHERE, WHAT)
$$ ##TITLE= Audit trail, XWIN-NMR		Version 3.5
$$ ##JCAMPDX= 5.01
$$ ##ORIGIN= Bruker BioSpin GmbH
$$ ##OWNER= she
$$ F:/spectra/data/she/nmr/H-F/1/pdata/1/auditp.txt
$$ ##AUDIT TRAIL=  $$ (NUMBER, WHEN, WHO, WHERE, WHAT)
(   1,<2021-05-14 11:35:53.07 +0400>,<she>,<DPX200>,
      <created by zg, POWCHK disabled, PULCHK disabled
       configuration hash MD5:
       00 E9 B6 7A A2 85 ED C7 34 08 36 98 17 FE 4E 26
       data hash MD5: 16K
       8C AA BF 2B A9 2C 82 6C 7D 13 A0 53 07 34 F3 E1>)
(   2,<2021-05-14 11:35:55.45 +0400>,<she>,<DPX200>,
      <Start of raw data processing
       efp BC_mod = 2 LB = 0.24 FT_mod = 6 PKNL = 1 PHC0 = -11142.34 PHC1 = 28.401 SI = 16K 
       data hash MD5: 16K
       FA 2A 9E AF 24 00 62 FA FE 7B E5 4B 5D AE 3B EB>)
(   3,<2021-05-14 11:35:59.39 +0400>,<she>,<DPX200>,
      <abs ABSG = 5 
       data hash MD5: 16K
       F0 50 0F 2E 2F D3 BA 1F D9 D2 2F 02 C5 B9 DC 97>)
(   4,<2021-05-14 11:36:16.15 +0400>,<she>,<DPX200>,
      <pk PHC0 = 1.622361 PHC1 = -1.2 
       data hash MD5: 16K
       0C A3 ED 3D F6 C7 A3 31 F4 30 A4 62 25 28 68 CC>)
(   5,<2021-05-14 11:36:19.90 +0400>,<she>,<DPX200>,
      <abs ABSG = 5 
       data hash MD5: 16K
       9E FA 4B A8 E7 CA B1 18 5F F9 4B CF 0F A7 C5 17>)
$$ ##END=
$$ 
$$ hash MD5
$$ FD D3 B1 88 81 E4 77 BC 01 3A E6 E7 CB A7 82 1B
##$RELAX= 
##$RELAX= 
##$RELAX= 
##$RELAX= 
##$RELAX= 
##$RELAX= 
$$ Bruker specific parameters
$$ --------------------------
##$DU= <F:/spectra>
##$EXPNO= 1
##$NAME= <H-F>
##$PROCNO= 1
##$TYPE= <nmr>
##$USER= <she>
##$AMP= (0..31)
100 100 100 100 100 100 100 100 100 100 100 100 100 100 100 100 100 100 
100 100 100 100 100 100 100 100 100 100 100 100 100 100 
##$AQSEQ= 0
##$AQ_mod= 1
##$AUNM= <au_zg>
##$AUTOPOS= <>
##$BF1= 200.13
##$BF2= 200.13
##$BF3= 200.13
##$BF4= 200.13
##$BF5= 200.13
##$BF6= 200.13
##$BF7= 200.13
##$BF8= 200.13
##$BYTORDA= 1
##$CFDGTYP= 0
##$CFRGTYP= 5
##$CHEMSTR= <none>
##$CNST= (0..31)
1 1 145 1 1 1 1 1 1 1 1 1 1 1 1 1 1 1 1 1 1 1 1 1 1 1 1 1 1 1 1 1 
##$CPDPRG= <>
##$CPDPRG1= <>
##$CPDPRG2= <>
##$CPDPRG3= <>
##$CPDPRG4= <mlev>
##$CPDPRG5= <mlev>
##$CPDPRG6= <mlev>
##$CPDPRG7= <mlev>
##$CPDPRG8= <mlev>
##$CPDPRGB= <>
##$CPDPRGT= <>
##$D= (0..31)
0 1.2 0 0 0 0 0 0 0 0.06 0 0.03 0 0 0 0 0.0002 0 0 0 0 0 0 0 0 0 0 0 0 
0 0 0 
##$DATE= 1620977752
##$DBL= (0..7)
$$ [...]
##$SUBNAM3= <"">
##$SUBNAM4= <"">
##$SUBNAM5= <"">
##$SUBNAM6= <"">
##$SUBNAM7= <"">
##$SUBNAM8= <"">
##$SUBNAM9= <"">
##$SW= 16.9725357007746
##$SWIBOX= (0..15)
0 0 2 0 0 0 0 0 0 0 0 0 0 0 0 0 
##$SW_h= 3396.73913043478
##$TD= 16384
##$TD0= 1
##$TE= 0
##$TE2= 300
##$TE3= 300
##$TEG= 300
##$TL= (0..7)
0 120 120 120 120 120 120 120 
##$TP= (0..7)
150 150 150 150 150 150 150 150 
##$TP07= 0
##$TPNAME0= <>
##$TPNAME1= <>
##$TPNAME2= <>
##$TPNAME3= <>
##$TPNAME4= <>
##$TPNAME5= <>
##$TPNAME6= <>
##$TPNAME7= <>
##$TPOAL= (0..7)
0.5 0.5 0.5 0.5 0.5 0.5 0.5 0.5 
##$TPOFFS= (0..7)
0 0 0 0 0 0 0 0 
##$TUNHIN= 0
##$TUNHOUT= 0
##$TUNXOUT= 0
##$USERA1= <user>
##$USERA2= <user>
##$USERA3= <user>
##$USERA4= <user>
##$USERA5= <user>
##$V9= 5
##$VALIST= <valist>
##$VCLIST= <CCCCCCCCCCCCCCC>
##$VD= 0
##$VDLIST= <DDDDDDDDDDDDDDD>
##$VPLIST= <PPPPPPPPPPPPPPP>
##$VTLIST= <TTTTTTTTTTTTTTT>
##$WBST= 1024
##$WBSW= 4
##$XGAIN= (0..3)
0 0 0 0 
##$XL= 0
##$YL= 0
##$YMAX_a= 327390
##$YMIN_a= -335172
##$ZGOPTNS= <>
##$ZL1= 120
##$ZL2= 120
##$ZL3= 120
##$ZL4= 120
##$ABSF1= 15.97921
##$ABSF2= -0.9934521
##$ABSG= 5
##$ABSL= 3
##$ALPHA= 0
##$AQORDER= 0
##$ASSFAC= 0
##$ASSFACI= 0
##$ASSFACX= 0
##$ASSWID= 0
##$AUNMP= <proc_1d>
##$AZFE= 0.1
##$AZFW= 0.1
##$BCFW= 0
##$BC_mod= 2
##$BYTORDP= 0
##$COROFFS= 0
##$CY= -3
##$DATMOD= 1
##$DC= 0
##$DFILT= <>
##$DTYPP= 0
##$F1P= 0
##$F2P= 0
##$FCOR= 1
##$FTSIZE= 16384
##$FT_mod= 6
##$GAMMA= 0
##$GB= 0
##$INTBC= 1
##$INTSCL= 1.334414e-10
##$ISEN= 128
##$LB= 0.24
##$LEV0= 0
##$LPBIN= 0
##$MAXI= 10000
##$MC2= 0
##$MEAN= 0
##$ME_mod= 0
##$MI= 1.114404
##$NCOEF= 0
##$NC_proc= -7
##$NLEV= 6
##$NOISF1= 3.799351
##$NOISF2= 2.8
##$NSP= 0
##$NTH_PI= 0
##$NZP= 0
##$OFFSET= 15.97196
##$PC= 1
##$PHC0= -11140.72
##$PHC1= 27.201
##$PH_mod= 1
##$PKNL= yes
##$PPARMOD= 0
##$PSCAL= 0
##$PSIGN= 0
##$REVERSE= no
##$SF= 200.13000790276
##$SI= 16384
##$SIGF1= 3
##$SIGF2= 2
##$SINO= 5.538805
##$SIOLD= 16384
##$SREGLST= <1H.CDCl3>
##$SSB= 0
##$STSI= 16384
##$STSR= 0
##$SW_p= 3396.73913043479
##$SYMM= 0
##$S_DEV= 0
##$TDeff= 16384
##$TDoff= 0
##$TI= <>
##$TILT= no
##$TM1= 0
##$TM2= 0
##$TOPLEV= 0
##$USERP1= <user>
##$USERP2= <user>
##$USERP3= <user>
##$USERP4= <user>
##$USERP5= <user>
##$WDW= 1
##$XDIM= 16384
##$YMAX_p= 279639805
##$YMIN_p= -817579
$$ End of Bruker specific parameters
$$ ---------------------------------
##NTUPLES= NMR SPECTRUM
##VAR_NAME=  FREQUENCY,     SPECTRUM/REAL,   SPECTRUM/IMAG
##SYMBOL=    X,             R,               I
##VAR_TYPE=  INDEPENDENT,   DEPENDENT,       DEPENDENT
##VAR_FORM=  AFFN,          ASDF,            ASDF
##VAR_DIM=   16384,         16384,           16384
##UNITS=     HZ,            ARBITRARY UNITS, ARBITRARY UNITS
##FACTOR=    0.207333158178282, 1,           1
##FIRST=     3196.46849458118, 0,            0
##LAST=      -200.27063585361, 0,            0
##MIN=       -200.27063585361, -817579,      0
##MAX=       3196.46849458118, 279639805,    0
$$ Real data points
##PAGE= N=1
##DATA TABLE= (X++(R..R)), XYDATA
$$ [...]
7433 4617130 5048946 5435549 5619521 6022022 6693355 7301469 7853240 8079419 8235438 8198860
7423 8198860 8266270 8076708 7800752 7014498 6440703 5678942 5144360 4641185 4378100 4257647
7413 4257647 3954383 3674880 3721172 3965485 3785368 3880843 3652191 3658566 3654926 3696622 3515861
7402 3515861 3617171 3620746 3592867 3885290 3877321 3903998 3812018 3859182 4001815 4328527 4481402
7391 4481402 4582269 4680681 4753317 4830817 4734165 4524156 4189576 3974522 3613959 3232295
7381 3232295 2882842 3011021 2826239 2642001 2390505 2338747 2382943 2413556 2236137 2029965
7371 2029965 2094540 2072032 2149177 2122099 2249864 2249137 2407426 2337203 2121550 1929374 1786725
7360 1786725 1843931 1864672 1917230 1901120 1883814 1758943 1364726 1198074 1269696 1273764 1309410
7349 1309410 1364493 1424900 1457818 1368014 1151040 1261735 1280850 1228171 1160369 1082628 1086937
7338 1086937 1304958 1459352 1167488 1069993 1101871 991094 1090434 1044733 837035 905106
7328 905106 1029907 957178 1046848 905634 688008 808211 1015944 1070719 1162154 1289167
7318 1289167 1200135 1072988 1251185 1226360 1211311 1180421 1383708 1449240 1337008 1398964 1416698
7307 1416698 1353338 1282736 1227672 1014381 1296214 1305655 1190093 916760 1011091 1018837 993874
7296 993874 1093095 1034301 935934 962203 1015497 991559 874564 822723 1010066 993566 761071
7285 761071 726424 888004 1009101 847807 927082 750058 813068 855041 903688 964027 1182765
7274 1182765 1281925 1335890 1255762 1346295 1537167 1509435 1360396 1325749 1255876 1198033 1224385
7263 1224385 985944 1013059 1051902 1012608 821471 859052 875941 978175 931926 594358 626579
7252 626579 505132 521574 776327 727278 748709 661508 696798 913851 770062 794851 898878
7241 898878 814424 931942 1098567 1199887 1030884 1111408 1282754 1348060 1264069 1126641
7231 1126641 1232068 1642551 1724497 1811404 1683123 1612936 1595096 1658291 1669028 1639062 1589491
7220 1589491 1295397 1261997 1213795 1464418 1500110 1442735 1513430 1631222 1801569 2051084
7210 2051084 2023469 2137613 2338042 2380852 2545034 2896034 3489281 3834951 4427852 4820335
7200 4820335 5241594 5400282 5612955 5821292 5839804 5689604 5547590 5410975 4810887 4220719
7190 4220719 3718043 3364996 2977117 2789689 2504443 2355632 2450925 2324848 2293440 2290023
7180 2290023 2308167 2121833 2035759 2109252 2152888 2039764 2127007 1842085 2043655 2258174
7170 2258174 2274256 2258926 2424594 2799095 2801560 3165663 3235060 3627251 4196680 4724940
7160 4724940 4911297 4933478 4941883 4827131 4340856 3857841 3549022 3219953 2846319 2367179
7150 2367179 2147451 1872760 1776636 1495733 1314730 1309184 1252854 1164851 949770 1032677 1037988
7139 1037988 986904 836551 895334 586039 513213 643169 617871 656711 539769 445613 244098
7128 244098 174114 44406 12267 248485 300916 99344 -24362 45048 189419 162369 -110824
7117 -110824 -61266 123990 207812 28481 -107220 -80979 -78059 -113980 -183730 -325281 -187917
7106 -187917 14890 -67479 -126163 -286963 -252175 -177320 -249316 -167550 -118110 116031 -41893
7095 -41893 -234997 -171885 -130643 -145175 -237315 -233374 -221522 -85171 -264149 -331680 -438264
7084 -438264 -440769 -324035 -379108 -370724 -312099 -326849 -250372 -258175 -424462 -519109 -450558 -486866
7072 -486866 -403170 -554636 -325286 -170665 -258101 -330346 -474717 -561670 -488809 -462014 -445254
7061 -445254 -396386 -360733 -417158 -547495 -523564 -406207 -397235 -354940 -419806 -734750 -594764
7050 -594764 -503579 -382978 -265617 -477237 -543312 -463140 -294947 -384069 -392671 -401990 -523899
7039 -523899 -519810 -515838 -399835 -375556 -257390 -245296 -279704 -397266 -387206 -402311 -273425
7028 -273425 -295618 -161578 -267701 -312790 -377972 -447237 -428049 -303595 -338780 -417151 -402607
7017 -402607 -324205 -201983 -397907 -458247 -548448 -520903 -417305 -453471 -476834 -495266 -486976
7006 -486976 -694526 -576876 -471710 -464862 -587300 -581373 -675043 -588325 -285264 -367713 -391960
6995 -391960 -554315 -256226 -359603 -289157 -324673 -184631 -379474 -403422 -526925 -560668
6985 -560668 -213939 -260136 -353817 -508741 -597467 -573811 -459770 -754661 -618752 -462773
6975 -462773 -505422 -512415 -515106 -494270 -456839 -468041 -552149 -395523 -412524 -423030 -414681 -406400
6963 -406400 -385560 -275577 -154210 -320596 -495555 -586038 -397728 -272856 -305081 -662137
6953 -662137 -494218 -540456 -506158 -555459 -583146 -402600 -489028 -677883 -817579 -451143 -355913
6942 -355913 -357428 -682299 -719120 -524784 -385332 -455038 -635036 -639992 -503966 -496593 -589050
6931 -589050 -393056 -322179 -340117 -352949 -372313 -596716 -495602 -476800 -467026 -392979 -353697
6920 -353697 -229380 -210684 -179450 -418610 -495992 -508356 -328401 -474396 -465605 -350169 -218769
6909 -218769 -222346 -469619 -486470 -505776 -506963 -523629 -375627 -342591 -270941 -236956 -107189
6898 -107189 -310119 -555809 -390876 -194695 -237784 -305216 -324958 -304410 -389062 -455597 -271312
6887 -271312 -92109 62627 -77991 -193204 -290199 -128795 -177751 -440692 -335890 -189316
6877 -189316 -184862 -203533 -460601 -622894 -276695 -139400 -123804 -274196 -197294 -108512 -149320
6866 -149320 -54135 -198707 -277552 1759 -190647 -398005 -226588 -135482 -64407 -100058 -144575
6855 -144575 -220046 -154000 -311708 -342764 -292509 -244903 -151638 -110139 -114256 -178704 9017
6844 9017 91284 137231 66054 36791 -87623 -114363 -187312 1983 108030 16940 218634
6833 218634 26770 104271 182947 183621 31602 265753 376329 543181 561369 739157 919388
6822 919388 919021 983602 1170284 1151367 1129593 1212794 1012292 976316 827816 557380 546852
6811 546852 699872 630286 656519 557323 574952 614342 558923 569366 558204 656634 723759
6800 723759 864453 852906 1070892 1209302 1242713 1190832 1306026 1499898 1305421 1199138
6790 1199138 906336 712176 510185 583705 424484 356865 404932 424436 287339 308805
6780 308805 354514 437561 396133 262171 232696 159527 432205 604297 376456 147075 93102
6769 93102 204983 215178 298432 240645 245337 85246 229076 498078 313555 390613 400121
6758 400121 284028 337447 652687 725550 701737 337521 67920 186358 394552 511203
6748 511203 577388 460038 175961 257897 302025 205518 84570 -72370 -88482 100451 196341
6737 196341 372396 320102 179260 59294 115250 86429 91565 275036 353587 252738 184004
6726 184004 79131 162577 150148 146564 72533 135089 350602 235414 226713 88724 239264
6715 239264 167387 369319 431420 346155 388532 328707 543774 622836 564120 461484 373643
6704 373643 360847 459622 473895 481508 497710 364437 354975 292935 391693 248040 333904 239438
6692 239438 181496 181347 259367 140809 33785 36542 52806 156106 78430 179015 212950
6681 212950 153032 -141297 154 50367 163692 152957 248313 144688 119273 41851 -118740
6670 -118740 4980 -150963 -55376 -168202 -27385 18071 247566 206883 74208 59652
6660 59652 40431 157805 21628 25039 -44275 187310 162333 88797 -204836 -85448 77812
6649 77812 175984 -32157 -97811 144167 46567 -45391 -117007 56335 85002 212560 34540
6638 34540 110737 221949 220034 418345 225257 90647 139884 271392 202723 221817 218047
6627 218047 380665 177813 111481 272704 353589 555535 287166 213366 187919 320495
6617 320495 134129 219252 260360 468712 560735 467320 257431 186684 101962 80079 -109656
6606 -109656 -241150 -60129 -77764 -7696 66068 36442 71067 197493 78027 -64217 36719
6595 36719 128756 164729 67984 1147 1604 20461 -29557 -191409 -28749 147440 12257
6584 12257 -88699 -208952 -22217 131347 1901 42940 14174 -83818 -37299 -62027 -206326
6573 -206326 -74499 66199 -18633 -117667 -108076 -103205 -221729 -455823 -300552 -255620 -136574
6562 -136574 -94324 -50053 -123340 29026 -101159 -91552 -140578 -148555 -88133 -200841 -239404
6551 -239404 -32566 138245 -41736 -211302 -107914 -230305 -248997 -228392 -248178 -141706
6541 -141706 -91953 -198414 -333452 -279880 -114844 17694 -118504 -113396 -282946 -64701
6531 -64701 -126584 -22750 -232879 -168470 -241084 -181434 -221451 -225228 -168531 -255630 -46869
6520 -46869 -292477 -113270 -44343 -143339 -395934 -410718 -329315 73361 62797 -99714 -249883
6509 -249883 -267353 257435 213411 86555 -100724 -306056 -143412 204675 164564 17067
6499 17067 -213515 -419336 -354481 -166539 20561 -27009 -179921 -374696 -318805 -232717 121324
6488 121324 -25710 -128342 -119607 68949 263651 201418 7195 -179690 -301879 -85001
6478 -85001 136862 44279 40033 -136805 -230098 -216355 -122767 -210097 -136270 -101068 -97351 -78062
6466 -78062 52782 151767 -36329 -50769 -145068 -51678 14174 38208 -40160 -211541 -289281
6455 -289281 -67310 -51602 -144695 67061 67257 -64470 -9032 32445 8075 142299 75086
6444 75086 46817 -96293 41173 195016 162143 -159674 -114550 46984 122837 353950 311970
6433 311970 77471 114913 262568 365498 282586 93067 139549 319682 311900 469685 510137
6422 510137 383424 332042 440277 455517 355554 367433 415636 494388 568033 703968 932628
6411 932628 686721 548356 571296 776923 909209 1048834 1066377 1207209 1438709 1283761
6401 1283761 1242083 1169577 1229907 1165552 1261584 1361784 1521971 1495941 1561181 1317244 1156287
6390 1156287 1174121 1330567 1399812 1191081 1140399 1151806 1186207 1031286 1034680 925960 1093900
6379 1093900 1097662 1121351 979336 1036382 887290 636121 802804 551677 662411 651261
6369 651261 853159 739271 788453 620119 524763 437183 574891 783610 796272 862632 753745
6358 753745 676256 463220 567575 403700 594060 556484 717510 719605 676921 752168 838860
6347 838860 879645 776468 670524 627382 985153 1253869 1267619 1164167 1102045 1039840 1095943
6336 1095943 1250826 1317070 1283592 1481607 1489036 1618536 1788846 1759535 1895376 1894249 2061392
6325 2061392 2018167 2002834 1884198 1928318 2012027 2017480 2073440 1976318 2073639 1907268 1731311
6314 1731311 1648481 1492649 1469836 1456566 1424746 1407646 1503244 1495081 1282743 1144001 822077
6303 822077 896176 952506 1041429 1124718 1226322 1106602 1134782 923353 894299 789359 806771
6292 806771 952016 935361 999916 1023232 939192 948668 985028 927783 1018309 1178182 1214847
6281 1214847 1361884 1412650 1286718 1218667 1267463 1270505 1478507 1730588 1687876 1786151 1881599
6270 1881599 1891756 1861303 1543739 1437832 1621172 1643379 1721298 1646833 1569935 1433402 1346540
6259 1346540 1217701 1182296 1101535 1124715 1060230 1087460 1118469 1141382 1020082 1035799 978715
6248 978715 1008312 1033227 1216544 1063446 980848 927137 830090 960515 897606 848199 844276
6237 844276 957374 846990 816434 818546 869806 854086 843227 860887 813887 877944 857003
6226 857003 790296 713670 783860 669518 433228 398043 452798 645304 838246 474004 307713
6215 307713 470060 525107 631864 401117 322106 248066 368801 560278 469138 281275
6205 281275 299242 380724 504641 373083 379073 567843 769329 595181 465993 590547
6195 590547 742016 591630 415780 625366 713007 711183 461995 337767 520942 796565
6185 796565 724662 535331 499616 578574 673811 435608 299331 481949 740510 701441 620708
6174 620708 425800 502570 623763 525931 355964 442366 724384 753265 985289 619665
6164 619665 631674 588129 576245 360251 332859 525137 667823 601844 318595 389613 500286
6153 500286 653802 430861 248365 491458 804523 1010464 837939 568735 534414 671754
6143 671754 694101 664181 777402 800538 676992 807522 782733 1036417 965928 714715 663631
6132 663631 651240 1010736 1096470 963488 792016 933308 839199 974440 996166 1008315 1119876
6121 1119876 1032773 938321 674110 830988 959905 816226 607046 599602 699323 972102
6111 972102 881606 566907 517450 666666 679131 442638 316372 251040 370307 409809 401814
6100 401814 295386 475158 615791 490484 443055 563356 709705 813253 583403 449290
6090 449290 493065 760316 636201 379692 435149 581514 525093 479028 437163 466700 368994
6079 368994 316367 342252 314482 430896 497617 396964 197518 123332 171523 317267 290908
6068 290908 245121 227630 270378 390942 450768 470114 487682 306258 345221 287135 308516
6057 308516 429492 434749 472436 496724 395566 418883 371665 379950 451350 448281 543613 464651
6045 464651 422536 301546 450987 672205 704354 543589 327801 236762 273182 440309
6035 440309 515688 550233 759025 835311 819471 642848 527262 634667 827948 734958 691778
6024 691778 745342 963292 982702 854930 787581 1055852 909784 696903 535351 551990
6014 551990 654345 705252 648390 472069 543150 692332 659739 452103 520378 621480 665480
6003 665480 596855 641679 507137 662739 742585 469828 432288 425935 503668 600696 555921
5992 555921 414773 483120 592340 575915 505399 687302 786958 537095 588293 502840 542441
5981 542441 639915 702650 488188 611775 678609 731229 610346 534720 644021 595569 655703
5970 655703 548412 673846 830711 808209 804350 778399 618095 494628 775641 798915 916868
5959 916868 1029544 1127708 915447 656084 487011 790168 864617 873839 809010 974502 1075753
5948 1075753 1041507 1035845 806857 742978 772399 937906 1098348 1124278 994252 992124 1159337
5937 1159337 1231566 1259307 1327299 1353628 1179348 1228962 1307876 1244386 1103517 1149974 1016224
5926 1016224 1111928 1161637 1171258 1257613 947699 853053 621562 928387 943402 976762 919503
5915 919503 1128899 1180728 1103373 958804 769397 712737 848988 950529 1121581 1286463
5905 1286463 1259068 1227552 1166253 1331357 1181616 1271290 1258054 1224257 1135526 1408745 1557139
5894 1557139 1258128 1308589 1166627 1008063 1122216 1388574 1320522 1350875 1355125 1359563 1292424
5883 1292424 1463710 1473839 1473268 1509862 1439418 1624184 1641064 1667209 1535062 1465765 1517793
5872 1517793 1483356 1328229 1528041 1521389 1354104 1395990 1407731 1441849 1545538 1656132 1443099
5861 1443099 1353446 1377702 1718767 1584282 1430881 1166799 1126116 1214083 1444274 1518395
5851 1518395 1470804 1417177 1189597 1156952 1144205 1306096 1399002 1489775 1386095 1646300 1642898
5840 1642898 1571995 1572390 1461557 1429853 1520189 1787160 1805981 1777305 1779944 1900390 1697715
5829 1697715 1757952 1606205 1911694 1860419 1725153 1830853 2011669 2016261 1959755 2109174
5819 2109174 1926862 1963833 2068655 2167642 2124189 2152586 2091671 1999001 1890127 1913008 2177600
5808 2177600 2284799 2306958 2227526 2123070 1965455 1965363 2060421 2157365 2256145 2211836 2318165
5797 2318165 2452425 2369913 2195997 2219991 2320555 2600480 2694942 2922542 2630079 2764153
5787 2764153 2850819 2842736 2798288 2935450 3156863 3406981 3506199 3550168 3699935 3729530 3838871
5776 3838871 3633655 3724827 4022788 4191280 4342302 4482334 4572682 4565871 4850526 4956075
5766 4956075 5079417 5205601 5581580 5792825 5914518 6242364 6584758 6533552 6714358 7012864
5756 7012864 7260998 7617265 8033389 8212834 8486672 8861919 9208373 9621615 10290815 10716986
5746 10716986 10903693 11620384 12073399 12529412 12904837 13486537 13865200 14400155 14771989
5737 14771989 15119310 15310306 15364157 15446987 15404543 15301297 15104476 14929931 14838062 14467822
5727 14467822 13908428 13446050 12780582 12462792 12307207 11684438 11249256 10886735 10544484
5718 10544484 9985616 9674337 9367682 9135722 8620481 8367606 8233792 8140596 8018907 7804557
5708 7804557 7727034 7465359 7473929 7289949 7342278 7312490 7302714 7156938 7062163 6821680 6837920
5697 6837920 7074682 7264732 7275890 7268303 7340084 7361849 7524034 7459095 7470328 7441072 7750616
5686 7750616 7773219 7718343 7824120 7710653 7644509 7498098 7504671 7078594 7067587 6910016 6765179
5675 6765179 6491970 6198093 6046477 5866844 5494519 5221474 5346503 5279079 5165867 4891590
5665 4891590 4801418 4723206 4585224 4378277 4388432 4212874 4145352 4114988 4025935 3860020 3964522
5654 3964522 3871901 3699792 3660560 3620969 3807861 3717498 3493834 3352417 3184827 3063080
5644 3063080 3095653 3053506 3018143 2930474 2930608 2806316 2738035 2745270 2742656 2587426 2178255 2181824
5632 2181824 2230246 2468761 2517932 2298039 2164207 2404425 2447776 2247295 2208086 2187196
5622 2187196 2047055 2098361 2143227 2204675 2217281 2017156 2045519 2077411 2170885 2245471 2033139
5611 2033139 2075608 2165396 2252241 2384222 2241054 1902635 1853244 1976821 2028565 1985584 2002393
5600 2002393 2036065 1987042 1928605 2042925 2061172 1853450 1872211 1671574 1627011 1923451 2093401
5589 2093401 1938091 1966187 1702441 1717742 1542645 1577269 1582823 1514867 1544765 1516941 1577628
5578 1577628 1593069 1722209 1521280 1510305 1422046 1474999 1515900 1552988 1467211 1510788 1577716
5567 1577716 1540897 1636272 1657216 1620948 1481461 1355155 1295919 1443950 1398195 1412732 1542442
5556 1542442 1555357 1543438 1597698 1568384 1437935 1535155 1276432 1483089 1470256 1563032 1652119
5545 1652119 1478162 1303459 1519548 1718258 1468932 1378921 1367938 1400647 1536842 1608112
5535 1608112 1642363 1675893 1490822 1464047 1427081 1521214 1552948 1515884 1453649 1491824 1660957
5524 1660957 1616733 1728506 1595900 1437602 1603915 1447929 1554675 1519638 1667915 1711742
5514 1711742 1651583 1512042 1645442 1518380 1589460 1582038 1407133 1419701 1680025 1859954
5504 1859954 1857137 1833050 1611358 1632263 1719598 1636213 1596514 1639028 1750394 1655328 1726453
5493 1726453 1917169 1946007 1900721 1893574 1735600 1833139 1880655 1965243 1857986 1889349 1942006
5482 1942006 1885196 1978629 1754651 1731042 1746843 1715312 1751707 1768299 1744718 1932740 1846152
5471 1846152 1722852 1809427 1926347 1846109 1948969 1958454 1913221 1887767 1884734 1892864 2019030
5460 2019030 2144344 2178335 2159392 1951604 1940938 2243449 2292560 2185509 2222632 2231446 2152323
5449 2152323 2178235 2006389 2009317 1975314 2051438 2135154 2184827 2022049 2127945 2010515 1874960
5438 1874960 1862727 1890254 1934953 1814661 1846437 1994694 2120720 2008182 1849977 1703230
5428 1703230 1729371 1849549 1941441 1949328 1983195 1770661 1771362 1763889 1860315 2042579 2095518 1958171
5416 1958171 1906003 1923251 2075188 2331321 1960634 1860249 1888359 1998487 2074294 2037168
5406 2037168 1999940 2055860 1959962 1842038 2005474 1997767 2035459 2017128 2055515 2206074 2336921
5395 2336921 2196707 2193264 2051866 1877627 2005749 2292644 2211052 1922614 2110075 2139966
5385 2139966 2241414 1996935 2013107 2068776 2208873 2164831 2171848 2208994 2250348 2194028 1927150
5374 1927150 2056958 2104948 2282980 2065409 2073349 2135430 2321367 2320843 2278299 2280172 2227384
5363 2227384 2351012 2445589 2354892 2285046 2361609 2376167 2534562 2278722 2323030 2539210 2576005
5352 2576005 2346750 2182843 2255638 2264718 2395567 2469631 2749479 2646333 2695498 2721996 2564433
5341 2564433 2529073 2585512 2694135 2693189 2791728 2906479 3046718 3044680 2983164 2980316 2921356 2942321
5329 2942321 3124096 3091576 3013372 3033960 3072319 3167559 3221318 3169960 3230170 3170543 3098092
5318 3098092 3236311 3220459 3128784 3146170 3196150 3200189 3370876 3398288 3426892 3283995 3083137
5307 3083137 3258928 3387395 3348917 3334671 3370119 3747379 3884995 3840204 3831933 3858178 3923164
5296 3923164 3861985 3893686 3984581 4168695 4178401 4094998 4165538 4214005 4185684 4238383 4198557
5285 4198557 4341327 4356537 4465310 4785725 4809815 4759375 4713744 4951440 5000653 5208142
5275 5208142 5374813 5617675 5706798 6040940 6091713 6276466 6493136 6423620 6506730 6519032
5265 6519032 6679668 6724867 6788448 6610318 6746027 6741957 6686825 6791135 6868591 7115125 7341161
5254 7341161 7543048 7870095 8107540 8374964 8773887 9045094 9497527 10070622 10415227 10811472
5244 10811472 11080984 11198572 11405852 11581465 11539106 11714381 11834713 11764960 11672163 11768040
5234 11768040 11600925 11500511 11507524 11271514 11163091 11091067 11037781 10901999 10838314 11031137
5224 11031137 11299355 11472614 11750781 11961938 12291435 12779575 13180073 13704215 14172233
5215 14172233 14650258 15558827 16460088 17082722 17629301 18209538 18563110 18781749 18747755 18566964
5205 18566964 18172948 17807060 17480112 17285869 17393830 17495496 17887300 18032624 18287378
5196 18287378 18573869 18667390 18684595 18735408 18769253 18970723 19469101 20164707 20969488 21993032
5186 21993032 23090202 24132455 25343780 26275511 26981588 27106306 26608011 25913161 25140729
5177 25140729 24495473 23952780 23525038 22859670 22465247 21943423 21654685 21473927 21675644
5168 21675644 21906003 22218738 22879176 23632197 24557441 25305208 26068770 26547984 26732579
5159 26732579 26952004 27431869 28164644 29460496 30885120 32595005 34434795 36476182 38244154
5150 38244154 39433300 39682977 38577343 36170434 33048562 30166226 27630945 25500202
5142 25500202 23713623 22175970 21119368 20258692 19668893 19165457 18824678 18439610 18508834
5133 18508834 18500671 18616777 19000023 19190057 19487222 19784196 19872577 19813364 20001199 20152284
5123 20152284 20399345 20736025 21460296 21914683 22519296 22981652 23221303 22853992 21776693
5114 21776693 20449164 18864850 17380620 15948843 14747765 13943963 13523742 13003815 12279119
5105 12279119 11679032 11193992 10835134 10581674 10349198 10110721 9970757 9746980 9524234
5096 9524234 9401153 9324301 9241863 9140436 8924180 8714818 8707411 8807353 8754558 8582796 8451389
5085 8451389 8163974 8206871 8145659 7973801 7892969 7768253 7831319 7669283 7628252 7736111
5075 7736111 7783381 7609086 7548553 7657233 7841165 7870394 7761057 7614758 7531228 7653762
5065 7653762 7625864 7769766 7644505 7336919 7432954 7608778 7343726 7110004 7237050 7276571
5055 7276571 7163678 7266436 7209619 7157808 7095042 6990463 7039083 7252707 7518214 7533210
5045 7533210 7689077 7897018 7920757 7942885 7678824 7569635 7668016 7818356 7672842 7684689
5035 7684689 7512127 7356010 7294381 7247317 7196340 7224490 7255845 7295942 7400762 7192916 7346345
5024 7346345 7564647 7598338 7737746 7964551 7885536 8064629 8088955 8102545 8178310 7783885
5014 7783885 7814143 7888893 7885180 7675532 7780801 7880818 7931701 7846697 7841674 8060896 8127543
5003 8127543 7813189 7519016 7431358 7326472 7171796 6895313 6947726 6881831 6883602 6832607 6948277
4992 6948277 6840358 6905751 6843250 6886655 6816086 6792639 7088300 7165343 7290871 7436791 7555776
4981 7555776 7515955 7582106 7466083 7527712 7772506 7738687 7755545 7714444 7726147 7758471 7800342
4970 7800342 7731893 7747427 7777757 7851890 7783515 7723895 7812102 7734283 7611688 7609403 7611228 7618881
4958 7618881 7644258 7650276 7549144 7535925 7827615 7935307 8027095 8019259 8195886 8253185 8440563
4947 8440563 8484131 8482579 8676141 8895458 9027481 8953894 9000002 8935904 8935142 8850599 8973473
4936 8973473 9034343 9149105 9103807 9404146 9516587 9624935 9516231 9384474 9179017 9047320
4926 9047320 9113881 8927218 9015593 8877609 9050791 9027168 9124710 9182940 9487149 9631403
4916 9631403 9574009 9701609 9987726 10564434 10962522 11389746 11550788 12084339 12387422 12618087
4906 12618087 12808039 13041039 12875071 12693602 12591826 12516165 12529669 12508702 12380465 11980701
4896 11980701 11882901 11645886 11390671 10958006 10903258 10717129 10610294 10521121 10386687 10347528
4886 10347528 10220828 10263918 10235518 10639364 10698288 11056125 11209694 11291295 11613190 12012268
4876 12012268 12430066 12548391 12613809 12773150 13237959 13155186 13307085 13223448 13216849 13138001
4866 13138001 12999949 12637402 12435298 12069336 11678254 11239285 10674080 10423989 9990928
4857 9990928 9487928 8921540 8485858 8309977 8257553 7914294 7804799 7824671 7684706 7558073
4847 7558073 7514546 7734525 7791799 7878106 7875680 8027291 8047129 8140750 8362376 8611381 8830562
4836 8830562 9102106 9297607 9255499 9186462 8956369 8627219 8136171 7893334 7623925 7485051
4826 7485051 7094694 6702620 6303304 6083724 6194711 6037000 5770455 5643064 5820958 5766984
4816 5766984 5577585 5353523 5296781 5334257 5095620 4926718 4940382 4945434 4819731 4886124 4666254
4805 4666254 4794768 4644963 4420780 4556087 4371975 4359711 4349310 4369577 4272737 4331617
4795 4331617 4369307 4408155 4300500 4270470 4278884 4162747 4149000 4168716 4158966 4144074 4197906
4784 4197906 4052508 4206953 4306567 4129330 3913302 3778350 3707422 3580214 3485700 3580716
4774 3580716 3785873 3652030 3620986 3648236 3579612 3628045 3765400 3785779 3822579 3866525 3962953
4763 3962953 3847606 3740618 3747401 3634051 3531297 3401491 3365325 3471116 3642409 3714113
4753 3714113 3498940 3526806 3812353 3926798 3848264 3937698 3739925 3745749 3800721 3611291 3662001
4742 3662001 3675121 3728939 3629035 3623942 3390248 3417184 3432434 3436358 3244503 3205877 3342950
4731 3342950 3389443 3321323 3456924 3450376 3226138 3020041 2946396 3142968 3676947 3725142 3445023
4720 3445023 3178689 3206750 3314868 3238315 3087856 3207411 3490263 3575375 3546916 3426013
4710 3426013 3501655 3648550 3631359 3285617 3225430 3539995 3868657 3742373 3580249 3572607
4700 3572607 3713783 3645941 3492078 3563875 3627892 3905665 3823689 3526765 3607151 3932129
4690 3932129 3985550 3832830 3828087 3930040 4157098 4004768 3958323 3610014 3815021 4166953
4680 4166953 3971143 3689293 3794705 4079980 4067263 4103273 4195643 4270858 4237274 4046923
4670 4046923 4051724 4126231 4161286 4336255 4366183 4083431 4258414 4485063 4537134 4654833 4444608
4659 4444608 4509871 4704631 4785701 4703939 4687827 4739642 4592748 4384521 4336338 4373615 4544246
4648 4544246 4481090 4495214 4429943 4552203 4706306 4661614 4642269 4711333 4691366 4847246 4865703
4637 4865703 4877324 4980227 5183203 5459886 5447088 5435969 5411201 5401465 5407121 5347254 5477937
4626 5477937 5508937 5516331 5598011 5709345 5826702 5858812 5989066 6037296 6143617 6123992 6460444
4615 6460444 6671073 6776452 6808979 6754775 6663284 6757337 6981964 7138994 7216334 7299272 7363497
4604 7363497 7403001 7350643 7064912 6995834 7142766 7106360 7167517 7373898 7610553 7503392
4594 7503392 7444345 7310820 7400587 7760642 7782864 7659124 7730774 7767568 7726769 8011183 8072125
4583 8072125 8182697 8500319 8331762 8461330 8537971 8832236 9256814 9232892 9229481 9277371
4573 9277371 9294045 9559632 9708391 9666008 9641050 9724129 10001136 9969839 10208460 10377164
4563 10377164 10768675 10778202 10839564 11129254 11313635 11275768 11439435 11596009 11724140 12108884
4553 12108884 12260743 12621058 12611615 12555653 12543342 12762254 12905258 13208909 13580079 13828692
4543 13828692 14095264 14235152 14525923 14729458 15099960 15490146 16271216 16734689 17377765
4534 17377765 18031186 18846133 19860474 20752711 21753682 22944574 24309783 25545025 26985586
4525 26985586 28343532 30209250 31960080 33520951 35053150 36578111 37899176 38550360
4517 38550360 38451829 38289250 38327703 38219800 38421275 38751873 39268020 40081644 40844615 41434875
4507 41434875 42588570 43849228 45285102 47043817 48655311 50570237 52589048 54909009
4499 54909009 57142032 59392224 61406837 63285815 64804571 65945862 66806338 67520908
4491 67520908 68024418 67885195 66708207 64738374 62460259 59498431 56604781 53199105
4483 53199105 49619163 46351620 43335295 40225607 37480269 34778773 32304580 30164973
4475 30164973 28126815 26457301 25150574 23831419 22458559 21521388 20740465 19948854 19245711
4466 19245711 18691206 18081450 17571097 17207471 16810838 16586065 16031294 15637745 15275035
4457 15275035 14965064 14927334 14832117 14490590 14392551 14292602 13996200 13628422 13168209 12961160
4447 12961160 12604483 12310892 12066036 11969511 11870347 11480597 11152395 10993684 10949276 10813474
4437 10813474 10658959 10512029 10382815 10241259 9902449 9725972 9635442 9630588 9624072 9519960
4427 9519960 9479475 9235351 9349340 9728704 9588586 9408629 9366478 9504365 9580144 9431879
4417 9431879 9182562 9491050 9735245 9906146 10159788 10306989 10587440 11095910 11267691 11149972
4407 11149972 11051120 10966487 10706153 10205554 9914001 9702084 9468303 9286071 8868548 8695708
4397 8695708 8451719 8367985 8210689 8039866 7899736 8007790 8013499 7739657 7540385 7492566
4387 7492566 7412808 7359111 7369102 7330283 7565841 7515034 7398434 7288826 7511176 7657234 7708060
4376 7708060 7769941 8065748 8347177 8619462 8639564 8502381 8428439 8557971 8707942 8567934
4366 8567934 8370605 8202928 8117624 7898309 7565925 7422895 7551047 7351372 7184621 7179627
4356 7179627 7180696 7355122 7269927 7192304 7180812 7339773 7417526 7382122 7163108 7191218 7435553
4345 7435553 7553809 7402003 7422025 7592396 7818351 8098275 8220776 8445224 8355751 8556019
4335 8556019 8527739 8455961 8373581 8526428 8450802 8485637 8311623 8048547 8048276 7783505 7711344
4324 7711344 7561871 7461477 7321619 7140710 6936074 7061994 7050744 7052228 6924111 6715861
4314 6715861 6920897 7025155 7234309 7026642 7013802 7150866 7337631 7419020 7474544 7423166
4304 7423166 7670245 7981891 8172899 8315169 8411088 8552030 8580294 8433893 8430884 8776269
4294 8776269 8702738 8409319 8135114 8229568 8470184 8351348 8068021 7966820 7723789 7881877
4284 7881877 7858269 7653863 7581363 7580669 7330076 7166041 7423985 7488071 7569344 7557218 7367783
4273 7367783 7584265 7861561 8113052 8264987 8479816 8672825 9159222 9588098 10115379 10580634
4263 10580634 11312408 12208476 13101056 13923345 15360246 16857999 18365609 20073726 22086253
4254 22086253 23731254 25235237 23794264 19531886 16668552 14554537 13118874 12015495
4246 12015495 11120218 10390194 9916875 9584266 9702814 9461158 9278121 8978766 8651967
4237 8651967 8534811 8382078 8455108 8386857 8300621 8161054 8265437 8356712 8358973 8424500 8458168
4226 8458168 8590552 8819409 8971845 9195564 9351461 9153659 9082438 8734118 9027190 8888258
4216 8888258 8679031 8560134 8513381 8607830 8703579 8649167 8680488 8959249 8935799 9239450 9559286
4205 9559286 9924263 10025801 10190231 10240279 10426876 10718652 10826519 10810524 10735105 10611577
4195 10611577 10451991 10354766 9936910 9585951 9228555 8942487 8800723 8810531 8782010 8799284
4185 8799284 8741259 8570004 8778956 8713041 8638185 8477526 8203770 8113565 8041574 7815621
4175 7815621 7864798 7837925 7673240 7677265 7764875 7972260 8127290 8088331 8099418 8127160 7933506
4164 7933506 7856445 7887901 7922222 8040763 8334982 8324695 8474186 8452219 8483671 8545818 8558708
4153 8558708 8518442 8820551 9186956 9370730 9608021 9879310 10009682 10100555 10402959 10576064
4143 10576064 11181882 11519879 11829686 11848224 11859853 11592739 11459909 11336939 11080589 10899212
4133 10899212 10157626 9608020 8906649 8328862 7989730 7849521 7566337 7320914 7231332 6939807
4123 6939807 6864542 6730444 6356002 6253075 6195225 6024638 6073998 6074843 5911175 5861994 5967115
4112 5967115 5784402 5620295 5567810 5411437 5249419 5305381 5304252 5261048 5194297 5007489 5054784
4101 5054784 4851465 4752495 4570266 4668852 4719305 4756298 4807091 4834849 4811472 4746636 4655300
4090 4655300 4508224 4592652 4729955 4667718 4575155 4486717 4536876 4421400 4328627 4460963 4245661
4079 4245661 4218146 4144752 4209176 4058754 3984013 4054822 4138975 3969665 4086464 4207419 4141786
4068 4141786 4123917 4063245 3925459 3942630 4117147 4021092 4082586 4054400 4282780 4329686 4014871
4057 4014871 3906199 3910531 3907602 3935494 4069379 4138017 4178234 4125230 4023632 4022490 4143655
4046 4143655 4092792 4113808 4118983 4092106 4242987 4296820 4172652 4099267 3973757 4058286 4096762
4035 4096762 4101716 4176380 4129986 4096557 4198402 4370583 4137819 4222721 4179762 4119497 4059690
4024 4059690 4197334 4400868 4406088 4315818 4171815 4315579 4461575 4650660 4534551 4659981
4014 4659981 4573327 4731540 4782777 4916478 4886739 4945372 5041597 4836957 4821892 4940614 4933785
4003 4933785 4634182 4740516 4709784 4927503 4911449 4979346 4900030 4911406 4902141 4916523 5042285
3992 5042285 5104669 5104501 5015464 5242881 5196000 5348572 5271245 5142065 4955536 5035430 5087156
3981 5087156 5218184 5331177 5274318 5543642 5682661 5676125 5475336 5673617 5637767 5598189
3971 5598189 5665385 5826473 6029906 5985539 6111303 6250884 6235321 6229268 6354879 6321701 6394653
3960 6394653 6383213 6378958 6580947 6687959 6761211 6804498 6722536 6552719 6634807 6563939 6463416
3949 6463416 6477984 6661698 6713451 6846225 6744503 6526653 6361777 6256500 6404203 6470381
3939 6470381 6443698 6544438 6635666 6822572 6799326 6702483 6755975 6800690 6804866 6787641 6737080
3928 6737080 6646296 6922057 6676778 6643221 6832888 6951212 6862944 6781533 6950700 7070997
3918 7070997 7253355 7338149 7393057 7220761 7221690 7306974 7397507 7395430 7597097 7736594 7781197
3907 7781197 7767873 7813497 8004988 8113502 8192442 8237749 8396367 8200254 8484235 8528024
3897 8528024 8587596 8899838 9180682 9549228 9758037 9999135 10259950 10912109 11435421 11988021
3887 11988021 12592776 13256190 13556763 13466127 13109231 12557313 11950191 11385199 10882433 10372045
3877 10372045 10230145 10192732 10268066 10052275 9913317 9798178 9773413 9695716 9674018 9752932
3867 9752932 9852441 9897103 9890287 10123857 10213164 10418288 10647665 10771094 10811719 11125443 11488414
3856 11488414 11863936 12114308 12438182 12933281 13511358 13789963 14086321 14430495 14717045
3847 14717045 15042782 15165931 15212583 15293898 15310681 15354615 15277514 15103743 15142724 15156660 15098932
3836 15098932 15376101 15690116 15993650 16493058 16881939 17061396 17485799 18113655 18545692
3827 18545692 19007949 19589938 20266463 20740736 20807826 20467753 20583471 20618087 20632850 20765425
3817 20765425 20934720 21041487 21502457 21917818 22276079 22689430 22939622 23084758 23199751
3808 23199751 23270482 23197107 23342954 23363003 23396065 23463320 23893132 24450406 24991238 25193120
3798 25193120 25505407 26217697 26752575 27464506 27895251 28267171 28643786 28867727 28891845 28986615
3788 28986615 28935147 28992293 29264902 29537489 29682699 30183262 30799518 31045451 31581570 32248865
3778 32248865 32977916 33616805 34286692 34715883 35466540 36264826 37145973 37845969 38444480
3769 38444480 39406541 40029741 40771077 41576139 42541664 43483111 44358798 45285321 46675536
3760 46675536 47973663 49213714 50347513 51056815 51806707 52645239 53485473 54025922 54378757
3751 54378757 54691069 55468812 56151108 56861199 57420096 58384120 59424466 60428866 61631311
3742 61631311 62952855 64780697 66376699 68019656 69712383 71614260 73564069 75707612
3734 75707612 77978327 80303101 82476736 84720361 87200691 89390971 91535264 93419301
3726 93419301 94854882 95664207 96277934 96382168 96201219 95411460 94175400 92662964 91283218
3717 91283218 90196108 89140620 88311725 87848045 87337493 86308096 85125876 83326225 80984417
3708 80984417 78042826 74798313 71332889 68176341 65521982 63130211 61088211 59356341
3700 59356341 58248425 57546229 57166085 56844892 56993797 57268022 57665133 57975646 57850892
3691 57850892 57368629 56011254 54021878 51828425 49751930 47645269 46005017 44440969
3683 44440969 42911833 41582136 40507696 39512339 38536852 37518730 36833391 36571504 36015798
3674 36015798 35354815 34764085 34315007 33815842 33526915 33157558 32711412 32050071 31423218
3665 31423218 30790963 30178384 29857364 29407698 28812345 28253540 27959807 27794940 27834764 27919482
3655 27919482 27781001 27827913 28103823 28368195 28423343 28181411 28053141 27961761 27722765 27441073
3645 27441073 27153840 26670342 25966220 25247132 24525927 24131530 23811889 23196565 22573763
3636 22573763 22228178 22191308 22302974 22170384 22116039 22106886 22149910 22387232 22538152 22290504
3626 22290504 21633165 21173215 20757103 20645071 20359416 20305178 20461310 20464126 20497346 20756309
3616 20756309 20977201 21191302 21571469 21624569 21906306 22011405 21907515 21792860 21519533 21107708
3606 21107708 20509326 20021255 19510040 19163776 18987774 18799254 18450903 18053738 17980745 17941082
3596 17941082 17828992 17717261 17537288 17545408 17682290 17612472 17690679 17709158 17684834 17614655 17534781
3585 17534781 17617616 17729182 17873810 17927125 17884154 17925311 18180339 18250686 18330066 18554388
3575 18554388 18665662 18702687 18919129 19129849 19096619 19076014 19048610 19070125 19185931 19127648
3565 19127648 19126683 19152427 19206108 19158828 19003238 18821775 18850382 18862854 18861446 18759350 18754324
3554 18754324 18898406 18864726 18951819 19079285 19263651 19394052 19712894 19959791 20088409 20396836
3544 20396836 20432095 20552124 20546296 20831927 21077378 21384060 21742379 21807224 22110482 22357870
3534 22357870 22768918 22998004 23158726 23236350 23558995 23392853 23240387 23036688 22903798 22796438
3524 22796438 22386630 22065833 21963525 22109040 22289516 22378195 22372090 22395876 22294935 22297044
3514 22297044 22114039 22073054 21866092 21808149 21875624 21873319 21879653 21834340 21846299 21869793 22044907
3503 22044907 22214572 22211435 22424576 22486022 22545932 22841496 22911181 23252133 23462328 23463506 23577811
3492 23577811 23485300 23454467 23596010 23606704 23652050 23525264 23629204 23820594 23543886 23385940
3482 23385940 23268678 23180984 23317801 23336470 23575049 23744020 24060165 24387039 24645474 24806667
3472 24806667 25043241 25388043 25830133 26382845 26813149 27299024 27998309 28771039 29423188
3463 29423188 30069777 30748937 31539735 32441331 33453558 34552872 36026600 37307768 38788920
3454 38788920 40233983 41869512 43266320 44893694 46892424 48561256 50031584 51441207
3446 51441207 53123238 55142598 57659121 60770230 64347389 68247469 72777021 77824143
3438 77824143 83787558 90552772 97839061 105062667 111377354 115343532 116578554 115805886
3430 115805886 114517107 114566500 116418873 119600276 123656523 128485981 133923688 139896306
3422 139896306 145994115 150829699 152008506 146884048 135890665 123084341 111306425 101168458
3414 101168458 92973015 86106396 80416450 75617561 71614174 68425223 65704293 63368805
3406 63368805 61083212 58878522 57117549 55701705 54416089 53295375 51953842 51269166
3398 51269166 50985528 50636471 50346150 50414785 50471240 50704752 50972190 51552021 52545116 53595251
3388 53595251 55133256 56279637 57584240 58983603 60220586 61041914 61529682 61345497 60415648
3379 60415648 58775550 56759912 54650482 52673757 51030044 49416836 48278946 47432110
3371 47432110 47043052 46748216 46828758 47125068 47279871 47672812 48407672 49085982 49696864 50618159
3361 50618159 51330153 52279808 53192713 54032592 55089482 56515929 58324262 60526645 63106199
3352 63106199 66001841 68871633 71383493 73057896 73038271 71037507 67631009 63762217
3344 63762217 59626191 55919945 52905127 50578983 48699975 47237424 45963107 45437812
3336 45437812 45038841 44489742 44128099 43598280 43291174 42944806 42607105 42532525 42604440 42810053
3326 42810053 42951451 43324542 43835924 44367595 44876863 45321185 45942357 46721913 47774454
3317 47774454 48340446 48361790 47793651 46623197 44653340 42346136 40086627 37931105 36355921
3308 36355921 35043673 34032465 33060415 32241885 31563105 30960399 30428628 29957714 29452026
3299 29452026 29175272 28909649 28500367 28152557 27899249 27893169 27849873 27710991 27655406 27966276
3289 27966276 28345692 28526752 28813975 29178491 29380631 29511494 29918134 30293347 30607017
3280 30607017 30770989 30873977 31021599 31334781 31706665 32140626 32725521 33416812 34068779
3271 34068779 34619787 34985276 34835950 34846059 34802810 35111615 35762363 36600601 37295911 37536877
3261 37536877 36915645 36215797 35468038 34811627 34370220 33395012 32915291 32712889 32515224
3252 32515224 32520323 32614025 32873983 33256857 33911550 34634679 35601742 36589360 37592593 38994849
3242 38994849 40555108 42444152 44342579 46385281 48759392 51193574 53635275 55637305
3234 55637305 56878312 58004049 59537587 61614664 64459838 68278168 72787293 77868852
3226 77868852 84106825 90906964 97419211 102007120 103470871 101502310 95884778 88741397
3218 88741397 82338138 77238435 73459794 71215310 69727558 68985196 68455719 67918774 66203235
3209 66203235 63879346 61864258 60008574 58700181 57703056 56887714 56210127 56049550 55741777
3200 55741777 56001156 56432089 56927848 57067545 56902853 56610944 56117590 55440416 54705352
3191 54705352 53963875 52818755 51958988 51089565 50474154 49732693 48976176 48139522 47085740
3182 47085740 46113143 45550473 45033729 44417357 44163198 43773543 43770299 43807626 43796041 43566066
3172 43566066 43564921 43740987 43968240 44015474 44284462 44671311 44902996 45265088 45552062 46185566
3162 46185566 46609485 47217133 47990263 49418185 51016852 52709806 54888246 57220153 59084126
3153 59084126 60691345 62002284 63013236 64846736 67261893 70663371 74362558 78150032
3145 78150032 81533089 83206230 80820434 74988487 68751594 63447222 59512645 56230997
3137 56230997 54033588 52087181 50783867 49655264 48835766 47974753 47299642 47091403 46990927
3128 46990927 46973951 47050301 47524535 48192267 49178300 50082598 51454715 53157468 55185562
3119 55185562 57123115 59551319 62182017 64855962 67873724 70757303 73566090 75603311
3111 75603311 76908149 77761687 78235671 77888899 76487987 74181258 71510961 69630955 68500331
3102 68500331 68090701 68286703 69379871 70425098 71466963 71668253 70443725 67394946 62764887
3093 62764887 58217523 54187178 50832896 47887739 45670971 43621973 42151787 41037050
3085 41037050 40349068 39659410 38932254 38278526 37666401 37403228 37216231 37082834 36817700
3076 36817700 36650253 36332988 35922757 35376384 35004833 34136396 33450337 32663411 31918912
3067 31918912 31568423 31297157 30874818 30693537 30712275 30496392 30557884 30743912 30906526 31200494
3057 31200494 31473165 31620828 31784646 32056864 32444309 32956284 33412150 33530348 34274527
3048 34274527 35204138 35948772 36278729 36099501 35628079 34962670 34092754 33473166 32879086
3039 32879086 32521630 32146122 31808079 31578603 31633900 31905623 31951060 32206869 32506664 32849748
3029 32849748 33357439 33519477 33982140 34565333 35286678 35884879 36494297 37167169 37923972
3020 37923972 38772842 39362867 39347910 39298974 39536189 39473347 39325045 39563134 39741492 39863316
3010 39863316 40341612 40811867 41385266 41920622 42813884 43560572 44370625 45316001 46195429
3001 46195429 47410352 48232853 49120126 50152797 51243016 52436113 53776831 54924891
2993 54924891 55900801 56909595 58176488 59337521 60517146 62052276 63269063 64521471
2985 64521471 65675197 67037673 68285910 69666015 70684917 72067399 73247387 74586619
2977 74586619 75929093 76973305 78061250 78797611 79920729 80656367 81529891 82321110 83002091
2968 83002091 83781807 84294192 85032359 85732436 85956935 86221492 86611393 86893871 87329338
2959 87329338 87486137 87688857 87727789 87709585 87771540 87796594 87786066 87948763 87760385 87748285
2949 87748285 87726983 87587362 87604038 87572879 87401114 87269556 87259997 87563383 87710284 87515386
2939 87515386 87246196 87138407 87268849 87453047 87479352 87181201 87262635 87257454 87405322 87437223
2929 87437223 87595869 87639237 87662018 87887250 88405037 88966199 89299090 89663391 90176807 91001120
2919 91001120 91634410 92349688 92813765 93275317 93912596 94556858 95051488 95595926 95916354
2910 95916354 96380450 96757593 97301843 97901438 98383248 98790660 99084993 99551681 99658881
2901 99658881 99948712 99757629 99329253 98755872 98142523 97397916 96775212 95847989 94783337
2892 94783337 94002657 92993429 92031335 91116276 90238255 89202265 88182621 86921807 85649532
2883 85649532 84277994 82996049 81726087 80179291 78647956 76914631 75534944 74034132
2875 74034132 72723542 71221552 69967102 68742450 67413978 66005523 64683381 63437766
2867 63437766 62018817 60618287 59493982 58407477 57032224 55924621 54663414 53602633
2859 53602633 52704150 51876091 51050400 49896040 49150317 48445507 47977273 47542819 47169091
2850 47169091 46609796 46345296 45927110 45517115 45271214 45010515 44762527 44578404 44611942 44433426
2840 44433426 44346877 44101705 43964092 43815816 43686827 43349263 43361254 43081974 42789851 42580035
2830 42580035 42545035 42549886 42515020 42696212 42808450 42887588 42864700 43030438 43294644 43594175
2820 43594175 43946299 44541878 45369428 46038235 46931117 47769835 48671665 49983097 51278404
2811 51278404 52792428 54117534 55382677 57097956 58736463 60260178 61838720 63247842
2803 63247842 64411312 65460244 66042874 66434433 66596096 66709064 66542488 66369854 66196074
2794 66196074 66115500 66073673 65948544 65819826 65725158 65594965 65188819 64750160 64060790 63437792
2784 63437792 62636377 61714016 60600770 59600205 58466019 57247760 56160419 55067678
2776 55067678 54456664 53593235 53049798 52224697 51816495 51580321 51135071 50991654 50744564
2767 50744564 50392913 50292676 50234097 49827391 49504538 49345200 49557769 49346341 49272687 49368809
2757 49368809 49705401 49874523 50298532 50680022 51261744 52121664 52873243 53853283 54636461
2748 54636461 55772486 56879702 57909711 58999222 60139259 61388073 63138074 65022558
2740 65022558 66783537 68776763 70877136 73490517 76096387 78992649 82179682 85875940
2732 85875940 89828224 94272252 99212616 104651499 110697656 117531002 125134019 133349553
2724 133349553 142251611 151224883 160179567 168335969 175417583 180707539 183914342 184976926
2716 184976926 184856071 183442037 181404354 179599694 177910917 176574402 175811305 175482631
2708 175482631 175252755 175102814 174573849 173425497 171077481 167565362 162774178 156758087
2700 156758087 149280301 141077698 132771014 124689028 117568396 110955305 105183545 100268747
2692 100268747 96197819 92483418 89287595 86659043 84255405 82198299 80245948 78698347
2684 78698347 77324875 75992901 74876605 74163459 73446746 72688289 72235451 71706011 71155808
2675 71155808 70652788 70372306 70347300 70239145 70413750 70523345 70707212 71062952 71379228 71765049
2665 71765049 72025494 72552525 73185946 73925060 74874505 75885300 77001600 78359263 79529576
2656 79529576 80968175 82312576 83661716 84883814 85817768 86469229 87151236 87710505 87946014
2647 87946014 88349045 88617161 88738235 88816832 88951789 89106216 89545040 89668171 89610807 89549759
2637 89549759 89534704 89301644 88854600 88099735 87135054 86273679 85317225 84503798 83410850
2628 83410850 82350704 81615844 80952963 80205588 79723547 79357302 78953391 78627409 78491769
2619 78491769 78718619 78671052 78864705 78976777 78935907 79170147 79600894 79727580 79951118 80110928
2609 80110928 80443258 81084714 81754751 82550423 83479245 84292939 84923549 85994215 87368517
2600 87368517 88536281 89894864 91527297 92903597 94599888 96534439 98582921 100708237
2592 100708237 102757475 105141963 107709371 110394501 113367496 116255936 119356763 122809800
2584 122809800 126613775 130915818 135176384 139614672 144263991 149075369 153965444 158699384
2576 158699384 163113107 167542513 171871419 176017766 180272497 184604676 188751537 192701190
2568 192701190 196733384 200811017 204794435 208468867 212248117 215689809 218684134 221645861
2560 221645861 224471072 226883074 229069296 231275843 233279139 235229718 237106091 239248230
2552 239248230 241089159 242811465 244520471 246369876 248407017 250590150 252888315 255235860
2544 255235860 257697888 260479763 263466278 266267379 269095101 271921855 274365994 276417127
2536 276417127 278093258 279110052 279426506 279042725 278537288 278037248 278027711 278155008 278482219
2527 278482219 278826923 279280307 279639805 279237101 278372135 276246646 273136452 269020391 263743609
2518 263743609 257573900 250977504 244050222 237340746 230876625 224799288 219229541 213734120
2510 213734120 208884560 203615630 198604398 193316016 187930774 182028474 175947285 169552771
2502 169552771 162999582 156449079 149712184 143192659 137339592 131952801 126998187 122489956
2494 122489956 118162675 114245849 110478053 106959346 103885502 100860861 97662207 94804412
2486 94804412 91985223 89236642 86743544 84439224 82205183 79972453 77994955 76023648
2478 76023648 74194313 72445045 71105831 69632432 68204956 66826750 65501583 64173754
2470 64173754 63108759 61895616 60577431 59663090 58728789 57846060 56873706 55974225 54963461
2461 54963461 54093729 52997510 52470992 51861148 51027359 50000468 49213688 48556660 47943333
2452 47943333 47075162 46258369 45405097 44607302 44121289 43532727 42851950 41992813 41238391
2443 41238391 40495271 39714515 39063642 38330725 37819122 37126190 36369175 35875992 35456498
2434 35456498 34934859 34164324 33243339 32660811 32288572 31849864 31188136 30566577 29945014
2425 29945014 29509234 28856427 28206308 27791248 27421877 27226331 26524569 25994979 25785769
2416 25785769 25641554 24990417 24468138 24010390 23805548 23762447 23340787 22731497 22402284 22302951
2406 22302951 22170007 21940811 21595165 21376468 21175555 21085732 20440994 20130282 19834541 19674599
2396 19674599 19327226 19043252 19113592 18837398 18652026 18163656 17802911 17651195 17722187 17328670
2386 17328670 16999353 16678875 16456086 16425780 16205285 16072715 15990746 15990927 15735606 15565437
2376 15565437 15306694 15368976 15370151 15226242 14908212 15011025 15085711 15144032 15035813 14810371
2366 14810371 14861545 14807371 14903277 14736117 14666435 14645744 14671742 14472276 14307227 14351828 14213922
2355 14213922 14107203 14175169 14235688 14370670 14590709 14701389 14917656 14854407 15108336 15299604
2345 15299604 15038314 14768732 14542252 14306455 13760731 13140385 12678384 12503480 12282316
2336 12282316 11984417 11676340 11621088 11442598 11403802 11131008 10991070 10926161 10829106 10816836
2326 10816836 10488752 10198597 10281734 10126301 9905486 10012604 9967156 9847618 9903620 9708531
2316 9708531 9582177 9595103 9265830 8993409 9035495 8902773 8854960 9060733 9026909 8899317
2306 8899317 8813570 8713695 8700942 8710717 8675561 8626661 8523198 8454843 8438334 8269047 8187004
2295 8187004 8206992 7992171 7924996 7935916 7983626 8227108 8140884 8029472 7798315 7762331 7858275
2284 7858275 7980726 7801058 7718124 7695904 7682474 7673951 7586223 7700546 7662714 7624414 7706634
2273 7706634 7522626 7544519 7644883 7559748 7318699 7247028 7580283 7780610 7756520 7549013
2263 7549013 7537608 7527176 7629326 7570429 7435436 7337551 7574316 7574194 7578372 7613257 7687711
2252 7687711 7535391 7324427 7178707 7194179 7282775 7272135 7170939 6962824 7090345 7170289
2242 7170289 7161167 7206616 7066790 7357092 7421079 7278609 7221749 7375211 7371934 7306769 7248687
2231 7248687 7180174 7430599 7473823 7362358 7138289 7164343 7189069 7310834 7188860 7004334
2221 7004334 6927166 6967558 7047146 7179972 7054335 7002772 7005338 6958730 7057390 7152334 7189431
2210 7189431 6792820 6676378 6770156 6825583 6947478 6971141 6838652 6721597 6915006 7006253
2200 7006253 7009318 6804650 6624748 6531017 6631053 6781297 7118928 7094187 6934349 7023461
2190 7023461 6929247 7036991 7068577 6980382 7153029 7243579 7434211 7680528 7804702 7870605
2180 7870605 7911507 7970162 7930760 8047575 7944211 7957624 7778244 7608144 7570379 7739090
2170 7739090 7815233 7955862 8028772 8032665 8188146 8486322 8915324 9319783 9142311 8491718
2160 8491718 7888998 7337296 6972882 6741279 6566589 6594561 6465625 6538614 6283061 6214911
2150 6214911 6110208 6182612 6160056 6199024 6232353 6213905 6242497 6196659 6340992 6511433 6845466
2139 6845466 6894404 6972657 7303729 7690906 8015352 8578993 9100358 9714472 10382267 10965949
2129 10965949 11600238 11262394 9691119 8618783 7880431 7349102 7077860 6775153 6420140
2120 6420140 6276078 6244237 6344153 6232069 6132433 5890478 5922022 5954118 6018260 5771370 5994393
2109 5994393 6021746 5891808 5881583 5931826 6167077 6349474 6418163 6297202 6537483 6916562
2099 6916562 7259668 7444261 7779582 8219089 8486512 8083723 7318863 6617210 6283093 6141427
2089 6141427 5745149 5549971 5532675 5420950 5326160 5097887 4972722 5111894 5157836 4994465
2079 4994465 4895663 4760592 4779324 4816898 4756522 4713687 4739063 4809289 4830120 4742103 4592606
2068 4592606 4752666 4739496 4600668 4608434 4601927 4605219 4498706 4333649 4251041 4360225 4301974
2057 4301974 4192065 4011482 3932743 4138625 4182225 4065080 4169209 3966157 3870928 4027275
2047 4027275 3983456 4022597 3980522 3908217 3807633 3938095 3799224 3872248 3791737 3689488 3773271
2036 3773271 3837536 3868168 3939702 3755957 3683517 3870712 3786158 3719429 3732986 3924589 3872417
2025 3872417 3839108 3781127 3683669 3603090 3723738 3787948 3702490 3749877 3894042 3933416 3831556
2014 3831556 3808629 3909708 4058967 4176281 4087878 4027376 4019582 4091815 4183078 4362781 4450560
2003 4450560 4521288 4461797 4257160 4244554 4352219 4191294 4074664 3828299 3943357 3917305
1993 3917305 3897626 3602886 3527275 3584867 3506828 3645658 3908965 3881709 3674595 3840677
1983 3840677 3768767 3678766 3626105 3568759 3586020 3689455 3691508 3655089 3970237 3820280 3713957
1972 3713957 3882488 3732258 3836407 4069982 3866536 3871316 3768640 3638671 3741936 3713763
1962 3713763 3516773 3213105 3141496 3331601 3400772 3383617 3316008 3055669 3207845 3189919
1952 3189919 3203011 3023377 3141735 3032747 2875918 2999220 3133880 3028626 3154421 3008887
1942 3008887 2889313 2991871 3005533 2950365 2925388 2639712 2777294 2936562 3028287 3108761
1932 3108761 3216413 3355358 3167761 3065651 3015255 3189834 3198701 3147253 3250171 3347065
1922 3347065 3532492 3577559 3337892 3341542 3558758 3638624 3441920 3298436 3476277 3612330
1912 3612330 3566307 3614579 3668202 3454619 3531131 3753603 3595360 3739955 4058072 4251760
1902 4251760 4375392 4506393 4634470 4883669 5069776 5424757 5734256 6055306 6286098 6479789
1892 6479789 6571212 6383505 6301747 6187598 6177558 5997834 6115262 6469001 6518698 6500420
1882 6500420 6650269 6843373 6607321 6583654 6534343 6457582 6337789 6520908 6476747 6613684
1872 6613684 6996235 7407552 7692329 7903625 8422207 8955478 9499913 10063242 10817324 11596235
1862 11596235 12342010 12977588 13118553 12695104 11927738 11347719 10727932 10346302 9888436
1853 9888436 9752009 9890799 9996266 10209058 10490102 10773218 10771975 10595525 10065714 9799263
1843 9799263 9501960 9471347 9478987 9574252 9600246 9620182 10033383 10452661 10724258 11049854 11446412
1832 11446412 11941797 12495047 13231621 14036107 14827595 15562408 16125779 16449721 16109290
1823 16109290 15269197 14087280 12888216 12090885 11587008 11224620 10776878 10343935 9907940
1814 9907940 9734720 9399191 9069188 8977805 8779255 8536244 8346013 8131902 7980753 7782055
1804 7782055 7684983 7666084 7809955 7958888 8077442 8191232 8340847 8460082 8441237 8383940
1794 8383940 8361188 8681215 8867360 9069831 9436687 9512964 9162834 8749361 8123851 7527234
1784 7527234 6998085 6426528 6074768 5783859 5763784 5525248 5262027 5007633 4868784 4688902
1774 4688902 4663020 4640137 4478007 4492680 4410463 4277212 4050617 3966498 3781567 3729326 3716103
1763 3716103 3718999 3682247 3443792 3347302 3453962 3340133 3280542 3317851 3234369 3043534 3066540
1752 3066540 3159733 2963310 3032017 2818703 2839838 3079958 3084428 3034631 2881257 2806827 2758057
1741 2758057 2841094 2754990 2675735 2558736 2774628 2807114 2913688 2791935 2675724 2774988
1731 2774988 2477030 2322126 2338395 2474158 2380737 2488359 2331329 2346867 2259753 2237438
1721 2237438 2031029 1989597 2257378 2206223 2131042 1985737 2003095 1967089 2228060 2058746
1711 2058746 1980344 1760122 1955335 2080310 1971574 1739263 1762203 1824314 2066765 2157246
1701 2157246 1672143 1777099 1875345 2036569 1968981 1894732 2008374 1931897 1727231 1696769
1691 1696769 1790865 1809973 1897947 1898651 1778030 1699385 1963277 1898188 1951285 1898748 1970753
1680 1970753 2075021 1950443 1715495 1711123 1814050 1572136 1707089 1662112 1693944 1740680
1670 1740680 1630787 1395837 1513605 1468796 1471001 1495691 1666731 1564683 1651437 1632278 1536630
1659 1536630 1423417 1459728 1693310 1645294 1590448 1575735 1553507 1616434 1725118 1456507 1619996
1648 1619996 1794102 1730980 1572715 1307348 1342057 1440862 1638318 1538411 1408325 1201554
1638 1201554 1279904 1436941 1413143 1331877 1374098 1292885 1157847 1228246 1265128 1249812 1174903
1627 1174903 1035400 1012777 1526845 1567135 1424104 1087312 1224329 1182817 1305220 1384431
1617 1384431 1331273 1321289 1344497 1249549 1128451 1337919 1164259 1086406 910273 943894 1092264
1606 1092264 1220533 1057444 1033023 1074667 992680 1294422 1200092 1124003 1033553 1224281 1171104
1595 1171104 1241527 1152891 1181933 1180582 1159487 1118198 1020251 1030629 1030543 1052519 935590 1156631
1583 1156631 1230415 1415394 1411224 1296733 1102559 1008315 932602 1073180 1191978 1143459 1127432
1572 1127432 1130845 1181073 1181392 902221 665228 764745 1099195 1131272 1150338 1161776 1187256
1561 1187256 1147945 1157735 1078054 1033773 943605 1101313 982685 1080032 1293171 1316842 1139310
1550 1139310 931877 1001884 1017860 1033625 1040785 1048135 1055794 1050277 1127101 1135584 1091841 1157705
1538 1157705 1218675 1090345 1013831 951231 1047819 1126992 1085451 1088170 1156254 1306536 1145281
1527 1145281 1183062 1219513 1271101 1234205 1059910 991420 1010034 1136367 1382028 1261683 999460
1516 999460 947440 1007491 1141761 1104395 1124057 1285403 1251823 1264783 1242271 1217464 1149569
1505 1149569 1131889 1041882 1300004 1232354 1306026 1250087 1127334 975905 936471 1070001 1095924
1494 1095924 1105814 1167115 1415881 1416207 1190011 993932 1071905 1097389 1208534 1055136 1044601
1483 1044601 1170380 1315564 1321216 1144834 1106392 1210162 1463292 1480590 1247725 1124708
1473 1124708 1202305 1074091 1263030 1371487 1508090 1422279 1392100 1344818 1053906 1128497
1463 1128497 1152718 1005633 806236 990848 1194854 1158975 1020372 1041155 1079240 1033098
1453 1033098 1048340 972380 975902 982637 1297271 1473156 1483891 1339331 979217 1000057 1075088
1442 1075088 827156 887050 1164544 1307908 1326740 1324537 1394697 1197581 1046211 960022 909070
1431 909070 1093980 1235301 1182121 1113549 985639 992374 964030 1125510 1071682 933821 891516
1420 891516 1066585 1043566 1053963 1028327 775704 714548 732765 842644 901852 915376 932712
1409 932712 815252 734223 899168 904952 890740 785599 850998 858856 828442 606616 490742
1398 490742 587155 724958 813234 612807 669303 645979 616395 540490 334779 442487 473247
1387 473247 544846 670051 874951 971332 732106 735052 723857 689075 615857 631045 627750
1376 627750 906724 899556 784691 651262 643470 463064 583947 604815 689878 776916 671710
1365 671710 742294 674097 744991 505513 450359 469183 660342 638170 722980 738021 610655
1354 610655 545407 678755 695602 629330 650667 431118 544008 554031 622757 368010 377567
1343 377567 595053 530512 503960 353612 592201 482136 450384 386441 523888 785080
1333 785080 585355 382352 414856 599712 574130 513831 372158 318520 496523 536545 535603
1322 535603 608745 498279 460716 506350 350510 307021 513349 573088 571659 572016 570439 735957
1310 735957 630261 477102 355491 342907 523854 522790 502090 552065 790936 589882 498276
1299 498276 473508 405817 429831 470946 505316 420499 386962 552219 455777 402458 409766 440449
1287 440449 516504 464209 502772 586805 477824 305815 541926 679491 558380 576047 653836
1276 653836 462655 479534 434059 305972 432518 537123 650155 672700 519915 476096
1266 476096 407365 300243 329265 450722 447880 604943 888880 703232 684653 715272 475335
1255 475335 413929 359494 613387 663011 765378 661183 739436 875313 834408 595801 277623
1244 277623 392763 588569 543937 504297 399025 466267 645990 502687 373553 494037
1234 494037 353883 529106 513432 314461 363762 502756 364293 310238 509217 622446
1224 622446 708734 448551 163016 308858 455838 400478 278984 213324 542551 661801
1214 661801 622362 357249 402636 504494 541290 521482 462788 748263 742568 570829 487777
1203 487777 388887 393530 185737 212644 548183 687986 767273 749719 670511 554378 590743
1192 590743 532966 396578 491287 423304 324541 479818 612348 382207 453243 519933 584157
1181 584157 666993 753454 803125 638970 617549 523105 651067 425966 298425 524409 832826
1170 832826 1021181 890758 874302 654437 613948 757927 843689 926963 1181201 1164633 929391
1159 929391 616751 683028 804187 857361 631826 862619 1172167 1150450 1058990 911977
1149 911977 824498 726061 831876 801946 822507 927721 1294502 1247438 1117668 1033708 847135
1138 847135 778195 977813 1018170 986899 1045799 931569 889111 715371 663089 754719 927798
1127 927798 739838 813622 718129 584823 762792 777916 642298 822764 829415 582097 616907
1116 616907 694541 726614 702697 504305 551223 572263 687931 703987 730406 685754 628559
1105 628559 563553 303745 465956 449065 533224 585903 467583 515761 462173 409894 447429
1094 447429 510062 643197 777659 932810 676569 653082 722382 701883 563857 503855 501821
1083 501821 612398 670750 790636 887656 772028 845338 705913 549160 598271 718359
1073 718359 802874 1145519 869772 853583 1142153 1078260 986430 927187 1073747 1169178 1124691
1062 1124691 1094685 1210548 1217821 1400424 1415641 1271949 1258915 1342362 1253373 1148334 1102454
1051 1102454 889154 983830 1098585 1232740 1228085 1203774 1257397 1133169 1091078 1194255 1328541
1040 1328541 1295678 1271502 1208795 1307896 1246310 1302236 1051770 1011232 891357 1015355 1184564
1029 1184564 1288080 1304003 1344554 1325074 1081847 1081557 1150204 1168220 1200966 1118902 1195296
1018 1195296 1313301 1420561 1424724 1275815 1123912 1207788 1356413 1574123 1729854 1725924
1008 1725924 1786161 2083683 2051278 2090468 2177356 2378458 2428705 2392044 2551192 2824011 2969049
997 2969049 2947374 2980637 3028521 3342553 3692144 3555531 3593786 3814612 4423399 4812051
987 4812051 5050768 5191049 5630040 6245807 6948777 7633131 7944600 8335855 9337533 10434330
977 10434330 11555777 13154379 15262282 17614009 20200043 23301752 27297696 31723336
969 31723336 37217977 43382253 49233582 53113623 44289542 33359712 26912110 22233879
961 22233879 18673009 16360367 14573560 12907960 11935299 11214224 10763966 10161406 9534477
952 9534477 9051463 8585995 8048561 7360397 6823994 6499091 6165109 6033027 5636667 5398396
942 5398396 4983609 4843898 4637997 4524326 4343368 4391737 4040444 3574592 3343911 3378495
932 3378495 3586440 3359007 3124420 2806942 2880679 2822198 2612227 2405230 2338043 2337775 2370087
921 2370087 2406296 2257608 2135822 1917144 2056418 1983886 2075921 1930898 1911195 1808644
911 1808644 1712828 1792975 1972995 1839151 1591938 1531335 1501071 1598579 1599111 1645641 1504036
900 1504036 1305771 1260503 1337032 1369231 1129458 1194556 1173145 1060039 1256192 1087926 1018988
889 1018988 1202779 1002670 957821 972663 928170 996462 1005327 837562 832587 969062 1069153
878 1069153 1136383 1233244 1138852 956841 804125 864376 952415 1061151 1078199 968256 868260
867 868260 785274 1034346 1045910 793624 653647 669158 584316 571675 708136 756224 713827
856 713827 700407 646935 693486 730165 436202 460030 715318 828537 758522 754682 641445
845 641445 579276 602679 536964 447383 430057 448939 398330 406956 371274 601293 676202 466423
833 466423 343096 383685 495004 571284 493063 385512 627192 524093 383347 384455 504224
822 504224 502306 490776 409020 445048 430934 382623 257459 223807 421708 458573 318450
811 318450 354649 488160 473192 329199 316881 375252 216188 236145 467044 353417 363864
800 363864 272792 222727 233961 304325 245927 306044 335481 277649 188887 155951 267177 49643
788 49643 52205 76714 71338 179605 506457 455571 302931 250314 150449 187512 143473 275295
776 275295 362236 320357 264142 107729 103415 353771 544318 344782 366231 76141 103497
765 103497 229335 343424 84095 84314 203680 462127 310285 201663 166723 231532 203665
754 203665 7336 36146 53715 69938 120989 162940 228349 288838 268266 82550 -46305
743 -46305 45366 303491 225116 176421 110513 122060 78509 124857 118087 81796 340042 324028
731 324028 314160 153340 125519 115206 153893 -9265 61019 147872 195588 107491 51753 61287
719 61287 108027 149258 12859 14235 20834 150985 21642 -70411 -17936 25992 150911 -4094
707 -4094 -22302 62736 354202 98463 -43339 -68800 -214761 35408 45993 11989 -7171
696 -7171 51512 41945 54708 24037 -11524 40494 -78712 36114 238023 382896 174088
685 174088 90766 151170 284299 335693 184684 247961 235812 163896 175651 241285 103257
674 103257 -28369 -156762 -132626 -140503 -104957 -5287 54323 259015 137392 159094 123887
663 123887 -71437 -234339 -145821 20130 84682 57179 -35134 -136448 -27668 113906 -19046
652 -19046 7144 -16339 -170007 -148799 -161267 -90711 -2879 51040 165119 117404 -181276
641 -181276 -206450 -162332 -142901 -169270 -63492 -103426 116064 246054 225073 105664 -30694
630 -30694 -5990 -152226 -184111 -153187 -96476 -20490 59080 -48914 -69443 -234667 -149187
619 -149187 5128 -108437 -56354 -224184 -186048 -218605 -142730 -117184 -194285 -215750 -311691
608 -311691 -397554 -361113 18981 61782 -42438 -255596 -132298 -154896 -240829 -307567 -391443
597 -391443 -466208 -555246 -370335 -233334 -124458 -148613 -125652 -149888 -34986 -45510 -69743
586 -69743 -147787 -98451 14909 102248 268829 111277 21014 -94370 -122532 -367302 -299573
575 -299573 -258169 -58695 -56560 -131525 -251128 -136522 -160275 -193333 -223261 -339519 -163144
564 -163144 -159707 -29879 114083 82105 -8869 -54718 -223044 -316312 -207031 -204152 -296428
553 -296428 -344043 -60622 42118 78000 -78756 -213962 -396360 -463913 -316304 -249317 -142630
542 -142630 -118463 61369 21002 98946 -161728 -186875 -332698 -483372 -389174 -258942 -74581
531 -74581 -172982 -157289 -234901 -260018 -259719 -215493 -333491 -388475 -338522 -186250 -197953 -162528
519 -162528 -55801 -232769 -270572 -362514 -363100 -372169 -458810 -495734 -490156 -321101 -15172 -108027
507 -108027 -159405 -259572 -305617 -346083 -246545 -240790 -264767 -151121 -217222 -250169 -371745
496 -371745 -327634 -297076 -202829 -206274 -377620 -386550 -244584 94503 76329 -95427 -109027
485 -109027 -177028 -327732 -372065 -417071 -336186 -368496 -151030 34292 -22698 -120011 -244837
474 -244837 -364923 -381832 -460784 -388288 -272900 -220954 -276455 -308129 -118379 -129505 -257341
463 -257341 -552319 -447307 -397938 -284297 -442100 -442334 -283023 -305912 -282681 -380406 -249258
452 -249258 -384205 -422609 -403815 -341346 -176038 -188840 -286739 -458546 -184676 -107772 -339785
441 -339785 -669157 -705387 -532811 -287227 -263816 -467147 -308969 -39080 -87105 -279608
431 -279608 -507881 -620921 -451629 -568154 -519507 -553053 -284309 -151846 -278641 -467615
421 -467615 -447656 -403762 -471718 -442309 -432485 -295863 -86810 -36711 -338785 -453998 -543907
410 -543907 -569747 -803215 -679328 -484114 -175426 -82173 -134877 -176569 -118860 -178813 -260014
399 -260014 -343214 -388930 -241069 -120529 58578 -63582 -149274 -357530 -416086 -383960 -351509
388 -351509 -272899 -204973 -193433 -308487 -308711 -407322 -238681 -320088 -406401 -412301 -367653 -264280
376 -264280 -331538 -362788 -265739 -265119 -308451 -255028 -251885 -406210 -580626 -400587 -242049 -327649
364 -327649 -425563 -450318 -306559 -271786 -322217 -294722 -528450 -664907 -521367 -390046 -337749
353 -337749 -227119 -367476 -445401 -476438 -337777 -382545 -479161 -532206 -394311 -230593 -183603
342 -183603 -65807 -12770 -277417 -364435 -360592 -312218 -334787 -575976 -553289 -490761 -464104
331 -464104 -420977 -442845 -467758 -442556 -443214 -487759 -193818 -266791 -349242 -584982 -741057 -602881
319 -602881 -401027 -222357 -214347 -166130 -249682 -408807 -333100 -243961 -216483 -260417 -299388
308 -299388 -283824 -419445 -388433 -260759 -301616 -579662 -408057 -299328 -216567 -143710 -336562
297 -336562 -596665 -526880 -408646 -227925 -241581 -333602 -431251 -332910 -295044 -373351 -394979
286 -394979 -582464 -607968 -608452 -457632 -365108 -441197 -580292 -626503 -723849 -748602 -565319
275 -565319 -574960 -617739 -504352 -371651 -447296 -496342 -637089 -609813 -666271 -586775 -465113
264 -465113 -473926 -473239 -552259 -542883 -490986 -632735 -622805 -478938 -431894 -470150 -421448 -365041
252 -365041 -464096 -485156 -636472 -659294 -583020 -594428 -632561 -445565 -507432 -637720 -763956
241 -763956 -773562 -503818 -272984 -209245 -236806 -484678 -512341 -504697 -506197 -654142 -534597
230 -534597 -489659 -517828 -527787 -416701 -533273 -685854 -571828 -670641 -585431 -523865 -448387
219 -448387 -620797 -597576 -621585 -516567 -463727 -581584 -660234 -641451 -540229 -485964 -507927
208 -507927 -536708 -481210 -503289 -609237 -609236 -546127 -473720 -540932 -538236 -585885 -558406 -631090 -663350
195 -663350 -721117 -498134 -460625 -538960 -581264 -583325 -630151 -454250 -560442 -718137 -675670
184 -675670 -704371 -592464 -561497 -714032 -707279 -558239 -591086 -623118 -668599 -516278 -521805
173 -521805 -588764 -631125 -667719 -614550 -625749 -500500 -500944 -556462 -572643 -589503 -817033 -994475
161 -994475 -854661 -786277 -542297 -642105 -726097 -725640 -570594 -702357 -666597 -670550 -681722 -577290
149 -577290 -557764 -600288 -506973 -690466 -810462 -917770 -833749 -744995 -660427 -654084 -557048
138 -557048 -614767 -587696 -543413 -626031 -676046 -813241 -882277 -831267 -699721 -606089 -525743
127 -525743 -608993 -610054 -631604 -645101 -759697 -842632 -638956 -642832 -684045 -613682 -670644 -649730
115 -649730 -638307 -701579 -710757 -781432 -739492 -783940 -739085 -648001 -676556 -601878 -734785 -635874
103 -635874 -762089 -774930 -866945 -887373 -890107 -820618 -745816 -735517 -804103 -739552 -686947 -922195
91 -922195 -1007885 -987638 -816741 -697458 -742686 -720068 -597946 -639465 -714002 -787386 -870780
80 -870780 -829888 -674172 -714709 -816597 -728432 -777708 -763556 -700405 -717908 -800931 -851492 -950502
68 -950502 -968586 -762272 -645383 -675299 -691889 -659177 -822170 -803749 -837157 -751385 -657387
57 -657387 -868626 -772497 -768753 -778491 -795094 -810089 -955722 -946444 -704438 -703572 -860229 -948967
45 -948967 -922696 -834094 -673847 -696879 -708994 -797980 -915883 -850241 -829644 -1027703 -1065464
34 -1065464 -875699 -729043 -779648 -796171 -696440 -833607 -890492 -904438 -989445 -930708 -838934
23 -838934 -957298 -940285 -865168 -773002 -895260 -888939 -938718 -991869 -824624 -827165 -914685 -856257
11 -856257 -725152 -754671 -832951 -906831 -1053848 -903203 -896392 -900842 -932967 -893308 -659593
0 -659593
$$ Imaginary data points
##PAGE= N=2
##DATA TABLE= (X++(I..I)), XYDATA
16383 -4377326 -4227882 -4071705 -3916031 -3933814 -3905037 -3791037 -3649163 -3611700 -3681815 -3564649
16373 -3564649 -3608527 -3499094 -3570148 -3468730 -3315212 -3242286 -3266987 -3368994 -3222872 -2986900
16363 -2986900 -3097536 -3052030 -3052040 -2899194 -2860126 -2716908 -2701798 -2801760 -2612016 -2600501 -2510821
16352 -2510821 -2578744 -2561945 -2564205 -2469373 -2371133 -2221432 -2087574 -2043022 -2105268 -2091684 -2049331
16341 -2049331 -2005913 -1972136 -1901319 -1794818 -1746480 -1708101 -1775367 -1447221 -1459719 -1509269 -1503521
16330 -1503521 -1452927 -1358978 -1234143 -1221474 -1330236 -1285660 -1245519 -1075002 -1050010 -1136729 -1162712
16319 -1162712 -1221040 -1050384 -842945 -831094 -775643 -735522 -797572 -725720 -674138 -555583 -472255
16308 -472255 -425828 -483563 -296418 -184349 -270125 -350436 -273554 -196679 -254253 -78947 -44082
16297 -44082 48803 115830 133539 207791 332269 177449 270946 157336 114276 237062 301533
16286 301533 498198 470749 478843 447430 623456 650578 711312 658536 671902 690470 581706
16275 581706 768803 850636 1110902 999369 936623 1146745 1136199 1041844 1031826 917214
16265 917214 1132859 1216187 1315914 1349347 1422315 1344645 1312265 1313379 1356569 1429268 1451149
16254 1451149 1521290 1479514 1655437 1716385 1849479 1593603 1441395 1483331 1622319 1739357
16244 1739357 1714045 1842348 1921422 2026580 1798282 1856886 1871744 2034721 2052084 2036645
16234 2036645 1873761 2052560 2176729 2042691 1847491 1936815 2155391 2207383 2318875 2344566
16224 2344566 2230691 2036547 2201910 2258441 2357991 2366783 2620408 2534075 2416087 2522690
16214 2522690 2495574 2451455 2310941 2418297 2486252 2739951 2818332 2821311 2698679 2704965 2720775
16203 2720775 2614028 2555162 2865403 2944307 2761268 2843667 2666800 2903422 2843894 2920251
16193 2920251 2752868 2817164 3009533 3238384 2981159 2909975 2977795 2864111 2986261 2983486
16183 2983486 2994340 3121811 3200108 2954215 2971798 3055035 2968640 3012060 3133956 3143499 3146510
16172 3146510 3289591 3241122 3323987 3138943 3244607 3289289 3456394 3338228 3274029 3294192
16162 3294192 3255311 3278757 3349297 3423141 3453614 3477450 3628101 3666911 3384030 3411805 3240365
16151 3240365 3452286 3587608 3604563 3464697 3468362 3571685 3477645 3410158 3313451 3294290 3500320
16140 3500320 3549261 3409200 3599534 3744185 3670914 3591009 3413597 3467159 3345451 3348231
16130 3348231 3452827 3543468 3508028 3684169 3643278 3569242 3619210 3693905 3719462 3709225 3646801
16119 3646801 3715496 3786129 3752684 3723163 3692969 3820288 3838921 3698604 3754208 3818108 3748682
16108 3748682 3637116 3542056 3809076 3730113 3760886 3756907 3905855 4045011 3950242 3913083 3738701
16097 3738701 3679009 3699057 3738804 3743567 3754587 3659847 3628602 3679226 3673441 3750833 3769557 3754084
16085 3754084 3733510 3731078 3723301 3891406 3613467 3582213 3748135 3773275 3779681 3911547 3987946
16074 3987946 3876989 3833297 3739046 3957566 4025037 4098200 3980957 3829474 3819197 3968364
16064 3968364 3829717 3668743 3796289 3818640 3705084 3763152 3871873 4043607 3975446 3694414
16054 3694414 3497798 3644636 3974301 3957553 3708339 3850558 3969712 3914419 3907403 3851841
16044 3851841 3618792 3760922 3847220 3760897 3988234 4002424 3860675 3672761 3682852 3684975
16034 3684975 3774459 3811407 3785375 3665774 3746659 3777088 3720783 3677040 3622070 3728900 3752467
16023 3752467 3742113 3888546 3976152 3973384 3866260 3733998 3815719 3916070 3954183 3953796 3732844
16012 3732844 3816416 3879594 3765316 3872939 3915823 3938652 4030460 4028987 4022783 3933937 3729564
16001 3729564 3771590 3800261 3687612 3841181 4109225 4047100 3886981 3869001 3788067 3988582
15991 3988582 4055209 3963588 3882574 3910094 3815038 3769633 3856383 3820349 3813431 3536928 3585966
15980 3585966 3894163 4197599 4137731 3781763 3734923 3911751 3907805 4008622 3985893 3833837
15970 3833837 3900413 3851638 3876748 3830562 3900850 3876070 3863819 3963791 4063101 4146965 3880025
15959 3880025 3843355 3713005 3842798 3914358 3927104 3931545 3866344 4036931 3973745 3962819 3814937
15948 3814937 3906103 3759817 3663695 3886567 4044041 4054231 3908895 3670978 3624380 3947156
15938 3947156 3778035 3975615 4022652 4145574 4164827 4297828 4132317 3971543 3950654 3914116
15928 3914116 3850576 3807212 3954632 4023260 4094990 3858555 3946066 3790198 4214036 4067301
15918 4067301 3910559 3877660 3931729 3988950 3981797 3878662 3861833 4208256 4129719 4064939 3902566
15907 3902566 3888493 3875029 3891047 3693444 3775782 3988349 4054612 4025165 3829708 3746657 3908168
15896 3908168 4000837 3809450 3841474 3795652 4007917 4094136 4070952 4051010 4143720 3847099 3678129
15885 3678129 3774199 3970802 4053012 3989183 4053159 3950281 4074559 3979306 3951841 3856512 3676747
15874 3676747 3817935 4107189 3968451 4042942 4141596 3977741 4094710 3945098 3913356 3961451
15864 3961451 4069269 3911220 3902701 4000778 3943392 4014744 4062184 4059810 4070779 4144025 4116823
15853 4116823 4197256 4005225 4062020 4010936 4007301 3879366 4038481 4003564 4083131 4029847 3800101
15842 3800101 3668537 3925466 3980155 3868555 4165959 4138977 3924488 3847643 3958565 3876103
15832 3876103 3890436 3914655 4105770 4174976 4196178 4069761 4065332 3959346 3884643 4073482 3909020
15821 3909020 3962335 4026793 4214267 4226624 4212699 4004605 3734591 4128423 4195548 4213621
15811 4213621 4051592 4034817 3944147 3881731 3789796 3775512 3936080 4183297 3971565 3931673
15801 3931673 4159756 4275599 4176378 3942032 3898654 4005937 4039068 3876711 3898968 4091364
15791 4091364 4200590 3967080 3832226 3717554 3876702 4088521 4175903 3955461 3857972 3995886
15781 3995886 3955763 3866892 3783743 3936733 4092527 4217928 4130849 4073439 4071320 4022396 3932614
15770 3932614 3767890 3932322 4209110 4299724 4084831 3927267 3899081 3964680 3902363 3837184
15760 3837184 3803575 4125795 4218870 4080664 3914929 3926574 3969496 3879794 3821688 3728618 3992373
15749 3992373 4034769 3873349 3823747 3929417 4014871 4186392 4212271 3980236 4052875 4118446
15739 4118446 4085977 3939621 3817247 3783917 4200141 4153178 4034291 3947162 3996596 3974437
15729 3974437 3782836 3756663 3671847 3927977 3814928 3861251 3883346 4113971 4131337 4103200
15719 4103200 3917570 3737066 3904013 3906032 4011818 3918734 3958669 3913433 3910557 3798146 3875643
15708 3875643 3912895 3946663 3994403 4099993 4194452 4006179 4186148 3938482 4015899 3818928
15698 3818928 3947219 3951735 3889660 3883457 3982210 4104567 4000349 4053529 4069411 3985851 3859175
15687 3859175 3882236 3820925 4077703 4021514 4204134 4090038 3912041 4043213 4012646 3912068
15677 3912068 3855518 3921695 3838972 3972307 3926491 3945046 4117752 4205093 4267983 4340534 4132798
15666 4132798 3976526 3876767 3824898 4072582 4209522 4408710 4158873 4043631 4028778 3919811
15656 3919811 3984805 3943188 3949079 4069925 4136293 4142853 4083627 4042312 3991568 3683797 3883047
15645 3883047 4010714 3990711 3979793 4075094 4161415 4161753 4162608 4002204 3977091 3989194 3964293 4039280
15633 4039280 3965637 3888327 4087569 4031531 3956528 3935805 4005896 4028716 3901162 4092502 3969541
15622 3969541 3939309 4057363 3968971 4021236 3956166 4014464 4035757 3989874 3753637 3815997 3971467
15611 3971467 3963684 4002010 4121734 4270601 4328504 4364866 4234791 4221443 4228021 4032194 4167344
15600 4167344 4042497 4020440 4118681 4136846 4135981 4198958 3993259 3844697 3884444 4111198 4390812
15589 4390812 4360326 4126771 4034729 4051161 4106378 4104304 4019771 4087145 4006563 4180401 4178635
15578 4178635 4131177 4200081 4004222 3979106 3990120 4083348 4209851 4133089 3891509 3873466 4190456
15567 4190456 4343053 4183656 3880093 3989694 4159869 4222870 4208229 3969613 3795270 3879063
15557 3879063 3914899 4105355 4254486 4209878 4310786 3991251 3942748 4085418 4165766 3964671
15547 3964671 3950650 4144479 4301092 4311363 4040884 4031128 4015886 4249982 4185704 4278557 4243967
15536 4243967 4237518 4336303 4203472 4010364 4006322 3847449 3760608 3868955 3941364 4099258 4146994
15525 4146994 4053454 3926736 4095128 4200877 4125677 3914923 3914802 4129501 4316647 4326786
15515 4326786 4006420 4086171 4281391 4364839 4127798 4046717 4041886 4141790 4263939 3938479
15505 3938479 4018118 4210389 4365035 4125128 3918351 3833304 3842378 3883236 3984556 4018437
15495 4018437 4010818 4014502 4028323 4090388 4095783 4281462 4127875 4057464 3693812 3960305 4067831
15484 4067831 4276912 4191188 3981104 4045629 4000578 4213303 4001004 3936804 3991429 4093686
15474 4093686 4183745 4386671 4188486 4103051 4105650 3937835 3962961 4025969 4089412 4036518 4140429
15463 4140429 4096524 4098867 4102487 4068223 3973720 4087138 4075585 4100175 4249105 4244119 4357660
15452 4357660 4204474 4132415 4079896 4126414 4060366 3984584 4001260 4128527 3929889 3918165 4074354
15441 4074354 4018525 4029674 4266669 4041663 4008899 4092512 4116433 4056592 4106148 4179261 4041452
15430 4041452 3978598 3904953 3974847 4045877 4002721 3955269 4071369 3980154 3958158 4020231 4041545
15419 4041545 4155302 4123266 4183425 3978675 3789445 3833873 3934413 4068250 4094395 4103753
15409 4103753 4138735 4200393 4129556 4012586 3973290 3925730 3917571 3995409 4189662 4297815 4215409
15398 4215409 4324735 4229403 4230685 4213724 4226166 4354380 4446445 4409045 4299662 4257362 4162071
15387 4162071 4153477 4067446 4120843 4218999 4338281 4190577 4139991 4132771 4089477 4128478 4002218
15376 4002218 4007123 4277696 4328703 4249384 4238534 3949413 4035581 4198152 4168711 4148447 4217747
15365 4217747 4221312 4111671 4004241 4006226 4051907 4051685 3969216 4083637 4231474 4104600 4094977
15354 4094977 4047674 4108750 3960951 4126092 4339759 4476747 4355225 4166785 4288975 4127275
15344 4127275 4184547 3919601 4023471 4162249 4417328 4388341 4246008 4209778 4285284 4218968
15334 4218968 4162750 4102974 4156439 4224579 4092905 4148785 3994454 4101485 4129338 3918427
15324 3918427 3970637 4016339 4091804 4264329 4348117 4210936 4133587 4301953 4289418 4269364 4234883
15313 4234883 4281437 4286959 4307943 4130532 3932549 3972621 4220641 4187799 4021260 4106217 4089396
15302 4089396 4132089 4136046 3846006 3854937 4125283 4120634 4247759 4297298 4129452 4158972 4261330
15291 4261330 4225311 4104282 4081369 4042917 4190359 4322191 4313237 4356156 4328497 4066985 3975628
15280 3975628 4115319 4293755 4344183 4327506 4332174 4213356 4206417 4180064 4083320 4023373 4021190
15269 4021190 4164064 4098838 4091349 4069834 4120902 3943955 3903666 4068232 4126317 4292878 4099269
15258 4099269 4072573 4166570 4208419 4112702 3887640 3874694 4163092 4367102 4402919 4093175
15248 4093175 4080701 4120018 4129344 4108283 3973853 4182365 4389156 4261059 4189452 4288081 4315785
15237 4315785 4380952 4343446 4203982 4056890 4260455 4243471 4092871 4172887 4361540 4270242
15227 4270242 4208564 4247429 4379001 4423681 4350981 4275902 4203542 4253424 4234030 4169624 4184515
15216 4184515 4360381 4435894 4493719 4337429 4102107 4027802 4091461 4139313 4122417 4207225 4348407
15205 4348407 4314696 4225048 4066843 4086773 4219530 4255032 4238297 4181717 4378951 4500204
15195 4500204 4414932 4232514 4054594 4080685 4155689 4076649 4190414 4113730 4157832 4023943
15185 4023943 4233617 4235621 4272255 4208511 4146632 4247783 4206855 4339329 4377105 4246695 4144804
15174 4144804 4396885 4339345 4289910 4149488 4179760 4077863 4218344 4068082 4006972 4241285
15164 4241285 4253633 4255737 4179774 4005860 4005888 4117185 4094766 4172967 4078119 4125920 4236619
15153 4236619 4200043 4216364 4112795 4087263 4020225 4106141 4095864 4223830 4382637 4283337 4202323
15142 4202323 4135379 4246083 4159512 4092103 4055303 4090655 4265880 4429754 4323914 4147910
15132 4147910 4260679 4472031 4397431 4058709 4083405 4053220 4147552 4131774 4137007 4176572 4167668
15121 4167668 4147097 4298420 4305139 4251760 4060462 4122147 4226093 4243198 4324748 4219930 4106609
15110 4106609 3976603 4131684 4173689 4102091 4070995 4229360 4282259 4305988 4223606 4266623 4308022
15099 4308022 4260371 4216651 3955016 3993897 4014421 4221556 4595722 4433416 4224833 4243697
15089 4243697 4303471 4291290 4196563 4204209 4245920 4248646 4334240 4238437 4239030 4204656 4415673 4277075
15077 4277075 4197916 4249795 4437178 4418027 4394594 4181948 4114662 4339907 4207318 4159732
15067 4159732 4118748 4330450 4300701 4234748 4317936 4387846 4507798 4392206 4248703 4221801
15057 4221801 4205723 4299945 4427436 4204713 4097519 4119692 4228426 4447082 4389668 4244239
15047 4244239 4207412 4188682 4309439 4189808 4056797 4261789 4203074 4234211 4286406 4318047
15037 4318047 4175941 4170468 4174392 4114571 4221636 4116008 4121831 4288875 4206501 4105555 4124628
15026 4124628 4276377 4256251 4371823 4462633 4339014 4363154 4225808 4095746 4176747 4189469
15016 4189469 4125216 4332119 4297859 4332842 4441474 4252415 4253487 4146455 4235699 4291949 4253517
15005 4253517 4112112 4051399 4253958 4450580 4413120 4157929 4137310 4275695 4287497 4320525
14995 4320525 4192615 4158744 4109420 3999424 4147841 4393684 4554167 4336328 4268897 4456697
14985 4456697 4490686 4207409 4059070 4067029 4203190 4279808 4413477 4405443 4365887 4463792 4440236
14974 4440236 4260464 4243556 4567085 4607812 4235633 4182676 4398083 4565160 4304604 4330879
14964 4330879 4261830 4202990 4205968 4026942 4101117 4157422 4315639 4387541 4441810 4252938 4246506
14953 4246506 4369069 4519562 4287523 4124743 3963265 4099614 4361075 4241997 4157226 4373880
14943 4373880 4535082 4358653 4285546 4238287 4279717 4392266 4333293 4313619 4342842 4504053
14933 4504053 4627595 4433474 4334640 4327001 4116219 4030473 4145073 4294978 4360772 4462710
14923 4462710 4413210 4275374 4206315 4207960 4292105 4275044 4217434 4301300 4315882 4337710 4463967
14912 4463967 4433646 4293071 4298833 4178949 4413024 4424983 4327348 4235182 4244090 4457240 4483093
14901 4483093 4502889 4268208 4371801 4342766 4417263 4357598 4408038 4365836 4322490 4365052 4393953
14890 4393953 4467921 4359802 4242558 4224869 4310871 4326814 4456151 4443374 4516579 4529461 4428544
14879 4428544 4465400 4181384 4245963 4270062 4256823 4269309 4356314 4303198 4335489 4406015 4250194
14868 4250194 4353736 4210534 4392473 4405469 4268687 4270624 4271334 4176253 4155518 4053005 4009806
14857 4009806 4034268 4138488 4345259 4327393 4428471 4635369 4472148 4117626 4298351 4377920
14847 4377920 4523416 4440058 4352531 4272418 4253139 4414567 4362948 4303492 4487532 4378731
14837 4378731 4480025 4448954 4389012 4446497 4335923 4254795 4365909 4541319 4469731 4388710
14827 4388710 4274158 4244651 4241750 4268808 4396007 4439041 4406299 4526677 4472706 4418177 4314709
14816 4314709 4306341 4396882 4462797 4406243 4265350 4481474 4612238 4491942 4477671 4453002 4364631
14805 4364631 4339905 4300907 4353482 4361512 4290521 4463571 4451801 4369905 4300212 4147840 4150590
14794 4150590 4433697 4550950 4516463 4407995 4373706 4360450 4463234 4497478 4339293 4302291
14784 4302291 4123223 4129550 4324645 4327422 4370119 4337170 4281097 4297786 4387797 4507332 4544195
14773 4544195 4224008 4251399 4230137 4332997 4632346 4539928 4422926 4425462 4331425 4316940 4372621
14762 4372621 4314771 4404688 4360039 4405882 4348907 4319348 4389927 4408374 4325980 4136493 4408868
14751 4408868 4503286 4670322 4451801 4599420 4612629 4588192 4421354 4351471 4330038 4267711
14741 4267711 4343859 4253311 4283023 4224686 4311255 4301168 4408195 4299126 4382476 4315701 4464733
14730 4464733 4591203 4406265 4375710 4528114 4601419 4437900 4345401 4154736 4306292 4366680
14720 4366680 4435766 4474032 4305556 4296930 4340176 4352639 4334336 4517372 4176062 4009003 3990661
14709 3990661 4347779 4526522 4684807 4487081 4330012 4439244 4503199 4485612 4460471 4369679
14699 4369679 4522765 4707394 4643392 4621205 4480220 4249745 4078214 4143322 4373696 4546149
14689 4546149 4509916 4370379 4319991 4358010 4586591 4661361 4524349 4271056 4316539 4320894 4430796
14678 4430796 4429978 4475567 4505487 4319567 4297925 4363188 4602868 4409071 4401036 4310887 4501860
14667 4501860 4608459 4581540 4405928 4359178 4257190 4494443 4651566 4371857 4387311 4323054
14657 4323054 4273421 4213932 4415777 4476665 4783057 4762847 4572270 4352746 4303686 4444035
14647 4444035 4547879 4318616 4332510 4604860 4568836 4612210 4381108 4456630 4402762 4531900
14637 4531900 4437936 4625221 4563451 4480634 4511899 4535210 4511188 4431345 4421938 4251155 4360721
14626 4360721 4474703 4644634 4526012 4417846 4258357 4367386 4369769 4403353 4439922 4268568
14616 4268568 4481463 4363499 4381482 4457852 4623245 4583888 4595356 4494007 4415149 4407086 4469696
14605 4469696 4345139 4142105 4348851 4526070 4572559 4363189 4550702 4447119 4462341 4268433
14595 4268433 4304272 4446224 4497553 4638350 4709002 4690231 4595740 4590682 4381319 4369790 4293739
14584 4293739 4524668 4633956 4663453 4612478 4661672 4497635 4458616 4621149 4547333 4692852
14574 4692852 4635461 4409471 4402450 4486832 4419799 4499269 4381568 4296063 4387247 4547507 4602333
14563 4602333 4562030 4509748 4440802 4639012 4467268 4482344 4494301 4425767 4396560 4445438 4408027
14552 4408027 4531263 4329291 4494394 4513433 4486953 4517077 4365787 4328374 4235402 4537779
14542 4537779 4364945 4471055 4339466 4393834 4463291 4548425 4455960 4274436 4216207 4273043
14532 4273043 4272065 4379524 4444415 4547369 4668602 4396955 4441219 4439619 4400763 4449421 4525409
14521 4525409 4543814 4562172 4560213 4403890 4409402 4394902 4646699 4442483 4316305 4382344 4577821
14510 4577821 4554348 4500924 4484999 4628596 4535656 4430708 4437699 4503644 4651569 4526768 4612047
14499 4612047 4405103 4414945 4514158 4564622 4524132 4533025 4548275 4580773 4599166 4585864 4422868
14488 4422868 4314443 4509919 4530030 4531336 4553377 4509204 4502323 4378666 4369153 4648445 4669674
14477 4669674 4489620 4514308 4623779 4578904 4563194 4638351 4560141 4586335 4462819 4404874 4547325
14466 4547325 4730349 4716262 4614753 4379954 4535894 4618463 4750276 4696768 4690398 4558215
14456 4558215 4570830 4508441 4334507 4489788 4453780 4449796 4287036 4311369 4461173 4631052
14446 4631052 4607213 4571370 4520202 4576784 4603513 4577252 4700436 4614393 4481989 4424387 4588964
14435 4588964 4574692 4540895 4453708 4428127 4610461 4688405 4605285 4565085 4607381 4595693 4726216
14424 4726216 4787659 4792229 4534707 4507948 4561645 4601437 4387673 4561784 4723237 4740169 4693201
14413 4693201 4655495 4542950 4482168 4611200 4419838 4517314 4499693 4611407 4634106 4709635
14403 4709635 4691961 4740305 4652045 4473118 4361445 4291838 4522487 4698189 4668470 4570996
14393 4570996 4410435 4299989 4384188 4461728 4630267 4524482 4447152 4260353 4424412 4566500
14383 4566500 4486978 4427912 4439729 4460262 4566082 4700598 4653382 4554456 4513475 4695152 4655737
14372 4655737 4696534 4688248 4528231 4498228 4557709 4638593 4607350 4530816 4536171 4684066 4547714
14361 4547714 4388527 4359818 4535013 4481861 4497999 4566300 4662718 4708003 4637397 4647903 4510185
14350 4510185 4513811 4519630 4644795 4703701 4844717 4762923 4663899 4445117 4564469 4542969 4611986
14339 4611986 4707279 4609924 4636113 4752211 4705485 4545273 4507285 4487450 4611264 4571786 4651633
14328 4651633 4543411 4558130 4769468 4645949 4500647 4490899 4551275 4442957 4613233 4672932
14318 4672932 4743380 4511211 4497730 4529831 4436677 4472722 4525527 4547983 4634709 4718849 4613338
14307 4613338 4773572 4680862 4579751 4586351 4911831 4821157 4777936 4809789 4796166 4585678 4610500
14296 4610500 4559167 4599256 4592489 4638197 4784944 4599848 4647732 4612627 4468813 4430504 4495048
14285 4495048 4563766 4583962 4394077 4426598 4619849 4690357 4756508 4561625 4550844 4596163 4746471
14274 4746471 4770048 4620531 4477207 4572328 4654708 4273355 4341259 4659569 4705908 4704606 4533545
14263 4533545 4475158 4683434 4650520 4639058 4570325 4612700 4696538 4796759 4812641 4585167 4489565
14252 4489565 4679705 4755114 4623566 4448907 4680662 4637908 4662853 4584198 4585849 4750323
14242 4750323 4735791 4661132 4523646 4769127 4796432 4887415 4704622 4585751 4528451 4581275
14232 4581275 4515635 4443265 4690156 4898173 4823872 4564524 4523505 4685424 4666627 4470634
14222 4470634 4486241 4599690 4644902 4481242 4399293 4304996 4608743 4813867 4787054 4839418
14212 4839418 4767586 4718486 4535079 4471581 4577538 4815075 4786965 4739594 4641812 4649202 4685439
14201 4685439 4632444 4544425 4573355 4738759 4748623 4829096 4557750 4692362 4578890 4687255
14191 4687255 4544484 4432631 4729154 4875025 4967330 4748701 4836564 4812806 4915497 4820429
14181 4820429 4589057 4575896 4798383 4703389 4589634 4563055 4622095 4712183 4462308 4458590 4535879
14170 4535879 4646141 4672918 4638956 4493706 4739061 4703438 4508341 4357316 4456323 4833212
14160 4833212 4849707 4851511 4685286 4704510 4694283 4678428 4668029 4752498 4734495 4779594 4663049
14149 4663049 4480416 4642413 4682328 4613406 4455747 4407838 4568291 4783254 4869889 4853453
14139 4853453 4631232 4585160 4699786 4560631 4630027 4670655 4595512 4622260 4740886 4798997
14129 4798997 4906739 4795659 4621808 4507893 4423870 4699840 4838892 4687021 4639768 4801373
14119 4801373 4856599 4800996 4780402 4812895 4976636 4927626 4779993 4671397 4605308 4650890 4557538
14108 4557538 4472820 4547400 4653363 4559126 4523183 4482393 4772870 4787981 4861245 4799913 4720558
14097 4720558 4702898 4727647 4678180 4449520 4552258 4495297 4655856 4606127 4797882 4905166
14087 4905166 4885269 4612716 4498517 4550912 4681369 4842237 4694767 4674044 4785327 4984552
14077 4984552 4919492 4955854 4699402 4603899 4532394 4545757 4729994 4775231 4916043 4677357
14067 4677357 4591489 4516588 4701150 4792400 4598216 4619974 4760689 4743106 4788977 4822710 4698883
14056 4698883 4930243 4942924 4871989 4704819 4746042 4744676 4752853 4655628 4729222 4901275 4827339
14045 4827339 4833420 4645357 4645039 4432841 4518575 4600498 4656576 4700748 4677627 4707046 4643058
14034 4643058 4569920 4589120 4680885 4612438 4817134 4837221 4943746 4926022 4822299 4776330 4720165
14023 4720165 4624515 4453224 4473951 4582168 4925038 4933747 4884228 4918497 4657493 4516907
14013 4516907 4646780 4509920 4539925 4624502 4604964 4686328 4701501 4773442 4766699 4619328 4531646
14002 4531646 4509463 4725049 4966604 4960396 4791376 4890445 4798843 4758794 4860141 4784172 4757034
13991 4757034 4649815 4619894 4730782 4770401 4682923 4835479 4790019 5027489 4954524 5038558
13981 5038558 4925803 4840053 4757023 4655198 4780491 4771176 5068818 4871609 4793631 4658343
13971 4658343 4649004 4656411 4630242 4801771 4914754 4952160 4808709 4888293 4846347 4893573 4765359
13960 4765359 4588532 4622200 4742153 4858731 4810063 4672269 4822333 4898235 4781541 4665197
13950 4665197 4576511 4711239 4778828 4806483 4690584 4734753 4818356 4799029 4763182 4842456 4929377
13939 4929377 4973863 4887712 4747721 4866892 4843174 4924653 4968614 4862757 4732681 4770362
13929 4770362 4856643 4812017 4812430 4871119 4812796 4774320 4853270 4969257 4837870 4724891 4775125
13918 4775125 4558097 4714573 4755457 4638219 4728236 4852775 4887921 5001920 4820367 4634413
13908 4634413 4584949 4878430 4744137 4750423 4709109 4752334 4939127 4990199 4810296 4763247 4909645
13897 4909645 4896930 4773072 4925321 4936490 4817465 4817040 4758139 4806544 4580706 4845265 5102286
13886 5102286 5015426 4985733 4978737 4967166 5072700 4886666 4541846 4618228 4738851 4855495
13876 4855495 4839866 4704776 4681817 4726265 4724954 4712294 4833814 4706814 4859925 4812474 5039377
13865 5039377 4955512 5086953 4912895 4924783 4836267 4802541 4971828 4939176 4719502 4665172
13855 4665172 4786606 4671168 4678123 4602475 4670085 4888423 4962608 4957225 4772126 4556926 4656002
13844 4656002 4913321 4702256 4646865 4735620 4933955 4860599 4879953 4787780 4922001 5035470
13834 5035470 5102266 4909789 4626650 4889775 5058685 5216599 4815027 4722889 4695713 4856091
13824 4856091 4700475 4829173 4691505 4754072 4604963 4722045 4871682 5078044 5176231 4873722
13814 4873722 4849024 4853125 5075943 4993323 4924312 4690410 4767826 4916995 5036206 5016550 4918647
13803 4918647 5186923 4998838 4900264 4745823 5024146 4909564 4957886 4912125 4948921 4969185
13793 4969185 4898425 4859884 4784996 4836558 4961092 5075286 4887236 4888404 4946393 4931734 4900682
13782 4900682 4988244 5059639 4943309 4818710 4968325 4846804 5026802 5176818 4943808 4761222
$$ [...]
##END NTUPLES=NMR SPECTRUM
##END=
