##TITLE=1H_EC-3253(9)
 CDCl3, 8 sc, 
 26.04.2021
##JCAMPDX= 6.0         $$ Bruker NMR JCAMP-DX V2.0
##DATA TYPE= NMR FID
##DATA CLASS= NTUPLES
##ORIGIN= UXNMR, Bruker Analytische Messtechnik GmbH
##OWNER= root
$$ XWIN-NMR		Version 3.5
$$ Mon Apr 26 13:59:25 2021 Russian Standard Time (UT+4h)  she@DPX200
##.OBSERVE FREQUENCY= 200.131506
##.OBSERVE NUCLEUS= ^1H
##.DELAY= (6, 6)
##.ACQUISITION MODE= SIMULTANEOUS
##.ACQUISITION SCHEME= undefined
##.AVERAGES= 8
##.DIGITISER RES= 18
##SPECTROMETER/DATA SYSTEM= spect
##.PULSE SEQUENCE= zg30
##.SOLVENT NAME= CDCl3
##.SHIFT REFERENCE= (INTERNAL, CDCl3, 0, 15.7039)
##AUDIT TRAIL= $$ (NUMBER, WHEN, WHO, WHERE, WHAT)
$$ ##TITLE= Audit trail, XWIN-NMR		Version 3.5
$$ ##JCAMPDX= 5.01
$$ ##ORIGIN= Bruker BioSpin GmbH
$$ ##OWNER= she
$$ F:/spectra/data/she/nmr/H-F/1/audita.txt
$$ ##AUDIT TRAIL=  $$ (NUMBER, WHEN, WHO, WHERE, WHAT)
(   1,<2021-04-26 13:58:16.84 +0400>,<she>,<DPX200>,
      <created by zg, POWCHK disabled, PULCHK disabled
       configuration hash MD5:
       00 E9 B6 7A A2 85 ED C7 34 08 36 98 17 FE 4E 26
       data hash MD5: 16K
       9B C5 52 21 43 4A 2C FA 2B 63 88 BE 6B 50 DB D9>)
$$ ##END=
$$ 
$$ hash MD5
$$ 17 C1 D7 0D 54 57 A5 0F 4D 81 D5 DF 30 35 35 2A
##$RELAX= 
##$RELAX= 
##$RELAX= 
##$RELAX= 
##$RELAX= 
##$RELAX= 
$$ Bruker specific parameters
$$ --------------------------
##$DU= <F:/spectra>
##$EXPNO= 1
##$NAME= <H-F>
##$PROCNO= 1
##$TYPE= <nmr>
##$USER= <she>
##$AMP= (0..31)
100 100 100 100 100 100 100 100 100 100 100 100 100 100 100 100 100 100 
100 100 100 100 100 100 100 100 100 100 100 100 100 100 
##$AQSEQ= 0
##$AQ_mod= 1
##$AUNM= <au_zg>
##$AUTOPOS= <>
##$BF1= 200.13
##$BF2= 200.13
##$BF3= 200.13
##$BF4= 200.13
##$BF5= 200.13
##$BF6= 200.13
##$BF7= 200.13
##$BF8= 200.13
##$BYTORDA= 1
##$CFDGTYP= 0
##$CFRGTYP= 5
##$CHEMSTR= <none>
##$CNST= (0..31)
1 1 145 1 1 1 1 1 1 1 1 1 1 1 1 1 1 1 1 1 1 1 1 1 1 1 1 1 1 1 1 1 
##$CPDPRG= <>
##$CPDPRG1= <>
##$CPDPRG2= <>
##$CPDPRG3= <>
##$CPDPRG4= <mlev>
##$CPDPRG5= <mlev>
##$CPDPRG6= <mlev>
##$CPDPRG7= <mlev>
##$CPDPRG8= <mlev>
##$CPDPRGB= <>
##$CPDPRGT= <>
##$D= (0..31)
0 1.2 0 0 0 0 0 0 0 0.06 0 0.03 0 0 0 0 0.0002 0 0 0 0 0 0 0 0 0 0 0 0 
0 0 0 
##$DATE= 1619431096
##$DBL= (0..7)
120 120 120 120 120 120 120 120 
##$DBP= (0..7)
150 150 150 150 150 150 150 150 
##$DBP07= 0
##$DBPNAM0= <>
##$DBPNAM1= <>
##$DBPNAM2= <>
##$DBPNAM3= <>
##$DBPNAM4= <>
##$DBPNAM5= <>
##$DBPNAM6= <>
##$DBPNAM7= <>
##$DBPOAL= (0..7)
0.5 0.5 0.5 0.5 0.5 0.5 0.5 0.5 
##$DBPOFFS= (0..7)
0 0 0 0 0 0 0 0 
##$DE= 6
##$DECBNUC= <off>
##$DECIM= 32
##$DECNUC= <off>
##$DECSTAT= 4
##$DIGMOD= 1
##$DIGTYP= 9
##$DL= (0..7)
0 120 120 120 120 120 120 120 
##$DP= (0..7)
150 150 150 150 150 150 150 150 
##$DP07= 0
##$DPNAME0= <>
##$DPNAME1= <>
##$DPNAME2= <>
##$DPNAME3= <>
##$DPNAME4= <>
##$DPNAME5= <>
##$DPNAME6= <>
##$DPNAME7= <>
##$DPOAL= (0..7)
0.5 0.5 0.5 0.5 0.5 0.5 0.5 0.5 
##$DPOFFS= (0..7)
0 0 0 0 0 0 0 0 
##$DQDMODE= 0
##$DR= 18
##$DS= 0
##$DSLIST= <SSSSSSSSSSSSSSS>
$$ [...]
##$SUBNAM2= <"">
##$SUBNAM3= <"">
##$SUBNAM4= <"">
##$SUBNAM5= <"">
##$SUBNAM6= <"">
##$SUBNAM7= <"">
##$SUBNAM8= <"">
##$SUBNAM9= <"">
##$SW= 16.9725357007746
##$SWIBOX= (0..15)
0 0 2 0 0 0 0 0 0 0 0 0 0 0 0 0 
##$SW_h= 3396.73913043478
##$TD= 16384
##$TD0= 1
##$TE= 0
##$TE2= 300
##$TE3= 300
##$TEG= 300
##$TL= (0..7)
0 120 120 120 120 120 120 120 
##$TP= (0..7)
150 150 150 150 150 150 150 150 
##$TP07= 0
##$TPNAME0= <>
##$TPNAME1= <>
##$TPNAME2= <>
##$TPNAME3= <>
##$TPNAME4= <>
##$TPNAME5= <>
##$TPNAME6= <>
##$TPNAME7= <>
##$TPOAL= (0..7)
0.5 0.5 0.5 0.5 0.5 0.5 0.5 0.5 
##$TPOFFS= (0..7)
0 0 0 0 0 0 0 0 
##$TUNHIN= 0
##$TUNHOUT= 0
##$TUNXOUT= 0
##$USERA1= <user>
##$USERA2= <user>
##$USERA3= <user>
##$USERA4= <user>
##$USERA5= <user>
##$V9= 5
##$VALIST= <valist>
##$VCLIST= <CCCCCCCCCCCCCCC>
##$VD= 0
##$VDLIST= <DDDDDDDDDDDDDDD>
##$VPLIST= <PPPPPPPPPPPPPPP>
##$VTLIST= <TTTTTTTTTTTTTTT>
##$WBST= 1024
##$WBSW= 4
##$XGAIN= (0..3)
0 0 0 0 
##$XL= 0
##$YL= 0
##$YMAX_a= 135357
##$YMIN_a= -134331
##$ZGOPTNS= <>
##$ZL1= 120
##$ZL2= 120
##$ZL3= 120
##$ZL4= 120
##$ABSF1= 10
##$ABSF2= 0
##$ABSG= 5
##$ABSL= 3
##$ALPHA= 0
##$AQORDER= 0
##$ASSFAC= 0
##$ASSFACI= 0
##$ASSFACX= 0
##$ASSWID= 0
##$AUNMP= <proc_1d>
##$AZFE= 0.1
##$AZFW= 0.1
##$BCFW= 1
##$BC_mod= 2
##$BYTORDP= 1
##$COROFFS= 0
##$CY= 11.3945322036743
##$DATMOD= 1
##$DC= 2
##$DFILT= <>
##$DTYPP= 0
##$F1P= 15.9154993809931
##$F2P= -4.1035820241983
##$FCOR= 0.5
##$FTSIZE= 0
##$FT_mod= 4
##$GAMMA= 1
##$GB= 0.15
##$INTBC= 1
##$INTSCL= 1
##$ISEN= 128
##$LB= 0.24
##$LEV0= 0
##$LPBIN= 0
##$MAXI= 10000
##$MC2= 0
##$MEAN= 0
##$ME_mod= 0
##$MI= 1.114404
##$NCOEF= 0
##$NC_proc= 0
##$NLEV= 6
##$NOISF1= 3.799351
##$NOISF2= 2.8
##$NSP= 1
##$NTH_PI= 0
##$NZP= 0
##$OFFSET= 15.70392
##$PC= 1
##$PHC0= -11122.14
##$PHC1= 14.40095
##$PH_mod= 1
##$PKNL= yes
##$PPARMOD= 0
##$PSCAL= 0
##$PSIGN= 0
##$REVERSE= no
##$SF= 200.130013532006
##$SI= 16384
##$SIGF1= 3
##$SIGF2= 2
##$SINO= 400
##$SIOLD= 16384
##$SREGLST= <1H.CDCl3>
##$SSB= 0
##$STSI= 0
##$STSR= 0
##$SW_p= 3612.71676300578
##$SYMM= 0
##$S_DEV= 0
##$TDeff= 0
##$TDoff= 0
##$TI= <>
##$TILT= no
##$TM1= 0
##$TM2= 0
##$TOPLEV= 0
##$USERP1= <user>
##$USERP2= <user>
##$USERP3= <user>
##$USERP4= <user>
##$USERP5= <user>
##$WDW= 1
##$XDIM= 8192
##$YMAX_p= 0
##$YMIN_p= 0
$$ End of Bruker specific parameters
$$ ---------------------------------
##NTUPLES= NMR FID
##VAR_NAME=  TIME,          FID/REAL,        FID/IMAG
##SYMBOL=    X,             R,               I
##VAR_TYPE=  INDEPENDENT,   DEPENDENT,       DEPENDENT
##VAR_FORM=  AFFN,          ASDF,            ASDF
##VAR_DIM=   8192,          8192,            8192
##UNITS=     SECONDS,       ARBITRARY UNITS, ARBITRARY UNITS
##FACTOR=    0.0002944,     1,               1
##FIRST=     0,             0,               0
##LAST=      2.4114304,     0,               0
##MIN=       0,             -134331,         0
##MAX=       2.4114304,     135357,          0
$$ Real data points
##PAGE= N=1
##DATA TABLE= (X++(R..R)), XYDATA
0 0 0 0 0 0 0 0 0 0 0 0 0 0 -8 8 -8 8 -8 16 -16 16 -24 24 -32 37 -40 48 -56 64 -76 88 -98 112 -128 144 -162
35 -162 182 -204 228 -254 284 -315 351 -387 428 -474 523 -576 635 -699 770 -849 934 -1030
53 -1030 1137 -1257 1394 -1549 1730 -1940 2190 -2494 2870 -3350 3986 -4866 6169 -8288 12288
68 12288 -22355 97381 126585 -134331 62211 79522 -60244 44552 66491 -54459 49037
79 49037 32607 -27858 46517 7445 -12953 38896 -2228 -15831 45887 -9669 -17500 37922
91 37922 -18288 10132 15793 -28982 6554 25376 -28092 3147 12983 -35240 18693 -477 -24338
104 -24338 16800 -7987 -22608 21695 -5986 -30782 34574 -15040 -24461 26986 -8610 -8493 13754
117 13754 -11665 -4616 21427 -21929 3830 14259 -21998 10064 8686 -17103 -3547 16001
129 16001 -12077 -2332 2090 -5561 7000 -13409 4144 7486 -11493 -3980 10884 -14051 567
142 567 20207 -26064 4426 13453 -15097 4899 10988 -15927 6691 18468 -23501 13173 12333
155 12333 -12591 12102 4658 -8204 14281 6307 -17150 23850 2098 -12000 16170 -1880
167 -1880 -1467 10589 2040 -9146 11177 -2443 246 7297 -11223 7643 2118 -8783 748 9765
181 9765 -12311 -1438 8544 -13909 4918 -1432 -7226 383 -426 -7871 1400 -1549 -11591 9168
195 9168 -7658 -6216 2008 -4924 -3716 1480 -2215 -7679 5122 -8192 602 840 -6554 2231 -2395
210 -2395 -2731 -1754 3577 -5345 3296 -1437 -3914 7150 -3424 -659 151 4677 -1470 337 -28 3175
226 3175 4768 -5197 8046 -1211 -766 6570 2268 -4279 6203 8186 -9314 7536 3353 1036
240 1036 1566 -1552 3204 4237 -340 -3295 9941 -5893 1654 6128 -8245 3112 6054 -4473
254 -4473 -4936 9177 -6811 -451 4250 -7410 3318 -137 -4954 -2756 4924 -6974 -559 879
268 879 -7845 3943 -2928 -3847 -1368 2148 -6272 -858 2036 -6462 2091 -2761 -178 -2586 97
283 97 -486 -1044 -272 -2461 3934 -5075 2060 1315 -1050 -332 1387 2308 -4289 5022 788 1052 -968
300 -968 3536 2719 -1991 4858 -444 2990 324 3286 -172 1560 4056 -545 2687 -2292 5990 33
316 33 -1429 2830 2552 -825 -936 5238 -5127 4042 2286 -3800 1024 2830 -1046 -3640 4393 -4122
332 -4122 1858 -225 -3780 2123 -556 -2032 -2755 1951 -4796 2026 -2143 -4832 2680 -2546 -2575 -2525
348 -2525 1552 -4315 274 -2232 -2994 2711 -4665 -552 -1153 131 -3886 944 -956 -3051 3532 -2821
364 -2821 -383 -578 2544 -2492 431 3468 -1807 1246 -31 3298 -2038 2335 1692 -165 2927 415
380 415 2580 -988 4385 412 742 1265 2717 2752 -2748 5215 949 595 419 3105 106 371 3863
397 3863 -3566 3085 870 247 -773 1239 526 -953 1597 -3117 3286 -1636 -1672 415 421 -1092 -1809
414 -1809 1750 -3956 2832 -1554 -2616 553 -436 -738 -1669 974 -3493 2442 -2404 -1460 1366 -2082
430 -2082 -34 -1402 1055 -2091 1872 -2436 -906 2253 -2528 368 -778 1115 -2101 1552 -1248
445 -1248 -557 2643 -2604 1196 351 1509 -1871 2123 80 -412 3895 -1651 1025 845 3019 -1494
461 -1494 1064 2817 -562 1293 804 3868 -2470 2185 1686 -49 1211 526 2064 -2647 2726 671
477 671 -716 -780 2044 -150 -2946 3677 -2484 -1630 -601 599 -2171 -1863 362 -3673 432 -2279
493 -2279 -805 -3160 -574 -200 -3385 -674 -1961 452 -3723 -828 -755 -1314 -1409 -2145 96 -2023 1695
510 1695 -3396 -578 1396 -890 371 -1320 1056 21 1848 -2019 1814 1367 -652 1772 -370
525 -370 2483 -407 2335 -899 776 3182 -55 11 -77 3849 -901 852 415 1119 1164 -700 2695
542 2695 -1563 1437 1146 795 -1201 1653 1623 -2993 2458 110 -30 -1624 1298 100 -1607 1337
558 1337 -1006 -201 -1552 1740 -1227 -359 -20 -1521 926 -2054 840 -2198 -902 -102 -111 -1773 -1858
575 -1858 1464 -2334 342 -1862 435 -811 -1172 254 -1831 1558 -1056 -432 -1389 1839 534 -1945
591 -1945 825 -461 1779 -1431 1562 -677 -23 1939 -133 168 -76 3350 -2336 1225 1671 687
607 687 849 -363 2413 248 2353 -67 863 972 1404 1333 -647 1987 -713 2327 59 709 1242
624 1242 -250 1131 -396 2143 -866 405 -286 1086 269 -1019 1433 -2115 650 -743 75 -1297
640 -1297 -1019 -177 -1707 862 -1865 -536 -2058 358 -946 -1944 -384 -2132 155 -1660 -245 -1828
656 -1828 -72 -856 -1727 301 -1274 340 -2443 412 -107 -369 -206 -1237 918 -393 814 -1407
672 -1407 1271 208 252 748 -785 1820 -260 1157 -285 1669 979 31 610 451 2587 -972 1375
689 1375 504 1168 672 370 1556 -556 1825 -416 736 123 999 295 -886 1804 -296 713 -1327
706 -1327 1047 -30 -498 406 -954 433 -1084 872 -1791 72 -6 -1472 -296 -841 590 -2349
722 -2349 203 -923 -680 -770 -1013 -409 -1745 766 -1826 -316 -680 -503 -568 -1169 735 -1430 194 -887
740 -887 644 -520 -650 409 -601 991 -1068 872 -640 780 425 -89 993 -355 1411 -782
756 -782 1252 303 1036 277 -223 1796 29 1227 -422 1635 27 893 892 -259 1409 -40 1009
773 1009 -505 1321 296 -212 685 51 1113 -1215 832 -226 321 -403 -255 120 -1197 1253 -1637
790 -1637 -321 -566 170 -1245 -975 718 -1683 88 -1210 193 -1056 -719 -437 -1251 206 -1374 245
807 245 -1682 47 -236 -1097 -442 -478 196 -1755 992 -795 48 -118 -636 408 -244 646 -1274 1237
825 1237 21 225 244 -71 1284 -457 948 -168 1201 -195 488 840 35 1632 -180 815 -6
842 -6 1812 263 -25 1185 341 1198 -602 1035 180 858 -330 -201 1154 -564 601 -556 953
859 953 -498 152 91 -641 741 -510 248 -1299 573 -437 -850 -219 -560 335 -1573 364 -758 -211
877 -211 -871 -303 -301 -1118 767 -1680 -8 -417 -38 -884 -385 186 -1213 554 -898 279 -447 -94 -86
896 -86 -300 797 -867 473 -526 934 -213 -201 800 266 482 -402 1625 -522 751 625 78 764
914 764 197 814 -411 1002 6 1039 172 19 1140 -256 934 -205 1174 -224 229 479 -94
931 -94 457 -561 757 -653 521 -438 -71 -30 -666 706 -911 177 -416 188 -657 -323 173 -1106
949 -1106 237 -916 54 -854 -169 -461 -803 323 -857 -323 -1010 583 -937 -419 -135 -576 248 -1109
967 -1109 661 -639 -112 -363 128 -239 -18 470 -1149 759 96 239 -309 368 668 -374 829 -69
985 -69 911 -90 580 185 241 846 -23 806 -225 1450 -53 -117 707 332 264 -155 1002 -737 862
1004 862 57 62 431 -266 686 -662 529 -96 114 -676 240 423 -794 339 -871 327 -809 122
1022 122 -45 -769 -27 -632 -111 -765 274 -1084 -167 34 -452 157 -1139 489 -571 -234 -527 -164
1040 -164 -90 -557 234 -626 417 -467 212 -564 -87 758 -889 161 99 682 -449 366 220 260 693 -303
1060 -303 761 -367 721 -33 81 480 545 358 -273 1381 -43 352 161 340 378 47 1103 -497
1078 -497 569 177 447 68 102 247 -322 422 -389 647 -762 -79 248 -369 19 -491 163 -356 56
1097 56 -779 156 -166 -794 128 -708 242 -400 -61 -737 -96 -124 -778 -88 -507 452 -1014 78 -190 -263
1117 -263 315 -653 159 -471 434 -599 -35 423 -95 28 -445 873 -319 339 59 270 319 -36 560
1136 560 -161 634 145 499 -220 537 499 -440 786 61 676 -122 230 246 308 142 -276 724 -303 484
1156 484 -36 175 60 -28 290 -453 760 -362 -14 -204 230 16 -463 -59 -452 277 -718 151 -47 -202
1176 -202 10 -440 -5 -437 350 -922 -133 -50 -338 -318 -493 189 -444 63 -429 -22 -224 -229 139 -480 231
1197 231 -208 162 -391 130 255 -502 229 77 348 -410 453 140 220 501 -103 444 -86 740 -229 267
1217 267 176 311 204 -182 782 29 328 26 466 -11 36 582 -322 527 -24 285 -183 355 126 -387 337
1238 337 -91 262 -336 448 -63 -99 -3 -278 131 -486 301 -505 -200 -48 -283 -240 -396 224 -518 -3 -171
1259 -171 -92 -160 -413 -245 -271 119 -669 193 -168 -169 -188 -346 184 -407 393 -195 58 39 -35 -70 -145 589 -369
1282 -369 114 -124 294 1 112 357 -301 604 129 240 13 353 186 -134 640 -121 307 -81 496 6
1302 6 100 213 -127 174 5 411 -395 410 121 30 54 -158 342 -348 133 -174 45 -185 -129 0 -260 205
1324 205 -244 71 -93 214 -134 -318 -136 -208 124 -458 -65 -212 -176 -161 -328 150 -421 189 -476 -42 -110
1345 -110 -324 -78 -188 272 -317 144 -131 208 -127 -146 190 -94 256 -271 371 -13 214 131 29 452 -39
1366 -39 478 -250 334 171 10 171 93 469 -36 246 -164 121 14 -52 96 -176 382 -154 44 -73 179
1387 179 -13 -142 320 -201 166 -197 105 -68 -70 75 -9 75 -214 201 -249 -165 -88 -41 -97 -338 230 -309 -1
1410 -1 -171 5 -169 -77 -47 -380 -76 -349 12 -147 40 26 -274 158 -261 151 -89 25 47 -53 13 -134
1432 -134 367 -153 356 -167 131 126 -36 15 -31 432 -94 258 60 323 149 0 213 -77 253 -35 255
1453 255 8 293 207 -44 310 219 167 -157 327 137 -48 160 64 88 66 155 -23 19 135 13 77 -130 170
1476 170 -339 -159 -139 16 -120 -56 132 -133 134 -340 103 -290 59 -68 -152 -11 -193 -178 -265 -7 -30 13
1498 13 -272 -135 150 -186 -30 -177 37 128 90 -28 -33 87 -158 159 -19 60 165 -87 63 -35 90 -130
1520 -130 47 -81 35 34 87 262 -59 229 -10 -13 269 -43 198 93 235 -48 8 27 202 -91 20 291
1542 291 -226 309 -40 46 -9 45 -47 -151 76 13 115 -253 115 -237 -200 -27 -199 151 -71 86 -153 65
1564 65 -88 -207 -198 -215 108 -172 142 -183 -57 41 -135 -88 -16 80 -161 40 -103 63 -38 48 120 -193 34
1587 34 -236 22 36 28 -109 9 109 -63 144 -80 201 -165 -37 113 -55 59 53 90 163 112 54 136 170 -21
1611 -21 75 -76 180 -38 58 83 21 74 1 105 -45 136 -54 4 -48 -132 55 -79 119 64 19 -196 -15 -65
1635 -65 -46 87 -39 -98 -106 -9 -93 -111 78 12 25 -175 -127 40 -43 66 53 -60 -62 -21 -248 192 43 -31 28 -10
1661 -10 127 -162 92 -149 4 -29 -137 205 -67 193 -21 83 -51 81 74 -111 239 4 206 -84 -6 -71
1683 -71 -7 -17 28 179 27 -27 133 213 109 -32 281 124 109 29 104 46 179 143 -93 207 -56 148 -177 -67
1707 -67 63 -55 -30 -40 61 -73 31 -15 20 -25 -82 34 35 73 -93 -39 -96 25 -87 -150 -13 -87 -53 -103 -49 -6
1733 -6 -20 148 -158 -43 -78 -110 -21 -152 85 12 103 -197 150 12 -115 112 96 23 -150 -38 -107 60 70 68 13
1758 13 130 22 6 176 -64 -1 76 28 -16 202 -106 78 -28 -81 9 -67 8 120 22 23 -96 178 -49 146
1782 146 -80 -14 144 -120 13 -40 -18 -101 -6 46 78 84 -128 76 -49 -21 -54 10 -84 -171 -80 -14 92 -104 -27 -109
1808 -109 31 -42 -168 14 -155 -49 -65 51 162 -96 -52 -104 146 -131 3 -54 -65 -15 -5 21 -188 5 45
1831 45 164 -153 -52 98 -119 -17 -129 35 30 31 78 104 154 -6 85 -20 147 -78 52 -127 46 159 -191
1854 -191 125 2 78 -105 192 -99 -83 189 -52 131 52 -81 -81 50 42 4 -51 -151 53 -47 -88 -74 46 -17
1878 -17 -102 -9 -94 -6 -103 21 -25 80 100 -99 -129 -195 71 -60 -12 29 -27 -45 -39 52 -245 75 -193 -26 101 -82
1904 -82 -53 142 172 -150 10 -118 118 -24 100 51 21 254 221 72 48 11 48 110 35 92 203 -52 7 285
1928 285 -50 137 6 203 -164 -40 15 37 78 105 165 -83 -39 124 11 7 54 71 24 53 -64 -29 -24 37 -177
1953 -177 27 -5 -66 159 -162 31 75 -157 -38 -25 29 -179 66 -123 27 -30 -123 27 -104 -74 -103 95 -122
1976 -122 -73 -95 -57 -69 -16 12 21 135 -78 -36 174 -14 -132 -92 76 24 180 74 -112 6 18 102 82 181 142
2001 142 19 88 147 136 31 168 -125 54 -120 5 192 44 74 -133 232 141 95 -150 -8 121 30 4 -54
2024 -54 154 -8 -90 -83 13 -39 30 61 -41 -35 -197 3 97 -111 -14 -75 -37 -190 -38 -94 -200 -127 13 -198 -278 151
2050 151 -128 -36 -74 -90 -81 -94 254 -156 -49 30 66 44 -50 223 -83 119 117 131 -65 -20 156 -28 95 -39 115
2075 115 -197 98 -46 147 -37 -140 118 -72 137 1 -16 157 31 138 -37 75 -10 196 -190 76 118
2096 118 -129 207 -69 51 -57 -39 -18 -49 -152 -9 59 -72 -11 -75 -53 -184 -116 113 -17 -11 -62 58 -160 49
2120 49 -199 -107 2 -105 -157 1 95 -75 38 -50 -32 -8 -38 -33 -157 65 -117 -63 -54 39 42 10 144 -40 210 -93
2146 -93 109 121 24 76 22 177 -152 34 54 109 91 -14 167 -85 113 -55 87 -1 -33 150 54 87 -102 106
2170 106 -64 -27 31 0 19 -248 4 102 130 77 22 -61 -85 16 -251 41 -170 -92 -119 9 -201 -257 137 -187
2194 -187 71 -89 -132 -212 -180 -60 -160 59 -99 11 -57 24 85 229 0 -214 55 16 99 -48 47 -58 125
2217 125 67 -19 169 19 -23 45 49 -26 -136 117 41 146 17 -99 43 154 88 33 109 103 139 -152 90 60 -66
2242 -66 -37 -63 -100 -73 34 -63 175 68 -167 262 -92 -24 -87 229 -142 -11 -122 -175 155 -107 104 -191 173
2265 173 -12 -66 -24 -41 70 -91 -81 -191 -108 19 -92 -112 -21 205 -202 -22 35 -159 -67 -203 111 -82 47
2288 47 27 69 63 131 -79 38 276 35 141 -121 160 -35 -104 -7 -51 234 -40 133 -37 214 -23 142 183
2311 183 -97 173 -71 57 -27 139 -11 73 -1 -38 198 -72 99 20 107 118 65 97 49 -155 -94 -31 -134 -60
2335 -60 47 -126 -6 -212 68 -64 -10 30 -17 -66 -83 2 -223 -160 -68 -131 -96 -195 -149 -85 37 -101 22 -104 -36
2360 -36 55 -212 -30 -175 221 0 133 -48 68 215 -33 145 74 217 6 86 -55 -21 86 41 97 -71
2382 -71 259 142 122 -64 80 99 -76 59 74 47 -78 34 85 109 89 31 198 55 148 66 -115 15 -177 -90
2406 -90 -255 -59 127 12 -124 -123 25 -57 -15 -161 81 -173 69 -9 -76 21 -121 25 -147 66 57 -99 -82 -181
2430 -181 92 -226 -186 -147 -108 -142 10 60 -90 206 -137 136 -27 30 -208 23 136 112 205 45 146 0 110
2453 110 157 -64 22 -103 73 -16 324 -101 48 78 -85 39 47 128 -46 -122 -33 -57 -9 85 188 -137 196 -13
2477 -13 75 -181 -85 195 -191 65 -154 81 -121 -32 -43 -5 111 -165 -21 -269 63 -138 -21 -34 -120 32 -36
2500 -36 85 -241 116 -186 -68 133 -413 -161 1 32 -42 -78 -48 -79 -37 -76 134 41 100 132 1 98 -154 -47
2524 -47 176 107 -44 44 -79 7 221 -111 277 48 326 41 130 -7 14 168 -63 66 -71 36 41 246 58
2547 58 5 159 -158 45 4 43 -241 13 25 -47 -68 -131 166 -80 -111 -120 -170 28 -152 -145 -168 23 -35 55 -49 -8
2573 -8 61 -196 6 -51 21 -111 -44 -91 -37 -148 -176 109 -164 111 -86 14 114 -97 199 2 -40 -193 35
2596 35 -93 -22 58 69 224 -131 121 0 -67 37 159 293 -49 170 99 216 -89 38 113 246 219 -47 145
2619 145 82 169 -44 51 40 135 20 -236 14 -137 -54 -168 166 -79 -94 -43 -250 5 -138 54 -43 -157 -39
2642 -39 -156 36 -10 141 -55 -19 -2 -126 -48 -214 -8 -251 60 17 34 -19 -82 -66 -171 -19 -112 -26 -98 -23 50
2667 50 -66 18 -34 9 -55 47 7 111 159 -56 98 -24 188 -80 -41 175 -120 102 -54 72 48 141 -140
2690 -140 91 157 118 208 8 65 163 67 167 -39 111 -180 42 -17 51 -38 45 -12 104 -145 -28 114 -91 6
2714 6 -231 112 -12 -41 -92 -102 94 -221 -69 -35 -81 -4 -137 33 -168 140 -167 -32 3 -65 -97 -32 107 68
2738 68 93 -167 -98 -52 232 -8 -66 212 -93 53 -18 144 -47 165 -6 -29 253 135 157 5 310 62 -67
2761 -67 156 2 169 57 73 -18 119 108 -169 76 87 206 -159 121 102 -10 -130 -159 206 -27 37 -187 -23
2784 -23 -93 36 45 -129 88 -102 125 84 125 -128 -42 -67 68 69 -153 -24 28 51 21 -48 88 -142 -16 -71 131
2809 131 -63 -129 18 -180 -97 -175 -69 35 149 38 -39 64 -106 64 -97 60 59 56 -90 157 31 -105 248
2832 248 -100 -77 6 17 -48 -58 279 8 151 -49 152 -14 91 132 -35 -11 -50 1 -131 121 29 47 118 -3
2856 -3 23 -50 -20 47 -38 -56 -167 -39 -99 48 -206 -65 -32 -127 -83 157 104 -43 -150 -119 35 -83 -34 -43 -81 74
2882 74 -38 11 -68 -49 -71 61 0 -215 103 -128 40 75 1 -57 -81 153 -4 -3 -35 163 -186 39 133 -73 78
2907 78 30 39 -157 57 -45 123 151 90 1 5 230 -61 126 -162 94 -58 75 140 -54 58 -102 -119 -155 -30
2931 -30 28 -97 7 -261 180 -66 66 123 -20 -22 -180 101 -68 85 -173 109 -105 -4 -138 -175 -20 -43
2953 -43 4 -48 -54 -10 -146 -144 -79 62 -66 -66 -13 -73 13 57 63 -101 -2 -88 96 37 -171 120 3 180 -108 73 -104
2980 -104 -34 -174 40 142 -89 77 59 136 28 201 83 -51 84 162 299 2 198 6 43 81 -2 97 43
3003 43 152 61 10 41 -11 71 -125 70 -5 137 -223 -25 45 -271 20 -267 80 -13 -81 -251 113 71 -85 10
3027 10 -115 39 -71 -88 -106 -114 194 5 38 -75 127 -58 -75 31 -133 103 -153 83 -81 112 -117 107
3049 107 -14 73 24 -93 63 -104 -54 83 61 85 0 172 28 89 -73 157 123 17 253 -104 5 -141 97
3072 97 30 20 90 57 -54 46 13 -121 114 -23 60 35 -154 42 -233 -77 -16 26 -119 -47 7 7 21 -22 8 -48
3098 -48 -56 153 -38 -41 -106 113 -98 -15 -87 62 -104 -89 97 -36 76 32 61 62 71 -1 17 214 -50 163 -40 117
3124 117 47 -94 192 -53 -185 -1 -22 14 120 1 16 62 -72 94 18 257 -176 111 187 75 77 9 225
3147 225 14 117 -37 70 -87 -52 -4 -217 -99 -86 186 78 48 -59 -2 -79 -141 164 -169 -14 108 -24
3169 -24 -43 -53 205 -155 5 -129 -38 22 -141 -18 -207 135 -20 -20 -28 -116 35 -129 -10 -30 -249 -68 -6 -15 47
3194 47 48 -10 63 -159 68 49 121 68 96 -24 -103 165 -68 77 101 156 43 -56 26 -46 236 -25 55 33 -57 126
3220 126 -2 117 -81 92 2 201 -13 44 70 -15 72 -109 -21 -85 -35 -20 -7 97 -78 56 -132 -53 7 35
3244 35 22 -71 63 -17 23 -72 -56 -97 -114 74 74 -83 -105 -51 -60 26 -177 -151 87 -73 -62 -108 -124 -46 296 -51 36
3271 36 -34 -120 10 9 245 -59 165 116 -5 -2 -11 49 -4 239 21 27 93 52 76 -1 48 14 203 -41 -13 48 34 -28
3299 -28 61 228 22 52 130 -29 -69 76 -116 -147 22 8 153 -79 -15 46 39 -25 -156 147 -96 -44 -28 -163 97
3324 97 18 -100 -197 65 -119 78 25 -39 14 3 -70 25 66 -33 -4 47 -219 70 -51 177 -55 -33 -105 -158 85
3349 85 103 12 -98 -21 -113 122 31 -57 236 -24 24 18 77 76 -76 31 -73 42 -125 90 -22 81 -103 -111 195
3374 195 75 24 6 28 28 30 -50 93 100 -108 93 -90 143 -20 39 172 -79 -125 -149 98 49 -5 -63 -114 -100 7
3400 7 87 -247 -41 -168 149 -87 69 -83 -75 14 -123 28 107 -21 -134 -228 -102 -166 -61 16 116 -29 -22 46
3424 46 25 176 -75 66 -29 62 3 -69 -31 178 254 104 94 -201 141 41 205 46 -31 -43 -64 89 -103 126
3448 126 93 8 166 -51 115 6 178 -99 62 -133 -70 6 -220 38 -131 -28 -93 -62 116 -156 3 -208
3470 -208 159 -28 -47 -36 -76 53 -29 -3 -48 141 -63 -118 -44 -29 -4 -43 7 -33 -21 -153 22 39 -105 158 -212
3495 -212 87 -18 99 -117 122 98 -70 -40 15 227 -140 176 85 29 142 -21 -14 -160 225 -92 184 44
3517 44 -14 69 -42 -120 111 93 -55 209 -55 146 48 3 -33 -10 114 19 15 -11 -21 -51 -137 225 -66 -18 -5 9
3543 9 126 -242 116 -8 52 -160 -19 -165 15 14 -136 15 -15 -22 -327 -1 -164 8 94 69 22 -32 -8 71 33
3568 33 112 -6 7 -31 9 -145 131 -75 62 28 -70 174 56 76 -128 75 114 65 -26 107 160 34 211 -213
3592 -213 159 65 28 19 24 35 -201 58 163 10 35 -70 -79 -81 101 -109 72 -52 -62 -148 -146 -59 -42 -24 -73 -132 -28
3619 -28 -28 77 -231 -66 -32 158 -79 -12 22 -111 -104 -248 -83 -1 -26 86 -118 64 -250 -20 -120 140 27
3642 27 56 49 -93 -23 15 57 60 -10 73 134 -79 75 184 -216 49 -7 86 83 75 30 -43 -21 -74 135 -110 71 34 88
3670 88 -134 40 232 -139 88 -52 59 115 59 54 -146 58 46 -55 -58 53 0 -76 -120 7 -28 18 101 -175 119
3695 119 1 -92 -57 0 120 -255 87 77 -40 -305 -169 -49 -96 120 93 -28 -29 6 50 -84 76 -90 159
3718 159 -206 9 -14 50 -103 10 67 -122 -12 -44 5 103 5 34 99 137 -89 -82 20 143 278 -41 17 -177
3742 -177 72 -126 11 -22 38 55 45 166 -62 141 -10 44 79 -31 44 -114 31 -5 59 109 49 0 -33 147
3766 147 -18 -62 -181 -18 -55 48 -133 -191 -89 -65 -20 -92 -126 -53 -58 -127 -109 -107 14 -2 50 32 -115 12 -104 -93
3792 -93 41 48 -49 -70 102 -272 -72 118 -69 80 -34 71 108 -132 3 -71 -23 -48 120 -80 149 -9 157
3815 157 55 -39 66 135 97 73 -16 -94 -8 63 56 -47 -134 185 75 29 98 16 199 43 56 75 61 -10 -48 -116 67
3842 67 -47 -121 -22 30 -16 -36 117 8 -70 -153 -97 -183 -82 -69 26 -127 -144 31 78 -17 99 -78 -125 -62 -43 89
3868 89 16 125 -30 42 -29 -68 14 15 69 35 81 -69 109 -2 64 -67 -88 138 -9 267 20 131 94 -92 17
3893 17 147 -23 8 -33 -45 86 52 67 72 -138 65 7 166 -58 -10 -18 -59 131 36 61 9 96 -66 94 -80 -8
3919 -8 132 -195 -26 -73 -173 -102 11 12 -44 22 -95 119 -29 -21 -150 -57 -30 2 38 -192 -78 -3 176 -15 197
3944 197 262 3 73 -23 152 15 130 33 -38 30 -106 163 17 70 -71 143 71 23 25 3 131 33 3 137 -48
3969 -48 137 -107 54 79 94 -72 67 171 64 198 22 131 73 26 -24 56 165 -26 -2 102 233 -43 -37
3992 -37 -63 143 67 -213 129 -182 21 -64 -127 -79 58 6 -186 -44 -98 57 13 -50 177 -16 81 -263 10 -194
4016 -194 172 -91 -32 5 -111 111 44 -3 44 -24 -109 -37 104 129 100 -22 140 136 140 98 43 130 -113 132 107 118
4042 118 -44 164 -14 -77 210 -56 -15 -114 99 -9 161 -5 -116 -25 -128 -18 -88 -32 -42 51 -19 41 86 189
4066 189 -26 -197 49 181 51 -3 -3 -2 -167 14 -120 -62 -65 19 3 2 -71 25 136 -72 82 25 16 71 54 94 -171
4093 -171 7 -325 111 74 -147 50 -99 130 34 238 37 108 21 -45 63 -83 90 -8 180 21 2 99 3
4116 3 232 -70 142 41 56 121 106 -33 73 -20 -93 93 149 24 34 -70 -30 -89 33 -20 -40 -42 132 -132 72
4141 72 52 -75 -2 -32 103 66 15 -99 -67 19 -136 4 -25 44 -62 -140 85 -186 10 31 -110 -14 7 -9 -68
4166 -68 64 -77 71 -96 156 -26 -215 28 -108 -86 -163 -2 -67 -14 10 -146 155 14 24 3 94 -81 165
4189 165 90 -27 93 -15 88 -214 105 -52 68 -2 50 142 -48 -88 86 36 6 123 -7 4 75 -101 55
4212 55 73 105 -84 -8 -143 42 135 -25 15 17 -51 24 -58 -60 -3 18 121 -39 -90 0 -6 -122 33 -134 213 -154
4238 -154 -37 -96 -109 -74 -8 -99 -217 -81 67 0 -11 -7 120 -14 32 -93 208 -87 164 57 -5 213 88 36
4262 36 131 208 90 -88 -18 -16 127 -112 62 28 -32 98 -76 342 48 126 -32 69 -114 164 -164 121 223
4285 223 -69 -24 -31 70 -131 124 -110 -4 -97 -277 20 -29 -15 -46 82 61 21 -55 -90 48 -15 -9 -108 -50 36 -66
4311 -66 46 23 143 -4 64 -25 -121 -155 -77 135 -94 72 35 92 18 26 75 -176 123 -19 69 14 106 92 -66 41
4337 41 -71 48 48 -15 -157 55 6 -30 227 -58 148 -32 83 4 -129 97 -85 -77 -172 116 82 -10 -145 -165
4361 -165 20 -95 58 -95 9 -40 -25 41 -12 27 -273 68 -37 -54 -2 -83 80 17 -120 -201 210 -145 -92 -44
4385 -44 -157 -135 -130 227 -110 -53 111 71 62 -9 0 -23 -11 8 -10 -133 97 70 -65 187 -180 143 49 101 29 -100
4411 -100 108 80 162 -28 -14 -4 76 -45 -43 142 -32 50 96 -10 -11 -168 3 -4 -25 3 104 26 101 4 48 93 20
4438 20 -10 -92 -57 54 126 -5 -71 -49 50 166 63 97 -60 -83 -96 39 45 -85 -6 63 -84 55 19 -33 -96 50
4464 50 -107 22 -12 56 -11 110 108 -6 -35 -85 74 -7 -27 -112 -89 -2 -168 -7 30 121 -44 67 36 -37 -138 -121
4490 -121 -80 36 -11 -71 206 -73 -64 33 -204 41 81 -23 -67 -3 21 50 73 -58 -54 -53 -1 -39 13 1 -62 -47 -7 -90
4518 -90 -35 6 105 -48 -216 -65 -102 -7 27 -229 103 -27 178 14 -103 -85 -3 169 -106 26 242 20 -36
4541 -36 -72 -56 -222 -71 1 -47 7 -79 121 -16 88 -56 -29 -75 -71 70 -97 39 -88 95 27 -94 83 -120
4565 -120 71 42 93 -35 -10 22 50 124 90 98 -168 22 2 -9 -168 -209 -36 -48 51 69 -105 -132 138 35 49 11
4591 11 -103 -40 -95 -43 21 -24 47 -40 -17 17 -35 -31 97 -41 12 35 -30 -87 10 35 -119 -68 86 -45 -21 -31 4 -194
4619 -194 78 -18 -38 -19 -95 -69 -59 -4 -19 -27 24 -12 45 57 -83 62 -37 -6 -109 -42 67 220 130 79 -5 71 -20
4646 -20 32 57 52 188 24 180 29 -54 -63 -27 -1 -59 96 -112 179 119 -10 -42 53 -63 -88 -139 -67 96 -101 6
4672 6 -74 -49 -17 36 29 -153 -56 22 138 28 -182 -108 149 -210 -172 -88 -83 311 52 -31 50 -72 -17 -34 -23 56 -25
4699 -25 -4 -111 160 -4 34 -33 54 62 29 12 -25 242 -148 86 5 191 24 58 -90 106 120 45 182 100 87
4724 87 -7 -54 108 73 106 -41 -51 75 60 174 -83 -25 -89 111 -118 7 -88 -38 -149 94 109 -25 37 110 -25
4749 -25 7 -133 2 -50 -227 15 -8 -50 -170 -44 -43 131 -113 22 45 -284 -14 13 -104 -20 93 -8 8 -9
4773 -9 -14 77 168 -13 90 -7 15 100 -53 93 76 60 31 38 174 5 -47 -13 -14 -8 -66 -1 60 16 -38 2 101 -50 31
4802 31 14 98 88 132 -53 6 14 -61 109 -29 49 -28 121 126 -56 -145 -118 -237 8 -13 -10 74 -19 17 -82 -10 56 19
4830 19 26 -15 101 -46 -27 -82 -62 -93 -29 155 65 60 50 37 -24 -50 34 -57 -176 -39 -19 36 -15 58 -88 97 42 145
4858 145 -28 101 216 46 -17 -24 38 61 7 -81 -18 41 -53 -59 -147 21 241 72 68 33 105 47 223 84 62 -83
4884 -83 37 24 44 -31 10 4 -100 -76 -56 52 -26 -92 15 52 147 -104 57 5 -122 -134 107 21 -117 58 -51
4909 -51 -81 -245 33 88 -124 86 -144 -116 87 173 36 -113 66 97 136 89 -100 -20 81 -49 -166 97 -81
4932 -81 199 -15 -18 78 -24 165 24 -21 -35 49 -94 124 -14 11 14 -70 -41 -53 93 -12 100 -61 36 90 -177
4957 -177 8 21 130 120 -39 16 90 25 16 49 -8 16 -94 -42 -8 -63 -118 -213 36 191 139 102 65 -20 -42 -5 -112
4984 -112 109 -108 -70 -24 1 -15 -106 -67 -37 92 -10 53 194 -41 16 -65 -19 77 11 25 75 21 -26 -102 -86 -66 -13
5011 -13 -35 10 -13 -54 -44 149 -44 152 85 -74 28 11 99 -31 76 34 -57 -70 -101 31 107 -62 -44 151 -159
5036 -159 92 73 -30 133 -15 16 138 -48 109 -47 -8 -50 -110 -159 -39 53 66 38 22 -57 -167 -35 -227 54
5060 54 -49 67 112 135 -94 -49 104 112 -194 10 31 11 -197 -13 -169 32 25 29 -54 -52 -2 81 1 -65 33 -32 -20
5087 -20 18 -75 -78 98 0 -12 132 -113 30 -46 -16 133 -170 140 20 33 136 -87 121 -109 -143 -43 25 -103
5111 -103 -127 85 50 -24 39 114 44 165 -60 -26 33 -54 1 -15 22 -1 197 -104 170 -139 5 11 -118 152 -85
5136 -85 118 -23 -100 -42 -138 164 -191 -132 -70 57 47 -112 22 15 92 113 -88 -40 96 -48 -145 -184 173 -35 -190
5161 -190 -12 -49 42 -188 30 -43 73 -87 -32 53 242 -93 -25 74 65 -122 -15 -73 3 -155 35 -73 -74 169
5185 169 -101 -29 -260 155 -70 70 -331 11 118 -29 18 -59 134 -3 37 -13 23 -47 -17 -51 -104 -2 28 171
5209 171 11 -1 -111 10 -46 -46 92 -64 50 152 -41 -1 -92 -95 1 196 7 -106 1 -34 -8 -62 92 -16
5233 -16 -108 51 -142 -49 75 67 0 -51 -51 -10 -134 -84 -92 42 -172 25 -57 32 -35 22 -11 -80 -120 -97 -15 202 7
5260 7 -59 103 -210 182 -10 93 -13 -102 97 -86 38 -51 19 -33 -81 99 23 37 64 42 -59 42 52 54 -70
5285 -70 -22 51 -31 115 183 -241 61 -217 -99 -74 13 -156 73 4 -4 -94 101 153 -13 -45 -104 -81 -147 74 -85
5310 -85 100 23 -249 37 -107 -116 -111 73 -31 -107 0 -114 217 51 155 123 60 -42 -15 -24 2 -103 -119 34 -108
5335 -108 -123 -6 -131 271 -7 -83 68 41 94 -104 -126 -75 -160 -74 -99 -76 -85 88 34 16 -17 -84 52 29 83 -18
5361 -18 2 -22 40 -48 -25 43 4 -22 100 142 112 45 -12 118 -67 34 14 -53 32 -6 -22 16 55 57 122 128 89 102 -68
5390 -68 -41 -4 -39 -48 -93 -15 -173 -160 23 -6 -30 -45 -18 -54 -21 -37 -91 -41 29 -52 -14 -17 168 -189 17 142 -1 116
5418 116 -13 196 13 4 35 87 218 -31 31 -28 25 -11 81 -156 40 48 -66 56 111 -85 -103 -34 -56 -13 1 25
5444 25 -35 -36 100 -43 -3 -135 82 75 -26 -109 -21 188 -103 68 130 123 268 -32 -55 -88 -99 -56 -11 -110 56 182
5470 182 -5 13 24 64 -117 -31 80 112 30 115 -242 -58 -64 2 68 50 140 -46 53 26 44 77 35 -100 111 -62
5496 -62 -130 22 -144 -4 106 58 -156 70 -104 -18 -80 -86 56 0 37 -15 74 123 22 -81 58 116 17 -29 43
5521 43 9 5 24 65 13 15 -129 95 -199 -33 -28 -97 -40 11 -5 -20 37 -9 -58 -14 -9 -161 -67 36 127 -229 13 -130
5549 -130 3 -100 -45 -59 88 47 7 -37 28 72 95 -60 -69 -14 -31 45 80 -189 133 -77 27 110 86 11 42 119
5575 119 9 126 -65 19 -157 140 39 -59 -5 -102 -80 9 57 46 -10 99 133 91 -54 70 -13 48 -83 -48 40
5600 40 -97 69 97 -10 -106 -152 -62 79 86 -113 -116 95 80 -61 25 -27 -126 50 -78 7 108 66 -92 -73 -30 -80
5626 -80 170 63 78 -31 -91 139 15 -129 2 -45 -23 -123 67 -131 -60 11 157 -17 -31 -8 -107 -122 -37 -128
5650 -128 10 2 129 -106 14 84 -43 -61 0 -29 90 2 -36 -37 29 117 -50 127 -18 96 -37 -26 -25 99 60
5675 60 72 138 9 -5 -119 36 15 -97 85 -28 35 -37 33 -29 -183 -94 -48 88 18 51 21 151 -81 118 -85
5700 -85 55 43 10 41 63 -1 -41 44 34 103 -32 -16 -20 -10 95 181 25 -39 -49 32 26 12 -43 22 40 -141 -162 22
5728 22 -24 34 67 -22 19 -42 73 89 -73 -111 132 19 56 12 -79 108 -15 -85 -85 -62 70 114 -78 14 -95 -114
5754 -114 210 10 -2 24 13 -93 -56 212 -122 103 8 -99 65 99 113 -36 -102 46 76 79 -16 -69 -36 -81 122
5779 122 -12 -28 -38 42 19 97 -81 -221 -91 -29 -47 31 -73 141 26 -132 -89 -31 -1 -88 17 117 14 101
5803 101 -76 -78 73 -64 38 -122 -39 -59 90 8 -52 -9 -63 -106 -52 12 55 -84 -149 -30 -108 -24 171 44 -9
5828 -9 97 -3 -115 39 53 41 -131 -81 57 -79 -73 -107 -10 -15 110 36 -197 -84 81 112 -167 11 44 38 -30 87
5854 87 19 -69 -140 27 4 -74 47 -42 225 -56 120 -125 -96 -30 -91 -15 75 26 -28 -86 -79 121 51 -26 -11 -112 63
5881 63 -17 -45 -29 -18 -73 15 143 -25 14 -103 85 73 -17 13 52 -48 26 43 26 -75 -61 -82 -41 -54 -58 106 113 -137
5909 -137 -137 141 -136 -209 42 -27 106 -128 -157 -171 3 -87 -86 61 71 -81 -98 -172 -51 -128 55 -86 20 29 -111
5934 -111 4 126 -9 48 -94 -14 36 -21 -113 51 -98 -44 72 -120 172 -65 11 -8 -5 -75 71 -126 35 93
5958 93 -70 48 87 135 61 -59 66 56 -164 -26 41 158 156 -169 57 -29 95 -84 124 84 38 51 -26 -141
5982 -141 -6 24 -54 -18 -2 135 16 44 104 -98 -49 -74 10 3 58 -5 -115 45 85 -18 2 142 -116 62 97
6007 97 26 -1 -1 6 -130 110 39 24 -77 -55 64 -68 84 -12 -3 -19 18 33 2 81 -34 23 -68 105 -92 -31 51
6034 51 -25 141 -24 -1 -153 -3 -33 110 -67 -131 37 -131 123 -112 44 -48 7 -40 -11 -108 -26 17 14 74 -70
6059 -70 -23 4 37 137 11 152 19 -83 172 28 39 -69 118 -35 -90 28 60 -13 51 -116 34 -75 -84 79
6083 79 -47 84 -22 -131 112 -25 -118 81 -129 -2 -85 15 145 -2 -274 -46 50 21 -63 35 -47 -143 -73
6106 -73 17 -13 -85 -184 53 -95 -80 -11 123 -82 31 -89 -39 -40 -125 34 43 -109 -79 195 -211 34 -59 47 116
6131 116 -22 -138 -65 -70 35 39 6 7 143 131 77 -144 61 4 -97 114 140 -11 -42 -31 1 14 -87 -36 113 -44
6157 -44 -3 -12 122 -131 110 51 49 -81 -43 66 140 -37 -11 114 31 154 -3 -137 -63 -16 14 58 -25 10 -74 -47
6183 -47 -100 107 44 -9 98 24 -140 49 5 19 -2 -52 -102 40 -15 29 -66 108 65 4 37 -100 3 -46 87 -31
6209 -31 136 17 -57 -118 -86 -8 48 -59 -97 3 41 1 55 78 33 -33 -43 38 70 132 18 -9 -1 -44 101 -2 -140
6236 -140 -103 6 104 47 -16 -3 65 -13 -40 -3 72 -57 -24 67 -131 -12 -1 -126 -113 54 -50 91 51 30 27 -50
6262 -50 0 174 -24 64 42 -156 56 3 23 128 27 60 6 55 3 -25 -30 -206 -15 126 97 125 -31 -10 26 89
6288 89 66 -7 -156 42 151 -48 61 88 136 -119 -11 1 -128 6 114 114 -95 174 -111 23 -27 -133 27
6311 27 11 -98 32 97 196 43 -37 46 -36 -77 -84 69 -65 8 61 -38 23 20 90 22 -52 -67 -75 -172 102 -68 20 80
6339 80 -117 11 -3 22 108 -1 75 124 -10 141 40 10 -96 49 281 78 44 -16 -45 58 64 -13 47 -59 -74
6364 -74 124 -185 108 167 -40 -67 64 -43 -51 21 19 177 127 221 103 65 -58 77 44 39 54 36 122 -126 81 -148
6390 -148 -23 -22 -50 -31 -17 154 -84 72 -34 -111 -36 -48 4 -41 121 17 67 82 -12 20 -88 191 5 131 49
6415 49 27 -47 -50 -166 -124 180 -81 110 -84 -51 -154 76 75 4 23 138 -79 -107 100 65 108 65 -54 5 -97
6440 -97 -13 -198 8 3 -69 60 59 27 71 67 117 -1 53 67 -7 -15 16 -5 87 -74 80 46 -258 -68 -36 42 64 23
6468 23 -97 26 29 2 50 95 173 -25 -43 -47 -98 8 20 106 77 -101 -6 -123 -58 116 -8 57 173 14 -79 -42
6494 -42 33 83 303 53 -17 -32 -26 90 72 -177 1 -103 60 16 -68 -18 42 -129 -9 -9 -62 133 78 49 41 -185
6520 -185 -73 35 31 59 -55 -133 22 43 -57 -14 -19 -118 -75 -55 9 185 30 44 1 -27 89 -15 5 -173 10
6545 10 -4 59 23 26 16 -175 -57 -124 110 -118 -28 85 14 -202 -135 65 22 54 59 -6 13 -83 -148 -135 34 46 -109
6572 -109 47 -127 -159 -112 -23 -96 -13 99 -94 123 107 54 61 12 146 -136 28 -88 -148 -63 178 65 11 86 99
6597 99 -26 124 -82 -127 -52 48 72 -70 64 34 85 39 -69 124 -36 -92 170 66 172 39 -11 90 54
6620 54 210 -88 -42 -18 -48 -4 92 -19 -56 -43 -121 30 -164 -64 -56 -17 -26 75 69 -49 -1 104 255 106 190 -179
6646 -179 53 -1 71 35 49 62 114 -73 -33 -42 4 79 -33 28 47 -4 -113 -33 -75 -4 -86 8 -26 55 132 13 -133
6673 -133 -27 -34 -79 127 -132 47 -50 48 43 -87 57 -59 -160 -100 102 -154 -156 -1 -28 95 -126 -19 -20 54 -24
6698 -24 -4 73 -18 -63 -35 2 101 -33 73 37 61 -47 108 -138 69 -178 -43 13 0 -154 64 -103 -39 10 23
6723 23 19 88 66 -3 -38 2 75 -162 -72 -132 -21 68 -98 51 80 -59 70 23 -49 135 -77 -26 -105 -110 158 18
6749 18 41 55 -16 34 72 166 -77 -119 -17 -10 -14 62 -75 8 -25 115 -71 95 -24 -85 25 162 9 -52 21 76
6775 76 -44 -109 49 -81 -103 112 25 -120 -111 -203 -100 -114 -41 120 -60 14 39 30 -23 -46 -95 54 58 -90 -22 -29 9
6802 9 -6 -11 -90 35 9 84 57 -15 38 7 65 -28 13 -17 -7 -13 -31 -51 81 82 178 78 19 24 116 59 -58 -4 99 -63
6832 -63 79 38 10 26 -96 -6 -105 -33 97 -131 -42 99 -47 -3 88 59 -69 -93 199 -85 57 23 8 40 -3
6857 -3 198 -31 -55 -50 -104 49 -52 45 48 -142 -9 -19 -94 45 104 -26 123 -13 32 -4 162 -179 -21 24 122
6882 122 -1 48 56 10 -14 -47 -14 -140 99 142 16 5 50 69 -37 12 -29 84 -34 85 16 56 114 112 -26 -91
6908 -91 -38 -124 -85 1 -15 -30 84 -156 71 -98 -130 44 -97 -51 -38 -65 -97 69 -32 -140 42 81 -97 68
6932 68 105 2 -41 70 -58 -5 127 10 91 -72 -20 -28 28 96 -82 -95 34 107 30 26 10 -208 86 157 -38 128
6958 128 12 133 9 -34 6 -35 -39 31 -59 -94 -133 -2 6 -129 -109 135 24 123 -40 1 145 54 -46 47 113 -201
6984 -201 -126 55 10 54 160 9 -87 6 -91 -25 -33 122 -26 62 144 97 12 -73 12 53 -196 -11 96 -30 44 -96
7010 -96 -109 76 99 -19 -154 -81 -13 -30 -7 -85 -105 -125 -22 44 -138 18 28 10 0 96 64 66 -61 -58 -38 -114 30
7037 30 -38 -64 -93 10 30 -47 -6 102 -26 -127 70 -24 -46 112 37 -7 28 -68 -57 63 72 -78 -151 27 -54 -80
7063 -80 -20 132 -6 28 -117 -22 -29 -23 102 15 17 -99 -81 92 -21 27 1 39 137 64 -77 98 -37 -123 52 -57
7089 -57 -3 -54 2 52 -84 13 -72 77 -57 25 -56 33 152 -71 80 -40 89 -76 118 -14 56 15 33 -33 106
7114 106 62 -63 84 25 -53 -30 89 68 75 -40 39 77 10 26 74 160 168 -21 31 88 51 94 63 -11 -179 -18 -95
7141 -95 57 -89 -67 -39 27 -7 -83 33 -158 32 217 -71 42 30 -21 32 -57 22 50 -53 -113 -209 -30 106 57
7166 57 -110 42 -72 22 14 -91 57 -23 109 91 47 -83 42 -39 2 -66 -16 -117 -177 -33 -130 -60 -149 -36 -96
7191 -96 -173 26 210 36 -52 24 -83 93 74 107 72 88 140 -12 -26 25 -185 -64 43 -57 -282 20 -33 -156
7215 -156 -45 28 -114 -54 82 41 -78 71 -66 23 -34 -127 34 -46 -17 -145 -44 64 42 52 -18 -56 23 -118
7239 -118 -29 -89 -73 -8 114 9 -166 -35 -31 -200 -114 -2 49 61 -33 130 158 58 -15 -91 109 -84 -76 -11 123
7264 123 116 16 -77 109 12 19 -15 -13 51 19 -38 33 9 -185 11 108 -62 37 26 -89 13 -191 -7 21 75 -105
7290 -105 -29 -30 1 -71 -18 -116 -38 -45 33 -83 15 -45 72 -14 104 -29 -100 89 -62 3 41 -188 -146 65 39 160
7316 160 -32 -116 -64 180 77 63 36 46 -69 -93 172 -126 -78 11 -110 13 45 109 -55 -11 -17 -91 -137 -20 -43
7341 -43 108 138 -178 -56 117 -78 -101 57 3 28 -115 -32 -72 -102 111 35 331 144 -35 110 28 -74 9 68
7365 68 66 4 -16 -132 -9 75 -109 63 30 22 4 -197 -64 -110 -93 39 8 23 -181 62 -45 14 -141 -109 -8
7390 -8 -118 175 -1 65 -21 78 49 -89 94 -66 51 -66 93 -172 105 26 10 -15 5 -13 45 73 27 -104 118
7415 118 66 -75 237 -137 88 22 31 31 135 -98 -164 243 26 57 -71 177 -135 -31 -32 130 -11 -187 -71
7438 -71 140 71 10 16 -46 65 -6 -47 210 -47 -48 10 241 18 -77 -39 98 66 13 -189 -23 191 113 19 -76 -79 -47
7465 -47 -150 -42 -17 -17 -41 137 92 -122 -36 -234 56 53 -101 -92 -86 58 65 -110 98 150 -39 -68 281 4 63 -70
7491 -70 -63 66 58 -57 31 127 122 -128 -104 -71 82 -30 -40 -43 -36 40 -88 -29 -73 59 -65 102 69 -81 -42 69 9
7518 9 47 -59 3 -101 139 -29 151 76 -18 -50 37 114 -144 5 49 -9 14 -28 -24 9 68 31 -21 14 -65 32 116 26
7546 26 43 -22 -71 -36 40 -69 -28 134 99 103 -40 -51 0 -48 92 11 -1 -79 40 -50 -109 47 11 -50 107 -82 24
7573 24 54 73 -17 28 106 -8 -66 21 85 -3 -210 122 95 -8 5 -57 24 165 116 6 37 9 -141 53 64 -76
7599 -76 -67 -165 56 46 35 20 55 -25 -29 9 19 -29 51 -3 232 -35 -8 -29 26 -227 -142 -43 7 42 -102 50 -76 -72
7627 -72 103 124 77 100 -124 97 -30 -64 64 -109 -75 30 -45 -119 29 -40 88 139 52 92 -10 76 90 118 -158
7652 -158 -39 -90 54 67 -16 -42 54 -10 97 108 51 30 -20 85 42 -30 -34 -48 -47 121 -70 27 12 -18 -92 57 -11
7679 -11 -100 103 18 -63 -59 -121 53 -11 -196 -53 -20 -204 -113 -105 -83 -93 -112 51 30 64 -166 -56 127 3 115 125
7705 125 12 44 74 132 112 90 147 -53 -76 -36 -22 -32 85 -93 96 83 -11 119 -100 98 -67 -116 73 12 -59
7730 -59 -80 53 -74 -110 -28 14 29 72 59 33 -74 -64 -75 -13 84 -108 61 -161 -168 -126 -81 -19 -56 -131 -33 48 -1 -44
7758 -44 -66 86 -96 33 12 78 149 -29 116 151 15 29 -45 -17 10 63 -72 6 -53 -37 -40 -62 -93 157 -58 -80
7784 -80 -29 11 -48 4 -142 95 88 -100 34 14 41 -156 -46 -39 -164 93 164 102 -15 -162 23 105 80 -34 -73
7809 -73 43 202 55 129 93 -103 -39 -111 -28 39 109 -59 -15 37 -110 176 56 -4 -80 -42 58 44 49 -56 -70 82
7835 82 -50 -11 78 -9 165 166 -223 -30 -92 -33 104 24 -119 40 32 34 -78 -107 165 -128 -85 205 54 -23 29 -4
7861 -4 -31 -124 5 100 64 164 -21 15 36 -47 -17 68 -11 -74 33 72 23 174 12 35 -96 -81 109 -24 8 -73
7887 -73 -20 62 16 18 93 -82 108 -10 0 -137 -67 -51 -81 23 21 -162 -19 -41 24 -76 12 -105 60 -37 -123 134
7913 134 -32 82 -15 51 -11 94 -138 -38 39 -55 100 -136 130 -45 -27 -56 43 26 -81 90 -5 135 36 13
7937 13 -90 -217 55 153 47 94 -146 -59 -19 -43 -145 92 -34 -82 -17 -7 16 -78 17 14 -82 -47 156 -47 43 -106
7963 -106 23 -63 -179 46 -4 37 25 24 -10 -12 -51 78 17 104 5 27 -94 38 -23 -1 87 -134 -56 18 123 -27
7989 -27 28 35 22 157 -62 -92 -7 -36 93 137 4 -189 46 -75 -279 90 -20 104 -115 17 -36 -34 -23 -33 -11
8014 -11 -35 50 158 84 -32 -63 19 31 25 16 -45 105 15 52 -81 -45 -31 -91 -19 -54 55 -62 112 6 74 0 -81
8041 -81 -4 146 -13 -61 -37 -81 -55 27 -188 -204 -41 43 40 43 79 -64 32 19 109 -68 54 157 155 57 19 -19 93
8068 93 4 -30 151 28 20 -18 -34 9 -61 192 131 -31 -72 -87 -149 184 -50 102 177 21 14 -171 54 -15 33 -20
8094 -20 171 12 -138 24 16 58 -24 -19 21 -106 76 -1 149 -154 -28 56 100 83 25 -21 -61 31 -37 21 31 -10 -119
8121 -119 10 -79 25 134 -3 24 -117 105 124 58 -2 -46 70 93 -9 -94 -121 -27 -119 57 -62 39 182 99
8145 99 141 -222 24 22 -1 -69 -67 -15 -87 21 51 158 120 -48 80 -205 125 -35 -2 -4 10 121 -161 -126 -244 93
8171 93 -173 146 -108 15 -61 114 -12 39 37 65 -64 104 -118 1 17 125 -32 -77 107 -25
8191b5
$$ Imaginary data points
##PAGE= N=2
##DATA TABLE= (X++(I..I)), XYDATA
0 0 0 0 0 0 0 0 0 0 0 0 0 0 0 8 -8 8 -8 16 -16 16 -24 24 -32 40 -46 54 -63 72 -80 96 -110 125 -142 160 -182
35 -182 206 -230 259 -290 323 -360 401 -447 494 -546 604 -666 737 -811 895 -985 1086 -1195
53 -1195 1318 -1454 1608 -1780 1978 -2205 2469 -2784 3161 -3627 4219 -5000 6080 -7693 10384
68 10384 -16041 56969 -105510 -23600 135357 -71269 -1573 73009 -51859 -8907 56621
79 56621 -54703 15060 12690 -38020 13633 2365 -37830 22107 -757 -45662 25208 -9947
91 -9947 -23987 16860 -31471 -9627 22643 -23537 -21017 22673 -29623 1119 19052 -30065 11033
104 11033 6496 -22005 15000 12473 -31202 23334 11012 -35815 28981 6062 -17884 13878
116 13878 -1485 -12118 19588 -9413 -13092 23728 -18572 -988 15038 -15970 -6655 16972
128 16972 -4876 -11448 11224 -6145 6057 -4030 -1780 13703 -8551 -4122 12284 -1353 -7213
141 -7213 23886 -13740 -7071 26433 -11088 23 15851 -7475 -2132 23945 -15521 -1321 23781
154 23781 -16165 4035 9285 -10061 4538 10207 -18585 9081 12080 -23422 10940 2150 -10039
167 -10039 5351 -226 -12927 2583 2936 -11510 6503 -11062 -1662 4977 -11828 -2245 6752
180 6752 -7590 -10586 12136 -11143 -2714 5781 -9605 1547 1091 -4456 -1796 5033 -9580 6439
194 6439 2566 -9599 7791 -861 -808 2832 2858 -5364 6004 1265 -2698 8407 -5139 4349 2806
209 2806 93 2138 5324 503 646 6150 -4336 8829 1030 -1663 4140 3849 1717 -1646 4265
224 4265 1015 6063 -4608 3511 3780 -5186 6472 1107 -3594 627 8705 -9606 102 7239 -5782
239 -5782 736 -3758 1227 1036 -1525 -6268 4721 -1869 -7558 7450 -8931 -1671 5239 -5003
253 -5003 -7729 5799 -1889 -8045 6938 -7416 -542 2167 -5305 -2218 4007 -2101 -5364 5679
267 5679 -6291 2692 2024 -4452 1348 2595 -1279 -2832 6896 -3755 2145 2940 -738 2175 214
282 214 3937 -738 3186 -752 4551 135 27 6111 -1642 2354 1102 3930 -2417 3356 4307 -1537
298 -1537 1618 787 4498 -3755 3150 921 -438 1529 -425 1245 -2262 3660 -2939 39 -1877
313 -1877 576 1471 -5936 1920 -157 -1730 -4153 2859 -3495 -2436 3506 -7109 -697 936 -1646
328 -1646 -5700 2177 -1866 -3450 2095 -5876 1413 -596 -2480 -2755 1450 -1606 -1614 2426 -5702 3588
344 3588 -118 -2561 -423 1990 -291 -1273 2909 -3042 4669 -1164 -471 2928 848 241 399 4070
360 4070 -2560 4839 894 -340 2991 2465 1536 -880 5952 -1208 1398 1706 2308 581 -85 4186
376 4186 -1541 2793 84 1505 -251 1327 1617 -2504 1755 -344 2091 -3789 1428 1394 -3450 -153
392 -153 -508 346 -3692 2193 -3945 -1329 1458 -3392 -994 -1712 579 -3611 260 -3145 -300 242
408 242 -4653 1192 -1009 -654 -3182 1456 -2204 -361 1397 -4479 1614 -460 -319 -1698 1410 -1560
424 -1560 229 1464 -3190 3462 -1340 108 48 1003 -143 239 770 -2425 4014 -1676 13 807 918
441 918 130 288 1968 -1782 3845 -1346 346 1965 692 -217 336 2829 -2066 3546 -1029 -829 1820
458 1820 1068 -85 -1766 3341 -1770 62 118 1455 -1866 -1881 2364 -2753 247 -1471 418 -2752
474 -2752 -809 1103 -3452 -1047 -739 103 -4940 1302 -1300 -4234 396 -851 -1106 -3324 1351 -2582
490 -2582 -103 84 -1623 -271 -930 2473 -2361 587 350 1161 -165 -757 3016 -460 1482 -295
506 -295 2257 306 2109 735 -1128 4621 23 1477 260 1806 1536 1509 421 122 3503 -1572
522 -1572 1925 194 1539 635 143 1190 -1188 3512 -1105 -612 -320 2270 -389 -1940 1266 -920
538 -920 1217 -2014 1117 -1117 -1153 1372 -1515 -1063 -1169 1690 -3823 383 564 -2120 -999 -974 989
555 989 -3022 697 -981 -826 -840 131 223 -2398 1258 -2112 845 -944 -203 15 -1592 1764 -419
572 -419 -70 -1525 2034 -415 -129 898 -317 1780 -1331 1932 -607 1351 774 -512 845 1203
588 1203 2372 -2102 1592 815 1522 199 299 1608 -858 2911 -69 163 228 2284 -358 -910 3256
605 3256 -755 600 -1085 1426 155 -63 -34 -1514 1047 -696 531 -2199 285 -1006 -594 287
621 287 -2278 675 -1895 -182 -1310 -112 -1071 -2015 -251 -1374 12 -2901 403 -2223 -1360 71
637 71 -1752 -556 -2168 541 -1832 338 -1088 -1178 -438 -350 1189 -2255 876 -783 441 356 -95 659
655 659 -372 1657 -1023 2042 344 863 66 314 2529 -262 1366 -319 2025 934 893 337 284
672 284 2127 -436 1850 -446 1566 358 150 765 96 1568 -1165 772 -97 1496 -709 -694 1003
689 1003 -741 772 -1327 698 -1231 97 -340 -1410 181 -959 319 -2312 890 -706 -1149 -862
705 -862 -730 642 -2239 245 -1504 -181 -846 -313 -589 -1441 1163 -1898 -39 -579 332 -1325 -658
722 -658 1040 -1189 562 -597 789 -651 1061 32 -669 1301 -346 1035 -631 1545 164 329
738 329 776 587 1275 -776 1833 24 1402 433 547 1034 149 1610 -544 1765 -173 898 274
755 274 250 1152 -217 1032 -1026 1408 -113 -44 -89 -124 486 -1139 776 -1116 582 -413 -573 -369 -615
774 -615 365 -1849 155 -902 247 -1306 -667 206 -1258 -302 -1414 326 -1681 135 -730 -1454 234
791 234 -907 -284 -1609 1166 -1349 -635 -98 -292 266 -951 830 -810 916 -300 259 262 -40 1530
809 1530 -832 1043 204 1029 -393 706 1114 -458 1421 -315 1361 391 1078 -134 689 1360 -515
826 -515 1242 -16 1482 -105 291 671 472 756 -625 1221 -409 865 -254 -56 286 -71 473
843 473 -1247 871 -608 124 -817 -387 123 -927 15 -1403 838 -1178 -359 -460 -396 -93 -1081 244
861 244 -1461 421 -715 -394 -731 -386 494 -1577 239 -512 404 -1066 -130 635 -541 291 -434 919
879 919 -1053 893 -245 -187 912 -5 407 -394 1382 -488 630 364 219 811 -99 1097 -341 1415
897 1415 -190 358 672 330 918 -726 1509 148 531 -145 1106 301 -635 1310 -770 702 -107
914 -107 341 -439 157 425 -429 420 -979 939 -772 -416 -294 -219 83 -1266 316 -1096 -43 -900
932 -900 -196 -149 -710 -71 -1085 495 -1133 204 -752 -566 -79 -510 -132 -981 716 -1049 152 -235
950 -235 -241 173 -551 458 -582 694 -331 -73 -74 521 367 -676 1039 -343 640 -284 672 785 -119
969 -119 720 159 800 -120 1067 -567 644 1249 -208 549 -166 1139 -480 563 422 339 298 -157 727
988 727 -487 789 -372 71 -108 164 326 -1438 541 -124 -83 -678 302 -611 -476 438 -1105 277
1006 277 -909 -53 -646 -118 -45 -785 -188 -661 577 -1201 -115 -271 -328 -44 -666 724 -873 108 -255
1025 -255 0 -9 -61 -137 -676 910 -290 531 -536 494 454 -360 427 -210 902 -335 596 138 337 398
1045 398 -19 850 19 1357 -302 158 750 684 252 -81 830 -296 982 -261 629 161 -164 818 -498
1064 -498 449 37 398 -669 636 83 -591 336 -309 258 -672 444 -664 -385 124 -403 -227 -641 -11
1083 -11 -840 -44 -422 -287 -364 -957 416 -960 -81 -484 -51 -89 -171 -189 -359 402 -1015 259 -241 88
1103 88 -25 -212 296 -354 676 -581 415 25 345 -50 -137 755 -225 635 -69 313 404 311 36 -91 850
1124 850 28 283 -87 951 239 -39 629 -152 777 -138 476 -24 239 616 -214 161 -171 751 -772
1143 -772 344 221 60 44 -360 351 -444 133 -632 377 -422 -438 77 -612 93 -462 -38 -704 2 -179
1163 -179 -487 -46 -470 305 -970 70 -298 -66 -264 -495 207 -629 180 -435 4 -198 68 -246 -150 565
1183 565 -487 256 -319 320 18 -30 374 -118 458 -169 719 -113 346 256 44 410 275 660 -332 461
1203 461 181 323 99 125 442 -178 417 -255 295 127 257 273 -321 648 -195 75 -359 501 -113 -135 118
1224 118 8 202 -579 487 -483 -11 268 -403 -270 -244 255 -719 56 -23 -278 -385 -211 178 -491 -6
1244 -6 -571 -71 -205 38 -78 -528 344 -441 -160 -289 270 -153 -127 170 -389 316 -256 171 -22 251 -166
1265 -166 -164 462 -167 383 -44 169 122 224 95 -95 491 76 151 -228 589 81 -111 409 31 199 -133
1286 -133 602 -331 295 363 -331 89 111 278 -542 457 166 -83 -112 -122 66 -429 344 -277 -29 -92 -13 -274
1308 -274 -245 180 -346 -50 -166 179 -189 -195 106 -345 -142 -255 114 -401 41 -79 -356 -47 -334 75 -362
1329 -362 216 26 -17 -143 -325 335 -40 194 -279 210 -61 98 -18 -104 418 -6 226 -129 184 121 -53
1350 -53 139 -7 303 -200 227 81 118 55 198 127 23 408 -247 41 -124 374 -92 -45 356 -44 66 -50
1372 -50 162 -71 68 85 -208 26 -408 64 -277 55 -54 -143 -20 -186 20 -397 306 -210 -66 -29 -103 103
1394 103 -200 107 -185 187 -283 112 -44 -291 212 -226 -13 -200 415 -210 -164 188 -92 119 -74 268
1414 268 -250 223 -47 -70 208 100 377 -167 204 56 -74 -120 107 359 -103 232 12 340 102 303 346
1435 346 -70 154 53 117 -10 415 82 -65 186 76 436 -208 287 -2 81 142 -50 55 -151 237 -323
1456 -323 110 -104 -98 -141 -281 144 -157 -174 -156 94 -307 -43 -17 -199 37 -152 201 -163 14 17 -370 -21 142
1479 142 -151 -463 213 -2 -15 -13 51 106 -248 110 -197 151 35 96 -14 82 241 -148 61 -103 379 -63
1501 -63 55 62 60 186 -94 201 -60 265 7 153 50 77 266 -143 181 138 183 106 -80 171 -80 91 -65
1524 -65 97 -103 238 143 -209 322 -140 -64 -69 222 -42 -94 -11 -92 62 -179 -85 -357 -17 -2 -187 -129 -45 28
1548 28 -93 170 -71 -150 -216 -5 165 -22 -73 -169 -18 -36 -68 -129 -43 -29 -37 82 0 169 -37 -84 124 -25 -2
1573 -2 -106 49 113 36 -116 46 144 -15 213 19 340 32 186 210 86 226 183 56 -168 294 37 121 55
1596 55 73 39 -67 251 -20 138 7 -28 -48 -46 87 -247 211 -132 -49 -138 -167 47 -268 38 -136 83 -70
1619 -70 -54 -5 -285 65 -137 -2 -79 180 -62 -208 0 37 -174 -334 89 -107 86 18 -52 -129 -131 118 -157
1642 -157 -52 123 92 -135 24 -40 0 56 -92 69 -134 -123 51 -19 -58 -39 118 -109 64 -91 -28 33 -52 172
1666 172 1 151 66 -26 10 25 108 -147 67 116 175 -67 12 86 6 169 36 -13 -284 -15 69 94 122 -17 106
1691 106 55 -1 -51 173 -70 94 46 27 35 -49 -71 68 -29 -177 -147 74 22 -42 -107 -97 -187 35 -51 0 77 -130
1717 -130 -83 -113 22 -30 -73 46 -80 35 -21 80 -218 58 -76 -112 58 -48 100 -4 51 95 9 -39 19 103
1741 103 65 -44 132 106 -72 39 83 1 143 -154 63 4 -68 128 2 -37 -111 114 14 157 -92 87 164
1764 164 -8 68 -155 72 -165 -37 56 44 35 -179 25 -33 -34 -47 -154 0 -136 -226 -131 68 -16 -20 69 -46 -32
1789 -32 65 109 24 81 -116 -98 -30 -25 -96 -106 -23 -100 23 135 45 -146 -88 59 -71 35 75 87 -166 63 96 -64
1815 -64 115 -167 17 -169 150 129 -64 84 -33 123 56 -64 -82 -10 46 105 -33 -72 146 -84 -27 -95 29
1838 29 -19 111 -45 -70 82 104 -158 -43 -13 27 12 52 -161 234 -144 167 -27 44 -100 -171 100 -118 -109 -17
1862 -17 1 91 -162 -1 -45 42 12 8 79 -106 44 -12 140 46 -49 -59 128 -7 -78 -26 -5 112 -73 118 -157
1887 -157 70 41 210 26 87 27 19 0 -51 142 24 -20 78 -154 284 43 4 -45 -52 52 -34 45 31 257 -29
1912 -29 96 0 31 257 49 -74 -31 277 109 -17 43 9 118 111 154 46 -41 -218 -38 -1 -109 -48 -152 -12
1936 -12 -77 -36 31 -108 3 -185 76 -5 -225 -63 -35 -91 -65 23 23 5 -160 33 -86 23 45 -128 15 91 69
1961 69 -19 -17 -129 -54 108 77 233 105 -91 -45 16 70 -66 127 -228 98 -85 172 -49 80 59 -48 -56 68
1985 68 192 10 15 -39 -10 64 -42 116 36 251 22 253 -45 -61 177 -51 71 -129 167 -35 132 -39 -161
2008 -161 0 -169 153 25 125 -72 -95 17 -90 -97 -117 -134 -25 23 -33 78 -55 -99 56 -29 203 -77 -114
2031 -114 5 -3 16 -223 -83 -261 -86 -45 14 25 -32 24 -212 104 -44 74 43 -42 121 -17 134 50 104 135
2055 135 172 61 -66 57 -20 158 -61 92 -35 41 17 -220 -150 -176 242 52 82 71 50 113 -147 -47 125
2078 125 -21 -65 94 -314 114 -42 -184 40 -210 44 -71 113 -120 79 -9 -100 79 -123 -67 -157 135 52
2100 52 13 -44 -60 187 -63 53 -124 53 -9 -91 27 -111 81 -92 -12 87 80 68 -97 58 83 92 42 75 35 98
2126 98 -31 -18 123 -101 88 -5 110 -12 -22 161 -31 178 92 209 17 153 70 -14 48 -4 253 -112 31
2149 31 -131 -59 143 66 -15 -60 147 -65 16 -201 -63 76 79 56 -87 58 -152 -78 -141 143 -167 -90 -133 -205 -84
2174 -84 -5 37 -94 -47 -115 -95 51 -132 101 -200 106 25 -27 142 33 52 -117 182 33 109 110 100 0 59 -38
2199 -38 14 93 -11 -10 175 93 114 -20 9 53 88 2 99 30 -17 164 -106 84 -64 60 -35 58 194 -106 5
2224 5 -101 226 -111 -82 43 -66 -25 -68 200 -59 200 -21 -84 33 128 139 -131 -35 -13 137 -105 -80 -55 -154
2248 -154 -1 -182 -16 -217 22 -205 -262 39 -124 -47 -168 84 -59 -36 -64 26 69 -204 17 -118 -22 -109 -78
2271 -78 -99 -127 102 -27 200 18 -10 96 -64 57 -74 165 108 62 -13 62 112 -70 158 -46 260 53 153
2294 153 39 -21 138 -80 101 -180 172 -27 64 139 51 -78 -12 174 -168 195 -96 124 6 -59 2 -30 72
2317 72 -74 97 -125 -124 -86 -82 51 -315 1 -31 223 -160 3 -139 -14 65 -238 -17 -102 15 -37 -23 10 -155
2341 -155 65 -70 0 -94 -21 -153 -69 86 -7 40 76 72 20 -52 87 -2 73 21 68 24 153 -15 31 112 32 189
2367 189 -138 227 -56 119 -80 72 157 26 92 -113 55 -6 138 -4 -22 76 -89 90 64 63 -83 -100 -83
2390 -83 113 99 -206 -81 19 -6 -132 125 -36 62 -24 -59 89 -7 -3 -61 19 -58 -38 77 -89 273 -123 -73 -131
2415 -131 -68 -10 -138 80 -104 79 -89 -17 121 66 118 -74 221 -74 47 -71 55 -45 -47 281 193 272 53
2438 53 102 111 -46 33 110 92 32 139 0 66 76 53 67 14 48 30 156 174 44 -131 62 44 -45 -28 -124 196 -67
2465 -67 76 50 -67 182 4 20 72 -15 -175 -51 -23 -102 125 -138 25 24 -24 -102 -182 -63 -2 157 -128 186
2489 186 -157 153 17 20 55 -80 173 1 130 -43 -73 -33 62 25 -174 216 -74 55 74 58 166 -17 219
2512 219 24 108 163 148 122 67 148 -68 227 9 54 -128 205 -49 -47 -96 -46 106 -117 318 28 93 230 -67
2536 -67 4 -108 106 -192 -13 -24 -29 52 -40 20 -57 73 -207 -69 -136 -210 -31 -160 4 92 -68 37 -30 174
2560 174 38 113 -131 -87 72 53 -80 137 -42 -148 20 -45 187 -187 110 -57 2 -21 -75 82 -24 7 -161
2583 -161 60 -76 81 297 -132 50 19 30 33 120 122 92 196 142 333 -160 48 302 133 107 -279 87 55 155
2607 155 23 -24 -17 57 67 -143 152 -49 31 9 -19 -34 -155 -62 -92 172 24 86 -204 -29 -49 -90 -71 -126 2
2632 2 -97 98 -235 -116 -79 -61 105 -89 136 -141 83 -98 182 51 -139 143 -157 6 -136 96 -16 -1
2654 -1 -14 1 152 60 158 -78 26 93 44 145 -42 108 -116 -70 -40 26 111 -30 209 57 113 -13 151 91 183
2679 183 -11 67 139 -65 212 -63 252 17 -5 151 -51 107 -89 80 -285 79 8 -66 -51 -160 6 -54
2701 -54 -109 -155 -68 -64 25 -112 -42 -23 -69 -104 -83 162 -50 -177 149 -81 -72 -30 124 -7 91 168 42 151 27 -51
2727 -51 -45 -17 86 29 277 109 112 -66 133 -4 150 54 58 149 23 86 -104 182 -147 85 28 92 115 60 114 45
2753 45 10 -110 -50 82 147 107 -98 82 2 -93 -31 -159 107 -191 78 -117 25 64 -116 206 -264 23 -257
2776 -257 -1 -22 -59 -234 -15 -75 -83 6 -85 64 14 14 -79 64 7 26 -21 -80 162 0 26 88 -185 -15 -54 121
2802 121 -119 158 -52 188 15 56 16 -100 238 71 157 -43 127 -129 51 -28 -216 119 50 216 27 69
2824 69 228 42 136 -85 25 11 98 42 124 -19 -37 174 -7 268 -106 14 101 -96 79 -4 28 45 118 -239
2848 -239 38 -95 -163 44 -139 21 8 -142 -201 -5 51 -110 -84 97 -35 -118 102 -155 -47 -18 -133 -11
2870 -11 -68 82 -2 7 45 -6 71 2 24 -74 -73 98 173 14 -20 -6 -170 225 -75 108 -46 30 71 -90 93 -58
2896 -58 120 14 218 -27 42 -5 76 121 -41 169 -69 -114 240 -173 111 -127 115 -94 75 -33 -55 81
2918 81 -136 48 -38 149 -106 40 -14 -110 -52 -210 -69 -257 103 -178 -97 74 -126 71 -170 -42 -140 29
2940 29 -89 62 86 87 52 -96 133 -203 -44 -23 -110 38 -32 182 -92 147 -40 52 20 -22 176 48 153 83
2964 83 15 169 70 166 90 108 -115 114 -143 95 28 205 192 31 57 -58 90 44 108 34 106 104 -134 116 -136
2989 -136 187 36 -11 49 4 48 -95 146 -144 126 -57 1 0 -83 120 -130 52 -70 115 -104 -63 38 -11
3012 -11 -3 -108 -53 -91 -144 -208 86 10 -232 -85 3 119 9 136 -37 -113 -92 -64 128 -131 -13 -164 47 -67
3036 -67 103 15 115 29 -31 27 210 -61 122 -3 96 -7 62 44 119 -9 19 31 -68 128 24 -17 -22 -68 -181
3061 -181 -64 -11 -96 55 -159 6 -179 117 54 -24 -32 -159 186 -138 73 78 133 -86 -180 -3 -41 53 -91 58
3085 58 -68 80 4 -108 41 -29 259 -178 47 10 16 -93 -122 -19 -145 73 -159 57 -112 -56 -11 90 -46
3108 -46 -165 99 54 89 168 85 -17 -63 181 37 179 -37 85 179 110 194 76 205 -41 6 -51 -16 156 -45
3132 -45 118 -119 147 -83 3 145 13 143 -192 57 -9 33 -11 13 -153 25 55 23 -40 -107 37 -96 122
3155 122 -36 -39 84 -189 -4 -101 76 -111 -76 -33 -134 206 -167 7 -135 -9 99 33 -6 94 140 -142 104
3178 104 -107 100 -35 -85 84 -67 77 -274 99 -43 107 54 22 194 -75 161 49 237 49 83 142 100
3200 100 46 -12 -14 128 62 62 -77 -74 1 170 -8 45 -148 211 80 69 70 25 188 -123 152 -88 -117 -70 -15 54
3226 54 -23 3 -148 -41 -12 -67 85 -154 125 -108 -2 3 -84 -45 37 9 104 32 -74 99 -7 144 39 -48 102
3251 102 -120 56 -116 34 29 -165 65 61 25 -73 96 -26 125 -79 88 -11 -106 57 -14 73 -166 144 39
3274 39 -119 135 -179 3 16 120 16 76 18 104 -44 -27 -52 -167 245 49 188 -87 -7 -26 -184 134 -87
3297 -87 97 -15 -100 -83 106 21 -193 49 -72 -66 -116 8 -41 -196 24 -291 -37 8 46 -6 -139 -3 -118 75
3321 75 -215 81 -79 48 162 84 -84 -151 145 -127 27 -111 -3 28 16 50 -107 50 -56 147 91 110 83
3344 83 -130 5 -175 7 -37 106 -30 -21 -57 -131 143 83 97 -36 122 -40 -34 120 -45 23 10 93 32 -28 -18
3369 -18 -58 44 -42 32 43 41 -62 117 -147 3 -1 -182 93 -104 -34 -23 276 21 -86 12 -84 46 -243 -27
3393 -27 -27 220 23 42 139 -57 140 -115 -129 82 -61 -122 21 60 -13 91 -1 160 100 75 -105 -205 142 -2
3417 -2 309 47 42 -49 -17 93 75 16 -197 33 -48 4 115 -159 153 -113 20 106 68 127 -48 -40 -150 39 -178
3442 -178 72 -166 185 1 -55 -40 -89 -82 -132 20 -168 -54 15 -173 43 -73 59 -47 -5 -56 -150 -106 -137 45
3466 45 -32 137 -51 -5 80 -57 -52 -62 137 -80 -9 -1 67 257 127 109 -44 36 121 -82 87 -2 200 76 54
3491 54 -100 250 -57 47 165 -42 158 41 133 92 71 -176 56 -66 -23 221 32 143 -58 55 129 44
3513 44 79 -21 90 -25 -34 -124 -60 -49 87 -68 -100 -11 -102 -10 -180 136 -79 -8 -107 -4 255 74 40 53 108
3538 108 -113 -106 -81 -81 -25 19 -36 -105 21 -288 -125 -39 -135 -66 10 107 4 21 212 -98 102 191 -32 35 110 64
3564 64 64 270 73 144 3 -31 70 115 100 -73 46 260 155 -22 47 -37 38 -37 -22 3 -35 -34 -75 -6 -51 4 133
3591 133 80 21 27 -13 70 -143 -56 -99 -92 4 30 -71 99 29 19 -177 -67 74 -86 74 -59 -124 -50 -59 66 -103
3617 -103 56 -134 -33 21 -71 -168 76 74 40 132 -90 46 -46 205 19 -16 86 55 32 -32 109 3 -33 76
3641 76 -64 -55 -37 63 -117 161 37 197 196 37 165 -2 106 -32 136 -116 191 45 -65 136 -134 12
3663 12 -107 80 20 -10 80 -103 40 -188 -53 -87 -84 124 -73 33 -88 -105 -150 65 -180 -61 47 88 -19
3686 -19 -54 51 -157 -107 -98 30 79 -89 -6 -115 43 64 85 -77 -4 76 -154 128 31 -50 -56 106 -57 -136 182
3711 182 -23 111 -176 125 34 -239 -43 3 189 -157 68 12 26 -22 76 86 100 142 -39 -132 -57 55 -237 72
3735 72 84 142 69 -28 181 -17 -68 -52 12 5 -89 -257 -76 88 -96 0 -176 -9 42 -126 -100 -95 100 -303 -21
3760 -21 190 33 32 38 87 15 40 -82 -66 45 68 16 -117 56 -95 -74 145 71 -42 52 -115 -261 238 -72 -5
3785 -5 -9 150 146 -162 107 46 -40 65 3 80 -61 61 -104 217 93 -105 -10 -27 106 55 14 96 11 -52 -50 53
3811 53 11 -9 -49 179 -192 116 -8 74 -55 -60 32 -115 109 -15 -93 -248 90 117 -33 -35 -90 -15 -42 32 44 -113
3837 -113 36 -208 24 -67 43 51 1 14 210 -28 15 31 6 74 55 42 -148 -14 -54 -144 -81 6 54 -131 73
3862 73 149 -5 196 -62 234 64 -70 40 79 -64 -65 154 -14 59 -110 130 174 79 43 -125 42 -89 62
3885 62 4 12 31 62 -3 23 -132 -29 -19 18 22 35 -78 134 -101 71 -108 70 -117 -43 3 -76 -22 -24 51 -179 -184
3912 -184 47 -131 181 -217 -51 61 -28 -20 -137 251 -41 82 -71 50 -72 -38 8 89 -4 -70 64 -102 322
3935 322 -116 187 15 18 50 -121 65 -60 34 -122 204 26 124 148 -163 153 83 3 -53 180 132 42 78 -33
3959 -33 160 -28 122 -16 266 56 -69 113 -10 214 -48 221 -113 31 -5 -42 20 -81 -115 -133 -62 -160 -114
3982 -114 32 -109 237 -131 -9 -40 -5 -28 -47 -89 -35 -32 -204 71 -98 81 -52 6 113 -123 57 7 11 42
4006 42 -29 -40 -95 138 -128 -16 -93 151 117 69 217 66 213 79 36 9 157 154 -105 128 -184 22 -18 -16 -69
4031 -69 -33 118 90 -133 -113 157 151 143 131 116 133 -23 189 -97 -45 -1 -43 -67 -156 179 -46 73 -172 -28 -77 -19
4057 -19 -221 -161 19 -62 106 -174 -23 -35 46 9 11 -51 -118 142 -41 -84 0 -138 -89 -32 135 -73 9 -20 248
4082 248 7 61 -4 -21 137 -72 -57 32 29 30 10 119 56 -20 84 114 -45 -35 -19 -49 131 -168 -124 -24 26 130
4108 130 -43 85 -31 -33 -54 -63 -190 -14 -10 -100 -53 -68 -153 21 76 65 94 -60 57 20 -191 13 -70 -24 33 -90
4134 -90 -42 -30 80 -268 -19 -251 11 8 -101 -53 146 143 -68 -114 -94 -92 14 -23 65 -22 5 -342 38 22 -67 -14
4160 -14 -143 -49 -46 52 -113 -3 69 193 105 24 83 -197 151 155 81 182 95 27 54 58 -55 182 -148 -86 -116 -30 6
4187 6 -60 63 -18 -5 -116 127 -121 73 57 -5 134 -106 68 -127 6 -108 11 27 -54 53 -155 98 -35
4210 -35 62 -50 -89 48 -108 166 -49 -65 -23 -194 -28 -69 -52 -123 -7 -98 2 -10 -63 -97 38 26 124 23 17
4235 17 -109 -31 -2 115 44 209 -14 165 88 181 104 120 83 -74 253 -87 177 189 -38 154 -127 117 -130
4258 -130 148 -4 -62 16 10 113 42 174 12 86 108 -99 71 -133 6 -175 162 -55 -35 -83 -73 18 -122 3
4282 3 -36 93 -35 -91 -32 -106 156 -106 -91 -61 14 -113 82 -39 -8 100 8 -31 103 21 4 -103 165 121 103
4307 103 89 16 18 60 -15 -77 -16 18 -106 48 126 94 137 63 -118 74 -18 81 -61 -14 -11 27 -11 54 171 1 158
4334 158 -19 168 4 349 -33 -290 27 -43 55 -171 113 -9 -93 -63 -260 142 -165 -41 -135 -57 85 -33
4356 -33 -258 -191 82 -36 27 -3 -183 97 -44 135 -178 68 61 -119 4 -4 96 -158 84 -8 100 -139 11
4379 11 -34 12 -33 -126 166 108 156 -71 19 -27 143 -12 -15 93 -197 73 128 23 68 -71 -2 32 90 -73 193
4404 193 6 -105 279 -175 29 16 222 -64 76 -63 -67 50 36 53 123 114 -113 -90 54 -68 46 66 40 -127
4428 -127 -43 -154 -67 54 149 -108 -229 103 -71 77 -145 -141 -39 -98 -142 -63 82 -140 -100 -50 -74 100 119 -15
4452 -15 -86 -68 6 4 -30 -39 -155 36 42 -73 110 98 -87 102 -182 186 -70 -12 -130 169 -9 -69 -10 -60 116
4477 116 -112 176 7 -31 -46 11 104 99 115 -179 -5 48 22 122 77 -4 -2 43 -18 46 -12 -32 117 -129 -35 -29 111
4504 111 69 102 -25 -141 125 -37 -183 -201 87 -90 14 -16 -85 56 -110 61 -10 -21 6 -48 17 -14 -2 -179
4528 -179 66 -159 38 -85 81 7 -40 56 -97 90 -7 70 -3 -78 -58 72 -22 -148 -14 118 48 142 99 20
4552 20 22 150 91 -74 70 76 86 72 -63 -94 49 -31 85 112 35 6 6 2 5 -11 -100 127 55 187 -143 75 -24 -36
4580 -36 -12 -45 137 22 42 54 -75 -27 -144 210 -138 -47 29 -237 -92 110 149 -152 21 53 -13 -31 -26 60 -91
4605 -91 42 -93 103 -23 113 1 -99 152 161 111 -76 19 142 10 -57 21 112 -133 100 -124 -14 168 35
4628 35 22 117 39 -164 -27 31 149 -94 52 -20 -73 33 -54 68 -186 12 -35 121 119 14 -31 -123 -13 -86 56
4653 56 -119 -13 65 -53 -18 -63 22 -52 50 -25 -70 67 -64 12 108 27 -113 -92 135 97 26 -127 128 69 84
4678 84 0 -151 1 -26 169 -46 119 -107 -49 12 -45 188 -69 -66 -16 -94 52 12 22 -109 114 -100 193 68
4702 68 111 -47 -89 -43 -20 209 -96 -13 66 -20 67 78 109 -36 170 9 -126 -8 13 -22 -36 25 -13 -10 -26 21 -33
4729 -33 -44 110 31 33 -104 81 3 124 -6 162 86 -204 -28 -185 -35 65 -99 -32 -30 160 -185 -12 -114
4752 -114 -93 -116 -57 -51 -103 147 -54 12 -70 40 34 -203 1 -67 100 32 116 22 111 -19 -35 92 61 120 -3 45
4778 45 -49 162 6 -37 100 -154 126 -91 92 -84 81 41 29 -50 -29 -136 -104 -108 34 55 19 -55 0 -14 4
4803 4 133 33 -39 22 -104 -69 136 -100 12 -11 63 30 -269 -56 -140 -4 -47 38 113 -149 -98 -81 43 0 -105
4828 -105 124 -175 -101 18 100 -70 52 -127 -3 -52 30 -104 -55 -83 -98 94 -93 50 -76 70 13 1 52
4851 52 -120 70 -17 25 102 -17 39 -64 -11 -20 144 138 67 119 47 72 -68 153 -83 38 115 169 49 -67 49
4876 49 -51 -13 -11 61 47 53 66 -59 20 -120 87 -37 83 -11 -14 16 58 76 -66 -34 -40 -79 -26 96 -27 -16 33 -63
4904 -63 42 -55 -65 -35 238 67 -115 32 -40 163 -61 -104 -73 91 21 -103 -112 12 42 44 11 -36 -7 -1 23 -117
4930 -117 96 34 59 47 -42 70 66 34 65 164 -26 2 -25 67 -17 112 76 162 -53 -57 58 -136 -182 -95 -63 -147 -1
4957 -1 -107 47 50 -121 -103 -76 -112 -69 83 -14 -139 3 21 -142 91 -170 -75 -74 -257 73 92 -130 66 -117 -7
4982 -7 -132 -75 -132 16 4 24 -39 -191 78 -79 -28 33 34 24 118 -15 -82 38 -90 -169 128 -63 53 -4 145
5007 145 -129 69 -37 -7 36 44 -2 -58 79 36 13 101 25 -90 29 61 90 62 -4 56 69 115 63 64 92 -49 63
5034 63 4 -174 -38 -1 36 -110 -8 -154 33 64 -191 117 -47 -23 11 -105 191 -69 -78 22 41 -89 -15 142
5058 142 -72 -54 -26 -43 -111 146 -107 122 -195 -17 4 12 236 87 -8 33 -70 58 16 -11 -3 -80 46 80 -41
5083 -41 88 7 -39 58 38 60 -44 25 54 -6 113 -31 51 102 96 56 2 37 27 9 120 106 2 -92 -298 37 1
5110 1 87 -115 57 -45 -166 -79 -236 -160 33 40 -138 -66 -31 51 163 -72 -64 -100 -39 9 19 -33 43 74 -48 4 -4
5137 -4 50 26 34 -79 -191 -28 -102 100 -34 73 139 -73 106 75 -198 114 60 60 -15 -1 14 -134 5 102 59 -10
5163 -10 33 38 101 -54 44 -30 104 -98 -118 67 33 72 41 51 50 -54 -92 55 5 99 62 105 64 80 -99 -47 50 5
5191 5 -174 20 -191 -76 -18 -89 116 124 127 -103 111 -37 63 44 -26 49 -79 -165 -117 -173 -128 44 -2 -21 4 -57
5217 -57 77 -115 -35 -102 22 31 -76 -55 -65 58 -108 104 -19 24 -38 -138 93 -24 -123 115 60 44 -39 92
5241 92 -107 21 -113 46 -18 178 -37 92 -116 -39 65 84 -32 121 -23 -83 85 -2 38 1 -41 45 152
5264 152 22 198 -88 202 -68 -2 -30 -23 40 18 34 45 -65 17 -1 -114 31 -160 -139 100 -130 33 -101 -25
5288 -25 -55 8 48 -24 72 -46 -108 -23 149 98 58 74 -159 11 25 -111 125 52 76 -132 -6 -180 25 -175 9
5313 9 53 -112 43 -120 131 140 -217 -85 -67 -63 -10 59 -52 77 -98 75 77 63 32 33 163 -28 63 22 -10 -119
5339 -119 2 138 -69 21 -142 50 56 -111 -115 123 -119 -72 15 -135 94 -35 42 -24 -80 158 -50 -123 -105 121
5363 121 107 67 107 -16 -18 -98 65 -17 -165 -18 -44 11 -190 -55 -53 15 42 74 148 -36 -173 45 -95 -128 29
5388 29 -116 71 -6 -117 60 -121 61 26 36 -104 -12 -9 106 38 13 -80 52 22 -94 60 -38 88 -4 -60 -135
5413 -135 -37 6 41 63 -102 28 -106 23 12 -113 -65 -69 -20 16 14 -1 -58 -119 -78 -130 -34 36 -158 -16 -45 -125 60
5440 60 -148 118 -75 47 -44 73 108 -143 110 -57 23 -101 -33 103 113 6 -143 62 13 108 106 32 15 -49
5464 -49 -5 43 21 -5 -126 -120 76 127 -88 141 90 139 -180 -15 110 49 27 98 3 136 86 -23 25 64 -10 -103
5490 -103 -138 80 71 24 -2 -95 -166 164 -21 -53 126 -15 -36 41 17 -29 -97 -20 -46 104 -81 -130 -52 -133 -18 -94
5516 -94 29 48 218 -13 -109 65 -22 -63 20 -153 -47 20 -47 65 -2 -7 -47 56 58 1 52 -96 -86 -16 -46 -114 194
5543 194 -43 29 -64 -82 88 277 28 -96 -72 75 30 -9 -139 -1 -59 -99 68 6 -10 52 78 -7 34 28 -52 4
5569 4 183 -91 27 -8 66 17 40 -29 87 25 -23 -11 49 -83 31 -62 103 -119 -46 81 -8 -178 -59 -113 -9
5594 -9 133 -10 -73 62 -110 -107 -111 -51 -128 -141 70 -67 24 32 38 -133 -49 44 -26 -173 -4 167 140 30 14 131 -28
5621 -28 -158 -94 -42 36 140 27 -117 128 68 88 7 120 9 60 -28 -150 60 -53 33 11 -57 56 -73 -90
5645 -90 50 -66 62 -78 -33 -27 113 -56 136 117 -135 -83 15 10 115 -112 56 66 -105 -147 -62 66 -40 147
5669 147 -170 -32 104 8 194 12 44 100 23 26 80 -80 -35 63 -75 171 69 92 140 -149 -40 -12 -16 58 -38
5694 -38 -1 -80 113 -9 160 87 28 94 -8 11 -46 -33 -8 -7 -67 119 -94 -64 24 -67 6 -172 214 4 60 18
5720 18 78 140 -39 -84 -234 57 201 24 68 -71 -4 140 -48 129 -48 -80 -15 -55 -64 -137 -22 23 31 -165 -2
5745 -2 -120 -61 50 124 108 -21 -126 229 152 -172 5 -51 61 -129 136 3 -57 147 -56 -39 -104 57 -119
5768 -119 180 -134 -149 14 62 105 -36 45 -22 -10 -94 111 91 101 43 -20 79 -40 2 159 113 34 225 145 51 75
5794 75 44 -216 15 -18 90 205 128 85 137 -108 -36 -167 5 -26 -60 49 -33 -45 129 67 83 -49 -98 57 11
5819 11 -96 30 49 -161 136 7 -10 111 -27 -67 -15 -130 -58 116 57 -12 17 -58 -75 80 -135 -110 -125 26
5843 26 -125 -22 -40 -8 -2 34 121 -114 2 -64 -153 63 -86 88 154 -151 31 -55 22 28 36 54 -60 10 125 -7
5869 -7 52 97 7 88 -22 -102 -64 -93 25 -30 -30 -50 20 -88 -38 -27 0 43 -186 186 -57 78 -84 26 -11 63 62
5896 62 -4 114 -8 -40 69 86 38 -14 83 81 -4 -52 6 224 127 10 244 -84 -56 -149 22 131 -134 -30 51
5921 51 34 13 76 -154 149 182 -168 9 16 128 -7 12 31 74 65 61 -153 -19 101 -72 87 -176 38 265 20
5946 20 21 167 -84 2 134 -93 144 -11 12 -45 -68 118 7 -16 -43 -43 78 -34 49 148 -38 -94 -43 16 95 -72
5972 -72 79 -32 -94 -170 123 22 -16 -78 -57 -26 -49 -110 -18 -61 8 22 91 62 -42 158 -171 8 72 -34 -107 35
5998 35 35 -40 -93 10 4 53 -56 -54 4 -67 45 6 67 29 106 -33 -38 -40 -43 68 87 -58 64 -35 -85 77 5 14 12 -119
6028 -119 12 56 -4 115 62 -4 62 40 66 59 142 -84 -99 58 -58 101 -213 -61 -8 76 -56 -5 -29 -122 -8
6053 -8 -99 129 97 156 50 -10 -34 207 65 -17 -264 47 17 37 69 110 -84 -6 -50 100 -35 7 -72 -4 0 73 -41
6080 -41 122 228 49 -142 -70 74 13 -113 -99 -27 -32 -27 1 68 199 32 44 21 -26 160 -18 -162 -20 -3 111
6105 111 -107 -6 -144 77 157 54 -91 -151 58 -17 -123 -91 -10 -1 -52 160 50 -14 -51 134 21 -199 -74
6128 -74 42 -1 -59 52 99 0 64 -77 13 111 -62 -12 28 -91 32 113 90 54 -66 -30 -32 -13 -7 45 27 -33 -81 33
6156 33 -53 -85 2 99 -47 31 -75 -29 -101 4 -141 16 64 -26 91 107 78 -53 60 119 -93 -78 -28 -24 -37 -95
6182 -95 79 10 -40 -48 -87 -88 64 -99 -92 83 -56 67 49 -7 47 -61 71 -9 66 65 -17 -149 96 59 -169 -67
6208 -67 -71 4 -105 -44 24 32 -71 -70 18 72 -93 -8 48 -72 -17 44 -3 -104 -31 13 -23 6 118 115 -170 -99 -24 -153
6236 -153 12 -28 48 -35 85 45 198 -68 -76 126 -44 -165 -11 -83 -8 -4 -65 -24 24 45 52 71 -14 87 -40 50
6262 50 67 151 112 157 86 -74 4 91 -21 -53 -3 -92 -14 -106 21 -86 -65 41 24 33 -116 -186 27 -73 -96 195
6288 195 54 -100 -55 12 11 -174 168 -12 32 -90 -18 80 14 -137 -132 -31 -92 35 -126 -21 -181 1 67 13
6312 13 -53 67 -112 -90 6 32 108 -28 69 60 11 13 59 80 -105 42 24 152 -7 29 53 38 -53 -54 -122 -69 134 19
6340 19 60 122 185 136 97 29 0 104 10 3 -68 -18 27 27 89 97 -92 -37 -50 -77 -82 29 -68 38 -56 -119 65 -63 -67 12
6370 12 56 13 108 5 46 -185 -7 -50 -127 -16 -58 28 -118 5 106 0 90 1 62 -7 89 61 -126 81 -55
6395 -55 71 -95 221 -81 110 -67 1 -26 69 -102 160 -31 -95 -24 43 89 114 71 179 -25 -29 92 34 44 23
6420 23 105 -17 63 -8 85 2 139 0 21 -41 -71 61 -35 -4 79 10 25 -99 74 87 -103 -69 44 -24 64 74
6446 74 -95 -164 -67 28 47 97 83 -98 -35 -22 93 -58 -170 -60 -99 -10 109 -34 18 151 -29 -55 -186 59
6470 59 35 -38 50 -23 -1 130 68 81 -87 -199 122 29 31 54 -90 3 -90 3 41 11 -219 21 82 102 -50 -55 -152
6497 -152 -46 38 123 27 -28 63 161 -17 4 -43 -6 -89 123 98 -197 -20 -54 106 -70 -41 108 -104 -76 -88 -107
6522 -107 -254 -103 19 -96 242 -196 -42 44 -54 -68 -17 -42 -72 81 -5 95 -56 -31 -60 -15 189 -120 33
6545 33 -49 107 -106 -122 72 78 -46 -44 -17 -110 -77 -18 -17 -74 -139 54 -112 211 95 4 26 -93 63 -42 13 -19
6571 -19 -94 -71 35 -53 -12 31 106 -40 90 34 199 75 16 58 -108 56 24 38 -14 1 -5 21 42 -46 -25 49 -117
6598 -117 -124 15 -101 14 -35 -144 31 6 -89 -41 49 35 106 -149 -1 43 -151 91 -25 74 220 150 -55 24
6622 24 -22 -140 -56 74 0 -168 201 -127 -84 -74 97 96 55 62 51 147 125 -30 -69 -153 -90 -90 -72 32 -56 73 -33
6649 -33 -97 -70 32 -41 118 -11 -336 1 127 -76 94 -46 221 -90 -90 -18 88 110 -46 30 -21 -198 -21
6672 -21 214 152 -120 59 29 -81 62 20 40 107 29 -9 73 -68 -32 2 159 -45 114 12 145 32 77 32
6696 32 126 85 -106 54 72 15 32 11 -203 5 151 -71 160 42 -76 -76 -100 37 -19 32 48 34 14 -77 -49 87
6722 87 23 9 51 47 -78 140 -21 -43 -30 -73 -55 -41 71 113 14 54 116 40 -32 74 -29 46 27 -88 35 29 64
6749 64 -97 112 -93 165 -114 -42 202 -1 59 -65 22 -160 -7 73 -9 -79 -124 72 -38 46 38 -116 -80 14
6773 14 -148 -109 -163 -20 134 -130 -64 71 -7 -121 105 133 -49 113 122 130 24 -23 28 -15 -24 76 -189 -75 -28
6798 -28 57 -120 -25 -15 -43 5 -47 -57 67 -33 -17 -84 119 -35 -91 -117 14 5 101 -70 -98 25 -108 94 -69
6823 -69 139 168 -73 18 -75 -65 -13 37 -59 124 24 -81 -14 58 -11 -96 39 -155 67 9 25 -77 3 -45 70
6848 70 144 5 -21 108 -80 65 54 35 97 129 -3 155 -79 -119 109 66 90 -32 62 -155 -38 42 -8 -80 39
6873 39 100 -93 59 50 115 46 -84 -55 -55 23 -24 -32 -98 -31 28 -14 -7 -119 52 -25 49 -105 -87 -152 -3 -52 -36 54 10
6902 10 -10 -58 218 -88 -94 106 68 -97 -114 -24 1 166 -126 -42 126 -61 39 -81 6 92 -29 -11 8 -20 -21 60
6928 60 98 81 140 70 90 -3 -8 9 92 -7 -33 142 172 -246 41 35 -127 143 -82 3 56 -24 23 30 48 75 -76 52
6956 52 -3 31 108 47 30 -155 -32 -5 -133 7 22 -9 -127 -112 242 142 17 171 183 -135 -36 26 37 -42 -11
6981 -11 66 103 -14 28 114 -11 87 72 38 55 -27 6 -37 -63 -77 39 -146 85 -139 -15 96 5 101 -117 17
7006 17 -83 79 55 73 -52 65 -35 3 -147 119 35 -62 15 -160 100 -147 224 -73 -52 -43 25 87 -55 108
7030 108 -54 -5 3 -45 20 -94 75 -46 108 13 -31 -4 -49 76 18 51 95 -4 -38 29 35 142 75 15 -25 62 -34
7057 -34 -56 -19 -10 -112 75 -23 96 -20 -45 35 72 -41 -22 77 183 11 68 78 -168 55 1 12 163 -112 62
7082 62 83 -47 -69 -125 62 -166 16 -138 -33 -159 -47 -60 17 -38 1 -65 30 -25 119 29 -89 46 -97 -97 132
7107 132 89 -53 53 -107 126 -51 120 142 -16 -38 116 70 -149 -43 -206 -65 -46 -21 -38 8 -34 -34 -45 28
7131 28 -136 11 -5 58 -50 104 15 46 -83 -23 -1 35 -10 66 18 -17 224 -41 -75 -14 158 -17 85 -9 -1 -46
7157 -46 46 13 -27 -19 60 -87 131 -55 72 15 -155 -112 -56 35 14 78 4 33 -28 167 103 4 33 65 -18 67 -180
7184 -180 122 0 65 77 -44 58 44 7 57 12 -58 125 70 117 -94 -65 14 -106 -13 65 67 -43 111 -4 -34
7209 -34 -198 -133 26 57 -114 3 -63 -223 31 -58 -78 129 44 57 -2 105 139 91 71 -99 -38 -48 12 -78 23
7234 23 18 55 -74 97 86 41 115 84 -113 5 -119 -48 25 -38 -132 10 -159 -116 43 -56 13 16 -4 -38 -22 109 -3
7261 -3 -90 101 98 141 -38 -65 -114 25 29 193 47 -110 -55 -98 -92 36 -115 -106 -39 -4 -20 82 -53 148 -84 77
7287 77 99 37 -60 -73 1 47 -164 -59 -47 17 99 -164 -47 29 27 -68 -19 -126 108 132 -45 -75 -113 -152 41 23 -50
7314 -50 -78 3 -33 -105 69 -31 156 13 -221 6 32 -27 -40 25 -99 22 -3 22 -68 -65 184 58 -28 129 63
7339 63 -73 -21 62 129 -73 -52 68 -43 32 33 100 27 75 42 -59 -75 137 -31 -55 116 -140 -93 -155 -54 26 -75
7365 -75 -27 6 14 -63 76 -41 -34 7 -13 -18 -45 19 -87 77 8 43 -15 5 41 -13 -131 55 -7 -178 49 48 -78 -31
7393 -31 75 -112 -72 130 52 105 -92 -43 4 -15 80 -89 -4 -14 141 -43 64 -126 -96 -126 -65 -39 187 -105 29
7418 29 17 -102 35 14 -102 -88 147 -101 56 127 -98 -123 210 -98 43 87 7 25 -106 -67 -13 -81 16 -161
7442 -161 -24 57 -49 -221 69 -154 52 8 -131 11 -150 137 -7 15 19 11 -4 71 19 113 -105 -156 35 74
7466 74 162 135 29 -89 83 -85 -26 14 -114 -35 -92 212 -141 9 17 63 -82 -12 14 58 57 55 52 34 140 -63 -187
7493 -187 2 -9 -66 7 -123 74 85 -158 206 129 100 60 -85 41 -23 -49 131 -157 134 -52 -54 -5 36 8 -27
7518 -27 -135 21 -24 -78 -29 69 11 -42 -60 -5 -142 13 75 132 -11 -35 -30 -83 62 -17 -16 85 -63 -63 29 81 239
7545 239 64 -90 -6 -56 108 87 -28 72 -62 -70 49 123 121 16 28 -90 -9 3 58 71 -29 57 69 76 -123 -72
7571 -72 -75 50 -61 52 79 -37 -9 46 23 -35 -201 50 -40 -21 19 127 -17 43 148 13 -86 84 -16 -27 -12
7596 -12 -84 250 112 51 -79 98 152 -113 -112 23 -34 28 -182 92 -190 43 106 30 -70 23 -1 -56 62 32 -70
7621 -70 -143 -87 31 -44 32 92 41 63 -17 -72 -144 -73 99 119 -16 8 67 -63 67 25 36 18 154 -73 -81 -37 -137
7648 -137 68 36 -60 25 134 210 21 22 128 132 76 51 25 22 4 125 -117 -70 137 -109 -141 -48 74 -81 26 -155
7674 -155 -117 47 -37 -69 46 38 53 -48 -75 -111 22 -135 34 -67 84 157 -63 -79 -67 7 82 16 -76 142 47
7699 47 60 -31 -16 12 -43 -166 -26 38 77 191 38 -57 45 -27 49 38 166 -29 93 -77 -12 28 -119 14 93
7724 93 -51 -16 60 166 -10 -132 -125 159 54 -119 46 0 -107 146 -46 21 82 7 -44 -36 39 65 52 90 210
7749 210 135 -20 -111 34 23 -15 141 64 -263 -37 98 -4 -3 -8 73 35 41 -175 -11 186 139 -130 -197 -67 144
7774 144 -29 3 100 57 -89 -22 106 39 4 -4 101 -145 25 -202 -52 -2 94 -61 -48 95 33 -81 -4 52 114
7799 114 62 -60 217 -31 186 151 37 22 93 -31 -48 -132 7 -55 -84 -14 -74 -148 -63 -54 -138 85 -23 93 -69
7824 -69 -157 19 2 164 74 26 131 -129 -103 -62 54 106 -56 30 73 3 63 -18 22 48 28 -1 -3 103 -40 -4 -46
7851 -46 -9 24 -165 -139 -37 -131 -19 58 76 68 -37 -59 -9 49 148 -114 -39 4 -23 107 -222 242 25 139 73 -16
7877 -16 -75 17 18 -47 -30 -33 37 -146 -147 130 71 -94 -157 -62 110 -65 42 114 -80 -86 -52 48 20 -19 65 22 15 -127
7905 -127 -65 -124 -48 175 -60 60 68 -42 -37 21 54 175 143 -87 -11 36 -135 86 -46 -64 -36 -38 -131 10 -41 74
7931 74 12 -202 -165 110 125 189 -31 214 35 -97 33 82 -115 -47 157 25 -64 -197 84 30 -74 32 -193
7954 -193 -100 13 -14 55 -19 -25 77 -17 171 92 -127 10 -47 -74 -48 -53 -11 66 5 4 -86 -12 19 -10 32 -125 71 -103
7982 -103 -108 -102 -78 7 7 67 -100 56 -54 65 221 40 110 87 -2 40 99 -113 146 70 -38 77 154 118 15 47
8008 47 58 -45 90 131 -71 34 23 -17 -37 -149 -94 -41 201 29 194 78 16 -179 145 0 -8 81 151 1
8032 1 -12 167 15 -143 90 6 -85 174 -128 9 8 121 162 -16 -67 -37 247 -198 -90 62 34 -229 143 28
8056 28 21 -204 -76 106 -18 107 -65 -16 -169 75 -38 74 -109 48 4 -101 38 -23 74 75 -44 105 -9
8079 -9 51 -10 -193 -44 43 -3 58 -86 -104 -89 33 -7 -67 73 -109 -42 -50 -11 95 22 123 -48 -44 82 51 186
8105 186 228 -97 86 -20 -104 18 -162 -52 80 84 -35 134 -145 137 -13 -20 26 104 45 -20 15 5 -26 -149
8129 -149 100 75 -137 62 -181 59 -10 -146 -182 129 54 69 117 102 89 -19 -97 -62 -126 89 18 37 -20 -171 30
8154 30 92 171 127 -38 98 -102 -187 99 -203 22 -132 39 -35 64 -50 82 -43 -36 -3 -27 -77 -66 -80 -44 -73
8179 -73 -18 103 17 185 122 -20 8 -102 70 52 -69 21
8191B1
##END NTUPLES=NMR FID
##END=
