##TITLE=1H_EC-3253(10)
 CDCl3, 8 sc, 
 26.04.2021
##JCAMPDX= 6.0         $$ Bruker NMR JCAMP-DX V2.0
##DATA TYPE= NMR FID
##DATA CLASS= NTUPLES
##ORIGIN= UXNMR, Bruker Analytische Messtechnik GmbH
##OWNER= root
$$ XWIN-NMR		Version 3.5
$$ Mon Apr 26 13:55:46 2021 Russian Standard Time (UT+4h)  she@DPX200
##.OBSERVE FREQUENCY= 200.131506
##.OBSERVE NUCLEUS= ^1H
##.DELAY= (6, 6)
##.ACQUISITION MODE= SIMULTANEOUS
##.ACQUISITION SCHEME= undefined
##.AVERAGES= 8
##.DIGITISER RES= 18
##SPECTROMETER/DATA SYSTEM= spect
##.PULSE SEQUENCE= zg30
##.SOLVENT NAME= CDCl3
##.SHIFT REFERENCE= (INTERNAL, CDCl3, 0, 15.7039)
##AUDIT TRAIL= $$ (NUMBER, WHEN, WHO, WHERE, WHAT)
$$ ##TITLE= Audit trail, XWIN-NMR		Version 3.5
$$ ##JCAMPDX= 5.01
$$ ##ORIGIN= Bruker BioSpin GmbH
$$ ##OWNER= she
$$ F:/spectra/data/she/nmr/H-F/1/audita.txt
$$ ##AUDIT TRAIL=  $$ (NUMBER, WHEN, WHO, WHERE, WHAT)
(   1,<2021-04-26 13:54:27.56 +0400>,<she>,<DPX200>,
      <created by zg, POWCHK disabled, PULCHK disabled
       configuration hash MD5:
       00 E9 B6 7A A2 85 ED C7 34 08 36 98 17 FE 4E 26
       data hash MD5: 16K
       43 CB 12 8C 80 7A 49 84 B8 0A CF 2B 01 85 1E D7>)
$$ ##END=
$$ 
$$ hash MD5
$$ 79 E2 F1 77 9A 4D AB 8F 97 C7 23 28 9F 7A 40 EC
##$RELAX= 
##$RELAX= 
##$RELAX= 
##$RELAX= 
##$RELAX= 
##$RELAX= 
$$ Bruker specific parameters
$$ --------------------------
##$DU= <F:/spectra>
##$EXPNO= 1
##$NAME= <H-F>
##$PROCNO= 1
##$TYPE= <nmr>
##$USER= <she>
##$AMP= (0..31)
100 100 100 100 100 100 100 100 100 100 100 100 100 100 100 100 100 100 
100 100 100 100 100 100 100 100 100 100 100 100 100 100 
##$AQSEQ= 0
##$AQ_mod= 1
##$AUNM= <au_zg>
##$AUTOPOS= <>
##$BF1= 200.13
##$BF2= 200.13
##$BF3= 200.13
##$BF4= 200.13
##$BF5= 200.13
##$BF6= 200.13
##$BF7= 200.13
##$BF8= 200.13
##$BYTORDA= 1
##$CFDGTYP= 0
##$CFRGTYP= 5
##$CHEMSTR= <none>
##$CNST= (0..31)
1 1 145 1 1 1 1 1 1 1 1 1 1 1 1 1 1 1 1 1 1 1 1 1 1 1 1 1 1 1 1 1 
##$CPDPRG= <>
##$CPDPRG1= <>
##$CPDPRG2= <>
##$CPDPRG3= <>
##$CPDPRG4= <mlev>
##$CPDPRG5= <mlev>
##$CPDPRG6= <mlev>
##$CPDPRG7= <mlev>
##$CPDPRG8= <mlev>
##$CPDPRGB= <>
##$CPDPRGT= <>
##$D= (0..31)
0 1.2 0 0 0 0 0 0 0 0.06 0 0.03 0 0 0 0 0.0002 0 0 0 0 0 0 0 0 0 0 0 0 
0 0 0 
##$DATE= 1619430867
##$DBL= (0..7)
120 120 120 120 120 120 120 120 
##$DBP= (0..7)
150 150 150 150 150 150 150 150 
##$DBP07= 0
##$DBPNAM0= <>
##$DBPNAM1= <>
##$DBPNAM2= <>
##$DBPNAM3= <>
##$DBPNAM4= <>
##$DBPNAM5= <>
##$DBPNAM6= <>
##$DBPNAM7= <>
##$DBPOAL= (0..7)
0.5 0.5 0.5 0.5 0.5 0.5 0.5 0.5 
##$DBPOFFS= (0..7)
0 0 0 0 0 0 0 0 
##$DE= 6
##$DECBNUC= <off>
##$DECIM= 32
##$DECNUC= <off>
##$DECSTAT= 4
##$DIGMOD= 1
##$DIGTYP= 9
##$DL= (0..7)
0 120 120 120 120 120 120 120 
##$DP= (0..7)
150 150 150 150 150 150 150 150 
##$DP07= 0
##$DPNAME0= <>
##$DPNAME1= <>
##$DPNAME2= <>
##$DPNAME3= <>
##$DPNAME4= <>
##$DPNAME5= <>
##$DPNAME6= <>
##$DPNAME7= <>
##$DPOAL= (0..7)
0.5 0.5 0.5 0.5 0.5 0.5 0.5 0.5 
##$DPOFFS= (0..7)
0 0 0 0 0 0 0 0 
##$DQDMODE= 0
##$DR= 18
##$DS= 0
##$DSLIST= <SSSSSSSSSSSSSSS>
$$ [...]
##$SUBNAM2= <"">
##$SUBNAM3= <"">
##$SUBNAM4= <"">
##$SUBNAM5= <"">
##$SUBNAM6= <"">
##$SUBNAM7= <"">
##$SUBNAM8= <"">
##$SUBNAM9= <"">
##$SW= 16.9725357007746
##$SWIBOX= (0..15)
0 0 2 0 0 0 0 0 0 0 0 0 0 0 0 0 
##$SW_h= 3396.73913043478
##$TD= 16384
##$TD0= 1
##$TE= 0
##$TE2= 300
##$TE3= 300
##$TEG= 300
##$TL= (0..7)
0 120 120 120 120 120 120 120 
##$TP= (0..7)
150 150 150 150 150 150 150 150 
##$TP07= 0
##$TPNAME0= <>
##$TPNAME1= <>
##$TPNAME2= <>
##$TPNAME3= <>
##$TPNAME4= <>
##$TPNAME5= <>
##$TPNAME6= <>
##$TPNAME7= <>
##$TPOAL= (0..7)
0.5 0.5 0.5 0.5 0.5 0.5 0.5 0.5 
##$TPOFFS= (0..7)
0 0 0 0 0 0 0 0 
##$TUNHIN= 0
##$TUNHOUT= 0
##$TUNXOUT= 0
##$USERA1= <user>
##$USERA2= <user>
##$USERA3= <user>
##$USERA4= <user>
##$USERA5= <user>
##$V9= 5
##$VALIST= <valist>
##$VCLIST= <CCCCCCCCCCCCCCC>
##$VD= 0
##$VDLIST= <DDDDDDDDDDDDDDD>
##$VPLIST= <PPPPPPPPPPPPPPP>
##$VTLIST= <TTTTTTTTTTTTTTT>
##$WBST= 1024
##$WBSW= 4
##$XGAIN= (0..3)
0 0 0 0 
##$XL= 0
##$YL= 0
##$YMAX_a= 268296
##$YMIN_a= -266712
##$ZGOPTNS= <>
##$ZL1= 120
##$ZL2= 120
##$ZL3= 120
##$ZL4= 120
##$ABSF1= 10
##$ABSF2= 0
##$ABSG= 5
##$ABSL= 3
##$ALPHA= 0
##$AQORDER= 0
##$ASSFAC= 0
##$ASSFACI= 0
##$ASSFACX= 0
##$ASSWID= 0
##$AUNMP= <proc_1d>
##$AZFE= 0.1
##$AZFW= 0.1
##$BCFW= 1
##$BC_mod= 2
##$BYTORDP= 1
##$COROFFS= 0
##$CY= 11.3945322036743
##$DATMOD= 1
##$DC= 2
##$DFILT= <>
##$DTYPP= 0
##$F1P= 15.9154993809931
##$F2P= -4.1035820241983
##$FCOR= 0.5
##$FTSIZE= 0
##$FT_mod= 4
##$GAMMA= 1
##$GB= 0.15
##$INTBC= 1
##$INTSCL= 1
##$ISEN= 128
##$LB= 0.24
##$LEV0= 0
##$LPBIN= 0
##$MAXI= 10000
##$MC2= 0
##$MEAN= 0
##$ME_mod= 0
##$MI= 1.114404
##$NCOEF= 0
##$NC_proc= 0
##$NLEV= 6
##$NOISF1= 3.799351
##$NOISF2= 2.8
##$NSP= 1
##$NTH_PI= 0
##$NZP= 0
##$OFFSET= 15.70392
##$PC= 1
##$PHC0= -11116.11
##$PHC1= 8.400949
##$PH_mod= 1
##$PKNL= yes
##$PPARMOD= 0
##$PSCAL= 0
##$PSIGN= 0
##$REVERSE= no
##$SF= 200.130013532006
##$SI= 16384
##$SIGF1= 3
##$SIGF2= 2
##$SINO= 400
##$SIOLD= 16384
##$SREGLST= <1H.CDCl3>
##$SSB= 0
##$STSI= 0
##$STSR= 0
##$SW_p= 3612.71676300578
##$SYMM= 0
##$S_DEV= 0
##$TDeff= 0
##$TDoff= 0
##$TI= <>
##$TILT= no
##$TM1= 0
##$TM2= 0
##$TOPLEV= 0
##$USERP1= <user>
##$USERP2= <user>
##$USERP3= <user>
##$USERP4= <user>
##$USERP5= <user>
##$WDW= 1
##$XDIM= 8192
##$YMAX_p= 0
##$YMIN_p= 0
$$ End of Bruker specific parameters
$$ ---------------------------------
##NTUPLES= NMR FID
##VAR_NAME=  TIME,          FID/REAL,        FID/IMAG
##SYMBOL=    X,             R,               I
##VAR_TYPE=  INDEPENDENT,   DEPENDENT,       DEPENDENT
##VAR_FORM=  AFFN,          ASDF,            ASDF
##VAR_DIM=   8192,          8192,            8192
##UNITS=     SECONDS,       ARBITRARY UNITS, ARBITRARY UNITS
##FACTOR=    0.0002944,     1,               1
##FIRST=     0,             0,               0
##LAST=      2.4114304,     0,               0
##MIN=       0,             -266712,         0
##MAX=       2.4114304,     268296,          0
$$ Real data points
##PAGE= N=1
##DATA TABLE= (X++(R..R)), XYDATA
$$ [...]
1789C9q69L24o72J112m78k99P16o23O37o70Q00q90R49K89j309O86M35K63j493
1808a053J491J7n01l9O15J78j020J447j355N64M03L3p68J27J610j839M38M44J52
1827I44q37L75K97n22O50j052M93j36O64q87l98J431r71Q5l89N97l88K9j62k96
1847d73Q88n30l67l77J437j025n18R55m56J99n38O08p64J030m68q37Q86K30j36
1866b56j038J613o16k40j32K88M10r55J325j379P17N31o01k65L86Q34j294O04
1884f8J06N30q32L78M74o13P59q79P15j82K59l80j92J021m92r7n63J392p35j84
1904D17QJ49J72o46O60p23P99o64K1r9J30N79j487Q81j13q2k05j39L17k51L18
1925D2q79R14m49K94q26L55O24j161R69m24K79m12K52j68K11K44p10M55m6Q17
$$ plain form
1789 39 -830 -506 -1178 -66 -544 -843 -127 -750 -113 -783 17 -873 76 365 -944 -258 177 440 -1053
1808 -1053 438 455 -46 -85 530 708 -312 1135 -220 344 747 780 12 139 1749 -90 348 792 944
1827 944 107 482 779 257 907 -145 348 212 876 -11 -409 1022 51 136 -253 344 -44 -15 -177 -473
1847 -473 415 -115 -482 -859 578 -447 -965 -10 -466 -267 -805 -197 -961 69 -399 -1236 -350 -120 -256
1866 -256 -1294 319 -297 -537 -669 -381 29 -926 399 -980 -263 268 -333 -598 -212 622 -672 -68
1884 -68 38 568 -264 114 588 -25 734 -145 570 388 647 267 75 1096 604 507 -56 1336 601 417
1904 417 425 574 746 100 760 37 836 172 193 94 224 803 -684 197 84 2 -203 -342 -25 -276 42
1925 42 -837 77 -372 -78 -904 -549 75 -1086 -117 -541 -262 -674 -422 -590 -379 -135 -845 -390 -436 381
1945C81j424N37J160j217M37m99Q59o82O20n72p7J071n47j60n41J810j315p1L67
1964A37J66K9m02Q20q08J080n83k71K14L48Q9j105J202om14m06Q71l08l65N24
1984H12r79J105o73J29l82J58O95j145M62J1P8o83N61l78J91j03q78J082m69K81
2004a25q93M03N67n73J59j14N04o69M29n35M33L19p55L60k91J198j128K14L89
2023a08K88n48l16Q24o24P65p97K34N95N0m92k95R21l21J65q03J155l34l61N90
2043E88p35R45o41K39m5J85J19k99J3j25P67r41K86K61n1j12l42Q34o18J82l01
2064B09K60k42q0o7l29J163j206K98j58K92j68m87N72n53O34p32N40m86O02m68
2084d06o26Q38k38k6m60P19j21k46K7k44P65o93M49p06Q55J65q38N85o3M70p15
$$ plain form
1945 381 -1043 -506 654 -563 -126 -625 234 -448 172 -400 -477 594 47 -113 -654 1156 -159 -230 137
1964 137 303 332 -70 750 -58 1022 439 168 382 730 819 -286 916 910 496 90 961 653 288 812
1984 812 -167 938 265 394 12 170 865 -280 182 193 271 -412 149 -229 -38 -141 -1019 63 -406 -125
2004 -125 -1018 -615 -48 -621 -462 -576 -72 -741 -312 -847 -414 -95 -850 -490 -781 417 -711 -497 -108
2023 -108 180 -368 -684 140 -484 281 -516 -282 313 363 -129 -424 497 176 341 -462 693 359 -2 588
2043 588 -147 798 157 396 351 536 655 356 369 244 1011 70 356 617 566 454 112 946 328 510 209
2064 209 469 227 147 80 -249 914 -292 6 -152 140 -28 -515 57 -496 138 -594 -54 -540 62 -406
2084 -406 -1032 -194 -432 -458 -918 -199 -320 -566 -539 -783 -18 -711 -262 -968 -113 52 -786 -201 -264 206 -509
2105e09N38k95N45j95k64L10p3Q10j370P30M06l44m14M49N35j017R82n62M85l02
2125D45L04m10k31J101j114N8N4P77r08n9O77n13R0k84L70m04N24l12o89Q36j54
2146A58j87p43J039n35jQ4j14O40q79N34o39O28p4n59K12K01J76q00R25o21M95
2167f0q3m74L79r1K55q03O96J33j57k14mN29p28O26n25O05k77k3lN5P15q45M30
2190A36l0N63p99J06P52n77L74k65N10m42M34l41j40O55m78J82o58J077m19n69
2210G1K36K46p9o91O18k51L45m01j27n6M4L62r93P71j40O3o73K99M48o42L92n87
2232g45Q08m52ok85K03N00p99N05j95N18n92J21K24j26L18o15N61k64L79o40J89
2253c93M61j59j5n67J111o61K56j92J41K32j01O3p09J290o25r3L38J23Qn83O22
$$ plain form
2105 -509 29 -266 279 84 -180 130 57 867 -503 227 633 289 -125 324 859 -158 824 262 747 445
2125 445 749 339 108 1209 95 153 207 984 76 17 694 181 271 -13 357 -47 477 165 -524 312 158
2146 158 -29 -772 267 -268 -269 -185 -299 341 -538 -4 -643 -15 -89 -648 -436 -235 -59 -859 66 -555 -60
2167 -60 -143 -617 -238 -329 -74 -877 -181 -48 -205 -419 -423 106 -622 4 -521 84 -193 -216 -219 -164 551 -294 136
2190 136 106 669 -130 -24 728 151 525 260 770 328 762 421 281 936 458 640 -18 1059 640 71
2210 71 307 553 474 -217 401 150 495 94 -33 -89 -45 317 -676 95 -45 18 -655 -356 92 -550 -158 -745
2232 -745 63 -389 -395 -680 -477 23 -776 -271 -466 52 -540 -419 -195 -321 -3 -618 -57 -321 58 -582 -393
2253 -393 68 -91 -106 -673 438 -223 33 -159 -18 214 113 176 -533 757 132 39 377 500 508 -75 547
2274E47j42J93m23L15j01j4M04p52N80J5J23q08M79N88j031M05j00K66o30L37
2294B51j08p1L66o85J91j74M92q28J77M60k78jn91Q03p14M51l76J22K29J6k65
2315e33k47R25p07J88j65N59k17n17N61l79O17m45K1J68M31j82q27J064l80L43
2335B78p25P19j22j16K54m16N86l10K02n70N81J83n54L37k42N96n72K69Q1n4J26
2356E31k39K45n28R19p94Q2N55m32j42j91N75m90K2p3K74m42Q2K9n38Q78o99K10
2378a66j31L89k30n96N62k0j87m04M07k23K76L7m72N82l27L33o78P31O1l46l7
2399d39q6O88o28L85l81N44J4m85M9N57K95r38N62j25J36j06m2N02n06Q63p71
2420H8j55N53k42j16J1O23n49J45k38O03o02J12M38p37P33m57j27P2M47m31k29
$$ plain form
2274 547 405 598 175 490 389 375 779 27 607 622 745 -63 416 1004 -27 378 278 544 -86 251
2294 251 143 72 438 -247 -56 -230 262 -566 -389 71 -207 -208 -799 4 -710 -259 -635 -513 -284 -268 -533
2315 -533 -780 145 -562 -374 -539 20 -197 -714 -153 -532 85 -360 -339 -171 260 78 -749 315 -65 278
2335 278 -447 272 150 34 288 -128 458 148 350 -220 361 544 -10 327 85 681 109 378 459 405 531
2356 531 292 537 9 928 134 216 771 339 197 6 581 91 113 40 314 -128 -46 -17 -555 323 -376 -166
2378 -166 -297 92 -138 -734 -172 -192 -379 -783 -376 -599 -323 -286 -758 -176 -503 -170 -848 -117 -56 -402 -439
2399 -439 -525 163 -465 -80 -461 83 97 -388 -339 218 513 -425 137 12 148 42 0 502 -4 859 88
2420 88 -67 486 244 128 139 762 213 358 120 723 121 233 671 -66 667 210 83 155 602 171 -58
2441e8N56k82O9o18P98m34Q6J40m88L45j61J1p44R66k69k98m2P5L13n38K69k21
2463e25L48j31m22L14J48J71p76O99m59N48k83l48O65l44J46l79N32n0J26k49
2483b69J63N75p96N25k36L93k59j78M86j79K46m86L72m05N95m20n0N03k89L33
2503F24o32O02k12j04j48J51J79m18M47n91P02l96j29K08M0J32o97L17R9J67o01
2524b60K93K17m88M36o73N13k69Q5k67K5N05l99j20k79Q62p58K33J16k69L98m67
2545e66L63l67O45l02l56J39K78R0o61P33l34M52j83j1K53j62J09m91Q23l07k1
2566A24k96M58P3m35O49n95L93n1l1j63K61N7o63N06NK50o58M91R5l83L68n05
2588e0M78j03J09o72L33M11m35j13j3N69o00l5J74j12J09l52K56k32L81m76N8
$$ plain form
2441 -58 498 216 285 -333 465 31 117 257 -231 114 -47 -36 -780 186 -83 -381 -423 -348 -35 -573 -304 -525
2463 -525 -177 -308 -730 -416 -268 -97 -873 -174 -633 -85 -368 -716 -51 -395 -249 -628 -96 -146 -20 -269
2483 -269 -106 469 -327 198 -38 355 96 -82 404 225 471 -15 357 -48 547 127 77 580 291 624
2503 624 -8 594 382 278 130 281 460 42 489 -102 600 204 75 283 323 455 -242 75 174 341 -260
2524 -260 33 250 -238 198 -475 38 -231 -146 -413 -388 117 -282 -402 -681 181 -577 -344 -228 -497 -99 -566
2545 -566 -203 -570 75 -227 -583 -444 -166 -76 -737 -4 -338 114 -69 -80 173 11 120 -371 452 145 124
2566 124 -172 286 359 -76 573 -22 371 320 289 126 387 444 -219 287 292 542 -116 375 470 87 455 -50
2588 -50 428 325 434 -238 95 506 71 -42 -55 514 -86 -121 53 -59 50 -302 -46 -278 103 -373 -315
2609c15J4J98k29m42O80k58K00l10J50J19k05K99n79Q71o01J40p8K76J19p95N13
2630b33k9L36n29L09n8K13N5m26N55r6K37p20O74J55l00J92j96M60m30K18k65
2651A22J93J68k10P3j48M65n66J38P2K37l03k18N30n40K40k51L2J3R0j0n29Q35
2673D33n44J42l70M44j73j58L44l68L76l61L2k82M67O3n13K68K7K08p68O59k6
2694a00j19N8k47K86k52L43m77M16K37n21K6L4M90n51M19n5l8L4L4J3o4N78p76
2717b32K25K64M4j52o7M19m13K86l75L37n9Q8L2m13O96l16rk49L61o1j45J42l52
2740E1K92l29K04r5K19k82j79K87k67M80q40N53l1k55J2j95N33o25L98m39K45
2761b63n8J09j34k9N28p89L79j30K66l08J8M18l55K78m90L88j93M21j68m16P10
$$ plain form
2609 -315 -301 -103 -332 -774 -94 -352 -152 -462 -312 -193 -398 -99 -678 193 -408 -268 -346 -70 49 -746 -233
2630 -233 -262 74 -455 -146 -204 9 64 -362 193 97 334 -386 288 443 143 335 139 599 169 387 122
2651 122 315 483 273 346 198 663 97 235 307 544 241 23 553 13 253 2 34 47 137 127 -402 433
2673 433 -111 31 -339 105 -68 -226 118 -250 126 -235 -203 -485 -18 45 -468 -200 -173 35 -733 -74 -100
2694 -100 -219 -161 -408 -122 -374 -31 -508 -92 145 -376 -350 -316 174 -377 42 -13 -51 -17 17 30 -34 544 -232
2717 -232 -7 257 301 149 82 501 88 374 -1 336 277 365 397 -16 680 364 355 106 467 406 261 403 51
2740 51 343 14 218 123 342 60 -119 168 -99 381 -459 94 63 -192 -180 -375 158 -467 -69 -508 -263
2761 -263 -321 -212 -346 -375 153 -636 -257 -387 -121 -429 -411 7 -348 -70 -560 -172 -365 56 -112 -528 182
2782A82l32l5j16N70l26j18K68r2L91o33M20k46M62l93r5L15L6K76p04O23k44
2803B09J05rn4N0j42L64m32M09M6l36j05O3K96m28K91k69L74m24L9l1K0M00p24
2826b88J99Q7K09m63N7L07p1q5k88M27n02K04j22p0M14m29k1j33O88n46N7J32
2848b37m6L3l82M28j88M67m27J02j4K29L03p23O70k87R6j98K73lOJ21l32K57l5
2871A13K32j94J46K25o47M73j95M91m79mJ73k22J88k31L50k51K95m86P9L48k86
2892A18J19j07K71l29J45l9J3N4l76J10k14O74p50K02k5R1m8m04L53k49M01n36
2914e26M11j87Q5Q2o65O44p9j18j81L20K4k54J87j00K93k18J87l67M21J62n08
2935c87K93k8K80k52K58l4N5k6j09L45l15K33k29K16J08l86K06k5L42n57J65r2
$$ plain form
2782 182 -150 -185 -301 269 -57 -175 93 1 392 -241 179 -67 395 2 -93 222 258 534 -170 453 209
2803 209 314 305 251 301 159 523 91 500 546 210 105 168 464 36 327 58 432 8 47 16 36 436 -288
2826 -288 -89 -2 207 -256 -199 108 37 -48 -336 91 -411 -207 -329 -399 15 -414 -435 -568 120 -426 -369 -237
2848 -237 -283 -250 -632 -204 -392 75 -352 -250 -264 -35 268 -455 215 -72 24 -174 99 96 102 223 -109 148 113
2871 113 345 151 297 522 -125 348 153 644 165 161 334 112 300 69 419 168 463 -23 56 404 118
2892 118 237 130 401 72 217 178 191 245 -131 -21 -235 439 -311 -109 -134 -43 -91 -495 -142 -391 10 -526
2914 -526 -115 -302 -217 -135 -800 -156 -235 -353 -534 -214 -190 -444 -257 -357 -64 -282 -95 -462 -41 121 -387
2935 -387 -94 -122 158 -94 164 130 185 159 50 395 80 313 84 300 408 22 228 203 545 -12 153 61
2957F1L68n5k50J00m3L00l11m1J06J47j88j80M32k39J98m92L89j08j29R5l41M93
2979C12l38P6o54P19j00j37k0r6M75o00K58m7o1Q8l47J87J09J71n37K52J14M6
3001a30j56k3L88n11L13Q6j21j3O2q8q5O06n66K39l4K49k60k48N27k57K23k69
3023f8L04j79L25k10k71N97k60m7l17O46k10j93K05j95J04r8K12m40M74N7l41
3044I5J54l5J43o22N65k28mj7j74R0j40N17q10M87j31oj04j22M42n42J47o4M07
3067D8l53kJ74k98M34m66J17N8M10m62j09L06j42J36k75O33l26O7j9j69M24k65
3089g9J63l72O29j89j44Q9pK77m98M26l62L55O0j31R5o2J88n06K84MJ45k11rL26
3113D71k69J72m02L14k33M8jJ1M02n02N9k31N13m59J04K07l82J50j30J33k23M40
$$ plain form
2957 61 429 374 124 224 181 481 170 129 235 382 194 14 446 207 405 -87 302 194 65 160 -181 312
2979 312 -26 50 -604 115 15 -122 -142 -238 237 -363 -105 -152 -213 -125 -472 -285 -176 -5 -542 -290 -176 -130
3001 -130 -286 -309 79 -432 -119 -33 -154 -167 -105 -193 -278 328 -238 1 -33 216 -44 -292 235 -22 201 -68
3023 -68 236 57 382 172 -99 498 238 191 -126 520 310 117 322 127 231 133 345 -95 379 436 95
3044 95 249 214 357 -265 300 72 68 51 -123 -33 -173 344 -466 21 -110 -116 -220 -342 100 -442 -295 -359 48
3067 48 -305 -307 -133 -431 3 -463 -346 -288 122 -340 -449 -143 -285 -149 -424 209 -117 -50 -69 -238 186 -79
3089 -79 84 -288 341 152 8 97 90 367 -131 295 -67 288 348 217 312 250 438 -68 216 220 365 154 145 471
3113 471 202 374 -28 286 53 101 100 111 513 11 70 -161 352 -107 -3 204 -178 -28 -158 -25 -248 192
3135A92m23j3K70k78L5l44O48l70P1p7NK85l28K47m65O58j32k75l3J13L00o21
3157e35P17k39n0k80J39L70k15K69m36N43j20Q7l36Q3L74m09L17k80M86o22N94
3178D57l04J37K55m59J2m0L66l95K47k5R4l7l63M81m11M01k83j00K64j56J07m93
3200b45O42n95J44O6j04J77l17K92m47N12k13l0j47J38J42m76M05j16J20l88K03
3221b37J51k29J11n0J24k28L43m31K63J15k56J01j04L54l67J80k5J56L10m59K35
3242E7j33M58m12R3Q4J57k44k26O75n18K47j18J20J09k24K58k46L55l46K40k14
3263A72L86j07o35L26N1O8l54L13j54Q8J2l67K32p9K63m53K05J36l55K35r8K34
3285A19l43R6l13K96K15l92P4j03M87n72K25J4m5N7j13K27k29M23m79J31j69L44
$$ plain form
3135 192 -231 -244 26 -252 -217 -561 87 -283 -212 -289 -284 1 -327 -80 -545 113 -19 -294 -327 -214 86 -535
3157 -535 182 -57 -107 -387 -248 122 -93 176 -260 283 163 250 -86 -3 371 -38 279 -1 485 -137 457
3178 457 153 290 545 86 98 58 424 29 276 251 345 308 -55 426 15 416 133 33 297 141 248 -245
3200 -245 397 -198 -54 12 -92 85 -232 60 -387 125 -88 -118 -265 -127 15 -461 -56 -172 -52 -440 -237
3221 -237 -86 -315 -204 -254 -130 -358 -15 -446 -183 -68 -324 -223 -327 27 -340 -160 -185 -29 281 -178 57
3242 57 -76 382 -30 63 147 304 60 -166 509 -9 238 120 240 349 125 383 137 492 146 386 172
3263 172 558 451 -184 142 193 261 -93 220 66 154 166 -201 31 -48 215 -238 -33 103 -252 -17 -115 119
3285 119 -224 -128 -441 -145 70 -322 -248 -351 136 -436 -211 -197 -242 -185 -298 -71 -300 123 -356 -225 -394 -50
3307e0j31j15M45k56l7O9K42k89m2K08j96L38k58L07j98K85p1k72K07m6J87n24
3329a97N08j91K0J88k18L92k59K0k90M41m9j26j24o3L46k94K09l47K19K3j13J20
3351B15k17M10n42N7J72J72n19R6J54k02K48l90J31m0J48J15m01L30k88K56l46
3372d41M98k60k44K95j24J55k63L22k07K99j67j43J80l7J79l24M83k49r3P0j37
3393b08N21k42O1k65M33j52k4j57J81J26k94J71k2K41k34p7K30q4J91m56K93k28
3415EL52k69n0M06l72Rj32L59j91lJ4O5J17l65K79m91N33j62l01Q0n1K30m91M93
3439F4l66K40k31mK28k55K92n29L51N4nk17K64J74n08M03l68N09l50J87j23m1
3461b31L46m44L25o0K68l99K41o8J07J6k38L65l88K03j0J09K27j86Qj00L51l89
$$ plain form
3307 -50 -181 -296 149 -107 -144 -75 167 -122 -164 44 -152 186 -72 235 37 322 251 -21 186 140 327 -197
3329 -197 311 120 140 328 110 502 243 263 -27 414 365 239 115 52 398 104 313 -34 185 208 95 215
3351 215 -2 408 -134 -77 95 267 -252 -156 -2 -204 44 -346 -215 -255 -107 8 -393 -63 -351 -95 -441
3372 -441 57 -203 -447 -152 -276 -121 -384 -62 -269 30 -137 -280 -100 -137 42 -282 201 -48 -141 -71 -208
3393 -208 313 71 132 -133 300 148 124 -33 148 274 -20 151 129 370 136 59 289 205 396 -60 233 5
3415 5 357 88 38 444 72 81 -51 308 117 114 128 193 310 -55 224 -267 266 104 -197 -117 -168 62 -429 64
3439 64 -302 -62 -293 -297 -69 -324 -32 -561 -210 -156 -161 -378 -114 60 -448 -45 -413 96 -254 -67 -190 -231
3461 -231 115 -329 -4 -64 204 -195 46 -22 85 101 -137 228 -160 43 33 142 369 183 191 91 442 53
3483E3J42rj47J19j56L67k41L60l41k06J68K15j04m73L50j21L13k06M0O1k56J34
3505F2j50O5P1j07j94J89Q6k62K07j63K47k42Q8q7rJ98m39K11l8K42n59K54K91
3528c9l72L25l94L69N9N0k08M9J98j60Oj0M64m63KJ39J16Kj89L41m41M88k55N3
3552A30J03k19J72k87M29r2K22m34M3l3M6Q0r6K84l99K54j22J2L11l76K08l1K6
3575B31j55r8J18n2K45m48M08k60J13j09m1ok9N6j56K99k71K6j10K9j4mK12l22
3599c38K46k73j26J71M17l10l59M96j29L19m03K80Qn7n3J9L04m44P4j23M44k2
3621A41k15M6J32J32k31P9M8M8J08k44J46lO8j60J59q1L8o1N8N5k73K11j55J41
3645A87k3n7M4k58N68l83j03j8J97l4o6N1j65K49k62L3lj25J66k89K83m2q4m9
$$ plain form
3483 53 195 186 39 158 2 369 128 488 147 -59 109 324 220 -253 97 -24 289 83 123 184 -72 62
3505 62 -88 -23 48 -59 -253 -64 22 -240 -33 -196 51 -191 -103 -190 -199 -1 -440 -229 -267 -25 -584 -330 -39
3528 -39 -411 -86 -480 -111 -52 -2 -210 -161 37 -123 -117 -127 337 -126 -124 15 131 133 -56 285 -156 332 77 130
3552 130 233 14 186 -101 328 236 458 24 67 34 80 160 64 348 -51 203 81 93 404 28 236 205 231
3575 231 76 -22 96 44 289 -159 249 -11 102 -7 -48 -54 -83 -27 -183 116 -155 -129 -239 -210 -224 -228 -16 -338
3599 -338 -92 -365 -491 -320 97 -213 -572 -76 -205 114 -289 -9 -1 -58 -111 -92 212 -232 -158 -281 163 141
3621 141 -74 -28 104 236 5 84 132 180 288 44 190 187 255 95 254 173 211 150 208 263 -10 201 46 187
3645 187 164 107 151 -107 461 78 -25 -43 154 120 54 105 -60 189 -73 -40 -43 -168 -2 -291 -8 -50 -134 -183
3669a83L21j34j02j10j93L29k38K40l27M09j22r5J3R4J55k52L00k10J18k51R9
3690a39J26k77L41m34L16J0N8j57K79J06l32J27o9K19j11L3Lj38L42l98L02q2
3712A25J73j13j66L50k40K23l98K93j06J23j32l8L17l21k4j21J15k6j19J83l19
3733b21K32k78J95r8P8O6pL9j45J62l28L16N5k06l6q2K13k84M65m07J09K7m1r0
3757b66P1J49k49K38j08L10m19J00R9j6J34m40M15o9K14k11j8L12k24N3n2L75
3779C98l29K53j98q7L45m24J19j77L59j21K8j14J61R9l20J81j07L53m54K7J40
3800A32nJ08l26M35l08Omr2K2N3m5q1J65r9R8k90rL62l75K97k09J89j13q5J94
3825B0k04J33j68J13k54K03j64J61J3K9J71l94L07q6O0j32K75r8p4J70j22K93
$$ plain form
3669 -183 138 4 -98 -208 -401 -72 -310 -70 -397 12 -110 -205 -192 -98 57 -195 105 -105 13 -238 -139
3690 -139 -13 -290 51 -383 -67 -57 1 -156 123 229 -103 24 -45 174 63 96 99 -39 303 -95 207 125
3712 125 298 185 19 369 129 352 -46 247 141 264 132 94 411 90 66 -55 60 34 -85 98 -221
3733 -221 11 -267 -72 -170 -92 -26 -33 6 -139 23 -305 11 66 -140 -176 -258 -45 -329 136 -271 -162 -135 -176 -266
3757 -266 -195 -46 -295 -57 -165 145 -274 -174 -75 -91 43 -397 18 -51 163 -48 -66 246 22 75 23 398
3779 398 69 322 124 37 382 -42 77 -100 259 138 166 52 213 312 -8 173 66 419 -35 -8 132
3800 132 127 235 -91 344 36 42 38 -54 -32 21 -24 -105 60 -39 59 -231 -240 122 -253 44 -165 24 -89 -174 20
3825 20 -184 -51 -219 -106 -360 -157 -321 -160 -147 -118 53 -341 -34 -120 -60 -192 83 -15 -89 81 -41 252
3847B52l05J26r6R3K75m36K70k04K08j48K67l12J48J99m26M08j96M1l0Nj2n7k5
3870D5L67j05k18nn4OK56m24K25p4K62l23J37N6j03J9n3P9k37K57k39J91j63n2
3894a50j03K5K60k02J8m8K36j79j71K75k58K87j86jl4J11J13j95J60o1J06k26
3916b23K97j00r5J89q8L22k24L3r9P2J15j67M3o1L86l83J44j38RJ84j28M2l0L61
3940D61m73M40l02J57j3k24J91j24J25j17k3j18m3J05p0J86j38J36k52K2O0j79
3962a93J91k25R5j17K03j92J58j1m4Q3j52J25l67M20q2j57J50k5P2k46K48l04
3984c70K69m4j19K56l6K05l76K86q5jL0j61J97k25M28l07J35M4q9N7l2K57k69
4007E0P8j46L00k49k3J72j55L02l17J77j69J70p4o9K01k83K32k88L62j99N0r1
$$ plain form
3847 252 -53 73 -23 70 345 -91 179 -25 183 35 302 -10 138 337 -89 319 123 164 134 139 127 70 45
3870 45 412 307 89 84 30 36 292 -132 93 19 281 -42 95 151 48 67 14 93 -144 113 -126 65 -98 -150
3894 -150 -253 -228 32 -170 -152 -200 36 -143 -314 -39 -297 -10 -196 -197 -231 -120 -7 -202 -42 -103 3 -223
3916 -223 74 -26 -121 68 -20 302 78 111 12 84 199 32 75 14 400 17 161 23 32 216 88 130 100 461
3940 461 -12 428 126 283 270 46 237 113 238 121 98 -20 -63 42 -28 158 20 156 -96 -74 -14 -193
3962 -193 -2 -227 -132 -249 -46 -238 -80 -91 -135 -52 -204 -79 -446 -26 -108 -265 -115 -140 -68 -314 -66 -370
3984 -370 -101 -145 -264 -8 -44 161 -215 71 -14 -15 15 -146 51 -174 254 -53 82 126 37 94 62 319 50
4007 50 128 -18 282 33 10 182 27 329 12 189 20 190 116 47 248 -35 197 -91 271 72 122 31
4029C1m8J51j96K25l46K71p8o5j46m5L55k56J85j86J73k20o0J48r1K27l30L39
4051C8j56Q8j89m8K08q8O1r9J23p0mPk7K40l70L25l14M64k40JJ40j1J47l84L54
4076A96l12K95l66L84p6L4m8j69N70m52N9q9J61M7r2J14m07L20j11p2K57j69J10
4099A84k89K87j32O9j5k8Q0n6j28j4P8J5N5j04j59J59j46o5N0K18k15m1J9N7K02
4124H1j90J01k67K19Nk48L08k56J01j70K76j3n3J5o7Q4k5L2j73L50j64J04j18
4147f8J86L6j90Q1K9Q6j53J33j46J11J61l68K02j76L16k44J15O6j08J9k28L54
4169B14j78J74k31O2J52j81K3m1J39n4j06M1Q7m7j72K97j52J56k69p7J59J73k76
4192a07o8K80l57L4j3J15j9o0J79k05M4Q8J92l59K08%J6p0R4K6j10P4j22L2J16
$$ plain form
4029 31 -17 134 -62 163 -183 88 10 -55 -201 -246 109 -147 38 -148 25 -195 -255 -107 -198 29 -301 38
4051 38 -118 -30 -219 -267 -59 -147 -86 -185 -62 -132 -136 -129 -156 84 -286 39 -275 189 -51 -50 90 79 226 -158 196
4076 196 -116 179 -187 197 121 155 107 -62 508 56 115 26 187 234 142 256 -151 169 58 -14 243 74 184
4099 184 -105 182 50 119 104 76 156 100 -28 -42 36 51 106 2 -157 2 -144 -209 -159 59 -156 -197 -178 -121 81
4124 81 -109 -8 -275 -56 -51 -299 9 -247 -146 -316 -40 -53 -106 -91 -158 -74 -99 -67 -240 110 -54 50 -68
4147 -68 118 154 -36 45 74 160 7 140 -6 105 266 -102 100 -76 240 -4 111 177 69 88 -140 214
4169 214 36 210 -21 41 193 12 35 -6 133 79 -27 14 101 54 -118 179 27 183 -86 -163 -4 169 -107
4192 -107 -175 105 -252 -218 -231 -116 -135 -195 -16 -221 -177 -89 103 -256 -48 -48 -32 -102 -8 18 -92 -18 -140 -108 8
4217Hk09J65J10j16Q9K0K2j59L7l4K23j03O6J30n2j09OM2q5J61j41O5J8mO7k11
4243FJ95j74K30k30J54j62K4P5k14J84q9J09nj97J49j06J43k85J71O5J11j74J31
4266A11R5k81N2r2J26k27J67j50O8j75J86J23q6L1j61K02RK8j96Q4R7j57M3p8
4290a81K80j83j08K36l05L81l22K22r8K46j79m6J10k25L86j60N6M7N1j77m8K23
4312B06j43n3J77R9k00Q2j42k4J84m37N97k48K4n4l3K0jK65m77L24j19j4j48J07
4336hJ22r2Nl94K84Q5r2p6m3J33k45K16Q8kn7p7J18j81K40k41m9J82L9j88K7L89
4362A83l96J65p0K51k18m7p0K07rQ7R6k35P1j20M6N2P5q7m9J62K6L1q1J27L4k55
4388b4L52m09K08q0M3m9J16q7N1l1K4k3j42J73n9N7M4Kq9j05Q3m1j35P6Q8r6j03
$$ plain form
4217 8 -201 -36 74 -42 47 67 89 -70 -33 -67 156 53 119 249 197 88 94 136 51 212 71 136 154 150 217 6
4243 6 201 27 257 27 181 19 43 118 -96 88 -1 108 103 -94 55 -51 92 -193 -22 43 154 -20 111
4266 111 206 -75 -23 -115 11 -216 -49 -199 -131 -306 -120 3 -83 -52 -213 -11 -2 26 -170 -86 11 -146 -103 -181
4290 -181 99 -84 -192 44 -261 120 -202 20 -78 168 -11 -57 53 -172 214 54 110 157 208 31 -17 206
4312 206 63 10 187 286 86 168 26 2 186 -251 346 98 122 68 35 55 54 319 -158 166 47 33 -115 -8
4336 -8 114 22 27 -367 -83 2 -90 -166 -209 -76 -321 -105 -17 -19 -76 -153 -35 -216 24 -217 -266 -84 -45 -233 -206 183
4362 183 -213 -48 -118 133 -85 -132 -202 5 -4 83 179 -56 15 -105 -59 -7 68 -19 -68 94 120 151 70 197 231 -24
4388 -24 328 -81 127 47 90 41 157 70 121 90 114 91 -51 122 63 120 164 166 77 -28 55 14 -121 -45 43 -53 -156
4415a56L32l32J21o7m1M6j10J62n6J17j23J35r1k07L03m04L91r7J59j84j55K24
4437c3j35K64k96K86k04K13l24K56k2j41L37k31J82l6j00j03J1J46p4K9L7J29
4459A91k43J77M4j17J50j61J12M7lq0M6O6j01L5j92L25j57j53N3j7%j44J33p4
4483f3J96k58M6J46m4J61k40J75j02j8j04m3K20j26R7l76M39l16R2k2O2Lj2m7
4507a34j24P9O1l9n2j0J09l4O0q3K40j94l7J84J4J3j43J38m7M7nL5j00J31L0m4
4533I5Nj4K4o3K10j81j12J29J0M5o4M7Q3r1k7M3P1l5k24K03O9n5n2Q5k09J47j98
4560e9J28j55J34l2r4jJ30J44m15K91r4J03k55O7J14r7J11q1n6m1J35n6N8K1l33
4585c33K14k9J74j54J11L3j73K96j53j6L1N6q8M8Qj63L97j80O5j38J54k12J34
$$ plain form
4415 -156 176 -156 -35 -102 -143 -97 -207 -45 -101 16 -107 28 -63 -270 33 -371 20 -77 82 -102 -257 -33
4437 -33 -168 96 -200 86 -118 95 -229 27 5 -136 201 -30 152 116 16 -87 -76 70 -4 25 62 191
4459 191 -52 125 169 52 202 41 153 200 197 117 163 229 128 163 -29 296 139 -14 39 22 22 -122 11 -63
4483 -63 133 -125 -79 67 23 184 -56 119 17 -1 -105 -148 72 -54 43 -333 106 -210 -118 -140 -78 -75 -87 -134
4507 -134 -258 -179 -118 -157 -209 -219 -110 -144 -84 -167 73 -121 -158 26 40 53 -90 48 1 48 43 78 -22 109 139 95
4533 95 100 86 110 47 257 76 -36 93 103 148 84 131 214 123 96 139 210 175 -49 154 223 168 116 201 -8 139 -59
4560 -59 69 -86 48 16 -78 -79 51 195 -220 71 -23 80 -175 -108 6 -91 20 -61 -117 -158 -23 -79 -21 0 -333
4585 -333 -119 -148 26 -128 -17 16 -157 139 -14 -30 1 57 -31 17 25 -138 259 79 144 6 160 -52 82
4608H2m1M7n6n1K17j08j6J88k34r6J89O1j91K27nj09O9k05R6j14J19j63J71r6
4632a9J24r3N3k1n7j3j31J50j39J13J66l23L6J26L0j59J03o4j85L37k69J20q2
4655a97J96j67p7L02j16Rk15L07j99m6O5P9J75j71L2j81K30N3j31J83j21L5j1
4678C4j4l7J64j10l1J24j17K37k77L09l04K25q7N3M1l40J82j52K54j76N5Q3L7
4701A53J05m72N12l91J99k08N3P1P8k2k07K73l48K68k07J01Q3N1k09l8K52k41
4723a44r5J15K9j1m9K48k44O4K4J7j20l0O4PJ47k40J49r0N8J17N4r2j04J24r5
4748i7rq9L10J43m25J70NJ33p2q2j0O1N8l5J87l12K77j91J32j99R4K6l5K82l15
4773GK20j56l7J25j54J52j49K02j61J6k20K72l0j16Q0N6R7k85J74j69n3j3p8J26
$$ plain form
4608 82 41 88 32 -19 198 90 74 262 28 -68 121 182 -9 218 213 104 173 -32 64 -50 69 -94 77 -19
4632 -19 105 12 65 44 -13 -26 -157 -7 -146 -33 133 -190 -154 -28 2 -157 -54 -118 -303 34 -235 -115 -197
4655 -197 -1 -168 -245 57 -59 -50 -265 42 -157 -203 -138 -59 116 -55 -23 -204 26 79 -52 131 10 45 34
4678 34 20 -17 147 37 6 130 13 250 -27 282 -22 203 116 169 210 -130 52 -100 154 -22 33 116 153
4701 153 258 -214 298 -93 106 -102 -49 22 100 78 -129 144 -204 64 -143 -42 41 92 -117 -155 97 -144
4723 -144 -239 -124 -95 -106 -155 93 -151 -87 -63 -46 -166 -196 -132 -125 22 -218 -69 -159 -101 16 70 -22 -126 -2 -97
4748 -97 -106 -195 115 258 -167 3 8 141 69 -13 -23 38 96 61 248 -64 213 22 154 -45 49 75 40 322 7
4773 7 227 71 34 159 5 157 8 210 49 65 -155 117 87 -29 51 107 204 -81 93 -76 -129 -142 -220 -94
4797i4J05k00l6J39J19r9l1j71K07o3o4P5R4j01o9R1J05p1j54K54j85K14O3l18
4821a90J85L1j4o4Q3n3J26j27O9p9P8J25k51N0J02rL3j5M6k15K07m9k3J40j49
4846C7J02r7K79j94J07j67J0K6j55J13R4P5l26J48j44n6P1n7K83k13N8n8N8j01
4870a07M2Jo9J66j27J13j61M1O3k8J1j87K82m13K69l2N1q4q7J10N3P3p5m5L09
4895A69j02j31J04J73k17J02j98J35J2L8J65k21J6k14K63j48J10j1O1o5L7J23
4917B01j64K88j84j8O6p5m7j39K11q2R0j43P2K09k53j4p7Q1l0k6j32J80R5j88
4941g9L2j50L39m92K82j4L0q5O9k66J59J51j1J16j92j4J09k10J63j92J86n6j94
4964c19L66%j8k69K68j25J17J1N5Rj81J87k09K63k24N0O1M9R7k90J67K5q3J20
$$ plain form
4797 -94 11 -189 -225 -86 33 -66 -97 -268 -61 -124 -188 -113 -19 -120 -189 -98 7 -64 -218 36 -149 65 128 -190
4821 -190 -5 26 12 -52 31 -22 104 -23 46 -33 45 170 -81 -31 71 62 95 80 126 -89 118 69 46 186 37
4846 37 139 42 321 127 234 67 77 103 -52 61 155 230 -96 52 -92 -148 -77 -134 149 -64 -6 -64 -6 -107
4870 -107 -65 -64 -133 33 -94 19 -142 -101 -38 -66 -55 -242 40 -373 -104 -136 -85 -169 -256 -146 -93 -20 -95 -140 169
4895 169 67 -64 40 213 -4 98 -100 35 47 85 250 29 45 -169 94 -54 56 45 106 41 78 201
4917 201 37 325 141 123 189 114 67 -72 139 57 147 4 76 285 32 18 -59 22 -8 -34 -166 14 109 -79
4941 -79 -47 -197 142 -350 -68 -82 -52 -137 -68 -334 -175 -24 -35 81 -111 -125 -16 -226 -63 -255 -69 -125 -319
4964 -319 47 47 29 -240 28 -97 20 31 86 95 -86 101 -108 155 -69 -19 42 91 188 -102 65 90 7 127
4988A27k5J49j5q2o0r7J68p4k2J53Qm3k5k48M32j10l14J74o7K2j21J53k90L42
5012A35j42r9J55r1q9j19K92j82j01K72j86J9m2J25j63K80j43K47k74L4k7q1J2
5035a68P6R5m3L6p9K5l0j66J79KJ14j31q3J48q0O4J0J56j27K12k49Q0J31l34K59
5060I7q5J15l36M39j84J03K0j90K85l90M22k07%M6Q0j03k95L87j50L0n6O4p8j84
5084a70K73lj3k11K43j41j02J95l63K63k42L19l6L9j76K3n2K0J92k16J50j85J17
5107g6J58l43M39m31J38n6J41j53K07j17J4J7p8J33j10K62j72J57k17j41L93k84
5129a19K43j83K83j78M9J6j65J50n7K03j68J18q0k5J1o0N9o6L4j14J47m3n0J63
5153A68j45K17l09O4o3R5J6N8J8p7p0j1Q3N7k07J3J27l1k07J91n0OJ11k88K11
$$ plain form
4988 127 102 251 236 154 94 -3 165 91 69 222 230 187 162 -86 346 236 -78 96 29 51 -70 83 -207 135
5012 135 -7 -106 49 -42 -131 -250 42 -140 -241 31 -155 -136 -178 -53 -216 64 -79 168 -106 -72 -99 -180 -168
5035 -168 -92 3 -40 -4 -83 -58 -88 -254 -75 -73 41 -90 -173 -25 -105 -41 -31 125 -2 210 -39 41 172 -162 97
5060 97 12 127 -209 230 46 149 169 -21 264 -126 296 89 89 135 215 112 -183 204 54 84 28 92 14 -170
5084 -170 103 100 87 -124 119 -22 -124 71 -292 -29 -271 48 12 51 -125 -102 -154 -134 58 -158 -8 -193 -76
5107 -76 82 -261 178 -253 -115 -171 -30 -183 24 -93 -79 -62 -140 -7 -117 145 -27 130 -87 -228 165 -119
5129 -119 124 -59 224 46 95 111 -54 96 39 242 74 192 112 87 98 38 97 31 65 -49 98 55 5 168
5153 168 23 240 -69 -5 -68 27 43 101 119 42 -28 -39 44 101 -106 -93 34 3 -204 -13 -63 -57 54 -234 -23
5178b3j46r0OJ98r8R8q3J5J19j02P6m0j32K22M0k64N4K15j93K18q5l1l9J01J03
5203A39j37M7r1J62k85K44J30q4j6j1J61j65N9j42J47J44k20J20k00K44k61J34
5225A19p1R7jj35K69m23J80p0K84k56rJ03j83P7l1j3nq5j10J57J35k99K60j71
5249a81K45j79n1O2jJ09j92P9J6J69k58J4M9j88K99l33K82r8O7l8k9K04k28J94
5273A3k83M12j58Nn8Q7m5j10K39j28J66j28J09K3m9n1j65K35p4Q1m4JQ7Q7j92
5298F0j38K79k36K32j65R9m0j05K59k38J30k41J15k7R1n4q2N7j87J61j32J3J83
5321C4o7mj69K41j59L5j24N8J99j84J66p8J08k42Q9P6n9L9p4j06J63J04k57K01
5345a0j00k8L25l74K41j65K23j80K3J95q7o1n6Q8p3R8Pl5p4J52p9LM6q8P9L5O0
$$ plain form
5178 -23 -169 -259 -253 -55 -153 -55 -138 -123 -4 -106 -30 -70 -202 20 60 -204 -150 65 -128 90 5 -26 -65 36 139
5203 139 2 49 -42 120 -165 79 209 125 109 98 259 94 153 11 158 302 82 202 2 246 -15 119
5225 119 48 145 144 9 278 -145 35 -35 249 -7 -16 87 -96 -19 -50 -63 -68 -153 -263 -106 29 -270 -10 -181
5249 -181 64 -115 -166 -104 -105 4 -188 -109 -93 76 -182 -168 -119 -307 -8 -341 -59 -157 -90 -128 -157 47 -181 13
5273 13 -270 142 -16 -11 -69 18 -27 -137 102 -26 140 12 121 144 95 44 -121 114 40 121 77 78 165 252 60
5298 60 -78 201 -35 197 32 131 91 -14 245 7 137 -104 11 -16 75 21 -61 -4 -191 -30 -162 -149 34
5321 34 -33 -37 -206 35 -124 -89 -213 -155 44 -140 26 -52 56 -186 -97 -21 -80 -41 -115 -221 -58 46 -211 -10
5345 -10 -110 -138 187 -187 54 -111 112 -68 -45 150 63 2 -54 34 -39 59 66 31 -43 109 30 33 79 -9 70 105 165
5372A65j21j23K90l11L71k91J75j4j14J54k69Q7j10J96j11J06J0q0N3k10J99j41
5394h9J11p5Jrq3J04m7R9k21J13o0j7J2j3J26p9K0p0J51j25j4k7J3K30k07K36
5420H0j18J52k19LJ30J9M3k40J5K02r7k3o4L52j00n0o7N1rj52K81j02N2j39J77
5445A77r5J54j83P0N8k58R0J19o1P0M4l17J36K24ml7k50K43j97J27r3L3L4j33
5469d9m4J45l2j15P4M8j87j5O6l8J17j20p3J0J00lK7o3J24j54m8J13l5K17l9k66
5495b40J68J18k02L0K0r2K44k33K64j68J68k12K6J31N7L1k51L57r3J38j35R2M3
5518B61j37j6m8L3LQ7r2J32k0j71J26l5j45L8M6r0J56O4j86J70q0L2j81L0L9n2
5544c6M7j36J41RO8k90J32k3m2K9o4J64j04LK4l5P1j16J33j68J60j50M2R1m2k1
$$ plain form
5372 165 44 -79 211 -100 271 -20 155 141 27 181 -88 -1 -111 85 -26 80 90 10 63 -147 52 -89
5394 -89 22 -53 -52 -61 -144 -40 -87 12 -209 -96 -156 -173 -161 -174 -48 -127 -107 -177 -26 -151 -165 -192 -179 51 -156 80
5420 80 -38 114 -105 -102 28 47 90 -150 -135 67 -30 -53 -117 235 135 85 18 69 60 -92 189 87 139 0 177
5445 177 82 236 53 123 181 -77 13 132 71 141 185 -132 4 228 224 187 -63 180 -17 110 17 50 84 -49
5469 -49 -93 52 20 -95 -21 27 -160 -175 -109 -147 -30 -150 -223 -213 -113 -116 -89 -152 -28 -182 -230 -117 -152 65 26 -240
5495 -240 -72 46 -156 -126 -106 -198 46 -187 77 -91 77 -135 -109 22 79 110 -141 216 123 261 126 218 261
5518 261 124 108 60 93 96 183 91 223 203 32 158 123 -22 16 62 -28 128 192 6 176 96 128 -53 -23 16 -36
5544 -36 11 -125 16 25 93 -197 -65 -88 -130 -101 -165 -1 -105 -102 -78 -113 -42 -158 -25 -193 -33 -183 -141 -50 -92 -113
5570a13k25M44j06Pj15K3J54j27K02k20J79l2j41Q9o5J13j43J46JR3r4J22r3M2
5594A41N6k14J82j08Q4o1L1l1M1k4m3J80k45P1n0O3J24k98K48j01K01l47R3J4
5618GN3P3l70J64j02J30Qm1o4M2K44k33Q4j73J35j42J78J02l20R0m4J58k11J7
5642b15J23j11Q0J1O2k5O0l7LN4m9N4k6rOJ54j20j8L5J74k22o0K04q3J22r9L7
5669A05o9lP5j40L00j52K4K8n4Q2j48K72l41np2Q0K58j46J3j34Mr9J15j86K94
5694A01k8k87J27J33j67N8J36k22J00j28J80j37j39M03k80J7P6j16J66l11L61
5715D3l13K25m9Q8n1o0Q7j37J38k29M95l23N2J2m0J11j38K9n3K25r9k3J63p6J40
5740B17p8J32l50L55k63N6l7J60k5j7M8p4P5j38L9QK2o0r6J22KM8j14l1J93j31
$$ plain form
5570 -113 -338 106 0 7 -108 -85 69 -58 144 -76 103 71 -70 19 -46 67 -76 70 71 164 70 192 99 141
5594 141 197 -17 165 57 141 80 111 80 121 97 54 234 -11 60 10 73 197 -101 147 46 247 -100 -7 7
5618 7 60 133 -237 -73 -175 -45 -37 -78 -142 -100 144 -89 -5 -178 -43 -185 -7 95 -225 -135 -179 -21 -232 -215
5642 -215 -92 -203 -123 -112 -50 -75 -15 -52 -49 5 -44 10 -16 -25 -19 135 15 -3 32 206 -16 -76 128 45 167 68 105
5669 105 36 33 108 -32 268 116 140 168 114 196 48 320 -21 -26 -98 -18 240 94 107 -27 -23 -122 -7 -193 101
5694 101 73 -214 -87 46 -121 -63 73 -149 -49 -177 3 -134 -273 130 -150 -133 -57 -173 -7 -318 43
5715 43 -270 -45 -94 -6 -57 -117 -30 -167 -29 -258 237 -86 -34 -22 -62 49 -89 -60 -113 112 13 -10 153 77 217
5740 217 139 271 -79 276 13 69 32 192 167 150 198 124 199 61 100 108 130 70 -26 96 98 146 32 1 194 63
5766F3j06j35K65j89K46l25K0J98j46J79k75J38m7m8J83p1P6k60J83p6qL7ro5
5790a72PJ88j84J31o5k36K39J1O4r8J66j96K50P1k84J5K25j9k35K50l15K13k1
5813EK21p9k2l8j38K59k21K57m7j74J17k25J85j11J90j88O3j54R7j0M0J94k00
5836B1N1l2N5J15j66nr6O7q4J29r5J8R8k3Ok60M26k83j48O6J88j31j88J28J38
5861ej7O6j00n4J86k24j28L23j96J34K1Lj44R9J1q1K22j78j8J55k5J11o3mj82
5886h8L31k70Q5j17J19Q5k02K46k43K96j36k7J30q6LL5p1n7n3J0N9K3%J78n06
5911b56N04k48l0J43RJ05j94J21k06J69k39K42o1q0R2j17J46k65M3j18J41M2j36
5934a93Q4q7M1L5K8p9K15k8l9Qk42J75qL7O8r4J57j73J42m9q2q1J35Jl9k5O1K16
$$ plain form
5766 63 -43 -178 87 -102 144 -181 -161 37 -109 70 -205 -67 -114 -162 21 -50 26 -234 -51 -127 -135 -98 -107 -172
5790 -172 -165 23 -161 -30 -95 -331 -92 -81 -17 -115 51 -145 105 176 -108 -93 132 113 -122 128 -187 26 5
5813 5 226 147 125 87 -51 208 -13 244 197 23 140 -85 100 -11 179 -9 54 -100 -3 -13 27 221 21
5836 21 72 40 95 210 44 39 -57 10 -74 55 -40 -22 76 53 59 -201 225 -58 -206 -140 48 -83 -271 -143 -5
5861 -5 -22 44 -56 -110 76 -148 -276 47 -149 -15 6 9 -135 -36 -25 -106 116 -62 -80 75 50 161 98 94 -88
5886 -88 243 -27 58 -59 60 145 -57 189 -54 242 106 79 209 123 126 161 90 33 -20 -10 49 72 72 250 -256
5911 -256 248 0 -30 113 122 227 33 154 -52 117 -122 120 59 -21 71 -46 100 -165 -122 -240 -99 -57 -193
5934 -193 -109 -196 -155 -120 -92 -171 44 16 -23 -15 -257 -82 -90 -53 15 -79 78 -95 47 -2 -84 -165 -30 -29 -68 -93 -32 184
5962A84k55R9j16L14k0l68K60n9J61k31K86k70P6J7l2O5q6L24l62J12o6Q6J53
5985B72j57k1j68Q6L1j0j25O9Q2p8R5l49L14k08K33K44m61K35j63J21p7k15K20
6008c0j59J29J17l9j58J27r3JJ5o3k4J06K8k46J90J9k3J16l31K95q4J39k76J65
6032g9K09j45R4j20NJ3K78k86J20j29L6Q0k19K90j68K04k95K78J83l13mr8K45
6055A79k57K02k63L42j02l8J22k08K03j66J57j87J35k1j23K70k19p2PM0n7r1J59
6078A2r3L8J4j00j41K00j13p3J85k42K59p4j1oK69k59LJ97k43K96m32K79L3m7
6102d9j17M2J0l1K62k29K52q7p6P7k03L46l19K75j74P3O8JO8k49L30j92J22j83
6126A7Q6J9j06K88q2j17L8M3j38jJ28q5j6j54O7k7N7k9N1o0j87M45l93J84j08
$$ plain form
5962 184 -71 28 -88 226 206 -162 98 39 200 -31 255 -15 61 78 46 111 25 349 -13 99 33 119 272
5985 272 115 94 -74 12 43 33 -92 -23 59 -19 76 -273 41 -167 66 310 -151 84 -79 42 -35 -250 -30
6008 -30 -189 -60 57 18 -140 -13 -106 -105 -90 -153 -177 -71 -43 -289 -99 -80 -103 13 -318 -23 -107 32 -244 -79
6032 -79 130 -15 79 -41 -36 -23 255 -31 89 -40 -4 76 -143 147 -21 183 -112 166 349 36 32 -66 179
6055 179 -78 124 -139 203 101 63 185 -23 180 14 171 -16 119 98 -25 245 26 -46 -39 1 -56 -147 12
6078 12 -81 -43 -29 -129 -270 -70 -183 -256 -71 -313 -54 -128 -139 -145 124 -135 -132 65 -178 118 -314 -35 -2 -49
6102 -49 -166 -124 -114 -145 117 -112 140 53 -23 54 -149 197 -122 153 -21 52 120 121 189 -60 270 78 200 17
6126 17 103 122 16 304 222 105 143 186 48 47 175 90 74 -80 -13 -40 17 -12 39 -21 -208 237 -156 28 -80
6151h0K7J9o1J95k50P4J02q9M5j05P8j69K25j81J68j90J46j00L8l2o3J12j25J00
6175a16j0J29j29j4K94k97J88k16L02j65J8N0O9j03R0J02k55K41j64K0Q2j74J89
6198A31p0M0n2J34r0J08q2j14J47r3J85k85J56j25J13L8rm3r9J78j73p2O6P1Q3
6223A43k17J22j36Q6j43J38K01j56R1k65J14j40M9L6j41K03k2k7j49L20k16J21
6245A2m6R3j36j45K53k12K82k38q1K32M3k31N9J76k36P2K0Q3jM7L7j77J93j7k8
6270E4k1LR6j72K71j69J06j35N7O3L5J15m71L89j72J25k31J25l2J22l4k66K60
6293A18k24K33k60m5P6J22P0j27mo5k6n3J15O5j55O3J57q7Kj24k3K48j99J13J63
6318A53k89K3M8K8J6k1J12l78L63q3j39Q5j25K91j57Q5k01K94k04N1N2j09R1P6
$$ plain form
6151 -80 -53 -34 -95 100 -150 -76 26 -63 -18 -123 -45 -214 11 -170 -2 -192 -46 -146 -108 -140 -203 -91 -216 -116
6175 -116 -126 3 -126 -140 154 -143 45 -171 131 -34 -16 34 103 0 90 192 -63 178 14 34 116 -58 131
6198 131 61 101 49 183 93 201 119 5 152 59 244 -41 115 -10 103 141 132 89 -10 168 -5 -77 -11 60 143
6223 143 -74 48 -88 -2 -145 -7 194 38 129 -136 -22 -162 -113 -77 -218 -15 -37 -64 -213 107 -109 12
6245 12 -34 59 -77 -222 31 -181 101 -137 -218 14 57 -174 -115 61 -175 -103 -83 0 -1 46 83 -94 99 82 54
6270 54 33 36 132 -40 231 62 168 33 90 153 188 303 -168 221 49 174 -57 68 36 158 124 -142 118
6293 118 -106 127 -133 -178 -102 20 90 -37 -41 -106 -132 -185 -70 -5 -160 -97 60 -27 -25 -149 -172 76 -123 -10 153
6318 153 -136 -113 -65 -37 -21 -42 70 -308 55 -28 -167 -82 -207 84 -73 12 -189 105 -99 -48 4 -105 -14 62
6342F2p5oK18q7K32k01j54J90k89J86R4kk0j4j64J04k2j95K59j45J51j43J31J23
6366B33j60Nl5N7k30K82k35L4R0j29J23j3j3j85J39J86k34o0J01J05k62M2rJ83
6390A5o3J07j16j21M07k68k56K57n0K2O3j7j66K04k06K05pQ0j98J11J16l25L28
6413A22k00L6R9j03J55k91K91m3o7Q8j4P6p0L5j89K66k10K80j70mN1J4k8j39J27
6438A12j15Q6l4P0J1j79Q0j5J47j45P0q7r1J46j81K94l88K22Pp2R5j85K23k88
6462b17K11o1oJ07l6l2q7J30k49J65nJ1j2L7oq5J78k21Q8m6K51k13N7P0j14l8
6488a23n8L13j50J46j24K0Ol2r9J89J56l24O1J40J2j13o7J40p2K3Oj66J64po8
6513b7J37J58j76k7n2mK03j83m8k8J64o4p5P4K6r3R8o7k1qj65K24Qj23j06N4K67
$$ plain form
6342 62 -13 -19 199 112 344 143 -11 179 -110 76 170 168 148 134 -30 74 52 -143 116 -29 122 -21 110 233
6366 233 73 78 43 100 -130 152 -83 -49 41 -88 35 22 9 -176 -37 149 -85 -145 -44 61 -201 -159 -168 15
6390 15 -48 59 -57 -178 229 -39 -295 -38 -88 -66 -3 -20 -186 18 -188 17 10 90 -108 3 119 -206 122
6413 122 -78 -42 57 -46 109 -182 109 66 -1 87 73 149 79 114 -75 191 -19 261 91 87 138 152 124 -15 112
6438 112 -3 83 49 119 130 -49 31 16 163 18 88 1 -90 56 -125 169 -219 3 10 -62 33 -152 71 -217
6462 -217 -6 -67 -73 34 -2 -34 -121 9 -240 -75 -80 -69 -81 -44 -50 -135 43 -178 -90 -136 115 -98 -41 29 -85 -123
6488 -123 -181 132 -18 128 4 24 30 -2 -101 88 244 -80 -19 121 133 20 -47 93 21 44 50 -116 48 41 -27
6513 -27 110 268 92 65 13 9 212 29 -19 -47 117 53 -22 52 78 -15 83 16 -5 -13 -178 46 54 -69 -175 -121 146
6540A46k10l1J52q8m7Mp4J00Lj6J83j76MR7k84K19m9J1j08K38j13q0L13l12J67
6565D9K6M4j11P0LM6n4J0o1j15J62J05j70Q9q2R8k75J71J7kK1qj8p1N3J88r9p5
6593A1p1K24j12O3j64J87j56K5N9k4n8j75J12l7J31l1M9j47P2L8j80K91k06J15
6617A6k44j9J84n0N2k1J07r5p5J53j43L6J00M0k20J11P3N4k78L86o8K1k14O5Q0
6642E1j81J80j29K27j09l7j0Rn9j7M9J13J0N1p7qK3p1k2N7K6r1N9J61k19j00J0
6669a04K32j5k3j16J92k83R8q1O6l9R4j08k1K43l41J77o3p5J43l2P2k38J67L8
6693a7L0o0p3K8m5J56j49R7j38J69k9j21l7N2L6J29j38J9J32j0l7L8o4J72k19
6718g9K35k27J20Oj76J70j61J00n8Q0O8M8r1jn2J59M2j5j79J13o6K4o7K02k63
$$ plain form
6540 146 -64 -95 57 -31 -78 -74 -148 -48 -45 -61 122 -54 -50 47 -237 -18 -67 -56 -164 74 -39 -119 194 -118 49
6565 49 75 119 8 78 81 127 73 83 22 -93 69 174 4 93 11 109 -166 5 22 20 41 33 15 -56 -3 185 86 11
6593 11 -60 164 52 115 -49 138 -18 7 66 42 -16 -191 -79 -116 15 -16 33 -114 -42 -4 -184 107 -99 16
6617 16 -228 -247 -63 -113 -61 -82 25 -70 -145 8 -135 -99 1 41 -179 -68 5 59 -219 167 99 120 -94 -29 51
6642 51 -130 50 -79 148 39 2 -8 1 -58 -75 -26 87 97 148 71 63 86 15 -7 50 76 -15 44 205 -14 -114 -104
6669 -104 128 113 90 -26 166 -117 -19 -100 -34 -73 21 -87 -108 135 -206 -29 -92 -167 -24 -56 16 -222 -55 -17
6693 -17 13 -47 -120 -92 -137 19 -130 -33 -171 -2 -31 -152 -189 -137 -101 28 -110 -91 41 31 -6 32 -32 140 -79
6718 -79 156 -71 49 55 -121 49 -112 -12 -70 10 78 126 35 34 -18 141 183 168 -11 102 36 60 -7 195 -68
6743f8K39j78J29o5l8K3j03J51J1m6j21J02pJ1l4n0O6o9k7j10O5J16j08P8j35
6768a68K79l91L84j56K2K7j84J51j80M27l64J43jJ0j5n6j06N9M3j5O6J7K07j33
6792F6n0o9l3J14r3R7q9K23j00j99j3J63O3k9j00K69r3K3m8o6NJ38j38l7k4J55
6818A35j34r1L10r0M6r3r9J42k29P6J0l7j6p9N1R0r2l1K10j63K28l16lJ12J8q1
6844a26n4K28r3Ok6j7M3O0k10J08Q8q1K4k12L15K7l51K15j9J34l2k33K43p4J16
6869G9p5J86j12k9o4P3P5J4J5j91K48l11J78l8O6Oj15Q5n3J67k60K6M4P8j57N8
6895gQ8j71K03p6M6J54k01J14k16J12j25P8p6j1l9N3P3j80L81m06Q9O9j4J45l35
6920b52K95j77P0q4J7M7L6N9k35L38p4Jk29J27P0j21J19k27J57%J17o9o9LkJ17
$$ plain form
6743 -68 171 -7 122 57 19 42 -61 90 101 55 -66 36 29 40 6 -44 22 -47 -74 -184 -119 -3 -111 -33 -168
6768 -168 111 -280 104 -52 -30 -3 -187 -36 -216 211 -153 -10 -11 -1 -16 -72 -178 -119 -76 -91 -25 -8 199 66
6792 66 16 -53 -86 28 -65 32 -57 166 66 -133 -146 17 80 51 -49 220 127 150 102 36 41 179 41 4 -20 135
6818 135 1 -90 220 130 176 83 -16 126 -103 -27 -17 -54 -70 -149 -98 -8 -100 -131 79 -84 144 -172 -175 -63 -45 -126
6844 -126 -180 48 -45 -39 -65 -82 -39 21 -189 -81 7 -74 -50 -262 53 80 -271 -56 -75 59 27 -206 37 -37 79
6869 79 4 190 78 49 -15 58 133 147 162 -29 219 -92 86 48 114 120 5 90 37 204 -56 -30 14 92 -65 -7
6895 -7 81 -90 113 37 83 237 36 150 -66 46 -79 -1 -77 -88 -127 -74 -1 -181 200 -206 -117 -48 -62 83 -252
6920 -252 43 -134 -64 -148 -131 -84 -48 11 -224 114 40 41 -188 -61 9 -112 7 -220 -63 -63 54 -15 -84 -81 -83 34
6946C4o6J11k02L3J86k09K42j16M9%k2j9K00j39N0rk7J09j46J9j88K48o5q9P1
6971E5J55j20j90K88j97j7P0k32K19j61L39j69j85O1pN6j00K6l2K05j38o2M3K7
6995f6O5j99K59k62J87O2l6nj68J20p0Q1p6LP2p1Q6j22K73j82m3K9J30q5Q4j39
7021g3k2K17j53J64k81Q0J57j91J65j9j10J09j0Q8r1j3j8J33j16P1J10j09lp2
7045A3j5nK65l11K30j88NJ14k59J74j29L35l16J16Lk5R5j04M4j37M0k99L48L1
7069B5M8j21LRj68J81k24K62N0r8P9j98O9o5J84j93J57j55R9O7l0O0j68J84M0
7094I7k7j32O2J20p3m6j68K03j9P2l9j08K54j37O6j48J63p9j21K07j29J73j06
7117H5J83j82K9k61J30J13r2P7r8J05o9J30q3p3J1K5jr7L7J2P3j15o3J39j64K57
$$ plain form
6946 34 -32 79 -123 -90 96 -113 129 13 62 62 40 21 221 82 132 123 96 205 59 78 -110 138 73 -16 55
6971 55 210 90 -100 188 -9 -26 44 -188 31 -130 209 40 -145 -84 -91 -35 -135 -109 -141 64 -74 -136 -93 -66
6995 -66 -1 -200 59 -203 -16 46 10 5 -163 -43 -113 -32 -108 -105 -33 -104 -18 -140 133 -49 -92 -63 67 -18 66 -73
7021 -73 -95 122 -31 133 -148 -68 89 -102 63 44 -66 43 33 121 30 17 -1 132 16 87 197 88 85 13
7045 13 -2 -7 258 -53 177 -11 -6 108 -151 23 -106 229 -87 29 32 7 102 -2 42 -95 -55 -354 -6 25
7069 25 73 -48 -45 -36 -204 -23 -247 15 65 -33 46 -152 -83 -148 36 -157 0 -155 -56 11 -19 41 -127 57 97
7094 97 70 -62 0 120 47 1 -167 36 17 89 50 -58 196 59 125 -23 140 61 -60 147 18 191 85
7117 85 268 86 115 -146 -16 97 5 82 -16 89 20 150 67 -6 5 30 29 -68 -31 -19 54 -61 -124 15 -149 108
7143A08l32J60m7L5M5L2j5k29K35J8K4j02o2Q7r5J41L8r9p5P6M3r2J18j34J71
7168D9mj05M0k8J61j10J81r8J1L5qj41J7J86k98R3J57J05j14j71O1J98M6m17K20
7193F6j31K53j47K8K5j55K0n6K29j19K7km9m1l0Q6m8J04l20R4J05o1K27k71Q9
7218g7M2O5k84J96rO3M9k44J19n8J71k99J23J46l5j08K3J18O7j06q7N4K01j74
7242d4L6j7L7p8jJ14J26p1l3P6r2l3J66j05j37J26l7oJ9j57K07k12RK63o3k0j45
7269g2K22j10J5K0j9l2p7L8M9O9j03M4P9k80J29N4Q2n1q2n9P4%J6j9k19M25k39
7296d6j56LQ2J36q6P2rJ42j50j68J58J7O5j52J41k48J08J66o8j14J2K53l08L24
7320A74j66L3k4j6J44k46L25l33J52L8Oo3J70p7j62J9o2J64NK9j50K6J45j50J72
$$ plain form
7143 108 -224 -64 -111 -76 -31 1 -14 -243 -8 10 34 -68 -130 -43 -138 3 41 -58 -133 -57 -14 -106 12 -122 49
7168 49 45 -60 -20 -48 113 3 184 86 97 132 124 -17 0 186 -112 -19 138 243 129 -42 19 217 263 -154 66
7193 66 -65 188 41 69 94 -61 -41 -97 132 13 40 38 -11 -52 -82 4 -44 60 -260 -166 -61 -122 105 -166 -77
7218 -77 -35 30 -254 -58 -67 -4 45 -199 -80 -138 33 -266 -143 3 -32 -140 -117 1 68 -38 -125 -71 130 -44
7242 -44 -8 -25 12 -66 -67 47 173 102 69 145 53 20 186 81 -56 70 33 27 46 -111 96 -116 -107 156 93 73 -72
7269 -72 150 40 55 75 56 24 -53 -15 34 103 0 44 123 -157 -28 26 108 57 -25 -84 -10 -10 6 -13 -232 193 -46
7296 -46 -202 -199 -117 19 -67 5 -4 138 -12 -180 -22 -5 60 -92 49 -199 -91 75 7 -107 -95 158 -150 174
7320 174 8 41 17 1 145 -101 224 -109 43 81 87 24 194 117 -45 -26 -88 76 81 110 -40 -14 131 -19 153
7345A53j34J22k05J80J54l17J51j35J78k99Q2P1mP7k7l9NO8q7j4KQ4k46J07o2
7370a35P1j47J41J15lr8j1O0o2o2n4J06k2M0r1J73L4J5j51j3N5k5k4L2j4o4J68
7397C4k19K44J4r1p1J9K64j30Lj1k0Q4nj59J21Q4j63J16Nj71L8k4j24K46j33l3
7423h2K73j67J1q9J1J12q0k4J69R0m6k61K4K06o3k76K52k21Q4p8K4J23p1J42k15
7448a52J42j64K70p1j19R5q3L4j77L12k20P6M3q0M5j41M1K07j35m5J9J68q5o1
7472h1J02O6k28K80j84N8J19j92J28Rj44J81j48J36L1j6j07r6J42O9j23l6J28
7495I4r6Q5j28L3Q4l2R4j32J06q9J92o5j39j28K11j67j45J64p5M0n4L31k72jj18
7520b07J18J44o2J38l08R3m0M1L5O4l4k15J91m9J00j13P3P1k05J17J38J33l22
$$ plain form
7345 153 19 141 -64 116 270 -47 104 -31 147 -152 -70 1 -3 74 47 8 13 81 -6 -20 -18 66 -180 -73 -135
7370 -135 -64 -211 -70 45 42 -56 -67 -7 -69 -131 -185 -79 -101 -61 -152 21 55 70 -81 -94 -39 -64 -88 -56 -70 -134 34
7397 34 -185 59 73 -18 -89 -70 194 64 67 56 36 120 115 -44 77 161 -2 114 119 -52 -14 -38 -162 84 -49 -82
7423 -82 191 24 35 -54 -43 69 -11 -35 134 224 178 -83 -59 147 84 -192 60 -161 -77 -155 -131 -8 -79 63 -152
7448 -152 -10 -174 96 25 -94 1 -82 -48 -225 87 -133 -57 -14 -94 -49 -190 -149 58 -77 -122 -103 65 -20 -81
7472 -81 21 87 -141 139 -45 13 132 -60 68 77 -67 114 -34 102 133 117 10 -86 56 125 2 -34 94
7495 94 -2 83 -45 -12 72 40 134 2 108 19 211 146 7 -121 90 -77 -222 -58 -133 -93 -147 184 -88 -89 -207
7520 -207 -89 55 -7 131 -177 -84 -124 -83 -48 16 -18 -233 -42 -91 9 -104 -31 40 -165 -48 90 223 -99
7543i9Ll9Q3L2j31K07n1L2r0M2Q7Kk02R2K08r9k7n2J2l6P7j04Q6K14k40J32j0
7570A29j5o0nR9j25J45j12o5L7n5O5q7M5n0R0j00m5J75j1p8Q5L2k62K24j86J9
7596a11J08p3P1n0K10j91l7pn1L0M2l6j3R7lp8J8K9j3l9M1J28m9n7nL8j39M0J56
7625E6J36j8n6q7O1M1j32Q4j00J86j36m5J81j29M5r8J50Pn7j55K67k31J09o0Q4
7650A03J6j3j00N2L0j23R1j94J87Q2l29K38n0R0p1k67K06r2J41j68K91j09k1J03
7674I3k19J92jM3k44J08j23J29m0n2J47p7l1Q4J41l13J23Q1r4r8M6J12q1pJ33
7699E2j0mn8K3p9O7J0J14j66J40R0k19M1JJ65j40N0m5r1J70m1qk66K55J22j15
7725E8L8o4%p8K86l64K2K18q4l4p3J0qj0K00k91J83j79J52j3j46K06p8O0N2p7
$$ plain form
7543 -99 -96 -135 -52 -20 -151 56 5 37 -53 -11 76 78 -124 -32 176 77 50 -2 10 -26 51 -53 33 247 7 139 129
7570 129 114 54 49 148 23 168 56 -9 28 -27 38 -49 -4 -54 36 -64 -109 66 55 -23 62 94 -168 56 -130 -111
7596 -111 -3 -76 -5 -55 155 -36 -73 -80 -131 -101 -59 -95 -108 -11 -14 -92 -74 -45 -58 -97 -56 72 23 -34 -39 -1 -140 -100 56
7625 56 192 174 118 31 92 133 1 85 -15 171 35 -10 171 42 87 -11 139 146 89 -66 201 -30 79 19 103
7650 103 119 106 6 58 88 -35 56 -138 49 131 -198 40 -10 80 9 -258 -52 -144 -3 -171 120 11 -10 93
7674 93 -126 66 65 108 -136 -28 -151 -22 -62 -114 33 -44 -75 9 150 -163 -40 41 -53 -151 -105 7 -74 -81 52
7699 52 42 38 -20 3 -76 -9 1 115 -51 89 179 -40 1 2 167 27 77 32 -59 111 70 62 -204 51 173 58
7725 58 96 32 32 -46 240 -124 -102 116 32 -2 -75 -65 -73 -83 117 -174 9 -170 -18 -31 -177 29 -49 11 63 -14
7751a4j23J09q4J99r9j82R7l8K32j60m2l0M2k8K3J44r6J79k49J93j72J09M6j1
7775D5q1pO6q6K7L7L7L6j06P2k04L07k76J18K08j54J38j64P5r8M1n1K27k22p4
7800h9k0J89j41q9K85m3j45o2J21k3K26k05L0J00j34j45M8N4J10j53M8l4J28j45
7824h9J16j47J98j18j35J1K6J86O6l43P1J17P0j11j6LJ11j75N1K51l27J62J1M0
7848B9J0K1j09k6o1P9L0N2J05j52J15o0q6L2j2l8J2R8j34J23N5Jp7k4lJ00K4j74
7876g0P4J44%M5j24l1j09O0K3R4j70M8m9P7j13J0j4K5J16o9j51K93l61R6J42k0
7902c4J13j66l4j0K30l04J7QJ87j3j58K24l6j08j15K33j06K7N5pN7J9j14p5J53
7927D3L6P7j47l8R0j6l7k5J74j02j6%%Q2j11J04m9J54j88p2M0j62J56rQ2m4j08
$$ plain form
7751 -14 -137 -28 -112 87 -12 -194 -97 -135 97 -63 -105 -135 -93 -121 -98 46 -50 129 -120 73 -99 10 56 45
7775 45 -36 -43 23 -63 -36 1 38 74 -32 40 -164 143 -133 -15 193 39 177 13 88 -10 31 -20 207 -15 -89
7800 -89 -109 80 -61 -150 135 92 -53 -115 6 -17 209 4 34 134 0 -145 -97 -43 67 -86 -38 -72 56 -89
7824 -89 27 -120 78 -40 -175 -164 -138 48 114 -229 -158 -41 29 -82 -98 -95 16 -159 -108 143 -184 -22 -11 29
7848 29 39 60 -49 -75 -136 -57 -27 25 130 -22 93 33 -53 -21 -33 -71 -59 39 -95 28 83 84 7 -17 -20 80 104 -70
7876 -70 4 148 148 193 69 38 -71 -11 12 106 -64 -16 -65 12 -101 -91 -105 -80 36 -33 -184 109 -252 -156 -14 -34
7902 -34 79 -87 -121 -131 99 -205 -188 -180 7 -6 -164 60 24 -84 -199 34 -72 -45 10 3 60 79 -35 -110 43
7927 43 79 156 9 -29 61 45 8 -17 157 55 39 39 39 121 10 114 65 219 31 -41 -1 -163 -7 -16 66 22 -86
7954h6O5k3R1q0N3p9K54Lk05l2N6k9j39J67o4prr7J58p3J20m7m9J01j35Q7k2l8
7982e9k0J79m22J90j44L04P2k78K81j30j6o9J60J8r1K34l73K03o0O2J05j74j73
8005b01K5K25o7q5K2L05q6l7n0lJ82k47Q3p0J50j32k0J96j76J53j92M7L2o5K09
8030A98k71J85l61K83J3q4J72j68JKJ16j35j12J62k6Q3j03Q7j35jP3l9k6J04j5
8055Cr2J08j53J55j18K29p2n9q1N3j39J8J06O3l0K2l0J03k69L21j56L8L0m2J9
8080B7J7J3M6K5k12J12j05J39M5o2j01L4m3R1J44Rj37m0j42J69R1j18j01Q3J3
8105ck0q3J15p3J7N9l2r5J16n4j01K49j87J14J50l51K94k32Q9m5J3L1j19P2j27
8130b03K34o5L1J7j95K11l9Q1m9ppq1J15q9p6M3J41j37M5R0j76O0p5J53L0K2m8
$$ plain form
7954 -86 -21 -44 47 -33 20 -59 195 198 -7 -39 17 -12 -151 16 -48 -55 -64 -161 -3 -76 44 -3 -52 49 -86 1 -21 -59
7982 -59 -79 100 -322 -132 -276 28 100 -178 103 -27 -43 -112 48 66 -25 209 -164 39 -21 41 146 -28 -201
8005 -201 -176 49 -18 -103 -81 224 138 101 51 48 230 -17 66 -4 146 14 -6 190 14 167 -25 22 54 -11 198
8030 198 -73 112 -249 34 47 -37 135 -33 -32 -30 86 -49 -161 1 -25 58 -45 42 -93 -94 -21 -60 -86 18 3
8055 3 -89 19 -134 21 -97 132 60 1 -80 -27 -166 -148 -42 21 -9 13 -17 86 -183 138 -18 20 50 8 27
8080 27 44 57 103 128 -84 28 -77 62 107 45 -56 -22 -65 26 170 179 42 2 -140 29 120 2 -99 -16 -3
8105 -3 -23 -106 9 -64 -47 12 -20 -115 1 -53 -154 95 -92 22 172 -179 115 -117 -28 -73 -60 -29 -148 -76 -203
8130 -203 31 -34 -3 14 -181 30 -9 72 23 16 9 -72 43 -46 -122 -79 62 -75 -30 60 -116 -56 -131 22 52 74 26
8157B6pl6N4o5kJ00k42J16L2MK9l3n9J28M4j41Q2K0r0J07r8Q1j58K79o3n6l6k9
8185a3j9Q1J6L1p5L7
$$ plain form
8157 26 19 -17 37 -28 -30 70 -172 -56 -24 -20 9 -24 -83 45 89 -52 30 50 -40 67 -31 50 -108 171 108 52 16 -13
8185 -13 -32 49 65 96 21 58
8191E8
$$ Imaginary data points
##PAGE= N=2
##DATA TABLE= (X++(I..I)), XYDATA
0@%%%%%%%%%%%Qj6J6j8K6l2M0n0N8p2Q8j05J29j52J76k08K41k79L24l72M23m81
33b56N50o24P05p96Q92r98J116j246J386j541J711j894K094k314K555k819L106
50A627l418L765m148M571n043N571o166O842p615Q510r565J0831j2375J4309j6822
65i126K0238k5172L3048m8253J29001l04132J59631L13061m05299J33654J28751
76A25402k23381J00221R4801j91719J21501j8428p6834J16223o2421o7673J47918
87F5610q9151o2172J48841j03697o839R9567j35941P5456P2334j52828O7958Q3134
99F2272j40345R5098K1774j25130J25499m125j07600J06107o281r8974J28492
110E6787l2380j08125J40453m5692n6712R1157o8701m996Q9160j01706J1269R2043
$$ plain form
0 0 0 0 0 0 0 0 0 0 0 0 0 8 -8 8 -10 16 -16 24 -26 32 -40 48 -57 72 -80 96 -112 129 -150 174 -198 225 -256
33 -256 294 -330 375 -421 471 -527 589 -657 729 -812 899 -995 1099 -1215 1340 -1479 1627
50 1627 -1791 1974 -2174 2397 -2646 2925 -3241 3601 -4014 4496 -5069 5762 -6613 7696 -9126
65 -9126 11112 -14060 18988 -29265 99736 -204396 -44765 268296 -137003 -3349 125402
76 125402 -97979 2242 97043 -94676 26825 8397 -68437 47786 -14635 -82308 65610
87 65610 -23541 -85713 63128 -40569 -47408 52159 -83782 -8326 64008 -88820 -20862 62272
99 62272 -78073 17025 38799 -86331 39168 35043 -72557 33550 27269 -71705 56787
110 56787 24407 -83718 56735 11043 -45669 45488 -23213 -28209 60951 -40755 -29486 62557
122F2557j10293L4674O5186r3340J8345O5434n5947r732M1270k1983J9987k8542
134a2384m355O4567n7840k2830Q2450m5589l4555Q5591o8757o548Q0811p6431
146a5870M898N3020n2570J3877L8046p4055L5781M9396q1054K4145L4116m4893
158a5163J9310J3012m8025M6368Q5n3338N5410j5936k5816L2216j1229j2265J8626
171C255j5390K629J8323l6029L1405L419m0970L8005J0804m8779K6416L4106o2263
184c5069L3561K0240m9209L6934L411l5960L6021O298n2067M7919J0543m7979
196b5357K5913J1844j6510O89J3459j5892Q485M551p701N950j3134J8738j030
209A0005j6528P285J5428j4531l747J4419j4644J4996n972j2420J1762J0224j4634
$$ plain form
122 62557 -47736 -13062 52124 -41216 -22871 42563 -13384 -23116 18154 -3829 16158 -12384
134 -12384 -16739 47828 -10012 -32842 49608 4019 -30536 55055 -13702 -20250 60561 -15870
146 -15870 -10972 42048 -10522 3355 41401 -32654 3127 52523 -28531 -4386 29730 -15163
158 -15163 4147 17159 -30866 15502 15587 -37751 17659 1723 -24093 8123 -3106 -15371 3255
171 3255 -12135 -9506 8817 -27212 4193 7612 -33358 4647 15451 -33328 -6912 27194 -35069
184 -35069 -1508 18732 -30477 6457 9868 -26092 9929 16227 -35840 12079 22622 -25357
196 -25357 556 12400 -4110 -3421 10038 -5854 2631 7182 -519 5431 -7703 11035 10005
209 10005 -6523 762 16190 1659 -2088 12331 -2313 12683 6711 -5709 6053 16277 1643
222A643r614K4879j0148p849L405O640o385n494J2380o421n742K755J3977k1524
236g498j051K1019j2777j0044P345J5073k3594K959J7129j2020q414J2197K948
249C272j7062J4630n365k639R251p389l633Q160L183j4872J2397k399k252O056
263A338p161K181L950J528p221O364l658O524p78j2274J3099J793l228o217O456
278B696K186J771p482m662J8422q857o418L677Q119o251k849N564m099K224k197
293A844P034j1753K805J3246j1877p341J1115Q466k1390O481J0100o346p637O537
307A284P878j7306Q353N501r246k837J3575r090r274K0396j4157m540J2005j315
321A227j0909P949L292r276P011n923M745j293p75K844n884K718O227l182j5347
$$ plain form
222 1643 -7971 16908 6760 -1089 2316 8956 2571 -2923 9457 3036 -2706 49 14026 -7498
236 -7498 -8549 12470 -307 -10351 -3006 12067 -11527 -8568 8561 -3459 -11873 324 3272
249 3272 -13790 840 -4525 -7164 2087 -5302 -8935 -775 2408 -12464 -67 -2466 -4718 1338
263 1338 -5823 -3642 308 1836 -5385 979 -2679 3845 3067 -9207 3892 5685 2457 -3760 2696
278 2696 4882 6653 -829 -5491 12931 4074 -2344 1333 9452 3201 352 5916 1817 4041 1844
293 1844 8878 -2875 -70 13176 1299 -6042 5073 13539 -7851 -1370 8730 2384 -5253 1284
307 1284 9162 -8144 209 5710 -3536 -6373 7202 -1888 -11162 9234 -4923 -9463 2542 1227
321 1227 -9682 -1733 1559 -7717 -706 -6629 -1884 -3177 -3952 -1108 -6992 -4274 1953 -1229 -16576
336a6576K1431p52j7146J0906L701l457o49J628o293J4057o679q157J3107m742
350C79K37J681j450m475J2330m854q384Q860J76M271j1044J753J0602k385j2525
365d828R994P463j6974J2298k138p677P400L060r901J207J0294j0526J978k17
379A433K616k843k994N330l851r00J442L481j1763R394K529j3147Q874J647m943
394c695k656Q350m236l817J504N223j55j2231J1873N60n404l94M052k313r85P347
410C023r839L945K712k91k465k173M186K270l409o141J3496o222l493L989j843
425b255L753k792j892l46R571p723k738N894j900K944l646o43J688N702p062K023
441E78J896k684P953r207K908L746j671k609K048J647k911K797m686N007Q9m537
$$ plain form
336 -16576 4855 4103 -13043 -2137 1564 -1893 -2542 -914 -7207 6850 171 -7986 5121 379
350 379 616 2297 847 -3628 8702 3848 -4536 4324 4500 8771 -2273 -520 10082 7697 -4828
365 -4828 5166 12629 -4345 7953 5815 -1862 5538 8598 -1303 -96 10198 -328 1650 1433
379 1433 4049 1206 -1788 3542 -309 -1209 233 3714 -8049 1345 3874 -9273 -399 1248 -3695
394 -3695 -6351 1999 -2237 -6054 -4550 673 518 -11713 160 720 -4684 -5078 -1026 -3339 -4324 3023
410 3023 -6816 -2871 -159 -450 -2915 -5088 -902 1368 -2041 -8182 5314 -908 -4401 -412 -2255
425 -2255 1498 -1294 -3186 -3532 6039 -1684 -4422 1472 -428 2516 -1130 -1773 -85 5617 -1445 578
441 578 2474 -210 7743 -1464 1444 5190 3519 910 2958 4605 1694 4491 -195 4812 4901 364
457C64k665Q527j881j2211J2675l795l759K745k0k918p77M991m950p11N96O238
473B449r614Q21R608q615j997M312M372j0191N542J877n354P140k293l618J249
488d312R929q308n082R848K492q328N63R106r989O076J289n449J252M043J465
503D595j0130Q433K461o485M23N826l202j978L537m559O429k850j490j633M636
518D013L502j2033P766K202o085K192N354q727J065Q971q316m56L090K346q555
533c671N562M639j0347K233M898P76r842O789J144o478O544j933n945L330Q108
548E807j1713M58Q101k574n936K802P775j1289M571K785m006K572j77r42j986
563c752M639q3k498m542Q819P84q054K917K72O456p411l80N177j661o75o70K819
$$ plain form
457 364 -2301 6226 4345 -7866 4809 1014 -2745 0 -20 -2938 -3715 1276 -3674 -4385 -3789 2449
473 2449 -7165 -6344 3264 -5351 -7348 -3036 1336 -8855 -3313 -1436 -6790 350 -1943 -5561 -4312
488 -4312 5617 -2691 -7773 2075 4567 -3761 -3198 5908 -4081 1995 3284 -2165 -913 3130 4595
503 4595 -5535 2898 5359 -1126 -703 5123 1921 -57 3480 -1079 5350 2500 1010 -623 4013
518 4013 7515 -4518 3248 5450 -635 1557 6911 -1816 -751 8220 -96 -552 2538 4884 -3671
533 -3671 1891 6530 -3817 -1584 3314 4090 -5752 1037 2181 -4297 2247 314 -5631 -2301 5807
548 5807 -5906 -5448 2653 79 -5857 -3055 4720 -6569 -1998 787 -3219 -647 -824 -1766 -3752
563 -3752 887 804 -1694 -6236 2583 3367 -4687 -1770 -1498 4958 -2453 -2833 2344 683 8 -662 2157
580B157l173L009j160J17r73K444P91n966O264m98j580k588M937j26m589M235
596C301j921J997j914J206j553J455J005l302J596N5J082n099M432p42j651K88
612B35l802Q149o018l125M224J328l977P64J430l781L568j37j173o022Q812J821
628B296j1628N529N022k453o655O989J199m750J530J933r63j753O774p285j25
643d340O950j622n822K019P702o823J310M98O94O21l64J36k448N201k491p79k31
660B11L088k095j727M161k910J986k884K656k21p36l8j280M706m349L10J177J172
677C227l933K683J622n324N193k139n18j279L865j601n936N663J539l754m545
692e237Q378j911m683K300J65N18k042K542m335K772J662k233j766R35N156o173
$$ plain form
580 2157 -1016 1993 833 950 -23 2421 3212 -2754 3510 3012 1432 -1156 3781 3655 -934 3301
596 3301 1380 3377 1463 2669 1116 2571 3576 274 1870 1925 3007 -2092 2340 1598 -53 235
612 235 -3567 4582 -1436 -4561 -337 991 -2986 -2222 -792 -4573 -1005 -1142 -2315 -8337 475 2296
628 2296 -9332 -3803 1219 -1234 -7889 -900 299 -4451 -2921 -988 -1951 -3704 3070 -4215 -4340
643 -4340 2610 988 -4834 -2815 4887 -1936 -626 -128 566 1187 823 959 -1489 3712 1221 442 211
660 211 3299 1204 -523 3638 728 2714 -170 2486 2265 1529 1491 211 4917 568 878 2055 3227
677 3227 -706 1977 3599 -1725 3468 1329 811 -468 3397 1796 -4140 1523 3062 -692 -5237
692 -5237 3141 1230 -3453 -1153 -988 -470 -2512 30 -4305 -1533 129 -2104 -3870 -2935 2221 -3952
708c952L87J658K339l044r24L274k301K584k259N11l00L659k774k945N810j048
724F75r56k947N140j14k798P69J313P36k693L792l665J821J903k131p08J385K924
741D446n377K663P0J139j285j772K926k6k93l902M773o49j942m1N59J761l722
758f72K644k010J054J1M05k538j99N107n931J33K330J260m538J419K556m039K754
775b54j375o06o23L933l745k579O551k365l185O03N531n334k23L714k048k48M51
792a802K049m253M105K00l147J339K295K13m887N218m81r98m92J194J103j589
808F7J654k967M164j156j228J28J281J076l000K726k370K849j027j826P07J957
824C035M23m951L912p4j65k383J539Q75j628J923l674K531J58L52l264O15M642
$$ plain form
708 -3952 -3565 -1907 432 -2612 -3536 -262 -2563 21 -2238 -1727 -2027 1632 -1142 -4087 1723 675
724 675 -281 -3228 1912 1798 -1000 -231 1082 1818 -875 2917 -748 1073 2976 845 137 1522 4446
741 4446 -931 1732 1802 2941 1656 -116 2810 2784 2491 -1411 3362 2713 771 730 1289 3050 -672
758 -672 1972 -38 1016 1027 1432 -1106 -1305 3802 -2129 -1996 334 1594 -2944 -1525 1031 -3008 -254
775 -254 -1629 -2235 -2858 1075 -2670 -5249 1302 -1063 -4248 -3645 1886 -3448 -3671 43 -2005 -2253 -1802
792 -1802 247 -4006 99 299 -2848 -1509 786 999 -3888 1330 849 -149 -641 553 1656 67
808 67 1721 -1246 2918 1762 534 662 1943 3019 19 2745 375 3224 2197 371 1078 3035
824 3035 3458 -1493 2419 2345 2180 -203 1336 2211 583 2506 -1168 1363 1521 1873 -1391 -776 3866
841C866m281j462J318L225m763J061J132j553J451j905J081j960L127j817j513
856b993J344O61Q18m111K969J073l60l563L098J701l866K300p50J573k077K041
872a42j091n85L159k744O81k72L346k838j173K616J182k176j111M595m329K609
888A727l20j519J496O71k42l347M969j046k037M33J815k83j961R87p70K911l707
905b23R97L57K9J026l728L030p72K30j147Q31q56O09J369m332K803Q77j303l259
923c462M356r9m549L308n09N21k659K462r52p75K861k881o92K258J904n540K767
940a681K026j588p27K37K689m281L816j345j880L496n95k061P5M378k939j399
956a779J161L634l125j571M541l498K446q53q45J29K372m72l445L470n58qj219
$$ plain form
841 3866 -415 -1877 -559 2666 -2097 -1036 96 -1457 -6 -1911 -830 -2790 337 -1480 -2993
856 -2993 -1649 -988 -170 -4281 -1312 -239 -599 -4162 -1064 637 -3229 -929 -1679 -106 -2183 -142
872 -142 -1233 -1818 1341 -1403 -722 -994 2352 -486 -1659 957 2139 -37 -1148 3447 -882 1727
888 1727 1407 -112 1384 2055 1813 -1534 3435 2389 352 785 2600 2317 356 1343 573 3484 -223
905 -223 774 1131 1160 2186 -1542 1488 716 946 -201 630 -226 383 1752 -2580 223 1100 -203 -3462
923 -3462 894 795 -3754 -446 -955 -434 -3093 -631 -1583 -2358 503 -2378 -3070 -812 1092 -4448 -1681
940 -1681 345 -1243 -1970 -1733 956 -3325 491 -854 -2734 762 167 -1894 -1819 2559 -380 -1779
956 -1779 -618 3016 -109 -1680 2861 -637 1809 956 111 240 2612 2140 -1305 2165 1607 1599 380
973C80J599r43M83o9j572K650j690P72k393K942N47l805J897L69J108l238J708
990G45j99o61J318j584p64J617J496n587M502k96k521J879j654K598k438M01j22
1007a270J73M13L19k318r0M992m221p54R43K817k432j922M259k888J463n62L59
1024g19q00K076p23k128K999n86O15k554K583M51q43k75j6K439k799K007j492
1041B35J205P96k096J562n92J268j588O50m04J557j666l86J778j907J789k997
1057g96K873m01k201J750p48R07j352M09j180J975j050m00o06m3K992m644J487
1074a028Q62O51j881j200L288j420n69j092K712j787L08K08j575K325l91j66k574
1091c329L672j44j918l11J358K157m235K506j60j68O70m39r41J021K237l874J721
$$ plain form
973 380 1979 1036 1519 1450 -122 2528 838 1610 -783 2159 2706 -1099 798 1167 2275 -963 745
990 745 546 -115 1203 -381 -1145 472 1968 -3619 883 587 -1934 -55 -1709 889 -1549 -1148 -1270
1007 -1270 -1097 -684 -365 -2683 -2773 2219 -2002 -2756 -1813 1004 -1428 -3350 909 -1979 -516 -1078 -719
1024 -719 -1519 557 -166 -2294 705 119 734 -1820 763 1214 371 96 80 2519 -280 1727 235
1041 235 1440 2236 140 1702 1110 2378 790 1440 1036 2593 927 541 2319 412 2201 -796
1057 -796 2077 1676 -525 1225 477 1384 32 441 -739 1236 186 -214 -820 -863 2129 -2515 -1028
1074 -1028 -166 485 -1396 -2596 692 -728 -1297 -2389 323 -1464 -1156 -948 -2523 -198 -589 -755 -3329
1091 -3329 343 199 -1719 -2030 -672 1485 -2750 -244 -404 -572 98 -341 -1282 -261 1976 -1898 -177
1108a77R18Q03k581P63L014l192J369o20Q58k04M25p47o16K258j079k65j527L729
1126C129j909j382K071q94Q37j978J509n20R55j662r4J696j447M46j596K185j289
1143E7K69m50q14J611j148K25j935L242j543j429J097J25M59k396K434j178M59
1160i15k27l02K55K52R00k962K776j88l13j197R16K076l081J236J36J022j576
1177a192J522j054j31K434k481Q14m59K416k013p63J532P01o46k417L916j049
1193A130n78j10P09J17m25J007k444K689n32n17j015J169J311k251N23m25K213
1210B571k438K25N27l61R09j762P14k61J415k589Q25R57j537J323k023J445l11
1227c71L86k110J199J778l013Q73K09J019k550J595K51j161J545q37O4j066L197
$$ plain form
1108 -177 741 1544 -1037 -274 2740 -452 917 297 1155 951 1376 629 13 2271 1192 927 -600 3129
1126 3129 1220 -162 1909 1015 1852 -126 1383 863 1818 156 62 1758 311 757 -839 1346 57
1143 57 326 -124 -938 673 -475 -250 -2185 1057 -486 -1915 -818 -693 -234 -2630 -196 -1374 -915
1160 -915 -1142 -1444 -1189 -937 -37 -2999 -223 -411 -724 -1921 -1005 1071 -2010 -774 -638 384 -1192
1177 -1192 330 -724 -855 1579 -902 -88 -547 1869 -144 -907 625 1326 680 -1737 2179 1130
1193 1130 552 442 1151 1268 843 1850 -594 2095 1563 1046 31 1200 2511 260 783 358 2571
1210 2571 133 358 885 524 1433 -329 385 124 1539 -1050 -225 732 -805 518 -1505 -60 -371
1227 -371 15 -2095 -896 882 -2131 -1258 -1049 -30 -2580 -985 -734 -1895 -350 -1187 -1123 -2189 1008
1244A008k365j182K887J47k243l22L939l078j6J485l27m58P86M04k338L020o95
1261F52j043j76K263k04k655K325l02L36j090Q99m04O24N08k560K482j89p0j709
1279c13J679L47j117N86j451K161j004j70j080J498M38k013P62J2R66k201J312
1296D12o34k25J279j792M08P9J595l230R23J599j250q90R8K165k283Q65n36P06
1314g11k67k58O47j647K283j203O7m05J129L5j699J597L15Q5j524J729k07j71
1332b05L3n22J598j451J506j297K14J509q30p28M87K076k608O32P18K21r26K97
1350G24R51j429K018j926J64M05Q30o91j832K757r30n73m83J503p54l34l3o61
1368b94J625j170j06j045K260j240j487J788j017R23j188K14n00R97p2j879J289
$$ plain form
1244 1008 -1357 -2539 348 495 -1748 -2070 1869 -1209 -1225 260 -67 -525 261 665 -1673 1347 652
1261 652 -391 -567 1696 1492 -1163 1162 860 1196 106 1005 601 1225 1733 -827 1655 1466 1396 -313
1279 -313 1366 1713 596 1182 -269 1892 888 718 -362 1136 1574 -439 323 335 1301 -900 412
1296 412 -222 -447 832 -960 -552 -473 1122 -2108 -1185 414 -836 -1726 -1628 537 -1746 -881 -1417 -711
1314 -711 -978 -1236 -589 -2236 47 -1156 -1089 -1494 -365 -330 -2029 -432 -117 -32 -1556 173 -34 -205
1332 -205 -172 -694 904 -547 959 -338 -124 1385 555 -173 314 2390 -218 414 1132 1353 427 724
1350 724 1675 246 2264 338 502 907 1737 1046 -786 1971 1041 468 -15 1488 734 400 367 -294
1368 -294 1331 161 55 -990 1270 30 -1457 331 -686 237 -951 -737 -1237 -240 -312 -2191 -902
1385i02J126n58k686L185m59j384J033o52O71p73J607k240Q97J817j483j034J513
1402c22J889l452J337O26K05r09O23M02j466K409j416l06N42J216j295p11K460
1419A832j354l71L63J118j441Q44m5n30J114j301J101j157J335j39j668J381j07
1436I75N8j260J087k31M88j276J48R36j008N92j674K063m22j147M89j80O87j116
1454g91L40p41J429o52o41j40M89J324k612J114L38K67j240M09R08j143J183j232
1472a391N50J12O63j080n03K202r18n74l61K563k198K43J097p96Q51r98J410j360
1490d88J089M35j340N57J268q69j607K626p29k21l50M98Q02j503J093j062R43
1507A142K01q68l98R95O47k123R31j45P90j087J7L66k22P91j904P05J28P27j815
$$ plain form
1385 -902 224 -334 -3020 165 -294 -1678 -645 -1297 -626 -1399 208 -2032 -1135 682 -801 -1835 -322
1402 -322 1567 -1885 -548 78 283 -626 -3 399 -1067 1342 -74 -380 162 1378 83 -628 1832
1419 1832 478 107 470 1588 147 991 946 416 1530 229 1330 173 1508 1369 -299 1082 975
1436 975 1033 -227 860 629 1117 -159 -11 925 -83 509 -1165 898 476 -671 -182 -362 325 -791
1454 -791 -451 -1192 237 -415 -1056 -1196 -707 617 -1995 -881 -543 -276 -1516 -1107 -199 -1342 -159 -1391
1472 -1391 -841 -729 -66 -1146 -1649 553 -365 -939 -1300 1263 -935 -692 405 -391 460 -538 872 -488
1490 -488 601 1036 -304 253 1521 652 -955 1671 942 721 371 869 1671 168 1261 199 1142
1507 1142 1343 475 77 1072 1719 -404 527 382 1172 85 102 468 246 1037 -867 -162 -34 693 -1122
1526a122L68J441j273L50q91J245p37L41r34K40R07o12l27m75K144j836k26J151
1544b46p92N74n72N91l86Q32m69l46P5P97%j877K640r96l43J69N75L30j243J022
1564C35l07L22r1K84p26N66J136j982R95M57N20j468O47P83o72M6n09J031q41
1583E26Q28j150RJ133o45m62k53J460j148jl54P16j97j050R20q34J130j063q8
1602e23L10J79j39q20P66n89P94j325O77M18m15l2q56J631p05l56j65J000k71
1621d21o99Q70o68R14q91N91l69L25N97j402P47L44O53j819J293N73o49k98M3
1640b66J201j133P66n55J80O50j83n61k86K041j619k31N85P71n48r62J584p79
1658F55J88l38K49n29R26o1j624J473j62m5j240J086J99q32K14n04Q15o91M68
$$ plain form
1526 -1122 -754 687 -586 -236 -1127 118 -619 -278 -1212 -972 -65 -677 -1004 -1479 665 -1171 -1397 -246
1544 -246 -1038 -464 -1036 -445 -831 1 -468 -814 -739 58 58 -1819 821 -175 -518 -349 226 556 -687 335
1564 335 28 350 259 543 -183 383 1519 -463 532 989 1509 41 688 1471 799 845 336 1367 526
1583 526 1354 204 213 1346 701 239 -14 1446 298 297 -57 659 462 -588 332 -502 628 -435 -523
1602 -523 -213 -34 -173 -993 -227 -816 -22 -1347 -670 -252 -667 -699 -1555 76 -629 -985 -1150 -150 -421
1621 -421 -1120 -250 -918 -4 -895 -304 -673 -348 249 -1153 -406 -62 591 -1228 65 638 -11 -309 -266
1640 -266 935 -198 568 13 193 843 660 99 -187 1854 235 4 589 1360 812 -150 1434 655
1658 655 843 505 754 225 1151 1090 -534 939 777 732 -508 578 777 -55 159 -345 470 -221 247
1677B47r14P72J11j000J43K04N55j214N85J10k3p0n74M51k6P53j672R51O58q29
1697g82k34L18J090j556R86n22L92n4L26m19m83J989j628NP82N26j110J19J448
1716A193j412M84P8K02n64R61m71r83J962o74k52q07J670n32r68R99k01K01o91
1735A95R01r79Q57k18q69O41Q7M01j713J340J0j35m79l04J037p40J03j060J240
1754C15k65k67m78J79R68j318N18p29J053k97o61K41K05N78j567R21J11K36o71
1773i28q7O98k37N73j174R30k61M22l78l12J205o92J8o26J253k09l73K11K63M53
1793G49j283J221n24L19k36K41j11k4J118j568N91N08k36j061P47R71j477N29
1811D74N1M47j050P80j37q03J276r03j40k51J400j207q70J478k85o28j75R43p77
$$ plain form
1677 247 -667 105 216 -784 -641 -437 118 -1096 -511 -401 -424 -494 -1068 -617 -643 110 -1562 -611 47 -782
1697 -782 -1016 -698 392 -1164 -178 -700 -308 -362 -36 -455 -938 1051 -577 -572 210 736 -374 -255 1193
1716 1193 -219 265 343 545 -19 942 471 -512 1450 776 524 -283 1387 855 -113 886 685 886 195
1735 195 1096 117 974 756 -113 528 615 1016 -697 643 653 518 39 -265 772 32 135 -925 315
1754 315 50 -217 -695 -516 452 -866 -348 -1077 -24 -321 -982 -741 -536 42 -1525 -604 -493 -257 -928
1773 -928 -1015 -317 -554 19 -1155 -225 -486 -64 -442 -754 451 -241 -223 -849 404 195 -178 33 296 749
1793 749 -534 687 163 482 246 487 376 352 1470 -98 493 1001 765 -296 451 1422 -55 474
1811 474 525 972 -78 702 565 -238 1038 135 -5 -256 1144 -63 -933 545 260 -368 -543 400 -377
1830c77M39o11k40R70l79k02r52J673q39k64J44Q2L50p03N46m01P43l94m54QR76
1851A15j64j267J394k58J01j89m3R0J08O15j447J143L60m55o36P15O14j027L86
1870A55J65N06j205J049n68o1J098j083J33J35O85r38o8R45k00k52n20J356j226
1889A06N95n35J86K59m70N27j060J278m59m35j34M84k00p15P83m51O65j061L69
1908b68l0j02L27q45O45l89O45r15R2P04q66L66j81O92n58K80n34O49R8m94O30
1929e4p25J318j093J80N29k42N0l70N54k65O88p52L79K59N3n08l40J647j349J00
1949E9K66L13j48r4K20p58J245n36n04oJ079l20j334J309n1m00m37P56m10k0O20
1970H49j259P97M9K45j286P16N76r47o8K93L95j042P55q89O93J17p58L82l71R31
$$ plain form
1830 -377 62 -549 -789 181 -198 -400 -1352 321 -518 -782 -638 -556 -206 -909 -363 -764 -21 -415 -869 -861 115
1851 115 -49 -1316 78 -180 -79 -268 -311 -221 -113 502 -945 198 558 103 -533 182 796 -231 155
1870 155 320 826 -379 670 102 41 1139 56 189 324 1009 71 3 948 748 496 -24 1332 106
1889 106 701 166 352 611 141 668 -392 886 427 -8 -142 342 142 -573 210 -241 424 -637 -268
1908 -268 -298 -400 -73 -918 -273 -662 -17 -932 -840 -136 -1002 -636 -817 -125 -683 -403 -937 -288 -190 -684 -54
1929 -54 -779 539 -554 -374 155 -87 -37 -407 147 -118 570 -182 197 456 509 1 -339 1308 -41 59
1949 59 325 638 490 396 616 -142 1103 567 63 57 1136 816 -518 791 740 340 -97 659 249 229 849
1970 849 -410 387 436 681 -605 111 687 -260 -328 -35 360 -682 73 -816 -123 -6 -764 -382 -753 178
1990A78j111K51K80o9l51J29M72n97R63j234O37L05m30M4j71J309j223L29J22
2009a67M94m33j00L11k96Q55q79L78KO16m64n66R56k22op25R92l98J98M9o60R15
2031H50m39N5n54P61N4n13r9L79N55j284O05l27M75n0q11O61m14P89p83J75q1
2052DM86p15j87J009j152N35q26Q97k24l72J66k1L55m79K11p42R89m60k93M68
2072c51k31L18p63P55j79K33l80M4L76k39M73j004R93o1k51n3K12M25n80M01m38
2093c00P23k81p5Q5O9Q21j280P06R0R5n70L00L84m34N98p96M64k62N37n83l59
2114f8J088q30j46m1P96r62J85L91n02M13m62L67q22J141p50o09Q11n8j06p75
2134i39J155p28J63k10J59J81k41M94r59Q62r2l01l15O22R3o88N49l28O42n79
$$ plain form
1990 178 -933 -682 -402 -471 -822 -693 -221 -818 145 -1089 -452 -147 -577 -533 -704 605 -618 -289 -167
2009 -167 327 -106 -206 105 -191 664 -215 163 165 781 317 -249 707 485 479 -246 746 348 546 595 -65 850
2031 850 411 466 -88 673 727 214 115 494 1049 -235 370 43 518 468 -343 318 -96 693 -90 85 4
2052 4 490 -225 -412 597 -555 -20 -846 51 -173 -545 -379 -400 -45 -524 -313 -1055 -66 -526 -819 -351
2072 -351 -582 -264 -1027 -272 -451 -218 -598 -554 -178 -417 56 -948 45 -16 -267 -320 -108 317 -263 138 -300
2093 -300 423 142 67 152 221 1042 -238 468 558 653 83 383 767 333 931 135 599 337 874 291 -68
2114 -68 1020 190 44 3 799 -163 22 413 -89 324 -138 229 -593 548 -202 -811 0 -58 -164 -939
2134 -939 216 -512 -349 -559 -400 -219 -460 34 -925 -63 -155 -456 -771 -149 -56 -744 -195 -523 119 -460
2154d60Q8J87r2K60o45O42j29J70n62N87P9m39N21o62P86l47L14m63K80M42o56
2175i9L15r2P21q79L75J4J29J71m07M80n12N94p03l0M54J06k55o67J251p68J54
2196C52k27K34Pm17K83o74O14j99k16k95O63J36j055O72k14K81p87M74J21k79
2216e26K93n38N78k38J87m68J91L19m25J10q7Q74q76K81P4n1M16m33R9j86Q10
2237D04n44R4J91O9j14m19Q35k95J62n81M02J25j56L62q22R97l07r2k52M82n8
2258D83m48M70k70M26n55L38j97K85K56r41O99l62N38q47M58J05k79j17R2K52
2278C86n65N99p12K38J51j51l79j59R07q89J39Q9K43l17j45L11k73L97n46Q4J24
2299d68L45m32l73R11l55q3j46M74n6k71K29k21P34m02k7k24Q92l36l66L33rN50
$$ plain form
2154 -460 -372 -185 -277 -17 -662 -20 -149 21 -541 46 125 -314 207 -455 331 -16 298 -165 115 557 -99
2175 -99 216 124 845 -34 341 355 484 655 248 728 216 810 107 77 531 637 382 -285 966 198 352
2196 352 125 359 366 -51 232 -442 172 -27 -243 -538 125 261 -794 -122 -336 -55 -842 -368 -247 -526
2216 -526 -233 -771 -193 -431 -244 -712 -521 -202 -627 -517 -604 270 -606 -325 -251 -302 114 -319 -220 -406 404
2237 404 -140 -46 145 214 100 -319 516 221 383 -198 204 329 173 535 -287 710 403 311 59 541 483
2258 483 35 505 235 661 106 444 247 532 788 -153 546 184 722 -125 333 438 159 42 134 386
2278 386 -179 420 -292 -54 97 -54 -433 -592 315 -574 -435 -346 -103 -420 -565 -254 -527 -130 -676 -592 -468
2299 -468 -123 -555 -928 -17 -372 -455 -601 -127 -183 -454 -225 -446 288 -114 -141 -365 527 191 -175 158 149 699
2321F99r72P31k21K03N6n37L97p8M05r82Q51j00l16pM4N78o70N14o15M26r5j7
2343B94q7j8L89p03J40K16K12m85lK44j88K50n93N20k42L73l94m66P57m70%l32
2365e86O43k96m24L42j5J74p06Q50n73L38l0m50M20j7K66p50N29L04l59j85K49
2386b76L25k78M35q08N99J35j14J15j12O99q04K73j20P06o00l3J84k93R74q88
2406A19J12O0M88q46J19N58m08J69l65N39m43L64j16n51P36l51j70k46J033p70
2426C1r4J83J0O7n85O43o84O24j15l36J04J16m3n61P09l67L7l88M03J45m21L38
2448a84l78L30r2j5k26K56J54p46O54k28M91m42OL95j36K41n44O17j69K75o23
2469c64M14M17n14L59m69O12k36Q3j33K27L35m53k12K21N93p77K0M37k13J46m86
$$ plain form
2321 699 -273 458 237 440 496 -41 356 278 683 -299 552 452 136 129 173 751 81 595 -20 406 311 294
2343 294 207 189 578 -125 15 231 443 -42 -45 199 11 261 -332 188 -54 319 -75 -541 216 -254 -254 -586
2365 -586 57 -239 -663 -321 -336 -162 -868 -18 -591 -253 -283 -733 -313 -330 -64 -814 -285 19 -340 -525 -276
2386 -276 49 -229 206 -602 -3 132 18 133 21 720 -84 189 69 775 175 142 326 33 1007 119
2406 119 231 291 779 -67 52 610 202 371 6 545 102 466 350 -201 535 184 14 -232 801 31
2426 31 -63 120 130 197 -388 255 -429 195 80 -256 -152 -36 -79 -640 69 -298 -261 -649 -246 -101 -522 -184
2448 -184 -562 -232 -324 -339 -565 -309 -155 -901 -247 -475 16 -426 -420 -25 -161 80 -464 153 -16 259 -364
2469 -364 50 467 -47 312 -157 455 219 302 169 396 731 278 66 287 880 103 123 560 347 493 7
2490GN62l38P0j41J19M8K4q8n14P68m46J71j52%K54n13J47m3L15o57M63l80L62
2513C8j50l24M29l45L73o01K79J55j12j63k01P42o70N18l12p5K75l28K14k55O47
2534A34m24j23j26M40K6l27O52m04N26l82nl6J93K63n85N94j79J61n61M77m1j21
2556A52L41m22O00m47J06l96M81P3m15K00k0L51o90L79k3k34L69l55P9j71M50
2577D08p68K09N18n07j19j08P64o90J94j89J30k5j17J22k62N69n01J5q4K39jn65
2599g68O66l24K88j07mj23L42l45j13N53l42K34m92M53J26l36K45k24L98k06K46
2620A67l44O11k68l02K19K4L30o11M32J14q6n3O8J98k82M81q10P00m3k88r1j91
2642b5O91l83j47J5J54j10k03K59k43M08n94L23J1J11k38m77N51k15J16o34O36
$$ plain form
2490 7 569 231 301 160 279 327 351 263 -251 517 71 242 90 90 344 -169 -22 -65 250 -407 56 -324 38
2513 38 -112 -436 -7 -352 21 -580 -301 -146 -258 -421 -622 120 -550 -32 -344 -419 -144 -472 -258 -513 134
2534 134 -290 -413 -539 -99 -73 -400 252 -152 374 -8 -13 -49 144 407 -178 416 237 398 -163 314 273 152
2556 152 493 71 671 224 330 -66 415 488 73 273 253 604 -86 293 270 36 405 50 129 -42 408
2577 408 -360 -151 367 -140 -259 -367 397 -293 -99 -288 -158 -183 -300 -178 -440 129 -372 -357 -441 -202 -203 -768
2599 -768 -102 -426 -138 -245 -249 -372 -30 -375 -488 65 -277 -43 -535 -82 44 -292 -47 -271 127 -79 167
2620 167 -177 434 166 -136 83 107 437 -174 258 372 286 233 301 499 217 698 -112 588 545 257 166 -25
2642 -25 666 283 136 151 305 195 -8 251 8 416 -178 145 156 267 29 -448 103 -112 4 -630 6
2663Fk38N0L8m47O22l69P9l77O06j06m06J57J0L87n88M34k35K78n1k32J25J1M59
2686B13p98M66Q1J6j85K24J53l39L77k77K96k00J72n7k22N37l67J46l5N34o24
2707A11j06M89k89K40l21L50l36K78r6l58N58j80m8k13L94j18k69%n1K61k19K75
2729C52o21M95k09j69LM4J12m87N48k38K7k53N3M4j91M30o04N26o6r5j46K7M32
2752A4n76K80j79N61m22nr8R4L91n62L39k55P95m82j38M63j72J20m49P03l29M5
2774A38j8r7Q2J27J09n41O38j53q3k5K30J02o16N37k82L16k60k4R7l7K44n65K14
2797A33J30P2n59M76N6l27K93m45M22l34K51l53jN53o97K50l05N05n09K50k09
2818c48qL45n47M72m76O11k83k93M03j06j33k67P30l93N1q2J42J76k63K41m51
$$ plain form
2663 6 -232 -182 -144 -591 31 -338 -259 -636 -30 -136 -542 -385 -375 12 -576 -142 -377 -99 -150 -382 -257 -246 213
2686 213 -585 -119 -38 -22 -207 17 170 -169 208 -69 227 27 199 142 -80 457 90 236 201 735 111
2707 111 5 494 205 445 124 474 138 416 320 -38 520 340 292 79 473 355 86 86 35 296 77 352
2729 352 -269 226 17 -152 -149 -105 7 -480 68 -170 -143 -396 -343 -299 -490 -60 -664 -138 -204 -299 -445 -418 14
2752 14 -562 -282 -461 100 -322 -327 -425 -331 60 -502 -163 -418 377 -105 -243 220 48 168 -281 422 93 138
2774 138 120 23 105 232 341 -200 438 285 202 177 407 509 -107 430 148 464 204 180 277 240 484 -81 133
2797 133 263 335 -224 252 308 -19 274 -171 251 -83 168 -185 -186 367 -330 -80 -385 120 -389 -139 -348
2818 -348 -356 -11 -558 -86 -562 49 -234 -527 -124 -230 -363 -630 100 -293 -242 -324 -182 -6 -269 -28 -479
2839d79O98m20K5p2K95O3n07P59l17J82l80J96M4J69J81m13M15k79M24p40N69
2860D13J17n19L31k1K45m57L30j70K26P2o29K00M1L36p28L46P1j08M2k51N73o39
2882a79L16l12J66J20j05j14k80Q55p45j5j4K45j84k30L85m88O81o11K33j48L67
2903e7j05m75N47j80N3k28M07j61J6j3m40O77j53Q2n11N61K58m42J89n3L27l78
2925g9M35l78K86o1j67J82k3L50n13K19J26K4j83l5L01k58K53m18K02L9M6m6k77
2948B5M69m30J03j85M39l24j89K76j05K23p40N77j51J45k83k69M59k05J47n96
2968f14O29l0l05k8PN32o03J29k22K42M6j43j12M6N10p44N44l4K64k87j61M43
2990A09m66M78l31K95k64L18j97p3M67n29K67j44M64l32M8K84l00L72j89J25n26
$$ plain form
2839 -479 219 -201 -176 -248 47 110 -397 362 45 227 -153 43 87 256 437 24 439 160 584 -156 413
2860 413 530 11 342 321 566 109 439 269 495 567 -62 138 179 515 -213 133 204 96 138 -113 460 -179
2882 -179 137 -175 -9 111 6 -108 -388 467 -278 -293 -307 -62 -246 -476 -91 -579 102 -509 -276 -424 -57
2903 -57 -162 -637 -90 -270 -217 -445 -38 -199 -183 -196 -636 41 -112 -30 -541 20 278 -164 25 -28 299 -79
2925 -79 356 -22 264 203 36 218 195 545 32 251 377 401 218 183 484 226 479 61 263 302 348 302 25
2948 25 494 64 167 -18 421 97 -92 184 79 302 -438 139 -12 133 -150 -419 40 -165 -18 -614
2968 -614 15 -15 -320 -348 -341 191 -412 -283 -505 -263 -217 -360 -472 -426 84 -660 -116 -150 114 -173 -334 109
2990 109 -357 121 -210 85 -179 139 -58 -131 336 -193 74 -70 394 62 110 394 94 466 277 402 -124
3011a24O81l51j93N09l93K21l08M13j94p6L8Q0m1k00M71o88N07j59k24O3J51Q9
3033B72n73K50j16K18j71N4j61J43K77n91L39j65M9k70M6J53j96O3o2J83j94M16
3055c6l46j79P27m25P8j60M45l46k6J40M9J18k49L37m38N71k96l4K27J5N6m69
3077b41P23k30l9j11R5J83k57K34l71M53j81Q8l10L32J67m81K71l70K98l40L45
3098B58N8j23L8m28M54k67R6k72J49L33n00L21l17M51o54L99l13J35J83l59J72
3119a86k39M69m24n2K50J08K8n16O44l44P0r7L8Q9q7P2l01N68j94P1l10L06J17
3142H0k82K46l03N46l93K4oL07J36n58N62k16Q3l00K95K60k96J23j65K82l51M55
3164E29m71K73R1k50p4q3O76p85L82l9Q1Q4m13L43n33O54o51K22R6o0j41k88N70
$$ plain form
3011 -124 557 206 13 522 129 350 42 455 261 185 223 303 262 62 533 -155 352 193 -31 32 183 272
3033 272 -301 -51 -167 51 -120 -66 -227 -84 193 -398 -59 -224 -175 -445 -399 -246 -442 -379 -441 -258 -452 -36
3055 -36 -382 -561 166 -259 -181 -341 104 -242 -268 -128 -79 39 -210 127 -311 260 -36 -70 157 172 228 -241
3077 -241 482 252 213 102 197 380 123 357 -14 439 258 346 36 368 535 54 325 -45 253 -87 258
3098 258 316 193 231 -197 257 -10 86 -186 -37 296 -204 117 -200 251 -403 -4 -317 -182 1 -358 -186
3119 -186 -425 44 -380 -432 -182 -74 -46 -562 82 -262 -192 -289 -251 -162 -249 -177 -478 90 -104 -33 -343 -37 80
3142 80 -202 44 -259 287 -106 -82 -88 219 355 -203 359 143 226 -74 221 481 185 308 143 425 74 529
3164 529 58 331 422 172 98 15 691 -94 288 249 330 414 1 344 -189 465 -186 36 132 72 -69 -357 213
3187B13l77K77m52M41k34j14L69o46N00l60J55P9J23j17l22K83k93L79m57L52
3207b01n3J80P1m49N27m02M52m29K17k5Q6l8p8M14l52K56k93K71l7j39Lj02N08
3230C87m93K12j65N17k71j66L54k25K09m44K70j78K59J2j93L02j08k5l57N07k13
3251A91j14J55k09L06l34K32l87L26k2m25K01J22K37n65K70K7O3j73j77J74j24
3272b26J17l44K15jQ8l84J73L30k74K05j56K02j61J7M1j39M68l71R3J09N9k72
3294b11l13P00n2m9k65M43m77L54k42j3N96m88K22l20M64j56k06K98j20J82k15
3315A32J52k85K87k9j66P7n7J68l84L74P2j26k36J61J71j69K20n80M77j19j17
3336B3j76R8K06m06K55k07L30m35J15J07j45K14m28L78k96J72p7o6K53j17J06
$$ plain form
3187 213 -164 113 -339 102 -132 -246 123 -523 -23 -383 -228 -149 -26 -143 -465 -182 -475 -96 -553 -201
3207 -201 -254 -74 -3 -452 75 -327 125 -304 -87 -112 -26 -64 -142 272 -80 176 -117 154 117 -22 -19 -121 387
3230 387 -106 106 -59 458 187 21 375 150 359 -85 185 7 266 278 85 387 279 254 -103 404 191
3251 191 77 232 23 329 -5 227 -160 166 144 -281 -80 42 279 -286 -16 11 74 -99 -276 -102 -226
3272 -226 -109 -453 -238 -239 -151 -535 -362 -32 -306 -101 -257 -55 -216 -199 -158 -297 171 -200 -107 2 61 -211
3294 -211 -524 176 124 75 -190 253 -224 130 -112 -125 471 -17 205 -115 349 193 -13 285 165 347 132
3315 132 284 -1 286 257 91 168 111 279 -105 269 341 215 -21 140 311 142 362 -218 259 140 23
3336 23 -153 -55 151 -255 0 -207 123 -312 -197 -90 -235 -21 -449 -71 -367 -195 -272 -338 -85 -202 -96
3357i6k97L49k14Q4j48O1L74l15J15k55L65j20Q0j27K49j4m08N75l53L94k72j3
3379A4K62k51L06k84O1K7J19k00RL72l59K80k98L85m91J39K1M7J50k13J22r6J71
3402B93l12J54K26k31J14m08M21k62K5j05k6J98k13J39m84O72k00q5k17R5J33
3423g3j98J46p6R7k54J36mPK83n31L46q7N8j46J09M1J35p7j87N5k03M01j20j16
3447b58M77l69K64p9J67k26K8J89r2J12j76K38o7K03l34N5K97l11j75J6M63k14
3469B08jo4q0K88j25l7l43N35j07j76M0J7J2k92L81k07k1q1K20j09m5M3k25J06
3493f3N9O7l66K67p2q2J17j61L09n59L95k01O9J25k69K40k72M21m56J88J01r6
3515b39J2o0M54n09M17l63J08J03RQ1k14M74l67K57j64J13J55r6j06j15L47k30
$$ plain form
3357 -96 -393 -44 -258 -174 -322 -261 113 -202 -87 -342 23 -97 -17 -144 105 91 -317 258 -95 299 27 14
3379 14 276 25 331 47 108 135 254 54 63 435 76 356 58 443 -48 91 112 159 309 96 218 122 293
3402 293 -19 135 361 130 244 -164 257 -5 20 -85 -111 87 -126 13 -471 201 1 -84 -301 -206 -73
3423 -73 -271 -125 -201 -104 -358 -222 -226 -219 64 -467 -121 -208 -150 -296 -187 -146 -11 -88 -275 -220 -423 -22 -142 -258
3447 -258 219 -150 114 35 202 -24 4 193 101 213 37 275 208 411 77 132 429 118 -57 -41 422 208
3469 208 207 143 63 351 226 189 -154 381 274 98 138 155 167 -125 256 49 28 -53 167 58 13 56 -169 -63
3493 -63 -4 63 -303 -36 -108 -190 -73 -234 75 -484 -89 -290 -221 -96 -365 -125 -397 24 -432 -244 -143 -239
3515 -239 -227 -287 167 -342 75 -288 -180 -77 -68 13 -201 273 -94 163 -1 112 267 171 65 -50 297 67
3537F7K06j63M18l18k54M67k82J19l71M27q6n1M6l07L03O1o4j30Q3K37m35J07
3559H0j86L18l95L30j19J05k28m5K46l48K93k80J77J1O6j36p3J69j65J52m83L45
3581a66j65J66P0k92M90l06kM2K65m17J56J67j23M6k20L83r8k3J07j99K61j41
3603AK54m17M33k10n3R5j4L41m05L45l93K57k6j43O2P8J55k68J02m7N9q8N3O6
3627B37j86J00k60K64j8o1p8o9K94k65O7k09L42l33R7j08m2K53k32R1p2J65j16
3650a39j81J54j4J81l60J61j0J39k19N0L6J49Rl03K50q0l1l5J3L87l03N5n4J67
3674B2n2j55K43o4K34l24K21r4K92j72r1J48jm1j72M27k58J61o1j41K45l35J79
3697B11o5K47q9k99K99r1M2l95L68k38K68j79q9K59k35J13m20M32j12N2n6L0l1
$$ plain form
3537 67 273 110 528 210 -44 423 141 260 -111 316 230 179 225 -82 221 282 218 88 171 408 -27 80
3559 80 -106 212 -183 147 28 133 -95 -140 106 -242 51 -229 -52 -41 25 -111 -184 -15 -180 -28 -511 -166
3581 -166 -331 -165 -95 -387 103 -203 -205 -163 102 -315 -159 8 -115 -69 -289 94 -4 -27 80 -119 142 1
3603 1 255 -162 271 61 8 103 89 430 25 370 -23 234 208 65 127 205 360 92 194 147 206 118 171 237
3627 237 51 151 -109 155 137 76 -2 -71 223 -42 25 -184 158 -175 -78 -186 -228 25 -207 -116 -188 -23 -139
3650 -139 -320 -166 -180 1 -359 -198 -208 -69 -288 -238 -202 -53 -44 -347 -97 -177 -208 -243 -230 157 -146 -91 -145 22
3674 22 -30 -185 58 -6 228 -96 125 31 323 151 60 208 207 166 -6 421 163 324 263 122 367 32 211
3697 211 146 393 304 5 304 213 255 -140 228 -10 258 79 -10 249 14 127 -293 139 27 79 23 53 22
3720B2l58K73j77J24OJ38l30K15R2l31K65j33M2m9L9k9l1R1j70J27j47K66j32
3743a87n4L14j88K03l93M12k53K44j04j14M33l38K15j42J76k5j98K06j27O3j95
3764e2L35j76j30J44p6O7m5J70j98K91k14K10k86J25R1l11K05k36M13j75l5j93
3786g6R5L9p2K18l08K05l46J66kQ4j32j58K58j7k3j54J65J09l56J93j50K77k42
3809b27p1J45j6L9j83J94N4P1l01K00J15j57P1j45K29O0j30j55J65j0r0L30k53
3832f5L00l10K47k13J19J34k78J55n7P9j17L40m5j11N8l50M05k0l7k41K2N0J15
3855A80q4p0J93k27J01l18K14J09k25J22j51L85k88K61l20K14k47k9P2j50K65
3876Go7j09R9j16J89k84K87j25M6l25L64j12q9K97l38K61l55M33k49Q4j53N1K32
$$ plain form
3720 22 -336 -63 -240 -116 -110 28 -302 -87 5 -326 -61 -194 -152 -201 -162 -191 -222 -131 -301 -174 -321 -55 -187
3743 -187 -241 73 -115 88 -305 107 -146 98 -6 -120 313 -25 190 48 224 199 1 207 80 143 -52
3764 -52 283 107 -23 121 45 112 67 237 39 330 116 326 40 165 256 -55 150 -86 327 152 117 -76
3786 -76 19 58 -14 204 -104 101 -245 -79 -81 3 -129 -287 -29 -46 -69 -223 -58 51 -305 -112 -262 15 -227
3809 -227 -298 -153 -169 -130 -313 -119 -65 6 -295 -95 20 -137 -66 -211 18 78 -52 -207 -42 -52 -142 188 -65
3832 -65 235 -75 172 -41 78 212 -66 89 32 111 -6 334 289 178 236 -114 291 271 234 -7 15 65 180
3855 180 96 26 219 -8 93 -225 -11 98 -127 -5 -156 229 -59 202 -118 96 -151 -180 -108 -258 7
3876 7 -60 -169 -70 -186 3 -281 6 -119 -73 -398 -34 -146 -235 62 -276 -15 -370 63 -186 -102 -255 -204 28
3899B8rK10n24L85j69J22j48P5J81j13J68l23L17n6RN7j01K30k24P3m1J2J09j66
3923A02J58k5M3k61K17k42K90l58L7K79k87L02l06J19k39K83l7j34J53k16J8j66
3945b70L39k01j6R6q2Jn6J15p9J20j76J4R0J57K8n23M61j67k7m8P8J33p8J77l02
3970b16J00Q2n1J00j39L85l75P5J11J75k05N5j9j2J23j33O7o4K65j88N9Q9j94
3993I0R9j08M31m57j4J54j15J11j46K27k78K91j82j16J87k7M1j76Q0j99K48j25
4015A6k25L46j34L2k14K56j65J77k32R1O8k05Q8j91K12j28k6K5J2J97k60J25p8
4038b13L03l62J3J78j31J67l77O03m17L40j82k22M35k01J47j24K45k11N6J30j34
4059D3J80k47R5j25L03j73J79j18o3L2j37J73j05K70k43J10K3j25K4J34J1Oj11
$$ plain form
3899 28 19 229 -295 90 -79 43 -105 -30 151 38 206 -117 200 144 153 210 109 339 115 188 147 159 268 102
3923 102 260 235 278 17 234 -8 282 -76 -39 240 -47 255 -51 68 -171 112 75 -59 94 -122 -104 -270
3945 -270 69 -132 -148 -52 -134 -133 -189 -74 -153 -33 -209 -195 -105 52 80 -443 18 -149 -176 -224 -146 -13 -91 86 -216
3970 -216 -116 -34 -85 15 -124 261 -114 -39 72 247 42 97 78 66 189 56 123 59 324 136 195 284 90
3993 90 189 81 512 55 41 195 80 191 45 272 -6 285 103 -13 174 147 188 12 92 -107 141 16
4015 16 -209 137 3 35 -179 77 -88 89 -143 -52 16 -189 -101 -292 -80 -208 -234 -209 -197 0 -260 -135 -213
4038 -213 90 -272 -259 -81 -212 -45 -422 181 -236 104 -78 -300 135 -66 81 -43 202 -9 47 177 43
4059 43 223 -24 71 -54 249 76 255 137 74 106 -31 142 37 307 64 174 197 72 96 230 241 247 136
4082A36j92K14O3k31L1j06J86o2j1j3r7J34m02L91j79J80j67J53j20l6p4n0P9
4105a73M7K20l40J15m9j20J71j00K83k71J3J25J5j5k30M67l13J86k79K53p6O8
4127cj27R3Q6j51L43l11J58j55K25j41j60K66n7O2M6l8J59k50Q0j27K80j90R9
4150A87q0K08k55q5L70l01K37m14K58m6j45J71k18L45k22pn3K30j34j74K26l29
4172b31L41k71N9m8l4M5r0J62k09L46j24k2l9k1J51l89L20p5N7k40K39O1k61J74
4196i9K6K00j56J38l99L62rj47J57j58K41k79K46r0K02j58j26L35k45J89k78K38
4218A90j1j7n4p1J23q9J6m3PJ16j6j4k12L02l01K82j82N5p9o6J27m3J41l71K14
4243Dk00L5K4R3J55k52J96k07K01j93N7kr9J00j16N3Q7Q3j70J75n4k89M20k79
$$ plain form
4082 136 -56 158 221 -10 21 -85 101 39 28 15 -82 52 -350 41 -138 42 -125 28 -92 -128 -202 -252 -173
4105 -173 -126 94 -246 -131 -180 -300 -129 -229 54 -217 -204 -79 -64 -79 -309 158 -155 31 -248 5 -71 -3
4127 -3 -130 -37 49 -102 241 -70 88 -67 158 17 -143 123 66 128 174 136 295 45 125 -2 278 88 187
4150 187 107 315 60 -25 345 44 281 -133 125 79 -66 105 -113 232 10 3 -50 180 46 -128 98 -231
4172 -231 110 -161 -102 -150 -184 -139 -229 -67 -276 70 -54 -76 -115 -136 15 -374 -54 -129 -72 -312 -73 -12 -273 -99
4196 -99 -73 127 -29 109 -290 72 63 -84 73 -85 156 -123 123 33 235 77 -49 286 41 230 -48 190
4218 190 179 162 108 37 160 71 87 44 51 167 151 137 -75 227 -74 208 26 81 2 -64 63 20 161 -210 4
4243 4 -196 -161 -137 -44 111 -141 55 -152 49 -144 -87 -89 -188 -88 -204 -151 -64 19 -151 24 -30 -319 101 -178
4267a78J90j44J44j8k40K71k49K50j75M06j62j08K7J1nj91L58q9L1j53mK64j56
4290H0n4j44L76k86J42mp5P6r7R0k10K47q6O8j4K09j72j69J00j1O9j21m5m5Q2
4315FLr8J65j19K8Jk05J52j2Oj56K87l44J60j50J01L73k03j18j5J37j78L5O6n7
4340a35J05p3J3J3J3j82J79J17j63J90k78L75l69R8R1N4J03k1m4r0K06n9m0q1
4364B2K25k2l08J65m7K15k93J57r3O1N9j90L35k11N0j07K0M9j09J03o0J36j73
4387a6K44k83R9k2j42J28j37K33l67M11k65J28o9j27L11k33J57k66J34Q8k02J56
4409d0o4J50j46O4k12K11J27l44K58r8J73k64O5L2M5J38q2j93M7K30j70J72j72
4432g3R3J55l71L70j1K5l01K91J2j04j6n5J54j43J13k08J75J19j84L0K4J87k79
$$ plain form
4267 -178 12 -132 12 -6 -246 25 -224 26 -149 257 95 -13 14 25 20 -171 187 98 129 -24 -28 236 80
4290 80 26 -118 258 -28 114 110 35 111 14 104 -106 141 55 123 109 318 146 -23 77 66 135 14 -31 -76 6
4315 6 9 -89 76 -43 -15 -14 -219 -67 -79 -73 -229 58 -286 -126 -276 -175 198 -5 -123 -138 -1 -179 -144 -78 -135
4340 -135 -30 -103 -90 -77 -64 -246 -67 50 -113 77 -201 174 -195 -97 -6 48 151 130 86 -4 202 143 103 22
4364 22 247 225 -83 82 35 250 -43 114 21 82 141 -49 286 75 125 18 38 87 -22 81 21 157 -16
4387 -16 228 -55 44 22 -120 8 -129 104 -263 148 -117 11 -58 -185 126 -107 50 -216 -82 6 -196 -40
4409 -40 -104 46 -100 -36 -248 -37 90 -254 4 -94 79 -185 -120 -88 -43 95 13 -180 -133 97 -73 99 -73
4432 -73 20 175 -196 174 163 188 -113 178 190 86 70 15 169 26 139 -69 106 225 41 71 95 282 3
4455CQ9J48j82j2p5K36j92j06J71o1j66K55j88l9J71r7QR6K1j99R3Q6k53K50k38
4480a81l6J91p9O9j33K14k06K37k94J6K06P2k84J08Kj91K69j77J47J04o5j4q7
4503a12J60j46P3P7p1j9M9J92k47K18l04K81k08Q7J6j27L44l91L73k39J33n2J02
4526A89l6j22J70k96K09k9J22j93ql7mQ5j28J46j17J38k81M2M10l07J54k99J50
4549d2j0n0J5J10L0j96J42j74K57j38J01k75J31J36m50L87O5j44q5OJ05j2J33
4572D2j55J83j35Q5j24O6K19j94nl0N9L2j51K11p1O6j79K63j22L3q8P6j25L9J69
4597A64p9J78n2j77J38K2j02p5K14k20J10mj2N2n4L3k07J74k81J17j5K92k04j24
4621a12J09j99J52j21K77k52O1M0j05Oj65M31k35J60j55M2j12J15J69l90L41l84
$$ plain form
4455 3 92 240 58 46 -29 207 15 -91 80 19 -147 108 -80 -119 52 -45 -37 59 80 -119 -26 60 -193 57 -181
4480 -181 -217 -26 -105 -36 -169 45 -161 76 -218 -202 4 76 -208 -100 -98 -289 -20 -197 -50 54 -11 -25 -112
4503 -112 48 -98 -25 52 -19 -38 11 203 -44 174 -130 151 -57 30 46 -81 263 -128 245 6 139 87 189
4526 189 153 31 201 -95 114 85 207 14 6 -31 -35 50 -78 68 -49 89 -192 -150 260 -47 107 -192 -42
4549 -42 -52 -102 -87 23 53 -143 -1 -175 82 -56 45 -230 -99 37 -413 -26 39 -105 -190 -184 -79 -91 42
4572 42 -113 70 -65 20 -104 -38 181 -13 -18 -48 11 43 -108 103 32 98 -81 182 60 93 5 81 -44 -5 164
4597 164 85 263 211 34 172 194 92 17 231 11 121 117 105 157 103 136 -71 103 -178 -61 -76 216 12 -112
4621 -112 -3 -202 -50 -171 106 -146 -85 -45 -150 -144 -309 122 -113 47 -108 -66 -178 -63 106 -284 57 -327
4643c27J61J48J2k9j21K28j99Q6l2j39K81l7q3o4L27k32m1J84j81J62m0K05k62
4666GJ54l21J12J8L6O6k23L76j61K00k60J11K38l00r7j4L31k39O8j41J71K0k26
4689g4L31l34K52j77J23n5q1l0j81J57k16L94j18j13jJ3Q7l50N08j66K1q5K36
4712A41j83n2N6K1R0j07J3k04K51J85l69J69j84K76p4m7m6J22M2j49J58n8K04
4735B55j66RJ43j24n9k7J32j16J92j49J7j8j1Q6k46M15j76J4L2j12Mj10J14j09
4759a0J96k06RJ3M2Q8r4P2j16k4p8J19M2j26o5j02J61M5j08j19L49l33J58N3k31
4784b65K61k77K59m3j01P0O2m2j53J47L4l0m3J65j55N4j4J2K9l3K88l03NJ23q2
4809c2J95j59R0Ql0qk6J14j66J22j40L64k38N9K1j60L16l01J69j30K76l04P0j58
$$ plain form
4643 -327 -166 -18 -6 -35 -156 72 -127 -41 -73 -212 69 32 -51 -115 212 -20 -61 123 -58 104 64 269 7
4666 7 161 -160 -48 -30 6 72 -151 225 64 264 4 115 353 53 -44 -58 273 34 102 -39 132 152 -74
4689 -74 257 -77 175 -2 121 66 -15 -45 -226 -69 -285 109 -9 -122 -123 -110 -23 -373 135 -31 -10 -95 141
4712 141 -42 -94 -38 -17 73 -34 -21 -225 26 211 -158 11 -173 103 29 -18 -64 58 100 -49 109 51 255
4735 255 89 98 241 117 58 31 163 47 239 90 107 89 78 164 -82 333 157 171 203 91 95 -15 99 -10
4759 -10 186 -20 -11 2 44 132 38 110 -6 -30 -108 11 53 -73 -138 -240 -79 -34 -142 -261 88 -245 -87 -34 -265
4784 -265 -4 -281 -22 -65 -166 -96 -34 -76 -229 -82 -48 -78 -121 44 -111 -57 -71 -59 -30 -63 225 -78 -73 50 -32
4809 -32 163 4 94 102 72 64 38 152 -14 108 -32 332 94 153 174 14 330 29 198 68 344 40 110 -48
4833d8J76J3k38K79j88J23j44j7mn6K35k19m0nQ7k6j03K30k21M1j57K50nk08O8
4858a77j04L52k76J01j71L31j79n0J63j39J08k89K92k37K16r3r1J66RJ08j18N9
4880a9l5J12Mm5J20o2Q5j00K41j33j97J49j4lj04J38Q3j43J15l9k63J59K42k55
4904C6J01k40K28k3j58K04k43J31P8J04l37J31k7J72q5j21J29j43J23j63j2P1
4926d4j85J90j21J72j03R5k32J41N2j94M1J32J3k01J99j71J94O7r4J02k40J99
4948A2j42P5j15Q6J03l3J55k01J47r1J06o2J47Ml05J66l5o3J77J95j96p8K12k47
4972A7L23k20N9j11j6J93k06k7L6J00j93K18j06l0or2K54k55J84j32Q7j95m9K69
4996A02l48L88k92J00j7Q3j7r3J90l96K64j90K20j05l5L4j26J13j96L29k12J60
$$ plain form
4833 -48 128 141 -97 182 -6 117 -27 -44 -48 -104 131 -88 -128 -133 -46 -72 -175 55 -166 -125 -282 -32 -37 -245 -177
4858 -177 -281 71 -205 -104 -275 56 -123 -173 -10 -149 -41 -330 -38 -275 -59 -152 -243 -77 -68 40 -78 -19
4880 -19 -54 58 62 17 137 75 160 60 301 168 -29 120 106 103 -1 137 220 77 192 153 -110 49 291 36
4904 36 137 -103 125 102 -56 148 -95 36 114 218 -119 12 -15 157 72 -49 80 -63 60 -103 -115 -44
4926 -44 -229 -39 -160 12 -91 4 -228 -87 -35 -229 -188 -56 -43 -244 -45 -216 -22 45 -49 53 -187 12
4948 12 -130 -55 -170 -84 19 -14 141 -60 87 -4 102 40 187 191 -114 52 17 -46 131 326 130 52 264 17
4972 17 340 120 179 68 52 245 39 12 48 148 -45 173 67 37 31 -61 193 -62 122 -10 77 -118 -167 102
4996 102 -246 142 -150 -50 -67 16 -1 -94 96 -300 -36 -226 -6 -111 -146 -112 -238 -125 -321 8 -204 -44
5018d4J08l62J64l2K21k10J90r7o9J88l84K35j40L15j25R8q5Q0m4Q6j7j44L94
5041C26l57K07q1P5p4LP6k09J49k1R4kj66P1J0J06j63Q4P0mm08K52RP2Nj82J37
5068G9o9q0J03j90J60Q7j40l9J30m2j58J1N4qn0J57L1j3k56pJ33j7J92l69J40
5093a61L7J22j33j6J06p2k3k04M20j52m1R3m4J24k09L22k36PN6L0J5K8k9j49K53
5118A44j57K25j11j11K10o1K9j28J59k28K17p1k4R7k94L16j83J61j48m0P7m1K03
5141B41k99K62l05J78k36J53Q8p3P7l08J13O5O1q2jMJ4k2P2N0j98N2j24N4J27
5166c7k19K73j56J54r6q9l2J57K01m36K60kK3P6j3j30JQ2p8J03k87M10j00k51
5190a86K75j08J25j77K40jp2p6J07J2j59K03k5K4n6j67J79n7Q0k35K51j62Q0o4
$$ plain form
5018 -44 64 -298 -134 -166 55 -155 35 -62 -131 57 -327 -92 -232 83 -42 56 -29 51 7 93 76 -68 326
5041 326 -31 176 95 170 96 99 175 -34 115 94 188 186 20 91 101 207 44 128 198 194 -214 38 47 119 124 -58 79
5068 79 10 -70 33 -157 3 90 -50 -89 41 -1 -159 -148 -94 -102 -152 5 36 23 -233 -240 -107 -124 68 -301 -161
5093 -161 -124 -2 -135 -151 -45 -117 -140 -344 76 -76 -117 -24 -68 56 -153 169 -67 -60 -4 26 41 69 40 -109 144
5118 144 -13 212 101 -10 200 139 168 40 199 -29 188 117 93 190 -104 212 29 190 42 2 79 38 241
5141 241 -58 204 -101 77 -159 -6 82 9 86 -222 -109 -44 17 -65 -66 -62 -48 -70 2 52 -146 -94 -218 -164 -37
5166 -37 -256 17 -139 15 -81 -170 -202 -45 156 -280 -20 -22 1 77 64 -66 -65 17 -61 42 -245 165 65 -186
5190 -186 89 -19 106 -71 169 168 96 20 127 139 -20 183 158 182 126 -41 138 81 161 -74 177 15 95 31
5214C1N1Mj24J54j30J9k70K82n3k5J48k83J31l0K08l58J84m8l3J77l27L73j93
5237a12N3j80K35lo4M7j17m5qL0M1oP8j23J22k8J02j1k20K49K6j12j2K05l1j31
5263a5n0P7N1j6P5j60J53pj35R0J48j57j00J98j39J53j32Q0N2p6Q0j19P3K7o6
5288H5j37O9J44k73K96k31K02j12j06l3K33k62J5j15J11K20l64J78j36J46Q2k06
5310a94J59q8j07Q9J11k11O7J11k0n4j52J71m6L8J85L9q9j35K32j65K00k28J77
5333I0j0j96L79k16O4l50L90m2n5J37k54K03k9q8J33Q2j31o1R7j1J78k65J73k03
5357A5K79k69N8L4j74K98k10j03J0R3k8q6K8p4K41k90J12P5r4R7j79K31l56L21
5381B9j78k9J52p3o2l8K32m21L47j09M5j22L9J67j57J28j50J73l41K54l3J37Q
$$ plain form
5214 31 82 86 -38 116 -14 5 -265 17 -36 -61 87 -196 -65 -95 113 -245 -61 -109 -142 35 -292 81 -112
5237 -112 -59 -239 -4 -7 -71 -24 -141 -186 -194 -164 -123 -129 -51 -174 -52 -80 22 11 -209 40 66 -46 -58 147 116 -15
5263 -15 -65 12 63 47 122 -38 115 108 -27 63 211 54 -46 152 13 166 34 114 166 90 170 51 124 151 85
5288 85 -52 17 161 -112 184 -47 155 43 -63 -96 137 -125 -110 -225 -114 106 -258 -80 -216 -70 12 -194
5310 -194 -35 -123 -230 -141 -30 -241 -174 -63 -83 -137 -289 -118 -164 -126 59 98 9 -126 106 -59 141 -87 90
5333 90 80 -116 263 47 111 -239 151 109 54 191 -63 140 111 23 156 238 107 46 143 132 310 45 218 15
5357 15 294 25 83 117 -57 241 31 -72 -62 31 3 -83 -55 -129 112 -178 -66 9 -85 12 -167 64 -292 29
5381 29 -149 -178 -26 -99 -161 -199 33 -388 -41 -150 -105 -227 -188 -21 -178 -50 -200 -27 -368 -114 -147 -10 -2
5404bq3J46j21k2J18j01K18k05J67r9M6o4p7L7n0J49m9L01m10J54R3%j64m6K11
5429A47j06J80l16O2N6rP3j5J05j48Q1k38L51j39M3n9l7N2l46K48Q3j11r8L7N5
5454d9mJ29j92K72k29O2Lj26K21k72P9k58M91j89M8q0j15J78k85M78j20k2n0q3
5478a13p5J92K8k94K43n1J29j23J43n7m0J94j51N6j35J18m4J78o5j79K07j64J68
5501A65j27J22mJ7j08j50K68n2J73m36K87p8j27J65k72K69j41J42j96L4P4j24
5523i9M4j58M70m36K13j2n0j18n9K30j71K95j56j38J02j09n6P1J21j92R2P9j67
5546b04K22j28k5j69K88j80K45j81J11J57k29j6j38K93j12P2J57j19J4Ml1R1j5
5569A07j28J51o8%M3j31K41l38K48j46K42m2j79J82k32K11j52nJ8j14K03r1R4
$$ plain form
5404 -2 -85 61 -60 -82 36 -65 153 -52 115 16 62 -2 -79 -42 -92 57 8 309 -101 53 146 146 -18 -64 147
5429 147 41 221 -95 -33 23 14 87 72 177 29 110 -128 223 84 127 68 31 83 -263 -15 68 -43 -141 -104 -49
5454 -49 -53 76 -116 156 -73 -11 -8 -134 87 -185 -106 -364 127 -62 -14 -94 -209 -31 -316 162 42 20 -30 -113
5478 -113 -188 4 32 -262 -19 -70 59 -64 79 22 -18 176 25 81 -54 64 20 198 133 -46 161 -3 165
5501 165 38 160 156 173 65 -85 183 131 304 -132 155 77 -50 115 -157 112 -29 113 -83 -49 25 -99
5523 -99 -55 -213 257 -179 34 22 -28 -146 -205 25 -146 149 -7 -145 -43 -152 -208 -137 -16 -208 -116 -37 -204
5546 -204 18 -110 -135 -304 -16 -196 49 -132 -21 136 -93 -109 -247 46 -66 6 163 44 58 62 31 122 107
5569 107 -21 130 62 62 105 -26 215 -123 125 -21 221 179 0 182 -50 161 9 4 22 -92 111 20 114
5592A14j27K7l9J03j39L8j24J9J53q6Q8k68K20j66J22P8j63K07k43O7pP7r5j35
5616b79J54o4L56n70M09J22p4l77J67J73j80K43k95J16O0j11k6J41J55j70P2j15
5638i3J71j42r7K50P1o8j42J69k5J40k76N9L38k71Q9l46L94j93P0L2j16J99j81
5661C2J08r0M5R0j32Q2j04N5J12J3n5r9j50m4J74p8L3l40M02m0j65J47j31K35
5685A00j68m6j4R1k9l5O8k27K91j86m2J43p8l6J41r0q3K93k87K36j02k2r5R9L49
5710B71m41K05n4J52o6%j05l7K01j47L03k38J11j20O1k0J45R4l31K95j08l3j11
5733B7kK67j98N4l6N4m6p0R6j51K60l40J80k9J0k76Q8J09j00P5k51K15r5J13q9
5758a35p3K23j93K57l21K13j61R0K37k81J61k34J97k24K26j50K5nK27m8j76K93
$$ plain form
5592 114 -13 14 -25 78 -61 -23 -147 -128 25 -61 27 -241 -21 -187 -65 13 -150 57 -186 -119 -126 -49 -144 -279
5616 -279 -125 -189 167 -403 6 128 54 -323 -156 17 -163 80 -215 -99 -39 -150 -176 -35 120 -50 22 -93
5638 -93 78 -64 -161 89 160 92 -50 119 94 234 -42 17 355 84 173 -173 221 28 98 130 14 213 32
5661 32 140 50 95 185 53 135 31 86 198 211 156 57 -93 -137 37 -41 -8 -348 54 14 -151 -4 -135 100
5685 100 -68 -114 -128 -37 -66 -101 -33 -260 31 -155 -197 -54 -132 -168 -27 -117 -200 93 -194 42 -60 -82 -177 -78 271
5710 271 -170 35 -19 133 67 67 -38 -75 126 -21 282 44 155 35 96 76 221 315 -16 279 171 138 27
5733 27 25 292 94 148 112 166 120 50 146 -5 255 -85 95 66 76 -200 -112 -3 -103 -28 -279 -64 -159 -46 -135
5758 -135 -208 15 -178 79 -242 -29 -190 -100 137 -144 17 -217 -20 -244 -18 -168 -143 -148 79 31 -145 148
$$ [...]
8191B5
##END NTUPLES=NMR FID
##END=
