##TITLE=1H_EC-3252(III-2)
 CDCl3,8 sc, 
 7.04.2021
##JCAMPDX= 6.0         $$ Bruker NMR JCAMP-DX V2.0
##DATA TYPE= NMR SPECTRUM
##DATA CLASS= NTUPLES
##ORIGIN= UXNMR, Bruker Analytische Messtechnik GmbH
##OWNER= root
$$ XWIN-NMR		Version 3.5
$$ Wed Apr  7 11:16:25 2021 Russian Standard Time (UT+4h)  she@DPX200
##.OBSERVE FREQUENCY= 200.131506
##.OBSERVE NUCLEUS= ^1H
##.ACQUISITION MODE= SIMULTANEOUS
##.ACQUISITION SCHEME= undefined
##.AVERAGES= 8
##.DIGITISER RES= 18
##SPECTROMETER/DATA SYSTEM= spect
##.PULSE SEQUENCE= zg30
##.SOLVENT NAME= CDCl3
##.SHIFT REFERENCE= (INTERNAL, CDCl3, 0, 15.9709)
##AUDIT TRAIL= $$ (NUMBER, WHEN, WHO, WHERE, WHAT)
$$ ##TITLE= Audit trail, XWIN-NMR		Version 3.5
$$ ##JCAMPDX= 5.01
$$ ##ORIGIN= Bruker BioSpin GmbH
$$ ##OWNER= she
$$ F:/spectra/data/she/nmr/H-F/1/pdata/1/auditp.txt
$$ ##AUDIT TRAIL=  $$ (NUMBER, WHEN, WHO, WHERE, WHAT)
(   1,<2021-04-07 11:15:01.62 +0400>,<she>,<DPX200>,
      <created by zg, POWCHK disabled, PULCHK disabled
       configuration hash MD5:
       00 E9 B6 7A A2 85 ED C7 34 08 36 98 17 FE 4E 26
       data hash MD5: 16K
       85 C4 2F A0 63 51 8D EC 5D 43 B3 E3 2A 70 1E EE>)
(   2,<2021-04-07 11:15:04.29 +0400>,<she>,<DPX200>,
      <Start of raw data processing
       efp BC_mod = 2 LB = 0.24 FT_mod = 6 PKNL = 1 PHC0 = -11131.7 PHC1 = 22.40092 SI = 16K 
       data hash MD5: 16K
       5B 27 C7 DF A7 03 F2 EC CE 41 16 EF B9 01 84 CC>)
(   3,<2021-04-07 11:15:19.56 +0400>,<she>,<DPX200>,
      <pk PHC0 = 3.241827 PHC1 = 0 
       data hash MD5: 16K
       A3 5B A5 13 3C 04 C9 07 99 57 67 D0 F2 3E 05 0E>)
(   4,<2021-04-07 11:15:22.85 +0400>,<she>,<DPX200>,
      <abs ABSG = 5 
       data hash MD5: 16K
       4C D9 83 D3 66 FC 20 D7 2B 68 07 CD 3A 50 CB 38>)
(   5,<2021-04-07 11:15:37.15 +0400>,<she>,<DPX200>,
      <pk PHC0 = -0.4035456 PHC1 = 0 
       data hash MD5: 16K
       72 44 63 80 8C EC 8D AB 04 A8 92 39 C0 6E 12 4F>)
(   6,<2021-04-07 11:15:40.60 +0400>,<she>,<DPX200>,
      <abs ABSG = 5 
       data hash MD5: 16K
       08 E8 3E BF 8B 67 76 B2 A3 BC 9F C5 0F C4 14 3E>)
$$ ##END=
$$ 
$$ hash MD5
$$ 19 2B 98 9C 7B 85 A9 48 6C 94 DF 3F 8A AC 51 54
##$RELAX= 
##$RELAX= 
##$RELAX= 
##$RELAX= 
##$RELAX= 
##$RELAX= 
$$ Bruker specific parameters
$$ --------------------------
##$DU= <F:/spectra>
##$EXPNO= 1
##$NAME= <H-F>
##$PROCNO= 1
##$TYPE= <nmr>
##$USER= <she>
##$AMP= (0..31)
100 100 100 100 100 100 100 100 100 100 100 100 100 100 100 100 100 100 
100 100 100 100 100 100 100 100 100 100 100 100 100 100 
##$AQSEQ= 0
##$AQ_mod= 1
##$AUNM= <au_zg>
##$AUTOPOS= <>
##$BF1= 200.13
##$BF2= 200.13
##$BF3= 200.13
##$BF4= 200.13
##$BF5= 200.13
##$BF6= 200.13
##$BF7= 200.13
##$BF8= 200.13
##$BYTORDA= 1
##$CFDGTYP= 0
##$CFRGTYP= 5
##$CHEMSTR= <none>
##$CNST= (0..31)
1 1 145 1 1 1 1 1 1 1 1 1 1 1 1 1 1 1 1 1 1 1 1 1 1 1 1 1 1 1 1 1 
##$CPDPRG= <>
##$CPDPRG1= <>
##$CPDPRG2= <>
##$CPDPRG3= <>
##$CPDPRG4= <mlev>
##$CPDPRG5= <mlev>
##$CPDPRG6= <mlev>
##$CPDPRG7= <mlev>
##$CPDPRG8= <mlev>
$$ [...]
##$SUBNAM3= <"">
##$SUBNAM4= <"">
##$SUBNAM5= <"">
##$SUBNAM6= <"">
##$SUBNAM7= <"">
##$SUBNAM8= <"">
##$SUBNAM9= <"">
##$SW= 16.9725357007746
##$SWIBOX= (0..15)
0 0 2 0 0 0 0 0 0 0 0 0 0 0 0 0 
##$SW_h= 3396.73913043478
##$TD= 16384
##$TD0= 1
##$TE= 0
##$TE2= 300
##$TE3= 300
##$TEG= 300
##$TL= (0..7)
0 120 120 120 120 120 120 120 
##$TP= (0..7)
150 150 150 150 150 150 150 150 
##$TP07= 0
##$TPNAME0= <>
##$TPNAME1= <>
##$TPNAME2= <>
##$TPNAME3= <>
##$TPNAME4= <>
##$TPNAME5= <>
##$TPNAME6= <>
##$TPNAME7= <>
##$TPOAL= (0..7)
0.5 0.5 0.5 0.5 0.5 0.5 0.5 0.5 
##$TPOFFS= (0..7)
0 0 0 0 0 0 0 0 
##$TUNHIN= 0
##$TUNHOUT= 0
##$TUNXOUT= 0
##$USERA1= <user>
##$USERA2= <user>
##$USERA3= <user>
##$USERA4= <user>
##$USERA5= <user>
##$V9= 5
##$VALIST= <valist>
##$VCLIST= <CCCCCCCCCCCCCCC>
##$VD= 0
##$VDLIST= <DDDDDDDDDDDDDDD>
##$VPLIST= <PPPPPPPPPPPPPPP>
##$VTLIST= <TTTTTTTTTTTTTTT>
##$WBST= 1024
##$WBSW= 4
##$XGAIN= (0..3)
0 0 0 0 
##$XL= 0
##$YL= 0
##$YMAX_a= 531047
##$YMIN_a= -553144
##$ZGOPTNS= <>
##$ZL1= 120
##$ZL2= 120
##$ZL3= 120
##$ZL4= 120
##$ABSF1= 15.99889
##$ABSF2= -0.973774
##$ABSG= 5
##$ABSL= 3
##$ALPHA= 0
##$AQORDER= 0
##$ASSFAC= 0
##$ASSFACI= 0
##$ASSFACX= 0
##$ASSWID= 0
##$AUNMP= <proc_1d>
##$AZFE= 0.1
##$AZFW= 0.1
##$BCFW= 0
##$BC_mod= 2
##$BYTORDP= 0
##$COROFFS= 0
##$CY= -3
##$DATMOD= 1
##$DC= 0
##$DFILT= <>
##$DTYPP= 0
##$F1P= 0
##$F2P= 0
##$FCOR= 1
##$FTSIZE= 16384
##$FT_mod= 6
##$GAMMA= 0
##$GB= 0
##$INTBC= 1
##$INTSCL= 2.992141e-10
##$ISEN= 128
##$LB= 0.24
##$LEV0= 0
##$LPBIN= 0
##$MAXI= 10000
##$MC2= 0
##$MEAN= 0
##$ME_mod= 0
##$MI= 1.114404
##$NCOEF= 0
##$NC_proc= -7
##$NLEV= 6
##$NOISF1= 3.799351
##$NOISF2= 2.8
##$NSP= 0
##$NTH_PI= 0
##$NZP= 0
##$OFFSET= 15.97092
##$PC= 1
##$PHC0= -11128.86
##$PHC1= 22.40092
##$PH_mod= 1
##$PKNL= yes
##$PPARMOD= 0
##$PSCAL= 0
##$PSIGN= 0
##$REVERSE= no
##$SF= 200.1300081089
##$SI= 16384
##$SIGF1= 3
##$SIGF2= 2
##$SINO= 5.538805
##$SIOLD= 16384
##$SREGLST= <1H.CDCl3>
##$SSB= 0
##$STSI= 16384
##$STSR= 0
##$SW_p= 3396.73913043479
##$SYMM= 0
##$S_DEV= 0
##$TDeff= 16384
##$TDoff= 0
##$TI= <>
##$TILT= no
##$TM1= 0
##$TM2= 0
##$TOPLEV= 0
##$USERP1= <user>
##$USERP2= <user>
##$USERP3= <user>
##$USERP4= <user>
##$USERP5= <user>
##$WDW= 1
##$XDIM= 16384
##$YMAX_p= 475331950
##$YMIN_p= -839352
$$ End of Bruker specific parameters
$$ ---------------------------------
##NTUPLES= NMR SPECTRUM
##VAR_NAME=  FREQUENCY,     SPECTRUM/REAL,   SPECTRUM/IMAG
##SYMBOL=    X,             R,               I
##VAR_TYPE=  INDEPENDENT,   DEPENDENT,       DEPENDENT
##VAR_FORM=  AFFN,          ASDF,            ASDF
##VAR_DIM=   16384,         16384,           16384
##UNITS=     HZ,            ARBITRARY UNITS, ARBITRARY UNITS
##FACTOR=    0.207333158178282, 1,           1
##FIRST=     3196.26027086973, 0,            0
##LAST=      -200.478859565056, 0,           0
##MIN=       -200.478859565056, -839352,     0
##MAX=       3196.26027086973, 475331950,    0
$$ Real data points
##PAGE= N=1
##DATA TABLE= (X++(R..R)), XYDATA
$$ [...]
$$ plain form
5184 6063843 6368336 6850888 7019592 6920117 7190467 7324657 7135325 7322654 7042196 6974061
5174 6974061 6960277 6774304 6500500 6307380 6329665 6550719 6328509 6392850 6744545 6898591
5164 6898591 6846479 7224104 7464492 7699359 7923626 8060122 8327632 8831338 9019840 8597207
5154 8597207 8518446 8464777 8329440 8587882 8611144 8676848 8362499 8094715 8449785 8591892
5144 8591892 8636139 8569003 8654800 8630318 8919592 8933504 8970015 8849047 8992799 9390321 9711069
5133 9711069 9931787 10018332 10053107 10405126 11187419 11544322 12016890 11943578 12313253 12452237
5123 12452237 12102856 11887033 10998342 10491948 10119291 9858477 9747699 9792661 9498996 9285711
5113 9285711 9108461 9160104 8910369 8994550 9318027 9327074 9248715 9752662 9900995 9787942
$$ packed form
5184F063843L04493M82552J68704r9475K70350J34190j89332J87329k80458o8135
5174F974061j3784j85973k73804j93120K2285K21054k22210O4341L51695J54046
5164F898591n2112L77625K40388K34867K24267J36496K67510N03706J88502m22633
5154H597207p8761n3669j35337K58442K3262O5704l14349k67784L55070J42107
5144H591892M4247o7136Q5797k4482K89274J3912L6511j20968J43752L97522L20748
5133I711069K20718Q6545L4775L52019P82293L56903M72568p3312L69675J38984
5123A2452237l49381k15823q88691n06394l72657k60814j10778M4962k93665k13285
5113I285711j77250N1643k49735Q4181L23477R047p8359N03947J48333j13053
$$ plain form
5103 9787942 10098078 10284345 10295362 10761846 10936097 11363221 11447476 11220245 10995349 11085231
5093 11085231 11239199 11050195 11013646 11001363 10620890 10084249 9976603 9556647 9521399 9412562
5083 9412562 9756395 9693415 9843089 10064889 9979720 9985610 10133706 10468755 10662371 10593777
5073 10593777 10801108 11405561 11813316 11814773 12011457 12580537 12601353 12945120 13106856 13210976
5063 13210976 13360741 13581334 13945074 14208282 14512972 14729664 14910722 14984457 14389218 14206172
5053 14206172 13903101 13251703 12992298 12810958 12779002 12889258 12910408 12784325 12789240 12625529
5043 12625529 12867957 12866627 13066108 13707254 13957332 14020429 14133286 14508349 15169890 15713100
5033 15713100 16126795 16456501 16813154 17591578 18340350 19127907 19935241 20574321 21395009
$$ packed form
5103I787942L10136J86267J1017M66484J74251M27124Q4255k27231k24896Q9882
5093A1085231J53968j89004l6549j2283l80473n36641j07646m19956l5248j08837
5083I412562L43833o2980J49674K21800q5169N890J48096L35049J93616o8594
5073A0593777K07331O04453M07755J457J96684N69080K0816L43767J61736J04120
5063A3210976J49765K20593L63740K63208L04690K16692J81058P3735n95239j83046
5053A4206172l03071o51398k59405j81340l1956J10256K1150j26083M915j63711
5043A2625529K42428j330J99481O41146K50078O3097J12857L75063O61541N43210
5033A5713100M13695L29706L56653P78424P48772P87557Q07334O39080Q20688
$$ plain form
5024 21395009 21726156 22060989 22182272 21701453 21099730 20151881 18959427 18248933 17460276
5015 17460276 16876287 16198924 15790868 15099024 14995930 14807650 14740400 14724373 14325147 13986399
5005 13986399 14117726 14187062 14194192 14426547 14442245 14325237 14784307 15443082 15811885 16293199
4995 16293199 16776442 16977270 17517361 18097346 18744516 19306750 19776442 19733758 19274106 19074115
4985 19074115 18146422 17639462 16930793 16104553 15464302 15072983 14921705 14488631 14161622
4976 14161622 14055346 13586649 13517944 13530959 13818671 13676644 13452895 13350205 13258836 12922836
4966 12922836 12721436 12753455 12672329 12703697 12785795 12564211 12888761 13136751 13083609 13431206
4956 13431206 13990180 14019829 13923110 13834047 14102075 14004744 13774126 14010670 13787210 14041852
$$ packed form
5024B1395009L31147L34833J21283m80819o01723r47849j192454p10494p88657
5015A7460276n83989o77363m08056o91844j03094j88280o7250j6027l99226l38748
5005A3986399J31327O9336P130K32355J5698j17008M59070O58775L68803M81314
4995A6293199M83243K00828N40091N79985O47170N62234M69692m2684m59652j99991
4985A9074115r27693n06960p08669q26240o40251l91319j51278m33074l27009
4976A4161622j06276m68697o8705J3015K87712j42027k23749j02690r1369l36000
4966A2922836k01400L2019q1126L1368Q2098k21584L24550K47990n3142L47597
4956A3431206N58974K9649r6719q9063K68028r7331k30618K36544k23460K54642
$$ plain form
4946 14041852 14380689 14405983 14353549 14883744 15250096 15531375 15693496 15971202 16335936 16487122
4936 16487122 16761741 17039006 17344311 17506836 17863707 17967591 18115956 18209917 18278588 18458808
4926 18458808 18675788 18616255 18789540 18850642 19221648 19881684 20366504 20830441 21482191 21928450
4916 21928450 22814214 23495342 24666100 25688259 26139924 26588103 26359011 25955084 25341168
4907 25341168 24617773 23722367 23187272 22665402 22048744 21567368 21335376 21174448 21142917 21096389
4897 21096389 20969567 21011620 21226850 21715002 22190805 22847365 23420969 23822570 24477060 25447616
4887 25447616 26690846 27852865 29214543 30533518 32185673 33946540 35845739 37397710
4879 37397710 38754655 39555329 40087569 40021117 39526067 38528089 37145740 35099943 33432698
$$ packed form
4946A4041852L38837K5294n2434N30195L66352K81279J62121K77706L64734J51186
4936A6487122K74619K77265L05305J62525L56871J03884J48365R3961O8671J80220
4926A8458808K16980n9533J73285O1102L71006O60036M84820M63937O51750M46259
4916B1928450Q85764O81128J170758J022159M51665M48179k29092m03927o13916
4907B5341168p23395q95406n35095n21870o16658m81376k31992j60928l1531m6528
4897B1096389j26822M2053K15230M88152M75803O56560N73604M01601O54490R70556
4887B5447616J243230J162019J361678J318975J652155J760867J899199J551971
4879C7397710J356945Q00674N32240o6452m95050r97978j382349k045797j667245
$$ plain form
4870 33432698 32019469 30102624 28511763 27015358 25673159 24409117 23600643 22865653
4862 22865653 22361169 21837247 21650941 21501487 21510374 21898274 21692843 21908212 22296083 22882072
4852 22882072 23171221 23902249 24715412 25533676 26095431 27112345 28312399 29082057 29838781
4843 29838781 30325171 30424556 29889153 29121499 28155269 27051741 26157274 25212989 24113307
4834 24113307 23281235 22857558 22096937 21390096 20652722 19760599 19085858 18654092 17880578
4825 17880578 17327545 16919581 16205395 15832400 15525421 15203531 14893717 14775063 14281309
4816 14281309 14379885 14231558 14179456 13876585 13518101 13415480 13204770 13186162 13368183 13717387
4806 13717387 13749580 14081794 14224089 14288770 14403694 14540494 14888876 14785465 14538127 14676033
$$ packed form
4870C3432698j413229j916845j590861j496405j342199j264042q08474p34990
4862B2865653n04484n23922j86306j49454Q887L87900k05431K15369L87871N85989
4852B2882072K89149P31028Q13163Q18264N61755J016914J200054P69658P56724
4843B9838781M86390R9385n35403p67654r66230j103528q94467r44285j099682
4834B4113307q32072m23677p60621p06841p37374q92123o74741m31766p73514
4825A7880578n53033m07964p14186l72995l06979l21890l09814j18654m93754
4816A4281309R8576j48327n2102l02871l58484j02621k10710j8608J82021L49204
4806A3717387L2193L32214J42295O4681J14924J36800L48382j03411k47338J37906
$$ plain form
4796 14676033 14522994 13565573 12841425 12297553 11461398 11009734 10808654 10457514 10118654
4787 10118654 9679679 9360564 8913036 8530528 8390313 8286633 7858064 7883640 7682776 7538050
4777 7538050 7647294 7468561 7301311 7505872 7534870 7845573 7862921 7692866 7511254 7174819
4767 7174819 6809243 6754680 6841373 6815339 6797609 6712870 6497357 6747257 6626081 6298878
4757 6298878 6143875 6128122 6204492 6162745 6182208 5956222 5995249 6160459 6113123 5958152 5957883
4746 5957883 5946887 5971910 5805781 5888101 5989107 5673037 5531093 5660176 5608507 6007987
4736 6007987 5775884 5523376 5500515 5605775 5735192 5932511 5809414 5905855 6204205 6084484
4726 6084484 5849947 5875569 6015523 5836996 5753860 6101871 6108244 5969832 6328188 6709073
$$ packed form
4796A4676033j53039r57421p24148n43872q36155m51664k01080l51140l38860
4787A0118654m38975l19115m47528l82508j40215j03680m28569K5576k00864j44726
4777G538050J09244j78733j67250K04561K8998L10703J7348j70055j81612l36435
4767G174819l65576n4563Q6693k6034j7730q4739k15513K49900j21176l27203
4757F298878j55003j5753P6370m1747J9463k25986L9027J65210m7336j54971k69
4746E957883j0996K5023j66129Q2320J01006l16070j41944J29083n1669L99480
4736F007987k32103k52508k2861J05260J29417J97319j23097R6441K98350j19721
4726F084484k34537K5622J39954j78527q3136L48011O373j38412L58356L80885
$$ plain form
4716 6709073 6827110 6850158 6850070 6758219 6695743 6310040 6159218 6085478 6212071 6086712 5937931
4705 5937931 5913874 5966078 6043795 6032841 5952124 5948531 6035297 5901527 5872770 5821385 6191981
4694 6191981 6215149 5837365 6108281 6088876 5851802 5825049 5794117 6066605 6060058 5492254 5454388
4683 5454388 5481037 5654533 5754444 5866832 5934242 5902336 5854371 5931381 6256453 6497019 6454729
4672 6454729 6537548 6497109 6299838 6185442 6302619 6190181 5953759 6241225 6294061 6037364
4662 6037364 6040968 6096770 5862821 6083557 6369837 6334096 6198873 6242508 6047536 6190455
4652 6190455 6564935 6762454 6693943 6648456 6630264 6414150 6375615 6511262 6604822 6708472
4642 6708472 6719256 6812944 6852610 7173184 6937210 7011535 6965147 7063779 6945108 7308822 7378665
$$ packed form
4716F709073J18037K3048q8r1851o2476l85703j50822p3740J26593j25359j48781
4705E937931k4057N2204P7717j0954q0717l593Q6766j33770k8757n1385L70596
4694F191981K3168l77784K70916j9405k37074k6753l0932K72488o547n67804l7866
4683E454388K6649J73496R9911J12388O7410l1906m7965P7010L25072K40566m2290
4672F454729Q2819m0439j97271j14396J17177j12438k36422K87466N2836k56697
4662F037364L604N5802k33949K20736K86280l5741j35223M3635j94972J42919
4652F190455L74480J97519o8511m5487j8192k16114l8535J35647R3560J03650
4642F708472J0784R3688L9666L20574k35974P4325m6388R8632j18671L63714O9843
$$ plain form
4631 7378665 7383192 7443543 7411090 7223513 6963857 7135038 7203462 7326872 7511644 7550535 7511649
4620 7511649 7428770 7287851 7369930 7792967 7683733 7838699 8020490 8055668 8275559 7935310
4610 7935310 8198463 8230325 8371267 7906323 7849370 8172144 8527377 8535550 8318042 8537481
4600 8537481 8537988 8658637 8895401 9087781 9148612 9388210 9598793 9758195 9960251 10007824
4590 10007824 10147904 10289701 10530566 10656869 10608582 10515689 10758314 10977208 11227601 11296364
4580 11296364 10973299 10681582 10735017 11055472 11296874 11347496 11718656 11621458 11624568 11843430
4570 11843430 11971791 12123945 12174692 12060459 11941145 12060770 11995789 12454179 12521588 12074943
4560 12074943 12454087 12371827 12312318 12557739 12847797 12876444 13201312 13449447 13744101 13985161
$$ packed form
4631G378665M527O0351l2453j87577k59656J71181O8424J23410J84772L8891l8886
4620G511649q2879j40919Q2079M23037j09234J54966J81791L5178K19891l40249
4610G935310K63153L1862J40942m64944n6953L22774L55233Q173k17508K19439
4600H537481N07J20649K36764J92380O0831K39598K10583J59402K02056M7573
4590A0007824J40080J41797K40865J26303m8287r2893K42625K18894K50393O8763
4580A1296364l23065k91717N3435L20455K41402N0622L71160r7198L110K18862
4570A1843430J28361J52154N0747j14233j19314J19625o4981M58390O7409m46645
4560A2074943L79144q2260n9509K45421K90058K8647L24868K48135K94654K41060
$$ plain form
4550 13985161 14196756 14532601 14049024 14085945 14507851 14832414 15027968 15157596 15598751 15949860
4540 15949860 16345426 16957992 17318392 17828298 18631362 19097834 19248390 19120775 19113970 19396205
4530 19396205 19742259 20093709 20578306 21422419 22410759 22926745 23573913 23861110 24313218
4521 24313218 24410318 24856616 24965074 24784678 24841472 25151218 25534244 26256451 26844442 27574833
4511 27574833 28645624 29552323 30831116 32061073 33594183 35433953 37498008 39681932
4503 39681932 42173592 45034627 48148729 51114095 54341379 57718385 60992742 64706244
4495 64706244 68433815 72232230 75849180 78942145 81618541 83183018 84090861 83966554
4487 83966554 82708885 80380028 77520871 74121440 70528193 66957269 63077894 59202775
$$ packed form
4550A3985161K11595L35845m83577L6921M21906L24563J95554J29628M41155L51109
4540A5949860L95566O12566L60400N09906Q03064M66472J50556j27615o805K82235
4530A9396205L46054L51450M84597Q44113R88340N15986O47168K87197M52108
4521B4313218R7100M46298J08458j80396N6794L09746L83026P22207N87991P30391
4511B7574833J070791R06699J278793J229957J533110J839770K064055K183924
4503C9681932K491660K861035L114102K965366L227284L377006L274357L713502
4495F4706244L727571L798415L616950L092965K676396J564477R07843j24307
4487H3966554j257669k328857k859157l399431l593247l570924l879375l875119
$$ plain form
4479 59202775 55747163 52575970 49631696 46659621 44368465 42340819 40539747 39115335
4471 39115335 37863810 36751175 36282004 35670972 34667989 33479855 32705883 31897529 31171164
4462 31171164 30364822 29326332 28247957 27588436 26542227 25767339 25125724 24648060 24202587
4453 24202587 23878773 23007864 22363958 21331555 20497663 19597920 18891619 18353784 17673466
4444 17673466 17454232 17285971 16925800 16609573 16436129 16113820 16006403 15939887 15653549 15868851
4434 15868851 15689402 15532851 15744497 15750431 15640585 15262223 15243725 15154763 15231248 15300957
4424 15300957 15518637 15393830 15540457 16003046 15717794 15469249 15180280 14874073 14967618 14665550
4414 14665550 14666321 14700535 14796068 14839749 14878965 14848005 15349952 15391563 15528885 15278877 15382654
$$ packed form
4479E9202775l455612l171193k944274k972075k291156k027646j801072j424412
4471C9115335j251525j112635m69171o11032j002983j188134p73972q08354p26365
4462C1171164q06342j038490j078375o59521j046209p74888o41615m77664m45473
4453B4202587l23814q70909o43906j032403q33892q99743p06301n37835o80318
4444A7673466k19234j68261l60171l16227j73444l22309j07417o6516k86338K15302
4434A5868851j79449j56551K11646N934j09846l78362j8498q8962P6485O9709
4424A5300957K17680j24807J46627M62589k85252k48545k88969l06207R3545l02068
4414A4665550P71L4214R5533M3681L9216l0960N01947M1611J37322k50008J03777
$$ plain form
4403 15382654 15458299 15873926 16485200 16667906 16781793 17279802 17665637 18015507 18614947 19358456
4393 19358456 19874539 20853712 21656264 22835748 23788482 24979877 26628490 28135893 30015829
4384 30015829 31893084 33335564 33748148 33302219 31833443 29947172 27663916 25352919
4376 25352919 23474753 21851653 20674974 19815657 19252233 18661859 17996709 17442885 16717930
4367 16717930 16107133 16060811 16162247 15761107 15246066 14844020 14636498 14457588 14435116 14265305
4357 14265305 13997883 13784675 13637147 13813663 14069677 14146481 14057031 13829948 13681282 14012125
4347 14012125 14372290 14620103 14467615 13896500 13682264 13773500 13688125 13350104 13182517 12761682
4337 12761682 12448476 12328384 12486744 11986059 11751457 12222555 12120328 12228212 12386685
$$ packed form
4403A5382654P5645M15627O11274J82706J13887M98009L85835L49870N99440P43509
4393A9358456N16083R79173Q02552J179484R52734J191395J648613J507403J879936
4384C0015829J877255J442480M12584m45929j468776j886271k283256k310997
4376B5352919j878166j623100j176679q59317n63424n90374o65150n53824p24955
4367A6717930o10797m6322J01436m01140n15041m02046k07522j78910k2472j69811
4357A4265305k67422k13208j47528J76516K56014P6804q9450k27083j48666L30843
4347A4012125L60165K47813j52488n71115k14236R1236q5375l38021j67587m20835
4337A2761682l13206j20092J58360n00685k34602M71098j02227J07884J58473
$$ plain form
4328 12386685 11883800 11850890 12062476 11843367 12151363 12251857 11933692 11696185 11588888 11517838
4318 11517838 11198243 11276259 11191660 10996138 10808283 10545831 10853760 10791028 10692374 10539782
4308 10539782 10220149 10190270 10412812 10688229 10963134 10846863 10768087 10834371 10812396 10759215
4298 10759215 10659925 11197867 11136581 11102557 11158389 10873627 10648975 10909086 11017796 11048392
4288 11048392 10568791 10480284 10865110 11138037 11445645 11626227 11669265 12114647 12434488 13075662
4278 13075662 13643155 14228490 15487615 16648059 17758261 19110669 20649477 21002836 19759254
4269 19759254 17708525 15981526 14478425 13588818 12792064 12156256 11915738 11879355 11701293
4260 11701293 11677320 11392090 11455764 11284252 11316360 11393359 11321312 11656016 11574009 11838599
$$ packed form
4328A2386685n02885l2910K11586k19109L07996J00494l18165k37507j07297p1050
4318A1517838l19595P8016q4599j95522j87855k62452L07929o2732r8654j52592
4308A0539782l19633k9879K22542K75417K74905j16271p8776O6284k1975n3181
4298A0759215r9290N37942o1286l4024N5832k84762k24652K60111J08710L0596
4288A1048392m79601q8507L84826K72927L07608J80582M3038M45382L19841O41174
4278A3075662N67493N85335J259125J160444J110202J352408J538808L53359j243582
4269A9759254k050729j726999j503101q89607p96754o35808k40518l6383j78062
4260A1701293k3973k85230O3674j71512L2108P6999p2047L34704q2007K64590
$$ plain form
4250 11838599 11840877 11786138 12045569 12186757 12642346 13188179 13332887 13193298 13157868 13292195
4240 13292195 13304109 13318211 12956580 12855516 12938316 12468746 12181791 11968547 11714448 11767734
4230 11767734 11627851 11300975 11061427 11067737 11116081 11058549 11006015 11022227 11044023 10966695 10742044
4219 10742044 10796848 10756377 10851658 10954158 10803186 10924240 10660852 10450570 10359342 10215303
4209 10215303 10697694 10620392 10237954 10228716 10464052 10532702 10723945 10937307 11014529 11027500
4199 11027500 11036102 11208157 11188528 11209662 11329048 11600161 11755184 11876662 11772139 11684262
4189 11684262 11417301 11445719 11326016 11619422 11753493 11592904 11897573 12524671 13298488 13614856
4179 13614856 13898091 14172204 14269753 13923799 13232513 12464734 12118627 11711586 11705513 11538241
$$ packed form
4250A1838599K278n4739K59431J41188M55589N45833J44708j39589l5430J34327
4240A3292195J1914J4102l61631j01064Q2800m69570k86955k13244k54099N3286
4230A1767734j39883l26876k39548O310M8344n7532n2534J6212K1796p7328k24651
4219A0742044N4804m0471R5281J02500j50972J21054k63388k10282r1228j44039
4209A0215303M82391p7302l82438r238K35336O8650J91243K13362P7222J2971
4199A1027500Q602J72055j9629K1134J19386K71113J55023J21478j04523q7877
4189A1684262k66961K8418j19703K93406J34071j60589L04669O27098P73817L16368
4179A3614856K83235K74113R7549l45954o91286p67779l46107m07041o073j67272
$$ plain form
4169 11538241 11248273 11120925 11271633 10996401 10854057 10887557 10942032 11006390 10932773 10955511
4159 10955511 10613563 10184610 10052903 10101786 10030779 10190169 10188755 10003588 10066184 10138072
4149 10138072 9876913 9460325 9562103 9731358 9564054 9584387 9682080 9692728 9459164 9324831
4139 9324831 9251111 9250481 9566105 9461134 9202541 9384387 9347813 9386227 9552282 9859817 9467616
4128 9467616 9765846 10301846 10365351 10455546 10614408 10571338 10717706 11059655 11285037 11229815
4118 11229815 11173326 11329731 11449887 11277577 11347346 11635543 11849333 11754300 11864334 12058734
4108 12058734 12049098 11626895 11340133 11289547 11409483 11401918 10926013 10649639 10511706 10748290
4098 10748290 10697347 10607541 10534101 10294284 10083664 10159713 10219166 10381126 10274595 9972868
$$ packed form
4169A1538241k89968j27348J50708k75232j42344L3500N4475O4358p3617K2738
4159A0955511l41948m28953j31707M8883p1007J59390j414j85167O2596P1888
4149A0138072k61159m16588J01778J69255j67304K0333R7693J0648k33564j34333
4139I324831p3720o30L15624j04971k58593J81846l6574L8414J66055L07535l92201
4128I467616K98230N36000O3505R0195J58862m3070J46368L41949K25382n5222
4118A1229815n6489J56405J20156j72310O9769K88197K13790r5033J10034J94400
4108A2058734r636m22203k86762n0586J19936p565m75905k76374j37933K36584
4098A0748290n0943q9806p3440k39817k10620P6049N9453J61960j06531l01727
$$ plain form
4088 9972868 10143440 10318044 10453654 10821633 10830513 10701489 10975202 11336357 11465854 11397975
4078 11397975 11475714 11372190 11095943 10945487 11001828 10807301 10684598 10606355 10118164 10287030
4068 10287030 10405196 10026205 9938723 9741699 9634863 9424723 9393167 9564327 9480743 9467277
4058 9467277 9290732 9099894 9157950 9256218 8991241 8949735 8767476 8424874 8539768 8548882
4048 8548882 8688796 8628172 8559267 8760759 8453866 8548785 8690399 8685419 8732702 8801228 8813016
4037 8813016 8874810 9068343 9075997 9219914 9368240 9239941 9003807 9084078 9457275 9106260
4027 9106260 9046769 9267983 8843083 9006812 9158002 9132886 9045139 8934191 9022128 8882500
4017 8882500 8724218 8838152 8996805 9038897 9230911 9256717 9632892 9700920 9746592 10156559
$$ packed form
4088I972868J70572J74604J35610L67979Q880j29024K73713L61155J29497o7879
4078A1397975P7739j03524k76247j50456N6341j94527j22703p8243m88191J68866
4068A0287030J18166l78991q7482j97024j06836k10140l1556J71160q3584j3466
4058I467277j76545j90838N8056R8268k64977m1506j82259l42602J14894R114
4048H548882J39914o0624o8905K01492l06893R4919J41614m980M7283O8526J1788
4037H813016O1794J93533P654J43917J48326j28299k36134Q0271L73197l51015
4027I106260n9491K21214m24900J63729J51190k5116q7747j10948Q7937j39628
4017H882500j58282J13934J58653M2092J92014K5806L76175O8028M5672M09967
$$ plain form
4007 10156559 10406045 10444843 10842495 11232949 11215247 11172273 11427937 10943479 10845690 10846389 10597068
3996 10597068 10502275 10772053 10795820 10531224 10298856 10473666 10244029 10169979 10029723 9969410
3986 9969410 9924395 9722425 9616882 9566769 9591706 9501817 9638962 9675609 9583204 9781859 10157040
3975 10157040 9933549 10212822 10481166 10518574 10355363 10560092 10825670 10720296 10793143 10647901
3965 10647901 10379597 10812226 10944291 11078952 11265518 11455115 11572002 11438001 11605577
3956 11605577 11570621 11396462 11270812 11233218 11193710 11177070 11608085 11586694 11872408 11903368
3946 11903368 11996341 12041197 11955706 12278137 12473683 12337005 12427465 12783779 12945219 12885041
3936 12885041 13110317 13181043 13294180 13242467 13084702 12813424 13124054 13343099 13336395 13312455
$$ packed form
4007A0156559K49486L8798L97652L90454j7702m2974K55664m84458r7789O99k49321
3996A0597068r4793K69778K3767k64596k32368J74810k29637p4050j40256o0313
3986I969410m5015k01970j05543n0113K4937q9889J37145L6647r2405J98655L75181
3975A0157040k23491K79273K68344L7408j63211K04729K65578j05374P2847j45242
3965A0647901k68304M32629J32065J34661J86566J89597J16887j34001J67576
3956A1605577l4956j74159j25650l7594l9508j6640M31015k1391K85714L0960
3946A1903368R2973M4856q5491L22431J95546j36678R0460L56314J61440o0178
3936A2885041K25276P0726J13137n1713j57765k71278L10630K19045o704k3940
$$ plain form
3926 13312455 13146069 13461936 13783497 13985008 14170141 14461721 14524252 14668175 14806425 15105424
3916 15105424 15005162 14844413 14798536 14316452 13895218 13725132 13572617 13066716 13201961 13414742
3906 13414742 13426806 13047513 12945456 13167525 13029111 13315268 13302494 13288421 13218720 12589141
3896 12589141 12418939 12274635 11937510 11666439 11774605 11652994 11404908 11327392 11471235 11310797
3886 11310797 11403648 11335045 11126236 11260372 11228508 11083119 10998139 11138189 10970398 10953200
3876 10953200 11290834 11761681 11691829 11595279 11775024 12046728 11897841 12047312 12199980 12162910
3866 12162910 12225889 12219881 12215436 11837587 11408427 11963984 12188048 12138702 11999279 11869101
3856 11869101 11946656 12079244 12462821 12658083 12512032 12771535 12559106 12728068 13026193 13025147
$$ packed form
3926A3312455j66386L15867L21561K01511J85133K91580O2531J43923J38250K98999
3916A5105424j00262j60749m5877m82084m21234j70086j52515n05901J35245K12781
3906A3414742J2064l79293j02057K22069j38414K86157j2774j4073o9701o29579
3896A2589141j70202j44304l37125k71071J08166j21611k48086p7516J43843j60438
3886A1310797R2851o8603k08809J34136l1864j45389q4980J40050j67791j7198
3876A0953200L37634M70847o9852r6550J79745K71704j48887J49471J52668l7070
3866A2162910O2979o008m445l77849m29160N55557K24064m9346j39423j30178
3856A1869101P7555J32588L83577J95262j46051K59503k12429J68962K98125j046
$$ plain form
3846 13025147 13476739 13688690 13773477 14446811 14697256 14902724 15318175 15572714 15797019 16166413
3836 16166413 16561187 16745300 16573198 16623026 16510698 16718116 17145884 17277745 17468000 17707192
3826 17707192 18319947 18796275 19084893 18893558 18934489 19122782 19514991 19390864 19228025 19166444
3816 19166444 19336087 19154773 19366009 19200482 18782118 18967676 19172415 19476992 19155356
3807 19155356 19227978 19640719 19807136 19847673 19661467 20060170 20417658 20551118 20907607 21415477
3797 21415477 21407627 21483311 21924650 22156505 22268719 22385386 22782168 22880483 23390180 23582786
3787 23582786 23761402 24039991 24441067 24796785 24978219 25054787 25279247 25410494 25736654 26160700
3777 26160700 26160041 26575393 26785508 27379009 27578760 27655523 28011403 28299896 28486308 28539812
$$ packed form
3846A3025147M51592K11951Q4787O73334K50445K05468M15451K54539K24305L69394
3836A6166413L94774J84113j72102M9828j12328K07418M27768J31861J90255K39192
3826A7707192O12755M76328K88618j91335M0931J88293L92209j24127j62839o1581
3816A9166444J69643j81314K11236j65527m18364J85558K04739L04577l21636
3807A9155356P2622M12741J66417M0537j86206L98703L57488J33460L56489N07870
3797B1415477p850P5684M41339K31855J12214J16667L96782R8315N09697J92606
3787B3582786J78616K78589M01076L55718J81434P6568K24460J31247L26160M24046
3777B6160700o59M15352K10115N93501J99751P6763L55880K88493J86412N3504
$$ plain form
3767 28539812 28807818 29377761 29842433 30200144 30965669 31496477 31953864 32469670 33370423
3758 33370423 33923270 34060489 34484269 35091546 35856223 36561099 37469130 38468913 39475061
3749 39475061 40654214 41406094 42755126 43823246 44772901 45655521 46382932 47068182 48113632
3740 48113632 49019826 49679989 50705101 52097808 53582140 55047291 56927336 58927696
3732 58927696 60907490 62992321 65476832 67711964 70210036 72781438 75461187 78413812
3724 78413812 81653135 84478965 87652041 91218434 94554412 98614542 102895283 107231041
3716 107231041 112126003 117151640 121593936 125890964 130082891 133663907 136470712 138152777
3708 138152777 137697963 135969475 133297049 129487097 125012419 119613718 114574188 109950061
$$ packed form
3767B8539812K68006N69943M64672L57711P65525N30808M57387N15806R00753
3758C3370423N52847J37219M23780O07277P64677P04876R08031R99783J006148
3749C9475061J179153P51880J349032J068120R49655Q82620P27411O85250J045450
3740D8113632R06194O60163J025112J392707J484332J465151J880045K000360
3732E8927696J979794K084831K484511K235132K498072K571402K679749K952625
3724G8413812L239323K825830L173076L566393L335978M060130M280741M335758
3716A07231041M894962N025637M442296M297028M191927L581016K806805J682065
3708A38152777m54814j728488k672426l809952m474678n398701n039530m624127
$$ plain form
3700 109950061 105657879 101527150 97879496 94298999 90488339 86655058 82568397 77968843
3692 77968843 73371542 69297725 65726433 62373103 59431904 57133831 54708674 52734990
3684 52734990 51198513 49581672 48159371 46554177 44976135 43726049 42406284 40933616
3676 40933616 39940696 38996488 38214279 37221342 36090350 35115554 34413394 33626127 32748877
3667 32748877 31861505 31230199 30623755 30197563 29438167 28736215 28429248 28066967 27517177
3658 27517177 27284488 27044066 26753566 26530565 26025507 25668181 25327517 25158821 24909981
3649 24909981 24668006 24389884 23791364 23390461 23079620 22811508 22376036 22356480 22178213 21815037
3639 21815037 22013465 22009426 21692723 21373010 21412520 21516628 21500255 21574062 21541199 21440327
$$ packed form
3700A09950061m292182m130729l647654l580497l810660l833281m086661m599554
3692G7968843m597301m073817l571292l353330k941199k298073k425157j973684
3684E2734990j536477j616841j422301j605194j578042j250086j319765j472668
3676D0933616r92920r44208p82209r92937j130992r74796p02160p87267q77250
3667C2748877q87372o31306o06444m26192p59396p01952l06967l62281n49790
3658B7517177k32689k40422k90500k23001n05058l57326l40664j68696k48840
3649B4909981k41975k78122n98520m00903l10841k68112m35472j9556j78267l63176
3639B1815037J98428m039l16703l19713L9510J04108j6373P3807l2863j00872
$$ plain form
3629 21440327 21539814 21522766 21379147 21156285 21151138 21405490 21652173 21261325 21295051 21530583
3619 21530583 21695128 21867828 22367760 22657684 22669100 22464760 22633160 22823286 22945853 22897439
3609 22897439 23286131 23696751 23987716 24180664 24429383 24995876 25364950 25333125 24722948 24250330
3599 24250330 23845938 23340677 23239453 23070717 22864440 23271252 23394393 23408850 23747635 23683260
3589 23683260 23777474 24152897 23934833 24482495 24785792 24760607 25112427 25155850 25699760 25852009
3579 25852009 25840086 25961468 25821476 25880218 26027205 26209211 26489170 26423230 26411422 26807342
3569 26807342 26943706 27213661 27418200 27328788 27378290 27321190 27672984 28072156 28098848 28033393
3559 28033393 27975534 27829589 28423900 28933028 28947021 28950765 29115841 29632367 29644908 29733702
$$ packed form
3629B1440327R9487j7048j43619k22862n147K54352K46683l90848L3726K35532
3619B1530583J64545J72700M99932K89924J1416k04340J68400J90126J22567m8414
3609B2897439L88692M10620K90965J92948K48719N66493L69074l1825o10177m72618
3599B4250330m04392n05261j01224j68736k06277M06812J23141J4457L38785o4375
3589B3683260R4214L75423k18064N47662L03297k5185L51820M3423N43910J52249
3579B5852009j1923J21382j39992N8742J46987J82006K79959o5940j1808L95920
3569B6807342J36364K69955K04539q9412M9502n7100L51794L99172K6692o5455
3559B8033393n7859j45945N94311N09128J3993L744J65076N16526J2541Q8794
$$ plain form
3549 29733702 29938937 30302314 30634361 30949986 31458747 31676990 32168007 32528361 32828297
3540 32828297 33206114 33386072 33503397 33507746 34451867 34934523 35122942 35454053 35893905 36341953
3530 36341953 36853316 37351472 37787407 38512606 39192142 39867348 40427255 41375604 42698814
3521 42698814 43859345 44946802 46382030 47677373 49589437 51214554 52284450 53342911
3513 53342911 53950417 54410668 54451996 54627198 55618779 56219521 56889081 57788032 59280006
3504 59280006 61221952 62215345 62266363 62129535 61684544 61189955 60570192 60062223 59994990 60182429
3494 60182429 60766243 61122735 61624280 62855490 64024938 64937894 66393218 67888405 69604250
3485 69604250 71944409 74658164 77001240 79278922 81229271 82549729 83157419 83008880
$$ packed form
3549B9733702K05235L63377L32047L15625N08761K18243M91017L60354K99936
3540C2828297L77817J79958J17325M349R44121M82656J88419L31111M39852M48048
3530C6341953N11363M98156M35935P25199O79536O75206N59907R48349J323210
3521D2698814J160531J087457J435228J295343J912064J625117J069896J058461
3513E3342911O07506M60251M1328J75202R91581O00742O69560Q98951J491974
3504E9280006J941946R93393N1018j36828m44991m94589o19763n07969o7233J87439
3494F0182429N83814L56492N01545J231210J169448R12956J455324J495187J715845
3485F9604250K340159K713755K343076K277682J950349J320458O07690j48539
$$ plain form
3477 83008880 82404504 81675684 80891648 80452837 80663498 81489907 82454580 83720369 84847306
3468 84847306 85824488 86714525 86876402 87057034 87396202 87317019 87074300 87538220 88804731
3459 88804731 89969690 90976639 91721031 92311205 92583618 92632884 92457243 92290939 92313138
3450 92313138 92860284 93831729 95228586 96825490 98434301 100141460 101747423 103490094
3442 103490094 105178297 107141932 109926173 113088052 117089108 122343584 129053907 137103081
3434 137103081 146450287 158153227 171744076 186232696 200857320 214100859 223184790
3427 223184790 225815994 221452217 209822377 193523688 176366487 160845331 147906881
3420 147906881 137618797 129381285 122934413 117279599 112530613 108233658 103540710 98829803
$$ packed form
3477H3008880o04376p28820p84036m38811K10661Q26409R64673J265789J126937
3468H4847306R77182Q90037J61877J80632L39168p9183k42719M63920J266511
3459H8804731J164959J006949P44392N90174K72413M9266j75641j66304K2199
3450I2313138N47146R71445J396857J596904J608811J707159J605963J742671
3442A03490094J688203J963635K784241L161879M001056N254476O710323Q049174
3434A37103081R347206J1702940J3590849J4488620J4624624J3243539R083931
3427B23184790K631204m363777j1629840j6298689j7157201j5521156j2938450
3420A47906881j0288084q237512o446872n654814m748986m296955m692948m710907
$$ plain form
3412 98829803 93669226 88639495 84990001 81749460 78715403 76073130 74018246 72589715
3404 72589715 71259605 70083455 69267998 68248949 67399763 66717031 66142669 65481886 64984800
3395 64984800 64333004 63344456 62818239 62055048 61126632 60771299 60572663 60188770 59954653
3386 59954653 59554914 59625724 59812644 59862061 60063832 60485136 60618949 61129596 61439884 61983600
3376 61983600 62606434 63450597 64486811 65803588 66819015 68037862 69519945 70987014
3368 70987014 72696628 74375287 75420468 76388279 77644660 78501147 79251934 79949565 80469089
3359 80469089 80803820 81561222 82325619 83123966 84336055 85708820 87374457 89478971 92055376
3350 92055376 94594010 97331226 100155683 103541504 106821759 110487196 114664640 119217015
$$ packed form
3412I8829803n160577n029731l649494l240541l034057k642273k054884j428531
3404G2589715j330110j176150q15457j019049q49186o82732n74362o60783m97086
3395F4984800o51796r88548n26217p63191r28416l55333j98636l83893k34117
3386E9954653l99739P0810J86920M9417K01771M21304J33813N10647L10288N43716
3376F1983600O22834Q44163J036214J316777J015427J218847J482083J467069
3368G0987014J709614J678659J045181R67811J256381Q56487P50787O97631N19524
3359H0469089L34731P57402P64397P98347J212089J372765J665637K104514K576405
3350I2055376K538634K737216K824457L385821L280255L665437M177444M552375
$$ plain form
3342 119217015 124289220 130463685 137113800 144460909 152306726 160455978 168005892 175022678
3334 175022678 180684326 184981513 187805587 189135804 189326146 188650858 187410220 185723373
3326 185723373 184262333 183391894 182953746 184069732 187220474 192194177 199428870 208781359
3318 208781359 220262355 232468891 244275348 252550063 255835024 253807065 245889050 233016486
3310 233016486 216190006 197731828 179622231 162575362 148127717 136404681 127079762
3303 127079762 119549499 113165222 107909781 103073684 98444711 94711592 91283396 88360849
3295 88360849 85737890 83550328 81659013 80121755 78671937 77185455 75508891 73971342
3287 73971342 72153001 70347160 68584570 67583500 66262109 65145561 64208202 63258832
$$ packed form
3342A19217015N072205O174465O650115P347109P845817Q149252P549914P016786
3334A75022678N661648M297187K824074J330217J90342o75288j240638j686847
3326A85723373j461040q70439m38148J115986L150742M973703P234693R352489
3318B08781359J1480996J2206536J1806457Q274715L284961k027959p918015j2872564
3310B33016486j6826480j8458178j8109597j7046869j4447645j1723036r324919
3303A27079762p530263o384277n255441m836097m628973l733119l428196k922547
3295H8360849k622959k187562j891315j537258j449818j486482j676564j537549
3287G3971342j818341j805841j762590j001070j321391j116548r37359r49370
$$ plain form
3279 63258832 62556245 61816512 61009213 60604709 60350156 60043289 59809319 59508622 59429927 59780212
3269 59780212 59996340 60250444 60454063 60852831 61388766 62397592 63360286 64531009 66168438
3260 66168438 68076749 70197554 71662999 72301623 72406500 72056803 71032129 70208973 69335130
3251 69335130 67691841 66030425 64032079 61870499 60393927 59546242 58950864 58645977 58584079
3242 58584079 58725501 59267485 59833495 60425345 61538477 62900218 63936686 65754668 68161652
3233 68161652 70394698 72931272 75466230 77634487 79112147 80333247 81444099 82305408
3225 82305408 82705813 82475747 81543827 79950130 78810811 78457541 78854675 79622762 80054998
3216 80054998 80296224 79550111 77645618 74717807 71474160 69322185 67596231 66476545
$$ packed form
3279F3258832p02587p39733q07299m04504k54553l06867k33970l00697p8695L50285
3269E9780212K16128K54104K03619L98768N35935J008826R62694J170723J637429
3260F6168438J908311K120805J465445O38624J04877l49697j024674q23156q73843
3251F9335130j643289j661416j998346k161580j476572q47685n95378l04887o1898
3242E8584079J41422N41984N66010N91850J113132J361741J036468J817982K406984
3233F8161652K233046K536574K534958K168257J477660J221100J110852Q61309
3225H2305408M00405k30066r31920j593697j139319l53270L97134P68087M32236
3216H0054998K41226p46113j904493k927811l243647k151975j725954j119686
$$ plain form
3208 66476545 65797546 65654560 64941172 64488338 63979646 63471472 62975877 62831047 62870650 63276591
3198 63276591 63987412 64885425 65588654 66567449 68022187 68978447 70450670 72073722 74182654
3189 74182654 76725511 79222546 81882974 84250338 85594497 85690011 85058014 83820292 82218025
3180 82218025 80203249 78374934 76763102 75723723 75295302 74989554 75294662 76275049 77373942
3171 77373942 78862564 80531926 82288447 84444490 87020092 89526236 92536524 96277552
3163 96277552 100932790 106803822 113723452 121021841 128168240 134230525 138117943 139087983
3155 139087983 135928644 129862867 122689502 115706542 110239061 105853993 102179427 99685590
3147 99685590 97792250 96360550 95416107 94579152 93203121 92235950 90960350 89655655 88179176
$$ packed form
3208F6476545o78999j42986p13388m52834n08692n08174m95595j44830L9603M05941
3198F3276591P10821Q98013P03229R78795J454738R56260J472223J623052K108932
3189G4182654K542857K497035K660428K367364J344159R5514o31997j237722j602267
3180H2218025k014776j828315j611832j039379m28421l05748L05108R80387J098893
3171G7373942J488622J669362J756521K156043K575602K506144L010288L741028
3163I6277552M655238N871032O919630P298389P146399O062285L887418R70040
3155A39087983l159339o065777p173365o982960n467481m385068l674566k493837
3147I9685590j893340j431700r44443q36955j376031r67171j275600j304695j476479
$$ plain form
3138 88179176 86934446 86577191 85827243 85146057 84627194 84591711 84772014 85658048 87299150
3129 87299150 88927050 90562699 92378419 93991147 95443111 96659678 96836442 96207551
3121 96207551 95245914 93927861 92714453 91545775 90731969 90029853 88705147 86893232 85142795
3112 85142795 83360493 81739130 80705796 79946906 78853116 77542641 76398564 75343221
3104 75343221 74761288 74745036 74511511 74207942 74230242 73778561 73353461 72808276 72555933 72438288
3094 72438288 72383902 72962704 73494749 74023907 75096297 76243508 77267119 78974382 81445843
3085 81445843 84538777 88149800 92060707 95716750 98937616 101034299 100407434 97035819
3077 97035819 91446326 85183217 79052111 73626702 69178286 65757662 62837762 60501005
$$ packed form
3138H8179176j244730l57255p49948o81186n18863l5483J80303Q86034J641102
3129H7299150J627900J635649J815720J612728J451964J216567J76764o28891
3121I6207551r61637j318053j213408j168678q13806p02116j324706j811915j750437
3112H5142795j782302j621363j033334p58890j093790j310475j144077j055343
3104G5343221n81933j6252k33525l03569K2300m51681m25100n45185k52343j17645
3094G2438288n4386N78802N32045N29158J072390J147211J023611J707263K471461
3085H1445843L092934L611023L910907L656043L220866K096683o26865l371615
3077I7035819n589493o263109o131106n425409m448416l420624k919900k336757
$$ plain form
3069 60501005 58597679 56765948 55449405 54509010 53447136 52873879 52213066 51762289 51474587
3060 51474587 50956445 50760380 50586941 50217668 50229042 50508199 50827350 50529532 49832069 49252781
3050 49252781 48352488 47930854 47412173 46953500 46772044 46580902 45958405 45704308 45739234 45570118
3040 45570118 45457015 45161201 44975120 44976247 45182420 45357316 45895005 45828652 46221844 46540896
3030 46540896 46734217 47389244 47676342 48266628 48453519 49260389 49967979 50472420 51229246
3021 51229246 52017886 52620834 53395030 54838012 55728444 56598165 57809659 59115786 59953803
3012 59953803 60902048 61834338 62941639 63989547 65151000 66333040 67358324 68541325
3004 68541325 69907632 71820934 73367585 75239555 77175037 79131180 81015349 83201548
$$ packed form
3069F0501005j903326j831731j316543r40395j061874n73257o60813m50777k87702
3060E1474587n18142j96065j73439l69273J1374K79157L19151k97818o97463n79288
3050D9252781r00293m21634n18681m58673j81456j91142o22497k54097L4926j69116
3040D5570118j13103k95814j86081J127K06173J74896N37689o6353L93192L19052
3030D6540896J93321O55027K87098N90286J86891Q06870P07590N04441P56826
3021E1229246P88640O02948P74196J442982Q90432Q69721J211494J306127Q38017
3012E9953803R48245R32290J107301J047908J161453J182040J025284J183001
3004F8541325J366307J913302J546651J871970J935482J956143J884169K186199
$$ plain form
2996 83201548 85730733 87800245 90211830 92730852 95319308 98011971 100457262 103068371
2988 103068371 105867572 108619528 111506315 114265774 117307352 120545547 123396524 126549847
2980 126549847 129477915 132393172 135221941 138117593 141213744 144244606 147239067 150030524
2972 150030524 152889771 155424635 158171849 160587428 162742572 165319459 167657208 169830659
2964 169830659 171445490 173499204 175449221 177133139 178566573 179674781 180666002 181989452
2956 181989452 182982204 183636269 184356295 185166871 185145275 185120940 185317458 184980761 184281100 183672074
2946 183672074 182821603 181893792 181011454 179682970 178344360 176930795 175518753 173851003
2938 173851003 172061264 170312091 168284797 165978560 163607268 160999100 158427104 155754298
$$ packed form
2996H3201548K529185K069512K411585K519022K588456K692663K445291K611109
2988A03068371K799201K751956K886787K759459L041578L238195K850977L153323
2980A26549847K928068K915257K828769K895652L096151L030862K994461K791457
2972A50030524K859247K534864K747214K415579K155144K576887K337749K173451
2964A69830659J614831K053714J950017J683918J433434J108208R91221J323450
2956A81989452R92752O54065P20026Q10576k1596k4335J96518l36697o99661o09026
2946A83672074q50471r27811q82338j328484j338610j413565j412042j667750
2938A73851003j789739j749173k027294k306237k371292k608168k571996k672806
$$ plain form
2930 155754298 153267531 150460754 147606646 145151099 142211902 139363338 136827719 134192960
2922 134192960 131397634 128379236 125686440 123044931 119860424 116978170 114604034 112074519
2914 112074519 109781457 107103411 104825135 102693705 100127444 98164069 96177289 94497749
2906 94497749 92792704 90824500 89387543 87982579 86595759 85058975 83498506 82238179
2898 82238179 81160186 80280712 79391767 78348530 77606109 76537652 75603836 74333517 73254165
2889 73254165 72014116 70637441 69472372 68106124 67041171 65985279 64884246 64094711
2881 64094711 63330689 62747694 62027955 61463935 60816223 60087904 59355443 58571179 57592567
2872 57592567 56571287 55886785 54980220 53884668 52806873 52217562 51741684 51160216 50355179
$$ packed form
2930A55754298k486767k806777k854108k455547k939197k848564k535619k634759
2922A34192960k795326l018398k692796k641509l184507k882254k374136k529515
2914A12074519k293062k678046k278276k131430k566261j963375j986780j679540
2906I4497749j705045j968204j436957j404964j386820j536784j560469j260327
2898H2238179j077993q79474q88945j043237p42421j068457r33816j270319j079352
2889G3254165j240049j376675j165069j366248j064953j055892j101033p89535
2881F4094711p64022n82995p19739n64020o47712p28319p32461p84264r78612
2872E7592567j021280o84502r06565j095552j077795n89311m75878n81468q05037
$$ plain form
2863 50355179 49654221 49157896 48691700 48377979 47842367 47479590 47462704 46938622 46897074 46839002
2853 46839002 47000622 46865066 46991489 47016236 47119166 47509379 47473709 47924143 48104787 48345337
2843 48345337 49032688 49635619 49862539 50264818 50621482 50971719 51086645 51138226 51301830 51733578
2833 51733578 52213387 52079025 52026502 51961344 51957965 52253614 52377018 52391946 52342568 51928394
2823 51928394 52288928 52687366 53226206 53668670 54272251 54968076 55528139 56193100 56565708
2814 56565708 57328290 58291230 59233318 59999407 61008333 62161652 63043177 63602722 64121719
2805 64121719 64434199 64657424 64773141 64783825 64635856 64341075 64089004 63902685 63532776 63046878
2795 63046878 62752633 62333534 61468162 60794881 60470945 59968400 59804120 60080853 60120990 60552759
$$ packed form
2863E0355179p00958m96325m66196l13721n35612l62777j6886n24082m1548n8072
2853D6839002J61620j35556J26423K4747J02930L90213l5670M50434J80644K40550
2843D8345337O87351O02931K26920M02279L56664L50237J14926N1581J63604M31748
2833E1733578M79809j34362n2523o5158l379K95649J23404J4928m9378m14174
2823E1928394L60534L98438N38840M42464O03581O95825N60063O64961L72608
2814E6565708P62582R62940R42088P66089J008926J153319Q81525N59545N18997
2805F4121719L12480K23225J15717J0684j47969k94781k52071j86319l69909m85898
2795F3046878k94245m19099q65372o73281l23936n02545j64280K76733M0137M31769
$$ plain form
2785 60552759 61205158 61682398 62084721 62524575 63020521 63641415 64495357 65173460 65749415
2776 65749415 66800719 68033629 69064592 69727419 70346814 70394057 69891296 69601522 69168089
2767 69168089 68763910 67998039 67688816 67269173 66576614 65730425 64874164 64318096 63463137
2758 63463137 62774137 62342977 62082568 61415838 60971188 61149812 61493039 61617135 61564398 61690963
2748 61690963 62118150 62758106 63670223 64640261 65772442 66804739 68131229 69331624 70711718
2739 70711718 72101093 73242862 74469530 75997242 76989760 78086175 79350082 80585625
2731 80585625 81816934 82352819 82723516 82890329 83061069 82627106 81972007 81192612 80703871
2722 80703871 80001140 79441912 79043749 78535323 77865669 77636674 76991097 76405056 76006601
$$ packed form
2785F0552759O52399M77240M02323M39854M95946O20894Q53942O78103N75955
2776F5749415J051304J232910J030963O62827O19395M7243n02761k89774m33433
2767F9168089m04179p65871l09223m19643o92559q46189q56261n56068q54959
2758F3463137o89000m31160k60409o66730m44650J78624L43227J24096n2737J26565
2748F1690963M27187O39956R12117R70038J132181J032297J326490J200395J380094
2739G0711718J389375J141769J226668J527712R92518J096415J263907J235543
2731H0585625J231309N35885L70697J66813J70740m33963o55099p79395m88741
2722H0703871p02731n59228l98163n08426o69654k28995o45577n86041l98455
$$ plain form
2713 76006601 75482739 74601553 73559854 72617245 71258105 70138370 69134312 67794986 66587904
2704 66587904 65795594 65046343 64397250 63490326 62872874 62354972 61875110 61498599 61218711
2695 61218711 61069960 60780872 60625623 60561960 60412635 60551847 60499787 60321382 60276073 60476590
2685 60476590 60512096 60560189 60956693 61134141 61344493 61760809 62273919 62788227 63599348 64407422
2675 64407422 64846514 65493006 66297640 66904766 67588431 68713813 69719437 70131358 71307956
2666 71307956 72514311 74060595 75071855 76044097 77420279 78941313 80552683 82541550
2658 82541550 84181906 85675603 87577148 89691794 92094181 94313168 96714411 99241227
2650 99241227 102114068 105543462 109180842 113032724 117009599 121420935 126531427 131783189
$$ packed form
2713G6006601n23862q81186j041699r42609j359140j119735j004058j339326j207082
2704F6587904p92310p49251o49093r06924o17452n17902m79862l76511k79888
2695F1218711j48751k89088j55249o3663j49325J39212n2060j78405m5309K00517
2685F0476590L5506M8093L96504J77448K10352M16316N13110N14308Q11121Q08074
2675F4407422M39092O46492Q04634O07126O83665J125382J005624M11921J176598
2666G1307956J206355J546284J011260R72242J376182J521034J611370J988867
2658H2541550J640356J493697J901545K114646K402387K218987K401243K526816
2650I9241227K872841L429394L637380L851882L976875M411336N110492N251762
$$ plain form
2642 131783189 137776180 143761718 150462655 157654942 164996757 172048151 178704404 184522092
2634 184522092 189231280 192723554 195152822 196698439 198001395 198757368 199748558 200758370
2626 200758370 201785953 203258271 204591824 206065491 207701058 208764318 209530586 209244930
2618 209244930 208319563 206809359 204071989 200966872 197898035 194065934 190233095 187233803
2610 187233803 184624971 182608434 180981445 179879949 179144893 178938066 179339560 179821379 180847390
2601 180847390 181863464 182995176 184420610 185987050 187793682 189969837 192650626 195045805
2593 195045805 197987027 201297506 204902678 208440293 212720382 216979821 221773452 226985384
2585 226985384 232227195 238196709 244246399 250753483 258090713 265913164 274104484 283214019
$$ packed form
2642A31783189N992991N985538O700937P192287P341815P051394O656253N817688
2634A84522092M709188L492274K429268J545617J302956P55973R91190J009812
2626B00758370J027583J472318J333553J473667J635567J063260P66268k85656
2618B09244930r25367j510204k737370l105117l068837l832101l832839k999292
2610A87233803k608832k016537j626989j101496p35056k06827M01494M81819J026011
2601A80847390J016074J131712J425434J566440J806632K176155K680789K395179
2593A95045805K941222L310479L605172L537615M280089M259439M793631N211932
2585B26985384N241811N969514O049690O507084P337230P822451Q191320R109535
$$ plain form
2577 283214019 292905063 303479734 314229907 325439238 337018821 347866501 358538836
2570 358538836 368656849 377833687 386000189 393855544 401081420 408085599 415091935 421746733
2562 421746733 428217491 434603927 441071620 447427357 453115649 458305772 462989602 467079406
2554 467079406 470314440 472466536 474077726 475116101 475331950 474974701 474403271 473670129 472461855
2545 472461855 471204446 469613697 467506291 465364767 463071434 460253582 457588125 454846038
2537 454846038 452187536 449667582 446799215 444199365 441413254 438832099 436178380 432977670
2529 432977670 429723288 426519148 423032487 419024628 415228809 411273715 407427044 404060797
2521 404060797 400722268 397786652 395592738 393827063 392157081 390976759 390335283 389991811
$$ packed form
2577B83214019R691044J0574671J0750173J1209331J1579583J0847680J0672335
2570C58538836J0118013R176838Q166502P855355P225876P004179P006336O654798
2562D21746733O470758O386436O467693O355737N688292N190123M683830M089804
2554D67079406L235034K152096J611190J038375K15849l57249n71430p33142j208274
2545D72461855j257409j590749k107406k141524k293333k817852k665457k742087
2537D54846038k658502k519954k868367k599850k786111k581155k653719l200710
2529D32977670l254382l204140l486661m007859l795819l955094l846671l366247
2521D04060797l338529k935616k193914j765675j669982j180322o41476l43472
$$ plain form
2513 389991811 389964264 390331339 390901224 391719982 393191439 394813165 396248229 397869674 399826753
2504 399826753 400933132 401797501 401781020 400498986 398408654 395018607 390599686 386083278
2496 386083278 380888911 375118598 368939418 362499087 356154120 349896880 343394971 336301898
2488 336301898 329105233 321196957 312289377 302895600 293229871 282670591 271911542 260776589
2480 260776589 250295288 240218282 230318299 220717186 212211688 204034208 196969570 190103444
2472 190103444 183996445 178527689 173471066 169110461 164579961 160493821 156785000 153219366
2464 153219366 149832601 146080108 142441310 138762748 135070151 131683655 128549755 125482296
2456 125482296 122391108 119490974 116777209 114150778 111645851 109001502 106420367 104138341
$$ packed form
2513C89991811k7547L67075N69885Q18758J471457J621726J435064J621445J957079
2504C99826753J106379Q64369j6481j282034k090332l390047m418921m516408
2496C86083278n194367n770313o179180o440331o344967o257240o501909p093073
2488C36301898p196665p908276q907580r393777r665729j0559280j0759049j1134953
2480B60776589j0481301j0077006r899983r601113q505498q177480p064638o866126
2472A90103444o106999n468756n056623m360605m530500m086140l708821l565634
2464A53219366l386765l752493l638798l678562l692597l386496l133900l067459
2456A25482296l091188k900134k713765k626431k504927k644349k581135k282026
$$ plain form
2448 104138341 101925665 99734858 97613245 95545176 93201686 91256263 89269284 87626073
2440 87626073 85967651 84569768 82659752 80521680 79274987 78038121 76792315 75505337
2432 75505337 74251641 73164433 71916253 70557951 69165311 68051735 66592456 64813226
2424 64813226 63187710 61923351 60049171 58072875 56668062 55632495 54483369 53140454
2416 53140454 51987798 50911391 49824820 49396286 48332167 47166616 46274100 45472373 44594529
2407 44594529 43376085 42818859 42506200 42004820 41370963 40674637 40179337 39831694 39297384
2398 39297384 38418760 38080323 37824540 37387500 36986801 36501925 36076352 35301451 34350849
2389 34350849 34003509 33764011 33243527 32737596 32069475 31598688 31043982 30641181 30322949
$$ packed form
2448A04138341k212676k190807k121613k068069k343490j945423j986979j643211
2440H7626073j658422j397883j910016k138072j246693j236866j245806j286978
2432G5505337j253696j087208j248180j358302j392640j113576j459279j779230
2424F4813226j625516j264359j874180j976296j404813j035567j149126j342915
2416E3140454j152656j076407j086571m28534j064119j165551q92516q01727q77844
2407D4594529j218444n57226l12659n01380o33857o96326m95300l47643n34310
2398C9297384q78624l38437k55783m37040m00699m84876m25573p74901r50602
2389C4350849l47340k39498n20484n05931o68121m70787n54706m02801l18232
$$ plain form
2380 30322949 29937633 29339153 28595080 28029716 27714969 27499787 26970677 26712245 26822995
2371 26822995 26741369 26252168 25893902 25830309 25556699 25388173 25139325 25103705 24842687 24469315
2361 24469315 24143702 24138096 24010754 23899397 23735948 23532112 23528859 23529469 23700840 23837037 23712774
2350 23712774 23719865 23951914 24293875 24775307 25231808 25592943 25897299 26437284 27177279 27695748
2340 27695748 28109063 28629763 28319042 27748751 26956138 26102844 25218283 24186218 23228659
2331 23228659 22191752 21620812 20922598 20354046 19900911 19557655 19312503 18995679 18687977
2322 18687977 18196733 17908876 17723461 17468134 17361668 17302821 16983023 16559548 16508480 16531437
2312 16531437 16342421 15939022 15741896 15987668 15843719 15661592 15321004 14998309 14973657 15100489
$$ packed form
2380C0322949l85316n98480p44073n65364l14747k15182n29110k58432J10750
2371B6822995q1626m89201l58266o3593k73610j68526k48848l5620k61018l73372
2361B4469315l25613n606j27342j11357j63449k03836l253O10J71371J36197j24263
2350B3712774P091K32049L41961M81432M56501L61135L04356N39985P39995N18469
2340B7695748M13315N20700l10721n70291p92613q53294q84561j032065r57559
2331B3228659j036907n70940o98214n68552m53135l43256k45152l16824l07702
2322A8687977m91244k87857j85415k55327j06466n8847l19798m23475n1068K2957
2312A6531437j89016m03399j97126K45772j43949j82127l40588l22695k4652J26832
$$ plain form
2302 15100489 14915732 14603637 14219569 14112543 14255079 14228727 13995510 13934766 13901389 13709423
2292 13709423 13542358 13714228 13514430 13239108 13276504 12959011 12653736 12585697 13131980 12975789
2282 12975789 12551356 12329520 12242691 12546939 12546729 12478619 12656117 12698604 12417612 12297253
2272 12297253 12467255 12260508 12332761 12391107 12384448 12385871 12399742 12111013 12209063 12449480 12177713
2261 12177713 12067079 12034307 11957426 11652582 11738734 11856169 12182569 12036021 11670877 11629150
2251 11629150 11562710 11571084 11690996 11721428 11701600 11661544 11659491 11748149 11523649 11361442 11297899
2240 11297899 11399255 11643190 11706451 11536623 11470642 11326495 11269414 11119098 11148402 11431094
2230 11431094 11294389 10885324 10606186 10700635 10826977 10672759 10725041 10718757 10583058 10634305
$$ packed form
2302A5100489j84757l12095l84068j07026J42536k6352k33217o0744l3377j91966
2292A3709423j67065J71870j99798k75322L7396l17493l05275o8039N46283j56191
2282A2975789m24433k21836q6829L04248k10o8110J77498M2487k80992j20359
2272A2297253J70002k06747P2253N8346o659J423J3871k88729R8050K40417k71767
2261A2177713j10634l2772p6881l04844Q6152J17435L26400j46548l65144m1727
2251A1629150o6440Q374J19912L0432j9828m0056k053Q8658k24500j62207o3543
2240A1297899J01356K43935O3261j69828o5981j44147n7081j50316K9304K82692
2230A1431094j36705m09065k79138R4449J26342j54218N2282o284j35699N1247
$$ plain form
2220 10634305 10436824 10433812 10794763 10959805 11078094 11129696 10891809 10929099 10958895 10864770
2210 10864770 10736791 10670843 10728254 10699394 10876891 11082892 10877591 10883366 10793016 10864319 11044126
2199 11044126 10950203 10965866 11123761 11306426 11081321 11044274 10892945 11257194 11276543 11372646
2189 11372646 11535191 11875775 12010200 12481115 12837939 13063514 12876817 13065190 13292179
2180 13292179 13528245 14134582 13993318 14161565 14116132 14092835 13786468 13277267 12885172 12132460
2170 12132460 11338255 11147180 10825992 10944531 10942788 10593024 10464477 10002383 9865050 10039645
2160 10039645 9944333 10023994 10163019 10056377 9760729 9879977 9771377 9925660 9664655 9858583
2150 9858583 10041984 10154978 10054338 10327616 10859510 11375711 11879365 12391329 12845488 13092170
$$ packed form
2220A0634305j97481l012L60951J65042J18289N1602k37887L7290K9796r4125
2210A0864770j27979o5948N7411k8860J77497K06001k05301N775r0350P1303J79807
2199A1044126r3923J5663J57895J82665k25105l7047j51329L64249J9349R6103
2189A1372646J62545L40584J34425M70915L56824K25575j86697J88373K26989
2180A3292179K36066O06337j41264J68247m5433k3297l06367n09201l92095p52712
2170A2132460p94205j91075l21188J18539j743l49764j28547m62094j37333J74595
2160A0039645r5312P9661J39025j06642k95648J19248j08600J54283k61005J93928
2150I858583J83401J12994j00640K73278N31894N16201N03654N11964M54159K46682
$$ plain form
2140 13092170 12776213 12139725 11427232 10833450 10133357 9530395 9322518 9281910 9078492 8708709
2130 8708709 8316943 8492577 8493747 8368765 8195287 7873351 7942476 8062368 8163916 8050830
2120 8050830 8137348 8159117 8191895 8076596 8195678 8180646 8192687 8149760 8255404 8475670 8809211
2109 8809211 9363962 9938484 10032328 9934308 9520853 8995895 8518291 8310383 8086111 7806368
2099 7806368 7626185 7642349 7398453 7569599 7584817 7325854 7294650 7267610 7327674 7203344
2089 7203344 7153820 7144326 7320093 7347893 6981862 6913066 6839190 6819566 6952506 6970613 6852859
2078 6852859 6843084 6743157 6675444 6807317 6749072 6835062 6851262 6710244 6455773 6267106 6368529
2067 6368529 6609268 6614795 6722540 6829439 6748169 6630619 6279190 6390224 6521174 6682010
$$ packed form
2140A3092170l15957o36488p12493n93782p00093o02962k07877m0608k03418l69783
2130H708709l91766J75634J170j24982j73478l21936O9125J19892J01548j13086
2120H050830Q6518K1769L2778j15299J19082j5032J2041m2927J05644K20266L33541
2109H809211N54751N74522R3844r8020m13455n24958m77604k07908k24272k79743
2099G806368j80183J6164k43896J71146J5218k58963l1204k7040O0064j24330
2089G203344m9524r494J75767K7800l66031o8796p3876j9624J32940J8107j17754
2078F852859r775r9927o7713J31873n8245Q5990J6200j41018k54471j88667J01423
2067F368529K40739N527J07745J06899q1270j17550l51429J11034J30950J60836
$$ plain form
2057 6682010 6709285 6838783 6675442 6522285 6789465 6776267 6830664 6734851 7016080 6979683
2047 6979683 6695053 6654779 6344960 6238173 6248827 6204280 6205265 6443834 6557885 6368796 6583669
2036 6583669 6699892 6686131 6791827 7032737 7211752 6994804 7091579 7101019 6804114 6800026 6828962
2025 6828962 6647745 6746406 6700326 6483408 6634778 6429884 6080647 5928739 6017275 6263310
2015 6263310 6160832 6108024 6059694 5743937 5707853 6112538 6211525 6173397 6054241 6083557 5950000
2004 5950000 6108415 6070514 6198062 6247086 6022801 5813751 5858616 5999464 5747364 5867359
1994 5867359 5815500 5810305 5856437 6010532 5775243 5685862 5807730 5818885 5555977 5416036 5838900
1983 5838900 5757835 5791829 5915284 6045799 5923323 5705143 5738723 5773844 5779846 5674840 6058696
$$ packed form
2057F682010K7275J29498j63341j53157K67180j3198N4397r5813K81229l6397
2047F979683k84630m0274l09819j06787J0654m4547R85K38569J14051j89089K14873
2036F583669J16223j3761J05696K40910J79015k16948R6775R440k96905m088K8936
2025F828962j81217R8661m6080k16918J51370k04894l49237j51908Q8536K46035
2015F263310j02478n2808m8330l15757l6084M04685R8987l8128j19156K9316j33557
2004E950000J58415l7901J27548M9024k24285k09050M4865J40848k52100J19995
1994E867359n1859n195M6132J54095k35289q9381J21868J1155k62908j39941M22864
1983E838900q1065L3994J23455J30515j22476k18180L3580L5121O002j05006L83856
$$ plain form
1972 6058696 6132036 6284908 6174990 6156248 6283159 6149216 6412274 6283478 6305798 6416443
1962 6416443 6421871 6505165 6414628 6457661 6737532 6706697 6628990 6439180 6402839 7075763 7025695
1951 7025695 7161574 7380323 7387415 7358917 7472427 7574575 7568079 7774231 7763121 7885130 8183587
1940 8183587 7965528 8010882 8050555 8449906 8623628 8835483 9067206 8994514 9108001 9462472
1930 9462472 9669238 10112605 10572491 10919655 10828874 11198905 11885722 11983561 11876775 12098062
1920 12098062 12314271 12728584 12794743 12688269 12799616 12647355 12909083 13077712 13353696 13700304
1910 13700304 13895778 14037857 14220676 14160141 14333614 14688964 15119110 15303487 15802682 16490793
1900 16490793 17308464 18034142 18796848 19463753 20532403 22066360 23491158 25010476 26700355
$$ packed form
1972F058696P3340J52872j09918j8742J26911j33943K63058j28796K2320J10645
1962F416443N428Q3294r0537M3033K79871l0835p7707j89810l6341O72924n0068
1951G025695J35879K18749P092k8498J13510J02148o496K06152j1110J22009K98457
1940H183587k18059M5354L9673L99351J73722K11855K31723p2692J13487L54471
1930I462472K06766M43367M59886L47164r0781L70031O86817R7839j06786K21287
1920A2098062K16209M14313O6159j06474J11347j52261K61728J68629K75984L46608
1910A3700304J95474J42079J82819o0535J73473L55350M30146J84377M99195O88111
1900A6490793Q17671P25678P62706O66905J068650J533957J424798J519318J689879
$$ plain form
1891 26700355 29018863 31738638 34602611 37682494 40564655 43130799 45044813 45317415
1883 45317415 44190022 41830624 39094860 36134482 33551735 31960972 30396659 29567278
1875 29567278 29256420 29049943 28819718 28345247 28141438 28722510 29693817 30700259 32109627
1866 32109627 33640276 35932254 38546781 41493826 44525484 47105523 49304247 49769090
1858 49769090 49434767 49155382 49847348 51695594 54582281 57737206 61830159 65918272 69296896
1849 69296896 70225550 68078564 63062795 56583982 50551181 45714485 41734449 38866374
1841 38866374 36810656 35062640 33672599 32959613 32467164 32246014 32392087 32509491 33509675
1832 33509675 34841519 36060265 37369439 38597062 38834801 37992735 36883895 35300043
$$ packed form
1891B6700355K318508K719775K863973L079883K882161K566144J914014K72602
1883D5317415j127393k359398k735764k960378k582747j590763j564313q29381
1875B9567278l10858k06477k30225m74471k03809N81072R71307J006442J409368
1866C2109627J530649K291978K614527K947045L031658K580039K198724M64843
1858D9769090l34323k79385O91966J848246K886687L154925M092953M088113L378624
1849F9296896R28654k146986n015769o478813o032801m836696l980036k868075
1841C8866374k055718j748016j390041p12986m92449k21150J46073J17404J000184
1832C3509675J331844J218746J309174J227623K37739q42066j108840j583852
$$ plain form
1824 35300043 34309971 33642774 33203822 33150854 32923708 32838889 33281874 33961848 34505198 35582529
1814 35582529 36007101 35207867 33512002 31243579 28266560 25573292 23269078 21296746
1806 21296746 19541220 18422053 17631288 16639458 15822688 15328904 14804317 14410225 13938709
1797 13938709 13472628 13251661 13184471 12855585 12671191 12570890 12233883 12001319 11981192 11908808
1787 11908808 11627195 11049860 10958075 10660770 10122972 9876264 9540582 9394517 9355375 9027758
1777 9027758 8851050 8574815 8049336 7992317 8005248 7651159 7976935 7882001 7685726 7645766
1767 7645766 7305174 7250685 7269232 7024562 6675970 6398556 6315479 6324321 6318263 6232288 6124267
1756 6124267 6342176 6536489 6372496 6259127 6462971 6586819 6247251 5958536 6092358 5976412
$$ packed form
1824C5300043r90072o67197m38952n2968k27146q4819M42985O79974N43350J077331
1814C5582529M24572p99234j695865k268423k977019k693268k304214j972332
1806B1296746j755526j119167p90765r91830q16770m93784n24587l94092m71516
1797A3938709m66081k20967o7190l28886j84394j00301l37007k32564k0127p2384
1787A1908808k81613n77335r1785k97305n37798k46708l35682j46065l9142l27617
1777I027758j76708k76235n25479n7019J2931l54089L25776r4934j96275l9960
1767G645766l40592n4489J8547k44670l48592k77414q3077Q842o058q5975j08021
1756F124267K17909J94313j63993j13369K03844J23848l39568k88715J33822j15946
$$ plain form
1746 5976412 5776541 5532843 5433740 5590042 5480853 5489987 5210047 4759913 4763744 4934341
1736 4934341 5050402 4937732 5066572 4793990 4505912 4852952 5045170 5047157 4789712 4608333
1726 4608333 4718254 4659685 4579422 4595189 4692018 4614015 4603351 4600135 4583409 4697991 4872711
1715 4872711 4711255 4680777 4527651 4575620 4547625 4072614 3878847 3940028 3840187 3825555 3874046
1704 3874046 3793654 3945729 4120471 4249685 4166710 3936524 3973061 4058392 4223520 3982736
1694 3982736 3938635 4231148 4378714 4319594 4359631 4762989 4869687 5156188 5140653 5289056
1684 5289056 5277870 4931007 4737503 4512256 4278772 3846017 3576469 3530521 3512754 3793471
1674 3793471 3635510 3477942 3559545 3711214 3697186 3469291 3624161 3363974 3223781 3112770
$$ packed form
1746E976412j99871k43698r9103J56302j09189R134k79940m50134L831J70597
1736D934341J16061j12670J28840k72582k88078L47040J92218J987k57445j81379
1726D608333J09921n8569q0263J5767R6829p8003j0664l216j6726J14582J74720
1715D872711j61456l0478j53126M7969k7995m75011j93767O1181r9841j4632M8491
1704C874046q0392J52075J74742J29214q2975k30186L6537Q5331J65128k40784
1694C982736m4101K92513J47566n9120M0037M03358J06698K86501j5535J48403
1684E289056j1186l46863j93504k25247k33484m32755k69548m5948j7767K80717
1674C793471j57961j57568Q1603J51669j4028k27895J54870k60187j40193j11011
$$ plain form
1664 3112770 3410835 3714090 3876158 3923456 3930770 3931856 3824094 3967850 4014176 4147362 4435108
1653 4435108 4449647 4446599 4428472 4110653 3981567 3802587 3363073 3257941 3261668 2964072 2954495
1642 2954495 2922868 3105895 3218541 3000149 3041772 2932965 2720397 2745567 2664984 2521550
1632 2521550 2668510 2687829 2330899 2320498 2579796 2465119 2123842 2367509 2515569 2578826
1622 2578826 2534469 2484473 2493273 2357702 2514761 2611509 2371009 2425681 2574529 2245196 2141027
1611 2141027 2283351 2526595 2399542 2237390 2033052 2045421 2137884 2225656 1875433 2158394
1601 2158394 2143269 2189259 2223855 2377980 2376883 1987593 1825916 1793129 2332723 2313299 2245010
1590 2245010 2026013 1730530 1991995 2308601 2440038 2420723 2274669 2261997 2107484 2132346
$$ packed form
1664C112770K98065L03255J62068M7298P314J086j07762J43756M6326J33186K87746
1653D435108J4539l048j8127l17819j29086j78980m39514j05132L727k97596r577
1642B954495l1627J83027J12646k18392M1623j08807k12568K5170q0583j43434
1632B521550J46960J9319l56930j0401K59298j14677l41277K43667J48060O3257
1622B578826m4357m9996Q800j35571J57059R6748k40500N4672J48848l29333j04169
1611B141027J42324K43244j27053j62152k04338J2369R2463Q7772l50223K82961
1601B158394j5125M5990L4596J54125j097l89290j61677l2787N39594j9424o8289
1590B245010k18997k95483K61465L16606J31437j9315j46054j2672j54513K4862
$$ plain form
1580 2132346 2036491 1987031 2109803 2161383 1990334 2056032 2125665 2277436 2211446 2282237 2242255
1569 2242255 2084026 2240077 2122743 2068712 2147980 2077155 2378440 2243332 2435035 2561121
1559 2561121 2506697 2579324 2640121 2763526 2821487 2894012 2828895 2679245 2700339 2699203 2675193
1548 2675193 2907646 2891508 2843155 3047861 2935292 2979381 3171612 3031538 3001388 2646604
1538 2646604 2587392 2762691 2801268 2975703 2894320 2782662 3011519 3214847 3148028 2931221
1528 2931221 3053340 3081473 3098810 3135964 3218488 3436902 3484419 3548198 3745227 3782694 3942841
1517 3942841 3833555 3800667 3686285 3590112 3660199 3804793 3887310 4241649 4229308 3937841
1507 3937841 3835865 4111866 3908452 3808219 3979050 4019497 4135514 3905554 3667181 3793672
$$ packed form
1580B132346r5855m9460J22772N1580j71049O5698O9633J51771o5990P0791l9982
1569B242255j58229J56051j17334n4031P9268p0825L01285j35108J91703J26086
1559B561121n4424P2627O0797J23405N7961P2525o5117j49650K1094j136k4010
1548B675193K32453j6138m8353K04706j12569M4089J92231j40074l0150l54784
1538B646604n9212J75299L8577J74435q1383j11658K28857K03328o6819k16807
1528B931221J22119K8133J7337L7154Q2524K18414M7517O3779J97029L7467J60147
1517C942841j09286l2888j14382r6173P0087J44594Q2517L54339j2341k91467
1507C937841j01976K76001k03414j00233J70831M0447J16017k29960k38373J26491
$$ plain form
1497 3793672 3691819 3780965 3938009 3963109 3635551 3753656 4150501 4154797 4076243 4098356 4363671
1486 4363671 4541239 4898640 4912758 5163639 5124266 5131780 5024919 4884675 4998525 4975804
1476 4975804 4905802 4876344 4907590 5193829 5224140 5185943 4944457 5096291 4946006 4690658
1466 4690658 4556348 4626036 4769318 4803991 4699097 4748238 4924990 4803552 4847646 4920146
1456 4920146 4895741 5233857 5483073 5586182 5529165 5672557 6086543 6379138 6360259 6341544
1446 6341544 6135129 6380657 6600897 6755441 6801631 6406492 6116082 5933485 5778120 5540723
1436 5540723 5350117 5174589 5007151 4882744 4896394 4772236 4385307 4438912 4536158 4299796
1426 4299796 4439377 4758385 4621851 4486447 4732148 4524336 4649266 4474611 4552965 4531787
$$ packed form
1497C793672j01853Q9146J57044K5100l27558J18105L96845M296p8554K2113K65315
1486D363671J77568L57401J4118K50881l9373P514j06861j40244J13850k2721
1476D975804p0002k9458L1246K86239L0311l8197k41486J51834j50285k55348
1466D690658j34310O9688J43282L4673j04894M9141J76752j21438M4094P2500
1456D920146k4405L38116K49216J03109n7017J43392M13986K92595j8879j8715
1446F341544k06415K45528K20240J54544M6190l95139k90410j82597j55365k37397
1436E540723j90606j75528j67438j24407J3650j24158l86929N3605R7246k36362
1426D299796J39581L19008j36534j35404K45701k07812J24930j74655P8354k1178
$$ plain form
1416 4531787 4507375 4631114 4859222 4999280 4807422 4868744 4850146 4939613 4784133 4943170
1406 4943170 5024216 4720831 4439566 4197650 4181918 3979751 3780244 3504554 3406583 3121670
1396 3121670 2769975 2580784 2756523 2753319 2514336 2566773 2549518 2513569 2474062 2374268 2731175
1385 2731175 2806835 2692180 2894762 2973610 2546128 2268152 2164372 1890559 1671946 1861651
1375 1861651 1943713 2059333 1861303 1671469 1499581 1647139 1399622 1488289 1887619 1864361
1365 1864361 1507119 1419928 1641431 1542273 1618508 1792897 1663041 1253143 1280631 1266960
1355 1266960 1296732 1214996 1390452 1211271 1164688 1313651 1329726 994769 1100528 1160225
1345 1160225 951822 956360 1311920 1282608 1196232 1061972 860838 1151227 1365311 1439194
$$ packed form
1416D531787k4412J23739K28108J40058j91858O1322j8598Q9467j55480J59037
1406D943170Q1046l03385k81265k41916j5732k02167j99507k75690r7971k84913
1396C121670l51695j89191J75739l204k38983N2437j7255l5949l9507r9794L56907
1385B731175P5660j14655K02582P8848m27482k77976j03780k73813k18613J89705
1375A861651Q2062J15620j98030j89834j71888J47558k47517Q8667L99330k3258
1365A864361l57242q7191K21503r9158P6235J74389j29856m09898K7488j3671
1355A266960K9772q1736J75456j79181m6583J48963J6075l34957J05759N9697
1345A160225k08403M538L55560k9312q6376j34260k01134K90389K14084P3883
$$ plain form
1335 1439194 1423555 1515233 1331296 1754853 1572017 1223689 1244515 1134815 1102214 1228442
1325 1228442 1235771 769694 891126 1086727 1205626 1033839 1035606 1302140 1153360 1224396
1315 1224396 1109006 945910 1142637 933548 898496 909430 847452 891471 1154144 1220194
1305 1220194 979044 923396 720387 925110 1180329 960505 1287263 1220680 1052451 1025854
1295 1025854 1099641 934828 889188 976646 962412 987159 997249 1206226 1008553 792285 802860
1284 802860 744823 605406 629660 985030 1052790 1238313 1170616 1262450 1188034 919888 1056025
1273 1056025 916026 1042238 1052776 1031791 739009 589790 824354 991097 916563 953914
1263 953914 898914 998504 877628 896930 1017577 978125 1145521 1448468 1464924 1236018 1304487
$$ packed form
1335A439194j5639R1678j83937M23557j82836l48328K0826j09700l2601J26228
1325A228442P329m66077J21432J95601J18899j71787J767K66534j48780P1036
1315A224396j15390j63096J96727k09089l5052J0934o1978M4019K62673O6050
1305A220194k41150n5648k03009K04723K55219k19824L26758o6583j68229k6597
1295A025854P3787j64813m5640Q7458j4234K4747J0090K08977j97673k16268J0575
1284H02860n8037j39417K4254L55370O7760J85523o7697R1834p4416k68146J36137
1273A056025j39999J26212J0538k0985k92782j49219K34564J66743p4534L7351
1263I53914n5000R9590j20876J9302J20647l9452J67396L02947J6456k28906O8469
$$ plain form
1252 1304487 1508590 1564178 1495593 1304827 1196893 1192917 1142971 1356902 1253704 1077895
1242 1077895 924791 1045656 1000851 1133975 1037806 858128 941822 934639 1054874 857685
1232 857685 890373 680629 686506 628259 754557 818148 467888 523583 958934 888109 589517
1221 589517 656886 652918 659602 954725 1031144 1087846 1041283 754868 685333 926984 804375
1210 804375 930546 1200976 1061797 1015344 765329 820899 955972 927304 949061 937886 1036289
1199 1036289 911551 732470 797434 822015 759905 765866 822898 932592 1264579 1150702 1066357
1188 1066357 1090708 1125225 1317611 1033558 640661 650828 650861 514634 376796 834281 1019123
1177 1019123 1082709 1027978 738130 1080753 1176808 1054049 1113733 961601 1063307 1144417
$$ packed form
1252A304487K04103N5588o8585j90766j07934l976m9946K13931j03198j75809
1242A077895j53104J20865m4805J33124r6169j79678Q3694p183J20235j97189
1232H57685L2688k09744N877n8247J26298O3591l50260N5695M35351p0825k98592
1221E89517O7369l968O684K95123P6419N6702m6563k86415o9535K41651j22609
1210H04375J26171K70430j39179m6453k50015N5570J35073k8668K1757j1175R8403
1199A036289j24738j79081O4964K4581o2110N961N7032J09694L31987j13877q4345
1188A066357K4351L4517J92386k84053l92897J0167L3j36227j37838M57485J84842
1177A019123O3586n4731k89848L42623R6055j22759N9684j52132J01706Q1110
$$ plain form
1167 1144417 1085174 1251838 1218576 984699 1264866 1328960 1632065 1481444 1001923 961393
1157 961393 1124702 1422344 1290587 1239280 1105625 1038234 1262273 1226442 1092771 1085553 1000541
1146 1000541 894752 869154 987206 1085390 1206691 1402314 1169776 1116815 971298 936449
1136 936449 1228636 1473895 1473806 1402917 1146215 1051229 1197340 1419034 1521416 1251119 1233163
1125 1233163 1348995 1560628 1539105 1661183 1640646 1743579 1928295 1488267 1356197 1517284
1115 1517284 1347808 1608730 1615366 1715776 1962984 1895219 1723506 1708864 1965172 1958336 2007981
1104 2007981 2277844 2301164 2432463 2590325 2724843 2627827 2705271 2707699 3214048 3196969 3154900
1093 3154900 3128064 2940131 3274166 3326783 3507725 3728193 3683874 3754289 3840656 3896540 4143248
$$ packed form
1167A144417n9243J66664l3262k33877K80167O4094L03105j50621m79521m0530
1157I61393J63309K97642j31757n1307j33655o7391K24039l5831j33671p218q5012
1146A000541j05789k5598J18052R8184J21301J95623k32538n2961j45517l4849
1136I36449K92187K45259q9p0889k56702r4986J46111K21694J02382k70297j7956
1125A233163J15832K11633k1523J22078k0537J02933J84716m40028j32070J61087
1115A517284j69476K60922O636J00410K47208o7765j71713j4642K56308o836M9645
1104B007981K69863K3320J31299J57862J34518r7016P7444K428N06349j7079m2069
1093C154900k6836j87933L34035N2617J80942K20468m4319P0415Q6367N5884K46708
$$ plain form
1082 4143248 4544836 4806970 5190367 5466313 5630552 5759581 6011048 6049989 5866198 5575006
1072 5575006 5522359 5904051 5916242 5668123 5341947 5333386 5126786 5237355 5321604 5187746
1062 5187746 5248236 5307125 5641718 5680927 5734663 5860961 6022631 5916785 5606614 5935140
1052 5935140 6186869 5999119 6145276 6057974 5852893 5849077 5827779 5763848 5525774 5005327
1042 5005327 4401741 4145189 4390875 4162709 4242471 4232805 4479441 4548063 4410511 4704833
1032 4704833 4530301 4420074 4659099 4773809 4475683 4632260 4901097 4836735 4556104 4702125
1022 4702125 5038177 5260074 5265086 5122953 5155619 5192769 4953021 5229982 5362479 5345980
1012 5345980 5096881 5391375 5487024 5609173 6061576 6516694 6908973 7181292 7455746 7710655
$$ packed form
1082D143248M01588K62134L83397K75946J64239J29029K51467L8941j83791k91192
1072E575006n2647L81692J2191k48119l26176q561k06600J10569Q4249j33858
1062E187746O0490N8889L34593L9209N3736J26298J61670j05846l10171L28526
1052E935140K51729j87750J46157q7302k05081l816k1298o3931k38074n20447
1042E005327o03586k56552K45686k28166P9762r666K46636O8622j37552K94322
1032D704833j74532j10227K39025J14710k98126J56577K68837o4362k80631J46021
1022D702125L36052K21897N012j42133L2666L7150k39748K76961J32497j6499
1012E345980k49099K94494R5649J22149M52403M55118L92279K72319K74454K54909
$$ plain form
1002 7710655 7916298 8332086 9121534 9499942 9723570 10317009 10402008 11048997 11554827 11905284
992 11905284 12534804 13333948 13747458 14282110 15146602 16387569 17727646 19407333 20866166
983 20866166 22581438 24363848 25619583 26981768 28811078 30910445 33871739 37085366
975 37085366 41877461 48088473 56551709 67734741 81922280 95627644 110401113 125185823
967 125185823 132394908 120732175 94503269 72648453 57209833 47597330 40988359 35876045
959 35876045 31947959 28706707 25804897 23485733 21725091 20378510 19390355 18824600 18021397
950 18021397 17109395 15596330 14603291 13613004 12764685 11885779 11017247 10705189 10358186
941 10358186 9718266 9248342 8738525 8326671 8176948 8036934 7682486 7483699 6997729 6765234
$$ packed form
1002G710655K05643M15788P89448L78408K23628N93439Q4999O46989N05830L50457
992A1905284O29520P99144M13510N34652Q64492J240967J340077J679687J458833
983B0866166J715272J782410J255735J362185J829310K099367K961294L213627
975C7085366M792095O211012Q463236J1183032J4187539J3705364J4773469J4784710
967A25185823P209085j1662733k6228906k1854816j5438620r612503o608971n112314
959C5876045l928086l241252k901810k319164j760642j346581r88155n65755q03203
950A8021397r12002j513065r93039r90287q48319q78906q68532l12058l47003
941A0358186o39920m69924n09817m11854j49723j40014l54448j98787m85970k32495
$$ plain form
931 6765234 6678474 6522024 6134685 5671381 5405830 5439943 5140854 5142698 5101026 5074822 4843013
920 4843013 4619269 4422819 4164963 3819419 4052413 4028586 3684997 3712966 3922197 3930249
910 3930249 3981823 3862458 3783781 3542393 3315972 3202714 3127888 3129116 2884906 2791929 2744198
899 2744198 2709965 2783442 2749055 2645493 2527008 2679286 2689905 2660201 2351564 2332458 2418687
888 2418687 2424692 2578297 2370837 2235199 2116334 2078196 2065824 1928789 2110499 2097048 1885462
877 1885462 2093017 1935443 1803236 1817100 1751800 1556174 1714502 1573029 1599055 1448302
867 1448302 1587572 1511343 1455075 1623451 1436874 1353301 1336361 1359332 1580149 1214852 1324492
856 1324492 1109444 934505 1225576 1316668 1150483 1254805 1296787 1349097 1208714 911351
$$ packed form
931F765234q6760j56450l87339m63304k65551L4113k99089J844m1672k6204k31809
920D843013k23744j96450k57856l45544K32994k3827l43589K7969K09231Q052
910C930249N1574j19365p8677k41388k26421j13258p4826J228k44210r2977m7731
899B744198l4233P3477l4387j03562j18485J52278J0619k9704l08637j9106Q6229
888B418687O005J53605k07460j35638j18865l8138j2372j37035J81710j3451k11586
877A885462K07555j57574j32207J3864o5300j95626J58328j41473K6026j50753
867A448302J39270p6229n6268J68376j86577q3573j6940K2971K20817l65297J09640
856A324492k15048j74939K91071R1092j66185J04322M1982N2310j40383k97363
$$ plain form
846 911351 653226 677752 806797 795882 671924 818962 800453 1043178 1116413 1170797 970641
835 970641 632733 774711 921500 846032 839692 746702 481123 501809 339830 457305 601634
824 601634 590058 796245 672007 656081 866221 701353 798383 606684 482532 542437 532596
813 532596 935623 927509 752956 884498 823581 842993 921016 390567 325051 689907 447625
802 447625 607444 578369 740113 676844 760534 658572 591967 563293 440338 571964 751468
791 751468 769994 449324 511580 528579 809497 743926 416823 281000 103776 58377 359287
780 359287 450519 420994 144224 16895 351319 298757 392697 537520 821287 868216 542054
769 542054 554523 688294 652846 201521 -32477 70034 428544 334698 319546 221872 229459
$$ packed form
846I11351k58125K4526J29045j0915j23958J47038j8509K42725P3235N4384k00156
835I70641l37908J41978J46789p5468o340r2990k65579K0686j61979J17475J44329
824F01634j1576K06187j24238j5926K10140j64868R7030j91699j24152N9905r841
813E32596M03027q114j74553J31542o0917J9412P8023n30449o5516L64856k42282
802D47625J59819k9075J61744o3269Q3690j01962o6605k8674j22955J31626J79504
791G51468J8526l20670O2256J6999K80918o5571l27103j35823j77224m5399L00910
780C59287R1232k9525k76770j27329L34424n2562R3940J44823K83767M6929l26162
769E42054J2469J33771l5448m51325k33998J02511L58510r3846j5152r7674P587
$$ plain form
758 229459 456257 381113 196324 395526 476691 356218 149261 584191 435593 273124
748 273124 404190 356863 374678 261370 173474 199091 27312 -37665 404105 535165 316116
737 316116 223994 498120 149531 -56072 -79749 29464 93933 -235755 -217740 93635 -42780
726 -42780 383432 229983 68709 -50016 412226 212381 78725 313541 148826 127351
716 127351 178807 287667 312762 316728 241347 32518 -206097 -58890 169791 187425 237733
705 237733 268717 17883 -39502 11525 80724 113280 318850 187752 145208 100201 -96228
694 -96228 75887 -124025 213572 368024 395742 168132 85687 99912 252386 427969 580931
683 580931 527765 461665 784883 797043 585045 685194 838311 607823 300601 314005 239116
$$ packed form
758B29459K26798p5144j84789J99202Q1165j20473k06957M34930j48598j62469
748B73124J31066m7327J7815j13308q7896K5617j71779o4977M41770J31060k19049
737C16116r2122K74126l48589k05603k3677J09213O4469l29688J8015L11375j36415
726d2780M26212j53449j61274j18725M62242j99845j33656K34816j64715k1475
716A27351N1456J08860K5095L966p5381k08829k38615J47207K28681J7634N0308
705B37733L0984k50834n7385N1027O9199L2556K05570j31098m2544m5007j96429
694i6228J72115j99912L37597J54452K7718k27610q2445J4225J52474J75583J52962
683E80931n3166o6100L23218J2160k11998J00149J53117k30488l07222J3404p4889
$$ plain form
672 239116 308518 226862 245212 300394 414327 433947 334134 29055 2989 -139850 -37036
661 -37036 107455 50458 60481 -218666 -73080 -447857 -285609 -187877 -3319 301544 146483
650 146483 252992 290875 109906 188992 237312 334108 163089 126580 100472 1656 -83451
639 -83451 -20756 196161 57881 -394696 -326715 -203063 -518792 -549383 -308407 -130310 -38603
628 -38603 14310 83610 71100 -143053 -62455 32892 -342715 -362783 -53088 -98189 -168169
617 -168169 -311349 -373857 -13094 58870 -54161 -351922 -367448 -180414 -105518 -271887 -123958
606 -123958 12467 61957 -183330 -190524 -384341 -273295 -124920 -109172 -106223 -143627 -145057
595 -145057 -166394 -89391 -69713 81719 18776 -431622 -641137 -654272 -137228 -232050 -382555
$$ packed form
672B39116O9402q1656J8350N5182J13933J9620r9813l05079k6066j42839J02814
661c7036J44491n6997J0023k79147J45586l74777J62248R7732J84558L04863j55061
650A46483J06509L7883j80969P9086M8320R6796j71019l6509k6108r8816q5107
639h3451O2695K16917j38280m52577O7981J23652l15729l0591K40976J78097R1707
628c8603N2913O9300j2510k14153Q0598R5347l75607k0068L09695m5101o9980
617a68169j43180o2508L60763P1964j13031k97761j5526J87034P4896j66369J47929
606a23958J36425M9490k45287p194j93817J11046J48375J5748K949l7404j430
595a45057k1337P7003J9678J51432o2943m50398k09515j3135N17044r4822j50505
$$ plain form
584 -382555 -28419 -145031 -206147 105589 149513 54490 -233434 -25241 -10032 -37177 -209693
573 -209693 -14317 28978 -338255 -321403 -213035 -132690 -53696 16152 -402779 -329488 -208240
562 -208240 -317921 -341180 -250485 -390118 -537309 -533631 -347378 -249867 -322352 -338702 -125529
551 -125529 211625 -15822 -97350 -174212 -314922 -369013 -444128 -339291 -79755 -162724 -78092
540 -78092 189119 -52695 -43616 -162876 -143791 -355606 -247330 -502521 -529602 -578351 -336459
529 -336459 -492041 -269697 -223104 -311799 -311096 -260922 -152766 -32740 -151384 -448599 -245273
518 -245273 -386524 -313907 -173386 -367686 -190367 -290620 -105276 149095 120542 -95197
508 -95197 -116124 -173173 -433515 -504919 -540403 -738582 -484754 -177547 -513206 -425790 -410504
$$ packed form
584c82555L54136j16612o1116L11736M3924r5023k87924K08193J5209k7145j72516
573b09693J95376M3295l67233J6852J08368Q0345P8994O9848m18931P3291J21248
562b08240j09681k3259R0695j39633j47191L678J86253R7511p2485j6350K13173
551a25529L37154k27447q1528p6862j40710n4091p5115J04837K59536q2969Q4632
540g8092K67211k41814R079j19260J9085k11815J08276k55191k7081m8749K41892
529c36459j55582K22344M6593q8695P03N0174J08156J20026j18644k97215K03326
518b45273j41251P2617J40521j94300J77319j00253J85344K54371k8553k15739
508i5197k0927n7049k60342p1404l5484j98179K53828L07207l35659Q7416J5286
$$ plain form
497 -410504 -416686 -142294 -92082 -205353 -2485 -206015 -345118 -285114 -146579 -122205 -450476
486 -450476 -593184 -308034 13895 -167124 -122254 -404950 -627360 -561478 -542680 -600378 -347854
475 -347854 -166718 -268852 -10798 -103919 -525267 -456336 -345964 -499524 -464991 -267886
465 -267886 -252244 -495545 -620835 -612010 -695246 -488947 -502275 -686517 -514890 -429428 -534742
454 -534742 -461928 -309682 -415516 -522358 -678782 -397383 -276680 -579087 -535424 -476955
444 -476955 -499195 -98474 -361225 -95245 -81830 -345294 -457817 -234472 -385634 -381266 -231789
433 -231789 -337809 -387290 -683903 -583362 -470630 -737609 -698089 -273774 -259539 -318027 -445787
422 -445787 -836086 -788725 -660981 -765291 -732139 -595755 -414925 -644081 -454271 -332138
$$ packed form
497d10504o182K74392N0212j13271K02868k03530j39103O0004J38535K4374l28271
486d50476j42708K85150L21929j81019M4870k82696k22410O5882J8798n7698K52524
475c47854J81136j02134K58054r3121m21348O8931J10372j53560L4533J97105
465b67886J5642k43301j25290Q825q3236K06299j3328j84242J71627Q5462j05314
454e34742P2814J52246j05834j06842j56424K81399J20703l02407M3663N8469
444d76955k2240M00721k62751K65980J3415k63464j12523K23345j51162M368J49477
433b31789j06020m9481k96613J00541J12732k66979L9520M24315J4235n8488j27760
422d45787l90299M7361J27744j04310L3152J36384J80830k29156J89810J22133
$$ plain form
412 -332138 -387198 -486544 -639409 -562620 -425263 -608003 -629310 -646946 -383589 -239361 -446507
401 -446507 -685725 -620692 -724952 -661325 -828321 -1118714 -756189 -749202 -584603 -436660 -518970
390 -518970 -603237 -747627 -804767 -746961 -678331 -709786 -620886 -348781 -438729 -691986 -689611
379 -689611 -521711 -412433 -415876 -488835 -651054 -578171 -500086 -517156 -599498 -755915 -912083
368 -912083 -1119640 -840172 -649175 -694482 -746075 -589105 -555500 -505971 -765917 -954775 -624007
357 -624007 -577365 -608127 -516329 -573637 -425416 -667626 -569698 -712407 -585658 -710635 -806819
346 -806819 -956560 -873487 -768150 -1188764 -804800 -560544 -430550 -594545 -754678 -590036
336 -590036 -678161 -455212 -611398 -611309 -769374 -840367 -848981 -866193 -715070 -763925 -1026002 -1054310
$$ packed form
412c32138n5060r9346j52865P6789J37357j82740k1307j7636K63357J44228k07146
401d46507k39218O5033j04260O3627j66996k90393L62525O987J64599J47943q2310
390e18970q4267j44390n7140N7806O8630l1455Q8900K72105q9948k53257K375
379f89611J67900J09278l443p2959j62219P2883P8085j7070q2342j56417j56168
368i12083k07557K79468J90997m5307n1593J56970L3605M9529k59946j88858L30768
357f24007M6642l0762R1798n7308J48221k42210R7928j42709J26749j24977r6184
346h06819j49741Q3073J05337m20614L83964K44256J29994j63995j60133J64642
336e90036q8125K22949j56186Q9j58065p0993q614j7212J51123m8855k62077k8308
$$ plain form
324 -1054310 -980513 -819804 -686096 -611497 -648577 -491782 -596999 -616338 -740224 -942236
314 -942236 -895489 -584122 -443716 -733623 -817705 -1092773 -1024107 -743624 -696471 -849827 -593486
303 -593486 -715008 -821530 -979624 -630249 -587063 -811788 -580926 -599852 -903840 -819414
293 -819414 -769389 -615518 -1195741 -949340 -1090108 -1115566 -678181 -498854 -463427 -849043
283 -849043 -993645 -862076 -994016 -1069652 -1371054 -1073101 -1007981 -792772 -690874 -884503
273 -884503 -754314 -549826 -742178 -979235 -621802 -809136 -928214 -871198 -769972 -815234
263 -815234 -738056 -739936 -841317 -992155 -1255453 -939420 -1020335 -644684 -791630 -997291 -980215
252 -980215 -1236413 -1060554 -1005268 -914083 -817597 -870020 -764700 -950269 -1070400 -1182613 -982179
$$ packed form
324a054310P3797J60709J33708P4599l7080J56795j05217j9339j23886k02012
314i42236M6747L11367J40406k89907q4082k75068O8666K80483M7153j53356K56341
303e93486j21522j06522j58094L49375M3186k24725K30862j8926l03988Q4426
293h19414N0025J53871n80223K46401j40768k5458M37385J79327L5427l85616
283h49043j44602J31569j31940p5636l01402K97953O5120K15209J01898j93629
273h84503J30189K04488j92352k37057L57433j87334j19078N7016J01226m5262
263h15234P7178j880j01381j50838k63298L16033q0915L75651j46946k05661J7076
252i80215k56198J75859N5286R1185R6486n2423J05320j85569j20131j12213K00434
$$ plain form
241 -982179 -793935 -1133350 -1281625 -1004151 -674067 -1010435 -1101057 -1115092 -1099753 -1025993 -1042713
230 -1042713 -1048039 -833310 -934885 -922074 -981046 -895690 -810151 -698265 -829805 -1013825 -1151001
219 -1151001 -1063228 -1083469 -911641 -1243302 -1050156 -731038 -761722 -836637 -958818 -840303
209 -840303 -805641 -1069187 -1249256 -1027725 -876533 -873755 -1006159 -1104655 -1155824 -1320200 -1151875
198 -1151875 -961295 -847615 -892006 -849792 -892356 -990127 -962775 -916573 -942187 -862323 -715284
187 -715284 -826042 -963698 -1185779 -1182761 -925316 -980538 -1095515 -1153348 -947175 -1040838 -928701
176 -928701 -830121 -1093783 -1419051 -1263110 -1121274 -1157053 -660723 -722232 -977510 -1230408
166 -1230408 -1133369 -976881 -884299 -738484 -917568 -895954 -898346 -1033579 -939202 -995335 -1186227
$$ packed form
241i82179J88244l39415j48275K77474L30084l36368r0622j4035J5339P3760j6720
230a042713n326K14729j01575J2811n8972Q5356Q5539J11886j31540j84020j37176
219a151001Q7773k0241J71828l31661J93146L19118l0684p4915j22181J18515
209h40303L4662k63546j80069K21531J51192K778j32404r8496n1169j64376J68325
198a151875J90580J13680m4391M2214m2564r7771K7352M6202k5614P9864J47039
187g15284j10758j37656k22081L018K57445n5222j14977n7833K06173r3663J12137
176i28701R8580k63662l25268J55941J41836l5779M96330o1509k55278k52898
166a230408R7039J56488R2582J45815j79084K1614k392j35233R4377n6133j90892
$$ plain form
155 -1186227 -1384646 -1169208 -1244772 -1294533 -1287256 -938659 -1069807 -1285074 -1087706 -999136 -737684
144 -737684 -889553 -1301813 -1179068 -1032136 -1002831 -1197047 -1313948 -1417507 -1365775 -1088254
134 -1088254 -955824 -877524 -1375533 -1436325 -1319301 -1173397 -1365638 -1222826 -1219652 -1191306 -1198437
123 -1198437 -1320312 -1431126 -1374090 -1355800 -1403657 -980501 -1039783 -1076873 -1095389 -1205794 -1256849
112 -1256849 -1408098 -1372421 -1339519 -1305813 -1233794 -1259152 -1346531 -1370796 -1356944 -1270387 -1114319
101 -1114319 -1124706 -789076 -725197 -1061464 -1237660 -1165249 -959128 -976626 -1317071 -1467623
91 -1467623 -1426889 -1463917 -1298643 -1238485 -1351137 -1441169 -1367809 -1122029 -1255649 -1140410 -1348842
80 -1348842 -1342738 -1336675 -1272622 -1244802 -1173024 -1163882 -1329026 -1389137 -1367092 -1090438 -1150699 -1250842
$$ packed form
155a186227j98419K15438p5564m9761P277L48597j31148k15267J97368Q8570K61452
144g37684j51869m12260J22745J46932K9305j94216j16901j03559N1732K77521
134a088254J32430P8300m98009o0792J17024J45904j92241J42812L174K8346p131
123a198437j21875j10814N7036J8290m7857M23156n9282l7090j8516j10405n1055
112a256849j51249L5677L2902L3706P2019k5358q7379k4265J3852Q6557J56068
101a114319j0387L35630O3879l36267j76196P2411K06121j7498l40445j50552
91a467623M0734l7028J65274O0158j12652r0032P3360K45780j33620J15239k08432
80a348842O104O063O4053K7820P1778R142j65144o0111K2045K76654o0261j00143
$$ plain form
68 -1250842 -1273686 -1286218 -1147115 -1261808 -1362418 -1305024 -1204202 -1154151 -1280355 -1290744 -1442199
57 -1442199 -1476524 -1457067 -1414803 -1290503 -1347131 -1279454 -1184488 -1227172 -1264851 -1490912 -1413825
46 -1413825 -1117966 -775272 -913323 -1213664 -1085790 -1105471 -1189203 -1316485 -1417857 -1440317
36 -1440317 -1459910 -1402118 -1195244 -1284033 -1253635 -1180080 -1166715 -1435187 -1566915 -1449947 -1638231
25 -1638231 -1666951 -1568443 -1395937 -1448784 -1347065 -1330943 -1490418 -1599786 -1436027 -1431823 -1482673
14 -1482673 -1517655 -1591410 -1533002 -1428692 -1502890 -1444986 -1217839 -1284871 -1312312 -1518636 -1443071
3 -1443071 -1327200 -1280645 -1284238
0 -1284238
$$ packed form
68a250842k2844j2532J39103j14693j00610N7394J00822N0051j26204j0389j51455
57a442199l4325J9457M2264J24300n6628O7677R4966m2684l7679k26061P7087
46a413825K95859L42694j38051l00341J27874j9681q3732j27282j01372k2460
36a440317j9593N7792K06874q8789L0398P3555J3365k68472j31728J16968j88284
25a638231k8720R8508J72506n2847J01719J6122j59475j09368J63759M204n0850
14a482673l4982p3755N8408J04310p4198N7904K27147o7032k7441k06324P5565
3a443071J15871M6555l593
0a284238
$$ Imaginary data points
##PAGE= N=2
##DATA TABLE= (X++(I..I)), XYDATA
$$ plain form
16383 -7287582 -7071068 -7008489 -6778614 -6604398 -6866079 -6824056 -6821215 -6775347 -6834987 -6462545
16373 -6462545 -6194260 -6340301 -6240948 -6047682 -5992460 -5957029 -6021022 -5742707 -5629208 -5850553
16363 -5850553 -5685095 -5592205 -5473259 -5332842 -5124365 -5051928 -4931866 -4870959 -4787974 -4723909
16353 -4723909 -4696097 -4657092 -4500362 -4498214 -4400872 -4393434 -4332522 -4118573 -4045334 -3997137 -3830034
16342 -3830034 -3724511 -3692974 -3817648 -3708482 -3698920 -3746529 -3403627 -3369547 -3100681 -3067566
16332 -3067566 -3054228 -2905228 -2806319 -2660509 -2733408 -2694678 -2336846 -2400873 -2664322 -2603681
16322 -2603681 -2602213 -2614143 -2214716 -2166982 -1989176 -1884654 -1901562 -1870971 -1789290 -1785860 -1543499
16311 -1543499 -1601055 -1579201 -1409058 -1286781 -1172467 -1096976 -1135222 -1118656 -1106278 -1110150 -887549
$$ packed form
16383g287582K16514O2579K29875J74216k61681M2023K841M5868n9640L72442
16373f462545K68285j46041R9353J93266N5222L5431o3993K78315J13499k21345
16363e850553J65458R2890J18946J40417K08477P2437J20062O0907Q2985O4065
16353d723909K7812L9005J56730K148R7342P438O0912K13949P3239M8197J67103
16342c830034J05523L1537j24674J09166R562m7609L42902L4080K68866L3115
16332c067566J3338J49000R8909J45810p2899L8730L57832o4027k63449O0641
16322b603681J468j1930L99427M7734J77806J04522j6908L0591Q1681L430K42361
16311a543499n7556K1854J70143J22277J14314P5491l8246J6566J2378l872K22601
$$ plain form
16300 -887549 -652731 -708100 -674479 -814261 -941218 -454651 -427676 -519867 -357144 -136109
16290 -136109 -288086 -205682 -702 -8319 101795 183566 187241 181063 252826 387529 440064
16279 440064 598351 425482 520539 564427 773944 624531 581574 701247 1042528 1195131
16269 1195131 1110853 1083879 944319 924685 910370 993911 1036059 1309915 1398376 1285636 1080802
16258 1080802 1560196 1529538 1448602 1490098 1829993 1963732 1923327 1896325 1933967 2006831 2169302
16247 2169302 2252231 2106218 2371036 2245833 2156309 2264917 2041727 2149260 2431120 2282188
16237 2282188 2474591 2477315 2580220 2638590 2500859 2461232 2494902 2812260 3048675 2751352
16227 2751352 2514753 2493946 2740729 3013376 3239195 3241779 3114522 2971150 2935083 3092941
$$ packed form
16300h87549K34818n5369L3621j39782j26957M86567K6975r2191J62723K21035
16290a36109j51977Q2404K04980p617J10114Q1771L675o178P1763J34703N2535
16279D40064J58287j72869R5057M3888K09517j49413m2957J19673L41281J52603
16269A195131q4278k6974j39560j9634j4315Q3541M2148K73856Q8461j12740k04834
16258A080802M79394l0658q0936M1496L39895J33739m0405k7002L7642P2864J62471
16247B169302Q2929j46013K64818j25203q9524J08608k23190J07533K81860j48932
16237B282188J92403K724J02905N8370j37731l9627L3670L17358K36415k97323
16227B751352k36599k0807K46783K72647K25819K584j27257j43372l6067J57858
$$ plain form
16217 3092941 3169764 3042966 3168022 3152696 3305427 3403408 3522556 3427673 3356267 3355591 3546620
16206 3546620 3544521 3612834 3598420 3768414 3853956 3854111 3832989 3844049 3847153 3973044 4119119
16195 4119119 4248407 4179817 3844560 4073850 3946730 3975673 4044603 4037657 4388233 4300190
16185 4300190 4289352 4330482 4217568 4306874 4466958 4405662 4269427 4399964 4447988 4498793
16175 4498793 4443466 4487507 4278127 4527791 4473915 4722588 4589280 4767523 4825784 4779722
16165 4779722 4746182 4331257 4510176 4816578 4766798 4625884 4597232 4386648 4592316 4719216
16155 4719216 4890522 4592707 4724000 4602409 4352477 4671836 4536863 4595217 4537892 4580825
16145 4580825 5041004 4977941 4930255 4841411 5156991 5272931 4892976 4930221 4940246 5080297
$$ packed form
16217C092941P6823j26798J25056j5326J52731R7981J19148r4883p1406o76J91029
16206C546620k099O8313j4414J69994Q5542J55k1122J1060L104J25891J46075
16195D119119J29288o8590l35257K29290j27120K8943O8930o946L50576q8043
16185D300190j0838M1130j12914Q9306J60084o1296j36235J30537M8024N0805
16175D498793n5327M4041k09380K49664n3876K48673j33308J78243N8261m6062
16165D779722l3540m14925J78919L06402m9780j40914k8652k10584K05668J26900
16155D719216J71306k97815J31293j21591k49932L19359j34973N8354n7325M2933
16145D580825M60179o3063m7686q8844L15580J15940l79955L7245J0025J40051
$$ plain form
16135 5080297 4944529 4936040 5007602 4879479 4913258 5123996 5038034 5011442 5269598 5520261
16125 5520261 5424732 5243895 5062643 5011782 5159994 5166339 5024873 5004180 4820817 5323625
16115 5323625 5468892 5379619 5233042 5195861 5115631 5182483 5173213 5314853 5150425 4868937
16105 4868937 5072499 5218926 5404342 5266831 5284259 5386244 5220483 5212326 5351130 5482304
16095 5482304 5326841 5604055 5750076 5355547 5342410 5203966 5228207 5333077 5482520 5551755
16085 5551755 5532899 5636265 5744494 5685301 5315225 5242676 5463599 5605866 5710340 5537837
$$ packed form
16135E080297j35768q489P1562j28123L3779K10738q5962k6592K58156K50663
16125E520261r5529j80837j81252n0861J48212O345j41466k0693j83363N02808
16115E323625J45267q9273j46577l7181q0230O6852r270J41640j64428k81488
16105D868937K03562J46427J85416j37511J7428J01985j65761q157J38804J31174
16095E482304j55463K77214J46021l94529j3137j38444K4241J04870J49443O9235
16085E551755j8856J03366J08229n9193l70076p2549K20923J42267J04474j72503
$$ [...]
##END NTUPLES=NMR SPECTRUM
##END=
