##TITLE=1H_EC-3252(III-1)
 CDCl3,8 sc, 
 7.04.2021
##JCAMPDX= 6.0         $$ Bruker NMR JCAMP-DX V2.0
##DATA TYPE= NMR SPECTRUM
##DATA CLASS= NTUPLES
##ORIGIN= UXNMR, Bruker Analytische Messtechnik GmbH
##OWNER= root
$$ XWIN-NMR		Version 3.5
$$ Wed Apr  7 11:25:52 2021 Russian Standard Time (UT+4h)  she@DPX200
##.OBSERVE FREQUENCY= 200.131506
##.OBSERVE NUCLEUS= ^1H
##.ACQUISITION MODE= SIMULTANEOUS
##.ACQUISITION SCHEME= undefined
##.AVERAGES= 8
##.DIGITISER RES= 18
##SPECTROMETER/DATA SYSTEM= spect
##.PULSE SEQUENCE= zg30
##.SOLVENT NAME= CDCl3
##.SHIFT REFERENCE= (INTERNAL, CDCl3, 0, 15.9771)
##AUDIT TRAIL= $$ (NUMBER, WHEN, WHO, WHERE, WHAT)
$$ ##TITLE= Audit trail, XWIN-NMR		Version 3.5
$$ ##JCAMPDX= 5.01
$$ ##ORIGIN= Bruker BioSpin GmbH
$$ ##OWNER= she
$$ F:/spectra/data/she/nmr/H-F/1/pdata/1/auditp.txt
$$ ##AUDIT TRAIL=  $$ (NUMBER, WHEN, WHO, WHERE, WHAT)
(   1,<2021-04-07 11:23:07.85 +0400>,<she>,<DPX200>,
      <created by zg, POWCHK disabled, PULCHK disabled
       configuration hash MD5:
       00 E9 B6 7A A2 85 ED C7 34 08 36 98 17 FE 4E 26
       data hash MD5: 16K
       C6 1D B0 C6 9C 93 1F FF 5E 39 27 D3 6E E7 C7 F8>)
(   2,<2021-04-07 11:23:10.53 +0400>,<she>,<DPX200>,
      <Start of raw data processing
       efp BC_mod = 2 LB = 0.24 FT_mod = 6 PKNL = 1 PHC0 = -11128.86 PHC1 = 22.40092 SI = 16K 
       data hash MD5: 16K
       0E BD 45 3C 26 DF ED 87 5E 42 85 BA C4 2E D2 86>)
(   3,<2021-04-07 11:23:34.82 +0400>,<she>,<DPX200>,
      <pk PHC0 = 13.26524 PHC1 = -13.2 
       data hash MD5: 16K
       7A AD 95 30 3E 6F F1 F1 CC 7F 86 05 2A 3F E4 69>)
(   4,<2021-04-07 11:23:38.84 +0400>,<she>,<DPX200>,
      <abs ABSG = 5 
       data hash MD5: 16K
       84 17 76 1C 81 36 A9 02 D6 EC EE 66 72 0E E2 24>)
$$ ##END=
$$ 
$$ hash MD5
$$ 0D 26 4C C0 0E 88 4B 0D 44 28 F0 D5 B9 59 F5 37
##$RELAX= 
##$RELAX= 
##$RELAX= 
##$RELAX= 
##$RELAX= 
##$RELAX= 
$$ Bruker specific parameters
$$ --------------------------
##$DU= <F:/spectra>
##$EXPNO= 1
##$NAME= <H-F>
##$PROCNO= 1
##$TYPE= <nmr>
##$USER= <she>
##$AMP= (0..31)
100 100 100 100 100 100 100 100 100 100 100 100 100 100 100 100 100 100 
100 100 100 100 100 100 100 100 100 100 100 100 100 100 
##$AQSEQ= 0
##$AQ_mod= 1
##$AUNM= <au_zg>
##$AUTOPOS= <>
##$BF1= 200.13
##$BF2= 200.13
##$BF3= 200.13
##$BF4= 200.13
##$BF5= 200.13
##$BF6= 200.13
##$BF7= 200.13
##$BF8= 200.13
##$BYTORDA= 1
##$CFDGTYP= 0
##$CFRGTYP= 5
##$CHEMSTR= <none>
##$CNST= (0..31)
1 1 145 1 1 1 1 1 1 1 1 1 1 1 1 1 1 1 1 1 1 1 1 1 1 1 1 1 1 1 1 1 
##$CPDPRG= <>
##$CPDPRG1= <>
##$CPDPRG2= <>
##$CPDPRG3= <>
##$CPDPRG4= <mlev>
##$CPDPRG5= <mlev>
##$CPDPRG6= <mlev>
##$CPDPRG7= <mlev>
##$CPDPRG8= <mlev>
##$CPDPRGB= <>
##$CPDPRGT= <>
##$D= (0..31)
0 1.2 0 0 0 0 0 0 0 0.06 0 0.03 0 0 0 0 0.0002 0 0 0 0 0 0 0 0 0 0 0 0 
0 0 0 
##$DATE= 1617780187
##$DBL= (0..7)
120 120 120 120 120 120 120 120 
##$DBP= (0..7)
150 150 150 150 150 150 150 150 
##$DBP07= 0
##$DBPNAM0= <>
##$DBPNAM1= <>
##$DBPNAM2= <>
##$DBPNAM3= <>
##$DBPNAM4= <>
$$ [...]
##$SUBNAM3= <"">
##$SUBNAM4= <"">
##$SUBNAM5= <"">
##$SUBNAM6= <"">
##$SUBNAM7= <"">
##$SUBNAM8= <"">
##$SUBNAM9= <"">
##$SW= 16.9725357007746
##$SWIBOX= (0..15)
0 0 2 0 0 0 0 0 0 0 0 0 0 0 0 0 
##$SW_h= 3396.73913043478
##$TD= 16384
##$TD0= 1
##$TE= 0
##$TE2= 300
##$TE3= 300
##$TEG= 300
##$TL= (0..7)
0 120 120 120 120 120 120 120 
##$TP= (0..7)
150 150 150 150 150 150 150 150 
##$TP07= 0
##$TPNAME0= <>
##$TPNAME1= <>
##$TPNAME2= <>
##$TPNAME3= <>
##$TPNAME4= <>
##$TPNAME5= <>
##$TPNAME6= <>
##$TPNAME7= <>
##$TPOAL= (0..7)
0.5 0.5 0.5 0.5 0.5 0.5 0.5 0.5 
##$TPOFFS= (0..7)
0 0 0 0 0 0 0 0 
##$TUNHIN= 0
##$TUNHOUT= 0
##$TUNXOUT= 0
##$USERA1= <user>
##$USERA2= <user>
##$USERA3= <user>
##$USERA4= <user>
##$USERA5= <user>
##$V9= 5
##$VALIST= <valist>
##$VCLIST= <CCCCCCCCCCCCCCC>
##$VD= 0
##$VDLIST= <DDDDDDDDDDDDDDD>
##$VPLIST= <PPPPPPPPPPPPPPP>
##$VTLIST= <TTTTTTTTTTTTTTT>
##$WBST= 1024
##$WBSW= 4
##$XGAIN= (0..3)
0 0 0 0 
##$XL= 0
##$YL= 0
##$YMAX_a= 231341
##$YMIN_a= -245715
##$ZGOPTNS= <>
##$ZL1= 120
##$ZL2= 120
##$ZL3= 120
##$ZL4= 120
##$ABSF1= 15.97092
##$ABSF2= -1.001742
##$ABSG= 5
##$ABSL= 3
##$ALPHA= 0
##$AQORDER= 0
##$ASSFAC= 0
##$ASSFACI= 0
##$ASSFACX= 0
##$ASSWID= 0
##$AUNMP= <proc_1d>
##$AZFE= 0.1
##$AZFW= 0.1
##$BCFW= 0
##$BC_mod= 2
##$BYTORDP= 0
##$COROFFS= 0
##$CY= -3
##$DATMOD= 1
##$DC= 0
##$DFILT= <>
##$DTYPP= 0
##$F1P= 0
##$F2P= 0
##$FCOR= 1
##$FTSIZE= 16384
##$FT_mod= 6
##$GAMMA= 0
##$GB= 0
##$INTBC= 1
##$INTSCL= 2.992141e-10
##$ISEN= 128
##$LB= 0.24
##$LEV0= 0
##$LPBIN= 0
##$MAXI= 10000
##$MC2= 0
##$MEAN= 0
##$ME_mod= 0
##$MI= 1.114404
##$NCOEF= 0
##$NC_proc= -9
##$NLEV= 6
##$NOISF1= 3.799351
##$NOISF2= 2.8
##$NSP= 0
##$NTH_PI= 0
##$NZP= 0
##$OFFSET= 15.97713
##$PC= 1
##$PHC0= -11115.59
##$PHC1= 9.200921
##$PH_mod= 1
##$PKNL= yes
##$PPARMOD= 0
##$PSCAL= 0
##$PSIGN= 0
##$REVERSE= no
##$SF= 200.130006865044
##$SI= 16384
##$SIGF1= 3
##$SIGF2= 2
##$SINO= 5.538805
##$SIOLD= 16384
##$SREGLST= <1H.CDCl3>
##$SSB= 0
##$STSI= 16384
##$STSR= 0
##$SW_p= 3396.73913043479
##$SYMM= 0
##$S_DEV= 0
##$TDeff= 16384
##$TDoff= 0
##$TI= <>
##$TILT= no
##$TM1= 0
##$TM2= 0
##$TOPLEV= 0
##$USERP1= <user>
##$USERP2= <user>
##$USERP3= <user>
##$USERP4= <user>
##$USERP5= <user>
##$WDW= 1
##$XDIM= 16384
##$YMAX_p= 471175292
##$YMIN_p= -3467175
$$ End of Bruker specific parameters
$$ ---------------------------------
##NTUPLES= NMR SPECTRUM
##VAR_NAME=  FREQUENCY,     SPECTRUM/REAL,   SPECTRUM/IMAG
##SYMBOL=    X,             R,               I
##VAR_TYPE=  INDEPENDENT,   DEPENDENT,       DEPENDENT
##VAR_FORM=  AFFN,          ASDF,            ASDF
##VAR_DIM=   16384,         16384,           16384
##UNITS=     HZ,            ARBITRARY UNITS, ARBITRARY UNITS
##FACTOR=    0.207333158178282, 1,           1
##FIRST=     3197.50312381906, 0,            0
##LAST=      -199.236006615729, 0,           0
##MIN=       -199.236006615729, -3467175,    0
##MAX=       3197.50312381906, 471175292,    0
$$ Real data points
##PAGE= N=1
##DATA TABLE= (X++(R..R)), XYDATA
$$ [...]
5042A5065063j25806j264218N13918j303624J23355j98941J9327Q88036R21541
$$ 15065063 14939257 13675039 14188957 12885333 13008688 12809747 12829074 13717110 14638651
5033A4638651L03149k74033R25513n74700n38106Q13496L49765j231657N47010
$$ 14638651 14941800 14667767 15593280 15018580 14480474 15293970 15643735 14412078 14959088
5024A4959088Q29223j309627q44860J886586K46369m71985L36913j159892Q3127
$$ 14959088 15788311 14478684 13633824 15520410 15766779 15294794 15631707 14471815 14554942
5015A4554942q56234k06603J025488l72596N87589N68747N49645n99218M43332
$$ 14554942 13698708 13492105 14517593 14144997 14732586 15301333 15850978 15251760 15695092
5006A5695092n62437o0032N07646L06888o21308N42971O39742q18615r16711P13575
$$ 15695092 15132655 15072623 15580269 15887157 15265849 15808820 16448562 15629947 14713236 15426811
4996A5426811n09653J86996K6105L04332m99051N46844J262967m2807O87511j57723
$$ 15426811 14917158 15104154 15130259 15434591 14935540 15482384 16745351 16702544 17390055 17232332
4986A7232332l11250p91589J3972J8671Q20736P89337n27094j291574m58720p12802
$$ 17232332 16921082 16129493 16143465 16162136 16982872 17772209 17245115 15953541 15494821 14782019
4976A4782019k76390r45303N5771n19222K25096N67710R5501L95686r5139k78847
$$ 14782019 14505629 13560326 13616097 13096875 13321971 13889681 13985182 14380868 14285729 14006882
4966A4006882j77040K11160p21591Q8510J100707K083j31327J361304r0771N1526
$$ 14006882 13829842 14041002 13319411 13407921 14508628 14510711 14379384 15740688 15649917 15701443
4956A5701443N6374l13074J441015k377213p59768J14472K05183J02366J646434
$$ 15701443 15757817 15444743 16885758 14508545 13748777 13863249 14068432 14170798 15817232
4947A5817232o79557r36352O88356j79422j37265j23106L06726j589727P62620
$$ 15817232 15137675 14201323 14889679 14710257 14572992 14449886 14756612 13166885 13929505
4938A3929505J665267j170115j6710R48495L25167o78630M5940k53091r9634j75881
$$ 13929505 15594772 14424657 14407947 15356442 15681609 15002979 15048919 14795828 14696194 14520313
4928A4520313J094949J859788o91282J22834P37498J06978Q51754L14410q03357
$$ 14520313 15615262 17475050 16783768 16906602 17644100 17751078 18602832 18917242 18113885
4919A8113885L06919K08290j43267K15274M531p87851J74052J424460P28350R41538
$$ 18113885 18420804 18629094 18485827 18701101 18705632 17917781 18091833 19516293 20244643 21186181
4909B1186181m04878M01746J290318J67096n96929L10442J563789O26077l18510
$$ 21186181 20781303 21183049 22473367 22640463 22043534 22353976 23917765 24543842 24225332
4900B4225332Q38535R53863J31349J346474j70316q87697J262321J950805J476995
$$ 24225332 25063867 26017730 26149079 27495553 27325237 26437540 27699861 29650666 31127661
4891C1127661J229248K583321L62499R50769K673978K555168J499263L82385P12359
$$ 31127661 32356909 34940230 35302729 36253498 38927476 41482644 42981907 43364292 44076651
4882D4076651J223392J246489r26085j140218J183551M45983j628980j72134J08880
$$ 44076651 45300043 46546532 45620447 44480229 45663780 46109763 44480783 44308649 44417529
4873D4417529j60191q83172l95635J31964k76860K30528P70505j002334P20957
$$ 44417529 44257338 43374166 42978531 43110495 42833635 43064163 43834668 42832334 43553291
4864D3553291J380111P05544J654879R20193J950145J773332L77235J599572K640541
$$ 43553291 44933402 45638946 47293825 48214018 50164163 51937495 52314730 53914302 56554843
4855E6554843K563027K640632K553922J761926K710395K574758J722275N23182
$$ 56554843 59117870 61758502 64312424 66074350 68784745 71359503 73081778 73604960
4847G3604960K88803N2589j723283k078437l200866o57489j646620l051004l115967
$$ 73604960 73893763 73946352 72223069 70144632 66943766 66286277 64639657 61588653 58472686
4838E8472686j708594k476805q36177l56933j119534j072388j313092j09613k93910
$$ 58472686 56764092 54287287 53451110 53094177 51974643 50902255 49589163 49479550 49185640
4829D9185640p18983L31900J768198r48688P6919L55554J54467L00199L91522
$$ 49185640 48466657 48798557 50566755 49618067 49694986 50050540 50205007 50505206 50896728
4820E0896728Q24034O37208O2726K48515K31478O21401j552312j031128m71331
$$ 50896728 51720762 52357970 52420696 52669211 52900689 53522090 51969778 50938650 50467319
4811E0467319l39011j093986j960523k368004j576050j403235j115183j729521
$$ 50467319 50128308 49034322 47073799 44705795 43129745 41726510 40611327 38881806
4803C8881806m03179k185973q93077m17301j213249o29953r6289l956p62467o12110
$$ 38881806 38478627 36292654 35399577 34982276 33769027 33139074 33042785 33038829 32276362 31664252
4793C1664252n15032L60885r4424j131600j026910k53264J0216J56499o4579m16550
$$ 31664252 31149220 31510105 31415681 30284081 29257171 29003907 29014123 29170622 29106043 28689493
4783B8689493j153132j025574k84485J76598j0882o57895J3339L71506O01895
$$ 28689493 27536361 26510787 26226302 26402900 26392018 25734123 25747462 26118968 26720863
4774B6720863n17085L95128l64775j356112n0529K73452m35520l34204J422879
$$ 26720863 26203778 26598906 26234131 24878019 24827490 25100942 24665422 24331218 25754097
4765B5754097N61290k26591l1963m33214m12233Q50418p24084j097642j16302
$$ 25754097 26315387 26088796 26056833 25623619 25211386 26061804 25337720 24240078 24123776
4756B4123776m35040O08374L56525l58023k70136N52492l86451j391925J19969
$$ 24123776 23688736 24297110 24653635 24295612 24025476 24577968 24191517 22799592 22919561
4747B2919561p98276m56573K83755l39506n80651m02442j61992N11075m36532
$$ 22919561 22121285 21664712 21948467 21608961 21028310 20625868 20463876 20974951 20538419
4738B0538419l90638L02407P96321L97565m6450J11579q97831m41386L08793Q13268
$$ 20538419 20147781 20450188 21246509 21644074 21597624 21709203 20811372 20369986 20678779 21492047
4728B1492047L40247r83282j081668n34331J030971J34366O94914M54235K135939
$$ 21492047 21832294 20849012 19767344 19233013 20263984 20398350 21093264 21547499 23683438
4719B3683438J95923k47438K95228J159721J97268J143203K083192O54355L39066
$$ 23683438 23879361 23631923 23927151 25086872 25284140 26427343 28510535 29164890 29503956
4710B9503956j437155j292558j81007j191397M99543j450237j709873j27393k036362
$$ 29503956 28066801 26774243 26593236 25401839 25901382 24451145 22741272 22613879 20577517
4701B0577517K9032j27602j168130j3788J02019K73119m62822n34324K49240K32781
$$ 20577517 20606549 20478947 19310817 19297029 19399048 19672167 19209345 18675021 18924261 19157042
4691A9157042l23557O61432m22183K0676k73979r28726K31469m51083m29370Q13801
$$ 19157042 18833485 19494917 19072734 19093410 18819431 17890705 18122174 17671091 17241721 18055522
4681A8055522N15813P28038n20467K81609j233897Q3316r7862P7981O97864M6729
$$ 18055522 18571335 19299373 18778906 19060515 17826618 17909934 17812072 17890053 18587917 18634646
4671A8634646p85943L20801Q16310o63601R28923R84829k36752o36601p07664
$$ 18634646 17848703 18169504 18985814 18322213 19251136 20235965 19999213 19362612 18654948
4662A8654948j88421J39150l15473l07840J182619J040053N25681k05055j054358
$$ 18654948 18466527 18605677 18290204 17982364 19164983 20205036 20730717 20525662 19471304
4653A9471304N70880q00377P90998l93571J253869o77326J142267o26501n48678
$$ 19471304 20042184 19241807 20032805 19639234 20893103 20215777 21358044 20731543 20182865
4644B0182865J568212R84104j65608N03229n32089J066069j4355P23239K79132
$$ 20182865 21751077 22735181 22569573 23072802 22540713 23606782 23592427 24315666 24594798
4635B4594798j170638k30989K195732J013627K49044k83619J85241J941469M68268
$$ 24594798 23424160 23193171 25388903 26402530 26651574 26367955 26553196 28494665 28962933
4626B8962933J179960P13658J461417J314464M7943P25487J607428J403468K059507
$$ 28962933 30142893 30856551 32317968 33632432 33680375 34405862 36013290 37416758 39476265
4617C9476265J928362K205777K959165K957518K973780K044936J250391j216826
$$ 39476265 41404627 43610404 46569569 49527087 52500867 54545803 55796194 54579368
4609E4579368j632057L15998p30781n0918p20713o67497K185495J358044J793353
$$ 54579368 52947311 53263309 52532528 52481610 51760897 51093400 53278895 54636939 56430292
4600E6430292K042774J364609K027054l34390J060954J316290o3706K052624J753189
$$ 56430292 58473066 59837675 61864729 61530339 62591293 63907583 63843877 65896501 67649690
4591F7649690K164982L06892j83828K791063L167037L420335M143694L434985
$$ 67649690 69814672 70121564 69937736 72728799 75895836 79316171 83459865 86894850
4583H6894850L369332M827046K623607K371077l0168n450095n802604k652154
$$ 86894850 90264182 95091228 97714835 100085912 100055744 94605649 88803045 86150891
4575H6150891k392689k760299k573331k019552l71935j63021R15536O84433k044073
$$ 86150891 83758202 80997903 78424572 76405020 76033085 75870064 76785600 77470033 75425960
4566G5425960r10395j846390j114209j964770q78623j887642j988429r81034k021679
$$ 75425960 74515565 72669175 71554966 69590196 68711573 66823931 64835502 63854468 61832789
4557F1832789K46553M07941o11441L69420J959387J265411P20347N08834p4364
$$ 61832789 62079342 62487283 61875842 62245262 64204649 65470060 66190407 66699241 66624877
4548F6624877J51783j084477l008474l544011j953605m0713j594333j216840j664005
$$ 66624877 66776660 65692183 62683709 59139698 57186093 57145380 55551047 54334207 52670202
4539E2670202p37937J127512j345685n1519J269003K074703q51166m60869Q14720
$$ 52670202 51932265 53059777 51714092 51662573 52931576 55006279 54155113 53694244 54508964
4530E4508964n35682r95136l161867k090985j041994j542401m78992N74131j206801
$$ 54508964 53973282 52978146 49816279 47725294 46683300 45140899 44661907 45236038 44029237
4521D4029237K3245k1880k51441R64685J629035J06309M76173M22853J285825
$$ 44029237 44052482 44030602 43779161 44743846 46372881 46479190 46955363 47378216 48664041
4512D8664041M32798n99307l11170j428453l75552k18461j240734o00070k39738
$$ 48664041 49096839 48497532 48186362 46757909 46382357 46163896 44923162 44323092 44083354
4503D4083354q20423k49999j911680j60079J492693P43627P64634M35819M50053
$$ 44083354 43262931 43012932 41101252 40941173 42433866 43177493 43942127 44377946 44827999
4494D4827999Q08811j202274j2095N28294K69437J072292K461927J106628J08058
$$ 44827999 45636810 44434536 44422441 44950735 45220172 46292464 48754391 49861019 49969077
4485D9969077K222635K606802K894245J747732p93585j542925k951089m611081
$$ 49969077 52191712 54798514 57692759 59440491 58646906 57103981 54152892 49541811
4477D9541811j923846j891298l292770j580251j158923j279554p12931k83519
$$ 49541811 47617965 45726667 42433897 40853646 39694723 38415169 37702238 37418719
4469C7418719j240952j049837j64679M8415l80641q67222k90515J00928k99492
$$ 37418719 36177767 35127930 34963251 35011666 34631025 33763803 33473288 33574216 33274724
4460C3274724q44580L90652j336M33060O85613P25217P88275M89938J145487K055877
$$ 33274724 32430144 32820796 32819460 33252520 33938133 34663350 35451625 35941563 37087050 39142927
4450C9142927J51797j626757j098530o89043k451321q82390q14063k602157r6254
$$ 39142927 39294724 37667967 36569437 35880394 33429073 32546683 31732620 29130463 29034209
4441B9034209j004307L75796r226j710826r92682o61885K48880r8672l90664q17293
$$ 29034209 28029902 28405698 28396472 26685646 25692964 25031079 25279959 25181287 24790623 23973330
4431B3973330Q42310J82589n55366l2353j82969j15500o32633p7468P5976p6999
$$ 23973330 24815640 24998229 24442863 24410510 24227541 24112041 23479408 23401940 23477916 23400917
4421B3400917J478781J38538r96611l39116k21306k79835P27103r06721j844562
$$ 23400917 24879698 25018236 24021625 23682509 23461203 23181368 23908471 23001750 21157188
4412B1157188Q11876J28399M8097q22561j295834J823960J265365j12738k98149
$$ 21157188 21969064 22097463 22145560 21322999 20027165 21851125 23116490 23003752 22705603
4403B2705603j103178R25646j091601L30731N70488j323182P73932K58259j092667
$$ 22705603 21602425 22528071 21436470 21767201 22337689 21014507 21788439 22046698 20954031
4394B0954031P91762J435899J216615j076176o95550P55656j519575o13483P29929
$$ 20954031 21745793 23181692 24398307 23322131 22626581 23382237 21862662 21249179 21979108
4385B1979108J070573L99644j001386J632886j018965l45944P97056m50886O36982
$$ 21979108 23049681 23449325 22447939 24080825 23061860 22715916 23512972 23062086 23699068
4376B3699068n18052k42418N7857L06649n6038m46348k02929M71691n82313o11858
$$ 23699068 23181016 22938598 22996455 23303104 23247066 22800718 22597789 23069480 22487167 21875309
4366B1875309M91069M38702j062157o61601J000525j81229J311587P71562j089097
$$ 21875309 22366378 22805080 21742923 21081322 22081847 21900618 23212205 23983767 22894670
4357B2894670J246071J20o25807O98171P65761K59032p0887l37579J006554k08013
$$ 22894670 24140741 24140861 23515054 24213225 24978986 25238018 25167131 24829552 25836106 25628093
4347B5628093O68059L7579O68395l21472P58157m57823n05645k11080K17476L64811
$$ 25628093 26296152 26333731 27002126 26680654 27438811 26980988 26475343 26264263 26481739 26846550
4337B6846550J271793N50449n9931Q02363J637087O00263J394627L495l21541
$$ 26846550 28118343 28668792 28608861 29411224 31048311 31648574 33043201 33046696 32725155
4328C2725155Q09395N16217R28501J033256M14871K86754K735975K530673K653155
$$ 32725155 33534550 34050767 34979268 36012524 36427395 36714149 39450124 41980797 44633952
4319D4633952L712579M883730L800182M882133K530979j124761p037644p444561
$$ 44633952 48346531 53230261 57030443 61912576 64443555 63318794 56281150 48836589
4311D8836589l173622k673156j785933j268270j414951r70349Q27614j484520
$$ 48836589 45662967 42989811 41203878 39935608 38520657 37550308 38377922 36893402
4303C6893402n00282J119872j113798j50047O31549j26295j386295J58650N57795
$$ 36893402 36393120 37512992 36399194 36249147 36880696 36754401 35368106 35526756 36084551
4294C6084551M07950j355291K65117N88030J86571L88866J017753M81502J70005
$$ 36084551 36492501 35137210 35402327 35990357 36176928 36565794 37583547 38065049 38235054
4285C8235054K26812Q32741J337893l28365P44855j230184m60063J148195j39351
$$ 38235054 38461866 39294607 40632500 40304135 41048990 39818806 39358743 40506938 40367587
4276D0367587Q33764J186321J043563K65973O13840J76818o17287l27956L93306
$$ 40367587 41201351 42387672 43431235 43697208 44311048 44487866 43870579 43542623 43935929
4267D3935929j80312n42511l0104J469916L83264O89434l15196k4195j90757O72242
$$ 43935929 43755617 43213106 43183002 44652918 45036182 45725616 45410420 45386225 45195468 45867710
4257D5867710K14156j538991n43255J49213j001955l95095J201168R11308j651651
$$ 45867710 46081866 44542875 43999620 44148833 43146878 42751783 43952951 44864259 43212608
4248D3212608n76144l5671N57167p08670j198853Q84444J701884l28768J110704
$$ 43212608 42636464 42600793 43157960 42449290 41250437 42134881 43836765 43507997 44618701
4239D4618701J303180K98121N08828K89402J815922J819344J367674j70957N58188
$$ 44618701 45921881 46220002 46728830 47018232 48834154 50653498 52021172 51850215 52408403
4230E2408403J911256n99273j287797k285689k115759m06244r5400k22801l39536
$$ 52408403 54319659 53720386 52432589 50146900 48031141 47624897 47529497 47306696 46967160
4221D6967160p47937J078226N32322L87292L99109L04471M25477l25698K6886
$$ 46967160 46219223 47297449 47829771 48217063 48616172 48920643 49346120 49020422 49047308
4212D9047308j071596O42135N22008J252609N28221k09935K53681Q03355N06374
$$ 49047308 47975712 48617847 49139855 50392464 50920685 50710750 50964431 51767786 52274160
4203E2274160M59098M85041K391108J566967O24133L98081J123063n04876P43457
$$ 52274160 52733258 53218299 55609407 57176374 57800507 58198588 59321651 58816775 59560232
4194E9560232O65502J638499J482235J143836K030519J635727K609459L504991
$$ 59560232 60225734 61864233 63346468 64490304 66520823 68156550 70766009 74271000
4186G4271000M093540O157336N027806O393548N127418N493995k33028n589536
$$ 74271000 78364540 84521876 89549682 95943230 101070648 106564643 106331615 100742079
4178A00742079j0873331j1562611q529774m870695k957035k964084k487365k874474
$$ 100742079 89868748 78306137 69776363 64905668 61948633 58984549 56497184 53622710
4170E3622710j186185j448013k471221j247606r36516J11939n53004j457219l15570
$$ 53622710 52436525 50988512 48517291 47269685 46333169 46445108 45892104 44434885 44119315
4161D4119315n22076K37600j858811k200357n59966J71930k38263j422123j805668
$$ 44119315 43597239 43834839 41976028 39775671 39215705 39387635 39149372 37727249 35921581
4152C5921581L08936J06701J70390j00829j443664l98471j417509K05681O84313
$$ 35921581 36230517 36337218 36507608 36406779 34963115 34564644 33147135 33352816 34037129
4143C4037129M46653n78257q45593P96292r98873J23136r56019Q1247l35308r75207
$$ 34037129 34483782 33905525 33059932 33856224 32857351 32980487 32024468 32105715 31770407 30795200
4133C0795200j255978j82397q59188p47472R26795r76754j584957K91104R25186
$$ 30795200 29539222 29356825 28497637 27750165 28676960 27700206 26115249 26406353 27331539
4124B7331539j69219p86836m08854o77863K27234J028566l69226m16994K15686
$$ 27331539 27162320 26375484 25966630 25288767 25516001 26544567 26175341 25758347 25974033
4115B5974033r24390n08396q05705r40530q4762R60741n99460k54337j50694M93100
$$ 25974033 25049643 24541247 23735542 22795012 22710250 23670991 23071531 22817194 22666500 23159600
4105B3159600J169046O29026q6093j82365q22876o8949j028492j023543L4054
$$ 23159600 24328646 24957672 24871579 24689214 23866338 23797389 22768897 21745354 21779408
4096B1779408P78221k96653J29802j7500J43261j340555Q21871M1873R43o7302
$$ 21779408 22557629 22260976 22390778 22373278 22516539 21175984 21997855 22039728 22040671 21973369
4086B1973369j20708K64498M8417m3742n68675K48283j62149M78123j87279j080856
$$ 21973369 21852661 22117159 22165576 22121834 21553159 21801442 21639293 22117416 21930137 20849281
4076B0849281m35015N89172M6670M16053p64848Q58648j238092N71416K84678
$$ 20849281 20414266 21003438 21050108 21466161 20701313 21559961 20321869 20893285 21177963
4067B1177963n41275p41122r93802M22248J277638o72297j32302m89356L74479
$$ 21177963 20636688 19895566 18901764 19324012 20601650 19929353 19797051 19307695 19682174
4058A9682174O84186r43662k96494l61670P35395K33172J84344L8987R41341q61210
$$ 19682174 20366360 19422698 19126204 18764534 19499929 19733101 19917445 19956432 20897773 20036563
4048B0036563O1359m9532J26624r39719j267491M04397R22679p8983p8164N54621
$$ 20036563 20097922 20048390 20175014 19235295 17967804 18372201 19294880 19215897 19137733 19692354
4038A9692354n48481Q11602K44165j15795m50654N93517j69353j74985L82749
$$ 19692354 19143873 19955475 20199640 20083845 19633191 20226708 20057355 19882370 20265119
4029B0265119L08474M37376k09565M59789j22505j30132o00210n75792L90604
$$ 20265119 20573593 21010969 20801404 21261193 21138688 21008556 20408346 19832554 20223158
4020B0223158o89977l0863J059107K94357O05925L75020p96378R8587j94375J015511
$$ 20223158 19533181 19502318 20561425 20855782 21461707 21836727 21040349 21138936 20944561 21960072
4010B1960072K52592o61868K71635l11306q53735m0132J666971M12634j102500
$$ 21960072 22212664 21550796 21822431 21511125 20657390 20617258 22284229 22696863 21594363
4001B1594363l46015Q63826N4825N4920K79807j404315O3563R1634m65638p92305
$$ 21594363 21248348 22112174 22166999 22221919 22501726 21097411 21160974 21252608 20786970 19994665
3991A9994665J21675J241997m09634m34063Q18044O12920L49621l41139P26383
$$ 19994665 20116340 21358337 20948703 20514640 21332684 21945604 22295225 21954086 22680469
3982B2680469o54640j21782Q11905Q43108M74083N42281K38629n18057n22244
$$ 22680469 22025829 21904047 22715952 23559060 24033143 24575424 24814053 24295996 23773752
3973B3773752o76519J76297n42774L3113J010488N07222j47086n52425j070647
$$ 23773752 23097233 23273530 22730756 22763869 23774357 24281579 24134493 23582068 22511421
3964B2511421Q57427J282738M60595j61375J648351j232284p16710P09352J22134
$$ 22511421 23368848 24651586 25112181 24950806 26599157 25366873 24650163 25359515 25481649
3955B5481649P47368l54215j766900j265706J904611Q9609L03662N99039Q33464
$$ 25481649 26229017 25874802 24107902 22842196 24746807 24836416 25140078 25739117 26572581
3946B6572581j039350l21715l70297m03077Q95144J424238K1352j158116M46074
$$ 26572581 25533231 25211516 24841219 24438142 25333286 26757524 26778876 25620760 26066834
3937B6066834L4269O08371K78735j026183K76984o15285r24628J289818Q84729
$$ 26066834 26101103 26709474 26988209 25962026 26239010 25623725 24699097 25988915 26873644
3928B6873644M10786j785553J323514J543806r62555q18220j113895k66826K63747
$$ 26873644 27284430 25498877 26822391 28366197 27403642 26585422 25471527 25204701 25468448
3919B5468448k21440L24735R6546J12657o21139j61976k15431N10434N08528r01494
$$ 25468448 25247008 25571743 25668289 25780946 25159807 24997831 24782400 25292834 25801362 24899868
3909B4899868j325505M44158J349830n6872n60672j89965J808242m01398q44418
$$ 24899868 23574363 24018521 25368351 25311479 24750807 24560842 26369084 25967686 25123268
3900B5123268N10243K52665O92574j027228o0644K64478L23923J97938m96047
$$ 25123268 25633511 25886176 26578750 25551522 25490878 25755356 26079279 26277217 25781170
3891B5781170j342291j83903J284923J046596N47887l44849l00295L78308p65814
$$ 25781170 24438879 24254976 25539899 26586495 27134382 26789533 26489238 26867546 26101732
3882B6101732k43754j04209K00884P81146j337654l60620J667848Q76321Q39129
$$ 26101732 25857978 25753769 25954653 26735799 25398145 25037525 26705373 27581694 28420823
3873B8420823J24351j051628J699224P3658Q8739J03441r94613k68705j1730k44163
$$ 28420823 28545174 27493546 29192770 29266428 29355167 29458608 28463995 28195290 28183560 27939397
3863B7939397J54359M12241L2751p39518N50965l40538K54000J67938P02697J56872
$$ 27939397 28093756 28505997 28538748 27799230 28350195 28009657 28263657 28431595 29134292 29291164
3853B9291164P6461j35170J23173Q57210J837920P73358O77280K44451Q71857
$$ 29291164 29367625 29232455 29355628 30212838 32050758 32824116 33501396 33745847 34617704
3844C4617704o5442j510779Q85510M74840N2856M07328j96200J772432J330113
$$ 34617704 34552262 33041483 33926993 34401833 34454689 34862017 34665817 36438249 37768362
3835C7768362k06401O73495l28184J632581n06520K012059Q67613R34092L555208
$$ 37768362 37561961 38235456 37907272 39539853 39033333 41045392 41913005 42847097 46402305
3826D6402305L154911K131040K714291J979386J312517Q77807p38619j733311
$$ 46402305 49557216 51688256 54402547 56381933 57694450 58572257 57833638 56100327
3818E6100327k123538j615943k323837j778783J34953j633233j986089p51172
$$ 56100327 53976789 52360846 50037009 48258226 48393179 46759946 44773857 44022685
3810D4022685j120171j173608j987605q0976J160364m13558j124780j395994J59145
$$ 44022685 42902514 41728906 39741301 39660325 40820689 40407131 39282351 37886357 38045502
3801C8045502O33026o65535o38257k86801M40535p23802R16802J204016O7455
$$ 38045502 38678528 38012993 37374736 37087935 37528470 36804668 37721470 38925486 38992941
3792C8992941L77572q66626K7295j394485J46776P9435J86374O56999Q2534q78594
$$ 38992941 39370513 38503887 38531182 37136697 37283473 37362908 37549282 38206281 38288815 37410221
3782C7410221P60558K10375J117673m93597L63667J172745p84014m01763p86602
$$ 37410221 38170779 38381154 39498827 39005230 39368897 40541642 39757628 39355865 38569263
3773C8569263j05701Q26672J245479O32200M91650j535491N98418J431412R1106
$$ 38569263 38463562 39290234 40535713 41167913 41659563 40124072 40722490 42153902 42245008
3764D2245008J150862J068246n75843N59907k03058o40028K61162M55179n04391
$$ 42245008 43395870 44464116 43888273 44448180 44245122 43605094 43866256 44321435 43817044
3755D3817044L15716N68091J060710Q95678j25965P44171O90508M42812j51455
$$ 43817044 44132760 44700851 45761561 46657239 46531274 47275445 47965953 48408765 48257310
3746D8257310J5914O7765K51370Q36310k31535j72041p00654j32700O4035L60071
$$ 48257310 48273224 48340989 48592359 49428669 49197134 49025093 48324439 48191739 48255774 48615845
3736D8615845K85805L38085P14831m17208J15737R27030l57260Q73564o10642
$$ 48615845 48901650 49239735 49954566 49537358 49653095 50580125 50222865 51096429 50485787
3727E0485787P9239l63530J136334n2363P33413K2206m16295q15355j177550K5427
$$ 50485787 50565026 50201496 51337830 51285467 52018880 52041086 51624791 50809436 49631886 49657313
3717D9657313L13690K68884j146624j210695K251649M22992o70070R1651l50430
$$ 49657313 49971003 50239887 49093263 47882568 50134217 50557209 49887139 49978790 49628360
3708D9628360M77753k43682r43661j138622J93578J62922N16581r22677O05801
$$ 49628360 50106113 49862431 48918770 47780148 47973726 48136648 48653229 47730552 48336353
3699D8336353R63655o95568j280772L43823J025409n37611K3441O04769p27937
$$ 48336353 49300008 48604440 47323668 47667491 48692900 48155289 48178730 48783499 48055562
3690D8055562k67669O4935K22551P24974o46129N00453j409069j98468K214466
$$ 48055562 47787893 47852828 48075379 48800353 48154224 48654677 47245608 47047140 49261606
3681D9261606O52498r81187p45487K26056j578947n42363j500005o89601N54253
$$ 49261606 49914104 48932917 48187430 48413486 46834539 46292176 44792171 44102570 44656823
3672D4656823l60474k64377M20831J84032K06243r52661n62149j397360M49139
$$ 44656823 44296349 44031972 44452803 44636835 44843078 43890417 43328268 41930908 42380047
3663D2380047J300399p78903J159326J25569j042896j94281O31382J213617L45540
$$ 42380047 43680446 42901543 44060869 44186438 43143542 42949261 43580643 44794260 45139800
3654D5139800L10217Q31563m4090M70327J531580j5785k35687j69392J198172
$$ 45139800 45450017 46281580 46237490 46707817 48239397 48223612 47987925 47818533 49016705
3645D9016705N44078K2175l12330R36475J544702N76248O82515J346429N55910
$$ 49016705 49560783 49582958 49270628 50207103 51751805 52328053 53010568 54356997 54912907
3636E4912907K249513J394262K35612n42693R80655J088107M01608j02945M44159
$$ 54912907 57162420 58556682 58792294 58249601 59230256 60318363 60719971 60617026 61061185
3627F1061185n16549p43683L74798J81659r17082l72591k6827N23314R9041j87683
$$ 61061185 60544636 59800953 60175751 60357410 59440328 59067737 59040910 59564224 59663265 59475582
3617E9475582R0365J295512J307202K12421O76332J796412Q99954M88215J136654
$$ 59475582 59565947 60861459 62168661 62381082 63057414 64853826 65753780 66241995 67378649
3608F7378649Q27109K518725Q64051P38038J125741J179194J016676Q97901j4406
$$ 67378649 68205758 70724483 71588534 72326572 73452313 74631507 75648183 76546084 76531678
3599G6531678J94972N49134k76233P37229l1197m79016o76485p45985o47163n31252
$$ 76531678 76726650 77275784 76999551 77736780 77705583 77226567 76550082 75804097 75156934 74625682
3589G4625682j414793j291618K34581j9501m37256q27641q72810m61811j466224
$$ 74625682 73210889 71919271 72153852 72134351 71697095 70869454 69996644 69534833 68068609
3580F8068609p47893J2981J46685j051756o59812m66902n78652N94698n13127
$$ 68068609 67320716 67333697 67480382 66428626 65768814 65301912 64723260 65317958 64804831
3571F4804831m0561r2120P7305J48102Q26562J90790J91602J176878J190920m49304
$$ 64804831 64764270 64672150 64749455 64897557 65724119 65914909 66106511 67283389 68474309 68025005
3561F8025005J350274n16528L01382R08970J72260n6748r15492j860617j262410
$$ 68025005 69375279 68858751 69160133 70069103 70241363 70184615 69269123 67408506 66146096
3552F6146096j220647l20156k208437j045508k691917j512080j692532q02704
$$ 66146096 64925449 64605293 62396856 61351348 58659431 57147351 55454819 54652115
3544E4652115j646099j558551m21295r5786J39180o86806k26097j229191j284704
$$ 54652115 53006016 51447465 51026170 50930384 51069564 50382758 50156661 48927470 47642766
3535D7642766q75423j341015L50747j108810P21280j02789j272729J026314n49401
$$ 47642766 46767343 45426328 45777075 44668265 45389545 45286756 44014027 45040341 44490940
3526D4490940o17161r45221K55690M58752M4748m13700N69875j587524J80876
$$ 44490940 43873779 42928558 43184248 43643000 43687748 43274048 43843923 42256399 42437275
3517D2437275M95070l0832q51454k55714l8641q51692l39852m1773M50375J492
$$ 42437275 42932345 42901513 42050059 41794345 41755704 40904012 40564160 40522387 40972762 40974254
3507D0974254M89906l44698P11319m61852p96057M42689n29934l8904J66084o3953
$$ 40974254 41464160 41119462 41830781 41368929 40572872 41015561 40485627 40446723 40612807 40548854
3497D0548854p27689M21689Q33400n34901k02762Q37866J170675K24851J333466
$$ 40548854 39821165 40242854 41076254 40541353 40338591 41176457 42347132 42571983 43905449
3488D3905449K256320r30085M27867M14754j216117j359869O0614M19634J423808
$$ 43905449 46161769 45231684 45659551 46074305 44858188 43498319 43558933 43978567 45402375
3479D5402375J172791q49482n95333N70046Q05284J361564l98794J552555R44864
$$ 45402375 46575166 45725684 45130351 45700397 46505681 47867245 47468451 49021006 49965870
3470D9965870J033524K052433O17097J84358J696759O98271r0132K428828J966381
$$ 49965870 50999394 53051827 53668924 53853282 55550041 56248312 56158180 58587008 60553389
3461F0553389J366019K049628N92752J503320K117698L240705K493300K650515
$$ 60553389 61919408 63969036 64561788 66065108 68182806 71423511 73916811 76567326
3453G6567326K245893K344988K211515N10616j035870Q61862M75541j38561O66231
$$ 76567326 78813219 81158207 83369722 83880338 82844468 83706330 84181871 84043310 84709541
3444H4709541K71382L02466K015582K596521J991044Q16184K647742J711651r48527
$$ 84709541 84980923 85283389 87298971 89895492 91886536 92702720 95350462 97062113 96113586
3435I6113586q01859k819720k888202k097409k687886k951261j590217k007801
$$ 96113586 95311727 92492007 89603805 87506396 84818510 81867249 80277032 78269231
3427G8269231j661380j963489J66877j847425k230760Q2249p47902j242966n84458
$$ 78269231 76607851 74644362 74811239 72963814 70733054 70815303 70067401 68824435 68239977
3418F8239977j521878J069621j414110j882611L76326J242110j285899j753493
$$ 68239977 66718099 67787720 66373610 64490999 64867325 66109435 64823536 63070043
3410F3070043R02410Q25579J14509J32055K49460O12881q05491n59413J296023
$$ 63070043 63972453 64798032 64912541 65044596 65294056 65906937 65101446 64542033 65838056
3401F5838056N61725q4604N27645R67479n11459j11676O8028L00573M42814L82091
$$ 65838056 66399781 66315177 66842822 67810301 67298842 67187166 67255194 67555767 67998581 68380672
3391F8380672J543638o01037m65798J145050J722230l17794k01556R99750j97714
$$ 68380672 69924310 69323273 68857475 70002525 71724755 71406961 71205405 72205155 72007441
3382G2007441L05711N57567M34026J14928k76734J516135Q65066l18883P5751
$$ 72007441 72313152 72870719 73304745 73419673 73142939 74659074 75524140 75205257 75281008
3373G5281008Q12845j34000J53732L091821L64317J053559J328062O19898J281529
$$ 75281008 76093853 75959853 76113585 79205406 79569723 80623282 81951344 82571242 83852771
3364H3852771K8103k26916J639557J598458J938827J548568K246452J682588J851384
$$ 83852771 83880874 83653958 85293515 86891973 88830800 90379368 92625820 94308408 96159792
3355I6159792K481382J966880K383413K502590J644524L110842J865584K647127
$$ 96159792 98641174 100608054 102991467 105494057 107138581 110249423 112115007 114762134
3347A14762134L028121K350076K527049M128067N352581L632076N001480O097141
$$ 114762134 117790255 120140331 122667380 126795447 132148028 135780104 140781584 146878725
3339A46878725O620803O803087Q449646P767648P487136P378363Q203044O929074
$$ 146878725 153499528 160302615 168752261 176519909 184007045 191385408 199588452 206517526
3331B06517526N968829M842628L944406L263299K802278J349767R99815J64779
$$ 206517526 212486355 217328983 221273389 224536688 227338966 228688733 229688548 229853327
3323B29853327J806329K594760J617623K882560L723586L333142M458482M106640
$$ 229853327 231659656 234254416 235872039 238754599 242478185 245811327 250269809 254376449
3315B54376449M505301O965503O207066P310637R252690Q760753Q768436J2982180
$$ 254376449 258881750 265847253 272054319 279364956 288617646 297378399 306146835 319129015
3307C19129015J3264803J0823658Q241645M634692m82818o066945j1580946j7544885
$$ 319129015 332393818 343217476 351459121 356093813 355610995 349544050 337963104 320418219
3299C20418219j7434328j8775916j8860067j6413096j2592241j1111475r293543
$$ 320418219 302983891 284207975 265347908 248934812 236342571 225231096 215937553
3292B15937553o827843n912571n340683n897918m458107m110548l048805k650422
$$ 215937553 209109710 203197139 197856456 191958538 187500431 183389883 180341078 177690656
3284A77690656k903008m295093k188284l463992k370416j365179j066943j536389
$$ 177690656 174787648 170492555 168304271 164840279 162469863 161104684 160037741 158501352
3276A58501352j741031j132076m36558j42605j820497j479908J99116K220028
$$ 158501352 156760321 155628245 155191687 155049082 153228585 151748677 151947793 154167821
3268A54167821j120212j490843J85226j057824n28549R29154Q20566O02451J407030
$$ 154167821 153047609 151556766 151741992 150684168 150155619 151084773 151905339 152507790 153914820
3259A53914820K951237J201676K707764K426011K797147M134602M207383K604313
$$ 153914820 156866057 158067733 160775497 163201508 165998655 170133257 174340640 176944953
3251A76944953L209221L681736M168694M037821L481657J314529J8385l00576
$$ 176944953 180154174 183835910 188004604 192042425 195524082 196838611 196856996 196556420
3243A96556420j571788l387969k564344j434413k80078j518909p0403L79819J15747
$$ 196556420 194984632 191596663 189032319 187597906 187317828 185798919 185728516 186108335 186224082
3234A86224082J572152O7945P81947J237394J77298k014417M77075R49791J761954
$$ 186224082 187796234 187864179 188646126 189883520 190060818 188046401 188523476 189473267 191235221
3225A91235221K313019L134027K807398M644587L750037N866116O149776N878923
$$ 191235221 193548240 196682267 199489665 204134252 207884289 213750405 219900181 225779104
3217B25779104P272343J0707109J2318621J5535040J6525972K0535673K1777103
$$ 225779104 233051447 243758556 256077177 271612217 288138189 308673862 330450965
3210C30450965K0561010J8763679J2796129M142880q123933j4557588j8080402
$$ 330450965 351011975 369775654 382571783 386714663 378590730 364033142 345952740
3203C45952740k1159323j8156763j3721755j2843943j1437328r978030j0261070
$$ 345952740 324793417 306636654 292914899 280070956 268633628 258655598 248394528
3196B48394528p199965n407001n693065l959175k089026j599597j010135j513000
$$ 248394528 241194563 235787562 230094497 226135322 224046296 222446699 221436564 219923564
3188B19923564k0898l10098o37648p67125p33935j603236p96677j189828j462710
$$ 219923564 219902666 219592568 218954920 218187795 217453860 215850624 215053947 213864119 212401409
3179B12401409k394212j561220j226067k018004N01005P86788J185538L04169
$$ 212401409 210007197 208445977 207219910 205201906 205702911 206489699 207675237 207979406
3171B07979406j291865k470530j266656k45358J268815P29322L76830J283526
$$ 207979406 206687541 204217011 202950355 202704997 203973812 204703134 205079964 206363490
3163B06363490R61539m95335n53142j038692j419106k486592j586180j375373
$$ 206363490 207325029 206829694 206276552 205237860 203818754 201332162 199745982 198370609
3155A98370609p44117m67994j096602l198975j387305l95149j128504p88435k82187
$$ 198370609 197626492 197158498 196061896 192862921 191475616 191080467 189951963 189163528 188881341
3146A88881341j760633j656687j45074P55531l46754J364833L92225P32047Q98500
$$ 188881341 187120708 185464021 185318947 186074478 185727724 187092557 187484782 188216829 189115329
3137A89115329R5244q23491n82310n04021K17480n18238J131562P33778J92881
$$ 189115329 189210573 188387082 187804772 187300751 187518231 186999993 188131555 188865333 189058214
3128A89058214M20362k59241n14219r03087j845103j171681j502539j460128j104651
$$ 189058214 189478576 189219335 188705116 187802029 185956926 184785245 183282706 181822578 180717927
3119A80717927l11723n84606p31178P48278Q20616l24305k906323k891408k910000
$$ 180717927 180406204 179821598 179090420 179838698 180659314 180335009 177428686 174537278 171627278
3110A71627278l461681m064754k011701j006021k246455k708236k404100k455197
$$ 171627278 168165597 164100843 162089142 161083121 158836666 156128430 153724330 151269133
3102A51269133j905456j737037j804363j424447k76615l01535P1510j315876k046366
$$ 151269133 149363677 147626640 145822277 144397830 144121215 143819680 143891190 142575314 140528948
3093A40528948j051870l1817j884200k02128l59688l64837J61098r40488l80612
$$ 140528948 139477078 139445261 137561061 137358933 136999245 136634408 136795506 135855018 135474406
3084A35474406M32123j37763j66636J612343L40065J13771K058408J101666J299853
$$ 135474406 135906529 135768766 135602130 137214473 137554538 137668309 139726717 140828383 142128236
3075A42128236J257961L01997J556081n73452j838177l506794j879351m33488
$$ 142128236 143386197 143688194 145244275 144670823 142832646 139325852 137446501 137013013
3067A37013013j189558p53877m86459o52785l20441J742549Q8351q35014n43629
$$ 137013013 135823455 135069578 134583119 133930334 133609893 135352442 135440793 134605779 134062150
3058A34062150P71045j306850j113751J85485k36490L39326N01792M7083K10293
$$ 134062150 134833195 133526345 132412594 132598079 132361589 132700915 133202707 133249790 133460083
3049A33460083K49949n8379R61583N67837k59519K068721J31120j79328M58569
$$ 133460083 133710032 133651653 134613236 135181073 134921554 136990275 137121395 136942067 137400636
3040A37400636Q20482J140319R55509n46042l9947J278056L94544m41222J089887
$$ 137400636 138221118 139361437 140316946 139770904 139730957 141009013 141403557 140962335 142052222
3031A42052222J491605O41937J450422N44880O89494J491763K091430J783371
$$ 142052222 143543827 144185764 145636186 146181066 146870560 148362323 150453753 152237124
3023A52237124J813503J732414J144489J448136N27509Q93390J291624K095855
$$ 152237124 154050627 155783041 156927530 158375666 158903175 159796565 161088189 163184044
3015A63184044K757042J536907J250546L41634J741634J268347J924378K670332
$$ 163184044 165941086 167477993 168728539 169070173 170811807 172080154 174004532 176674864
3007A76674864R92072J504271J351886P44834L168575J244377J581840K426699
$$ 176674864 177666936 179171207 180523093 181267927 184436502 185680879 187262719 189689418
2999A89689418J721029J466872R88987K041457K101223K080135K264772K950499
$$ 189689418 191410447 192877319 193866306 195907763 198008986 200089121 202353893 205304392
2991B05304392K422754L818904K815012L715003L179500K574375K700272J986133
$$ 205304392 207727146 211546050 214361062 218076065 221255565 223829940 226530212 228516345
2983B28516345K970409K108520J261179R03773R61581Q78620K115385J978916
$$ 228516345 231486754 233595274 234856453 235760226 236721807 237600427 239715812 241694728
2975B41694728J142121K223336J109584J396489K354470J902138J650498L44465
$$ 241694728 242836849 245060185 246169769 247566258 249920728 251822866 253473364 253817829
2967B53817829n93763O62303k64700p6703p6500j576448j73o68021o60099O78236
$$ 253817829 253224066 253886369 253621669 253544966 253468466 251892018 251891845 251223824 250563725 251241961
2957B51241961R78581n15177N02523Q93551R0536R90519J039314M66954L87869
$$ 251241961 252220542 251705365 252207888 253101439 253191975 254182494 255221808 255688762 256076631
2948B56076631k00180n94982N80634L79670P87603O54382n55636L139554J753224
$$ 256076631 255876451 255281469 255862103 256241773 257029376 257683758 257128122 260267676 262020900
2939B62020900k56588J679500J184348K315108R33420J406649P7100K321133K644508
$$ 262020900 261764312 263443812 264628160 266943268 267876688 269283337 269360437 271681570 274326078
2930B74326078Q53286P54022K96907K419484J417224K21741Q96213J913104J400199
$$ 274326078 275179364 275933386 276230293 278649777 280067001 280288742 281184955 283098059 284498258
2921B84498258M37780Q55592O21146L54056J466522O90989K112376J053937J056976
$$ 284498258 284936038 285791630 286412776 286766832 288233354 288924343 291036719 292090656 293147632
2912B93147632O84366N07118J918217R84287J327360K033527P92007R84310r61744
$$ 293147632 293831998 294339116 296257333 297241620 298568980 300602507 301394514 302378824 301417080
2903C01417080l32522r78178j946359k201485k827307l012607j926731k355982
$$ 301417080 301084558 300106380 298160021 295958536 293131229 290118622 288191891 285835909
2895B85835909j701002l507481j082003j530231l937035m086748k990759k333667
$$ 285835909 284134907 280627426 279545423 278015192 274078157 269991409 267000650 264666983
2887B64666983m449507l885985m581231n673434m596550m995149l636367m215305
$$ 264666983 260217476 256331491 251750260 246076826 241480276 236485127 232848760 228633455
2879B28633455l108193k614503l301079l576914l025715k696888m152337k971773
$$ 228633455 225525262 222910759 219609680 216032766 213007051 210310163 206157826 203186053
2871B03186053l144926k923950l796571j425862k890659k274954k559160l109023
$$ 203186053 200041127 197117177 193320606 191894744 189004085 186729131 184169971 181060948
2863A81060948j883522o66783j089627j878452j888674k176031o44482j63640
$$ 181060948 179177426 178510643 177421016 175542564 173653890 171477859 170833377 170669737
2855A70669737j220465k84822q23729j005670N80373m95738j245224r42895j542066
$$ 170669737 169449272 169164450 168340721 167335051 167915424 167419686 166174462 165231567 163689501
2846A63689501J321705o50941Q9120N42323o87655l64607L87004M2557J44247
$$ 163689501 165011206 164360265 164449385 164991708 164304053 163939446 164326450 164369007 164513254
2837A64513254j187465l41052k29021J72976J3696m66956K83440P07213k42058
$$ 164513254 163325789 162984737 162755716 162928692 162942388 162475432 162758872 163466085 163224027
2828A63224027P67405O2942j140155m72712Q04469Q77370O71914M79525J71005
$$ 163224027 163991432 164054374 162914219 162441507 163245976 164123346 164795260 165274785 165445790
2819A65445790R54755L2265K97653L34489J166852K16115J058908J119320M76369
$$ 165445790 166400545 166432810 166730463 167064952 168231804 168447919 169506827 170626147 171102516
2810A71102516q67383K93066R82736J86815q36379J246064K430682J286524Q25709
$$ 171102516 170235133 170528199 171510935 171697750 170861371 172107435 174538117 175824641 176650350
2801A76650350J31908J516286M25272N8238J653722P18113J882286K342111J578678
$$ 176650350 176782258 178298544 178723816 178782054 180435776 181153889 183036175 185378286 186956964
2792A86956964N22720J258183J664627K945136J389152K707033M093026M432162
$$ 186956964 187479684 188737867 190402494 193347630 194736782 197443815 201536841 205969003
2784B05969003K754433N79799O63916j83581J101k23260P48727J356835K392707
$$ 205969003 208723436 209303235 209967151 209783570 209784671 209561411 210310138 211666973 214059680
2775B14059680K497457M648092M279824N138161N723964N611614N052760N080824
$$ 214059680 216557137 221205229 225485053 230623214 236347178 241958792 247011552 252092376
2767B52092376M337983L651576N382825N086244M447814O121315Q230330R191241
$$ 252092376 256430359 260081935 265464760 270551004 274998818 281120133 289350463 298541704
2759B98541704R050355J0606467J2758477J3540243J5799495J5215439J4174917
$$ 298541704 307592059 318198526 330957003 344497246 360296741 375512180 389687097
2752C89687097J2432591N483124r44494l722763k565758k821239k310103N23666
$$ 389687097 402119688 407602812 406658318 402935555 400369797 397548558 395238455 395762121
2744C95762121j523568q25851q86769j119798k079038j395546k245876l404527
$$ 395762121 394238553 393412702 392525933 391406135 389327097 387931551 385685675 382281148
2736C82281148k872475o207580p484455r045803r570038j0709479j1046679j0174210
$$ 382281148 379408673 373201093 365716638 356670835 347100797 336391318 325344639 315170429
2728C15170429q629120p855133p548921o088009n652014n460733o510733n962533
$$ 315170429 306541309 298686176 291137255 285049246 279397232 273936499 267425766 261463233
2720B61463233n113150n649796q377777q435730p189473n750716n191680m299667
$$ 261463233 256350083 250700287 242322510 233886780 226697307 220946591 215754911 211455244
2712B11455244l300596m770311m073830k520295k852862k205624l059535k934175
$$ 211455244 208154648 203384337 199310507 196790212 193937350 191731726 188672191 185738016
2704A85738016k37358k807738l149345k293798r18860j639396k219800j157586
$$ 185738016 185500658 182692920 179543575 177249777 176330917 174691521 172471721 171314135
2696A71314135j85543q0909m64753q19341P50211L88610j11885J554850P5540
$$ 171314135 171128592 171047683 170582930 169763589 170513800 170902410 170790525 172345375 172420915
2687A72420915O42829R30887L22475J49926J508317J431201J501510L29769p34948
$$ 172420915 173063744 173994631 174317106 174467032 175975349 177406550 178908060 179237829 178502881
2678A78502881J568414K780569J894638L036003R86645J453300K127576K206774
$$ 178502881 180071295 182851864 184746502 187782505 188769150 190222450 192350026 194556800
2670A94556800J406557N17093J396885Q58604J854022N63085J448295O54188r0480
$$ 194556800 195963357 196480450 197877335 198735939 200589961 201153046 202601341 203255529 203165049
2661B03165049O21599N37526P51890K85082r7585R08592M22572N03227l85597
$$ 203165049 203786648 204324174 205076064 205361146 205263561 206172153 206594725 207097952 206712355
2652B06712355j48928K62881j072052j071061n89171n12586q52057n60351o44215
$$ 206712355 206563427 206826308 205754256 204683195 204094024 203581438 202729381 202169030 201524815
2643B01524815j070198J564694O81964J159147K020427P2958R31574R61525J511027
$$ 201524815 200454617 202019311 202701275 203860422 205880849 205953807 206885381 207846906 209357933
2634B09357933J967188K266700J927091K375907M44060K850781K936738L563491
$$ 209357933 211325121 213591821 215518912 217894819 218338879 221189660 224126398 227689889
2626B27689889L822106L422996K462517L664158M168236K603829J547574M008955
$$ 227689889 231511995 234934991 237397508 241061666 245229902 247833731 249381305 253390260
2618B53390260L906283L745443K674292J947024L051059L556419L323337K481492
$$ 253390260 257296543 261041986 263716278 265663302 268714361 272270780 275594117 278075609
2610B78075609L080421N000092M872876K430259L930263K540003L329304L432360
$$ 278075609 281156030 286156122 291028998 293459257 297389520 299929523 303258827 306691187
2602C06691187L503309L182082L855362L706728M584716M147886N700402N515896
$$ 306691187 310194496 313376578 317231940 320938668 325523384 329671270 335371672 340887568
2594C40887568M338077L578336N556955L509389L413306N146480L048414L483442
$$ 340887568 345225645 348803981 354360936 357870325 361283631 366430111 369478525 372961967
2586C72961967L756376L890502O232799M735893M335158O036449N976947K895817
$$ 372961967 376718343 380608845 386841644 391577537 395912695 401949144 407926091 410821908
2578D10821908K610901L734428J608037J507440J490696l5661L20325O64741n56712
$$ 410821908 413432809 417167237 418775274 420282714 421773410 421737749 422058074 422722815 422166103
2569D22166103O79070J294688J200380J502842J546267J150340Q45217J021417
$$ 422166103 422845173 424139861 425340241 426843083 428389350 429539690 430384907 431406324
2561D31406324J228603m4252R05035j338348l48161M55757j072712r88007j980175
$$ 431406324 432634927 432590675 433495710 432157362 431809201 432264958 431192246 430204239 428224064
2552D28224064j362402l43745M05939J10805J179996l10293k57084J336782m69550
$$ 428224064 426861662 426517917 426923856 427034661 428214657 427904364 427647280 428984062 428514512
2543D28514512j282961J87762l20849K81334N54283J75936N65497O45002J414896
$$ 428514512 427231551 427419313 427098464 427379798 427934081 428110017 428675514 429320516 430735412
2534D30735412J466253P55463N79937J60142J311214K914136J175989J650461
$$ 430735412 432201665 432957128 433537065 433697207 435008421 437922557 439098546 440749007
2526D40749007R85900J922133L372146K022512K390571K881780M563952K828279
$$ 440749007 441734907 443657040 447029186 449051698 451442269 454324049 458888001 461716280
2518D61716280J588361J412414K626943K147210j89351J6440J68010q88240o38156
$$ 461716280 463304641 464717055 467343998 469491208 469301857 469318297 469486307 468598067 467959911
2509D67959911j855060l589391k058274k637294l075129m009127m154563n631894
$$ 467959911 466104851 462515460 460457186 457819892 454744763 450735636 446581073 440949179
2501D40949179n183279m371067n649989p735883p649053p847739p768860r870776
$$ 440949179 435765900 431394833 425744844 418008961 410359908 402512169 394743309 384872533
2493C84872533q544198q748319r565886p705380p943235p912376r416198q075842
$$ 384872533 376328335 367580016 358014130 350308750 342365515 334453139 325036941 316961099
2485C16961099q491345p540177n811698r767745p102044o966144p509484o858055
$$ 316961099 308469754 300929577 295117879 285350134 278248090 271281946 263772462 256914407
2477B56914407n458411p416555o119765m988787n144550l850653n934031n976610
$$ 256914407 251455996 244039441 237919676 232930889 227786339 223935686 218001655 212025045
2469B12025045m724242n106344m296292l298221m518305l028778m118867l421178
$$ 212025045 207300803 202194459 197898167 194599946 190081641 187052863 182933996 179512818
2461A79512818l135011l093603k863843k455599k114353k241694k995815j690620
$$ 179512818 176377807 173284204 170420361 167964762 165850409 163608715 160612900 158922280
2453A58922280j996388k523596j810688k004447k233398k134954r37820j114377
$$ 158922280 156925892 154402296 152591608 150587161 148353763 146218809 145280989 144166612
2445A44166612k691844q98744j133893j154520k146576j181782q50977j612189
$$ 144166612 141474768 140576024 139442131 138287611 136141035 134959253 134108276 132496087
2437A32496087j450905n48877k418940k405718j796815k223404j896212j280765
$$ 132496087 131045182 130496305 128077365 125671647 123874832 121651428 119755216 118474451
2429A18474451j683924k031324o57329k003488l28834k918964j780984j301121
$$ 118474451 116790527 114759203 114101874 112098386 111769552 108850588 107069604 105768483
2421A05768483m57276j225882j976172q67563j022674p95440j366679j668380
$$ 105768483 105311207 104085325 102109153 101241590 100218916 99423476 98056797 96388417
2413I6388417j348946o28884j624705J54660k82932j118954q20507Q88148j074786
$$ 96388417 95039471 94410587 92785882 92940542 92657610 91538656 90718149 91606297 90531511
2404I0531511j508425J56130j222102n64314k109917j973358q35427j456594o34079
$$ 90531511 89023086 89179216 87957114 87392800 85282883 83309525 82474098 81017504 80383425
2395H0383425L74349j844678k167625j804589j482272j88090O85649K12382j203979
$$ 80383425 80757774 78913096 76745471 74940882 73458610 73270520 73956169 74168551 72964572
2386G2964572n94425l10495K40419M60162q72616j299279j132258j026419r73028
$$ 72964572 72370147 72059652 72300071 72760233 71887617 70588338 69456080 68429661 67456633
2377F7456633j264511o47019o13116l87657N13943k20617m17130j73402p33145
$$ 67456633 66192122 65545103 64931987 64544330 65058273 64837656 64420526 64247124 63513979
2368F3513979n10137n67785J79376P98269k36257p21658j098746k05829M61981
$$ 63513979 63003842 62436057 62615433 63413702 63177445 62455787 61357041 61151212 61613193
2359F1613193j197274L09720j370917n48349j61813r34770Q66766k45181k96170
$$ 61613193 60415919 60725639 59354722 58806373 58644560 57709790 58576556 58331375 58035205
2350E8035205m70797j239430n10619Q87280p79189j224362K11700o94772O15241
$$ 58035205 57564408 56324978 55814359 56701639 55922450 54698088 54909788 54215016 54830257
2341E4830257j103306o20337O48314L01875K31199o76387Q64230L87990j191584
$$ 54830257 53726951 53106614 53754928 54056803 54288002 53611615 54475845 54863835 53672251
2332E3672251O61499j17989j124837l9458L2539O32466k12024P42772k69180o02482
$$ 53672251 54333750 54215761 53090924 53051466 53084005 53716471 53504447 54247219 53978039 53375557
2322E3375557q65081N3143k85996m71576M24722J62944K40381r60042j24098Q58011
$$ 53375557 52510476 52563619 52277623 51806047 52230769 52393713 52634094 51674052 51549954 52407965
2312E2407965K18623r60093k11325n85761p92319m04997o87644m87347J24742
$$ 52407965 52626588 51666495 51455170 50869409 50077090 49672093 48984449 48497102 48621844
2303D8621844K1127L22312Q9507k67129O11357p37185j408317l52658j8002J48125
$$ 48621844 48642971 48965283 49054790 48787661 49399018 48661833 47253516 46900858 46882856 47030981
2293D7030981m6711O27787O76409N50077L86002L58423j646575P04069R00372
$$ 47030981 46984270 47612057 48288466 48838543 49224545 49582968 47936393 48640462 49540834
2284D9540834q75810j63048M18556O51388q04072j32318q39256P63954o12651
$$ 49540834 48665024 48501976 48920532 49571920 48767848 48635530 47796274 48560228 47947577
2275D7947577j047225l80189o52794n59739j459996q13574J144219q03308o22331
$$ 47947577 46900352 46520163 45867369 45307630 43847634 43034060 44178279 43374971 42752640
2266D2752640r39462L55707l73250j18867J081878J59740P508n38251K66770L40732
$$ 42752640 41813178 42168885 41795635 41676768 42758646 42918386 42925894 42387643 42654413 42995145
2256D2995145r80558M8061M79287m43983K39876n24610J165620J149112J20748
$$ 42995145 42014587 42062648 42541935 42097952 42337828 41813218 42978838 44127950 44248698
2247D4248698J482954K20842j651647q58494J107936o34689N02030R50223J18817
$$ 44248698 45731652 45952494 44300847 43442353 44550289 43915600 44417630 45367853 45486670
2238D5486670O23038n60997m18345j89489R19751J073430r66247k83082P35711
$$ 45486670 46109708 45548711 45130366 44940877 45860628 46934058 45967811 45684729 46420440
2229D6420440N99786l17073j640400M68388J337868K46633K06054L41533P34969
$$ 46420440 47020226 46703153 45062753 45531141 46869009 47115642 47321696 47663229 48398198
2220D8398198J306069Q37670M96836O10630J367987m96328j173971j908384J143788
$$ 48398198 49704267 50541937 51038773 51649403 53017390 52521062 51347091 49438707 50582495
2211E0582495J451935K34384J125151J074143l45417R69485o64829M38829J412714
$$ 50582495 52034430 52268814 53393965 54468108 54122691 55092176 54427347 54866176 56278890
2202E6278890J1990N66964J651893J529826J633993J489871J316111K371650J479043
$$ 56278890 56290880 56857844 58509737 60039563 61673556 63163427 64479538 66851188 68330231
2193F8330231K000799K921726J209131P45162O12519J8765J564295K430473K757418
$$ 68330231 70331030 73252756 74461887 75207049 75819568 75838333 77402628 79833101 82590519
2184H2590519K757285L941791K477661J812021K288778K514671K641269L54208
$$ 82590519 85347804 89289595 91767256 93579277 95868055 98382726 101023995 101378203
2176A01378203L59238J299146j518549l830682l760847m390668l517983l647908
$$ 101378203 101737441 103036587 101518038 97687356 93926509 89535841 86017858 82369950
2168H2369950m493672k576468k464119j143416j153405j726621O25494J231911
$$ 82369950 77876278 75299810 72835691 71692275 70538870 68812249 69437743 70669654
2160G0669654J210192J741122m62510j876562k512229l603327m418059l575999
$$ 70669654 71879846 73620968 73158458 71281896 68769667 65166340 60748281 57172282
2152E7172282r61865p53509j069066j221903r36973R0063j805775j32534M4555
$$ 57172282 56210417 55456908 54387842 53165939 52228966 52319029 50513254 50380720 50425275
2143E0425275j411728J34026P84502j184710j11888o37285m80367o24592k78696
$$ 50425275 49013547 49147573 49932075 48747365 48635477 47998192 47517825 46893233 46614537
2134D6614537p58373p65572L89866J3436L30386k44350L32587J25464k25477j06701
$$ 46614537 45856164 45090592 45480458 45493894 45824280 45579930 45912517 46037981 45812504 45705803
2124D5705803P86158q41686p48231j965248p59100J49748k309150l87149p92097
$$ 45705803 46491961 45650275 44902044 42936796 42177696 42327444 40018294 39631145 38839048
2115C8839048M12991k38748m81791j149593j271867k65180L0525l7006r20975
$$ 38839048 39252039 39013291 38531500 37381907 36110040 35844860 35875385 35838379 34917404
2106C4917404J67252L90688M10302M19820k82473n79563q81095m75263j67103
$$ 34917404 35084656 35475344 35885646 36305466 36022993 35443430 34562335 34087072 33919969
2097C3919969k21369m16555n64989N21917p43301p2726J411363j421655r82231
$$ 33919969 33698600 33282045 32717056 33238973 32495672 32422946 33834309 32412654 31430423
2088C1430423R14914J140529p59455n45543k66508l43609N69674m25753J622234
$$ 31430423 32345337 33485866 32726411 32180868 31914360 31570751 32140425 31714672 33336906
2079C3336906n91544K51372J649811J99181j85909R67020N64359J374548K04183
$$ 33336906 32745362 32996734 34646545 34845726 34659817 35626837 36191196 37565744 37769927
2070C7769927j355903l74557l54236j203766j373666K26450J8164j374694o69356
$$ 37769927 36414024 36039467 35685231 34481465 33107799 33334249 33352413 31977719 31308363
2061C1308363j88344j90527K20129M67802Q82091k6410p95006L28920J63582J526197
$$ 31308363 31120019 30929492 31149621 31617423 32499514 32473104 31678098 32007018 32170600 33696797
2051C3696797j155109J034756k98921m9304K15792o52313Q43520P35512Q17284
$$ 33696797 32541688 33576444 33277523 33228219 33444011 32791698 33635218 34370730 35188014
2042C5188014J98124J54133J552863J551654K503985K196622K762418K337920
$$ 35188014 35386138 35540271 37093134 38644788 41148773 43345395 46107813 48445733
2034D8445733L33331r24842k129884j973305m216142k875265r57614r0376p07018
$$ 48445733 48779064 47854222 45724338 43751033 39534891 36659626 35702012 35611636 34904618
2025C4904618j395354q48961J2736K20941k16958r49120O57191L63082L06221
$$ 34904618 33509264 32660303 32673039 32893980 32677022 31727902 32385093 32748175 33054396
2016C3054396n89375k11912r42413O95551Q05160l44020j099332L54017N26946
$$ 33054396 32465021 32253109 31310696 32006247 32811407 32467387 31368055 31722072 32249018
2007C2249018o6614J336227N32925j27587J124745K353669J324928P38233M02525
$$ 32249018 32182404 33518631 34051556 33923969 35048714 37402383 38727311 39465544 39868069
1998C9868069j919157j440203m26607j277600k505049r17239j374710j642467
$$ 39868069 37948912 36508709 36082102 34804502 32299453 31382214 30007504 28365037
1990B8365037m18766K13912l68790O28113O03009k67846r14775K83412J93389
$$ 28365037 27946271 28160183 27791393 28419506 29022515 28754669 27839894 28123306 28316695
1981B8316695m19884p37886j79249q24157l88032K55609J385n11331l5974o7160
$$ 28316695 27896811 27158925 26979676 26155519 25767487 26023096 26024481 25513150 25477176 25410016
1971B5410016j3610l93276P74075J685135j34854M48745p52235n84452O15410
$$ 25410016 25396406 25003130 25777205 27462340 27327486 27776231 27023996 26439544 27054954
1962B7054954K26395m03900o02742J00820K83022L67955K85679j70199P14147
$$ 27054954 27281349 26877449 26274707 26375527 26658549 27026504 27312183 27141984 27856131
1953B7856131K48487K46715Q08398J37704o26841J47052L38774J125428J655557
$$ 27856131 28104618 28351333 29159731 29297435 28670594 28817646 29156420 30281848 31937405
1944C1937405J21299j133205J675371J261334J182196l53220M23862L69673R25968
$$ 31937405 32058704 30925499 32600870 33862204 35044400 34691180 35115042 35484715 36410683
1935C6410683K649698J396603j99646J344014J244492Q18037R60821J788816K095221
$$ 36410683 39060381 40456984 40257338 41601352 42845844 43663881 44624702 46413518 48508739
1926D8508739K1797J558460K245282K018721K565887L421180J689823Q95004K772145
$$ 48508739 48530536 50088996 52334278 54352999 56918886 60340066 62029889 62924893 65697038
1917F5697038K033971l00230M59773J541847N41262k58355l71348L2951J039472
$$ 65697038 67731009 67430779 67890552 69432399 69973661 69715306 69343958 69376909 70416381
1908G0416381j253539m20349q36306p34987J451524L63799j82388J329344K69687
$$ 70416381 69162842 68742493 67906187 67171200 68622724 68986523 68804135 70133479 70403166
1899G0403166J842204M16326j059647O89528k29364J392392J582164J554698K37947
$$ 70403166 72245370 72661696 71602049 72291577 72062213 73454605 75036769 76591467 76829414
1890G6829414K965365L108049M292899M642814M491899M509251M682887N366923
$$ 76829414 79794779 82902828 87195727 91838541 96330440 100839691 105522578 110889501
1882A10889501N421102N376600L160357K399092K111739K6113j433167k301844
$$ 110889501 116310603 121687203 124847560 127246652 129358391 129384504 127951337 125649493
1874A25649493l686495l943087k385048L1118j266318j865990k447784k532445
$$ 125649493 121962998 118019911 115634863 115665981 114399663 112533673 110085889 107553444
1866A07553444l057003l983968l646353l988711l070343k962505j716361j719995
$$ 107553444 104496441 100512473 96866120 92877409 89807066 86844561 85128200 83408205
1858H3408205j040623k416160o08380j71762J151692J58699k53495K144911J996318
$$ 83408205 82367582 79951422 79343042 79171280 80322972 80481671 80228176 82373087 84369405
1849H4369405J758881J960430K539988K306389K440909J846333K391597Q89954
$$ 84369405 86128286 88088716 90628704 92935093 95376002 97222335 99613932 100503886
1841A00503886P58967K07417j190433j87721k920613k719735j060315k399696
$$ 100503886 101262853 101470270 100279837 100092116 97171503 94451768 93391453 90991757
1833I0991757j712474j743146k488087k198017k835025k729509k720554l214282
$$ 90991757 89279283 87536137 85048050 82850033 80015008 77285499 74564945 71350663
1825G1350663l336093k985963j847359k560540q82866q93757k096091o65926J36217
$$ 71350663 68014570 65028607 63181248 60620708 59737842 58844085 56747994 56082068 56218285
1816E6218285J03751k78559j870166m4509r90589p90741r68280p23980k242369
$$ 56218285 56322036 56043477 54173311 54128802 53138213 52347472 51379192 50655212 48412843
1807D8412843p32087j143930j453649j452826q85148j259617o9682j054848k120159
$$ 48412843 47680756 46536826 45083177 43630351 42745203 41485586 41415904 40361056 38240897
1798C8240897j067549j27763j82112m26309N65481J499292j223026K70785o81598
$$ 38240897 37173348 37045585 36863473 36437164 37002645 38501937 37278911 37549696 36868098
1789C6868098j394631J31119n72735P495n74047M26851k48581k10746q46292p48909
$$ 36868098 35473467 35604586 35031851 35039346 34465299 34892150 34643569 34432823 33586531 32837622
1779C2837622j722365m95346j432091j109947m44451j63144J76490K78102q25775
$$ 32837622 31115257 30619911 29187820 28077873 27633422 27470278 27646768 27924870 27099095
1770B7099095L8880j8289n9879r2504j105847j283113R94928n03457j99899l22637
$$ 27099095 27137975 27119686 27059807 26967303 25861456 24578343 25573271 25069814 24869915 24547278
1760B4547278J89622M28687m03077N28203m97028o00189l89656k41075l05748
$$ 24547278 24736900 25165587 24762510 25290713 24793685 24193496 23803840 23562765 23257017
1751B3257017k054459j41177M10773J88968j075637k19739M82843o72811o84723
$$ 23257017 21202558 21061381 21472154 21661122 20585485 20365746 20848589 20175778 19491055
1742A9491055J053614J292172J49439P90439l63052k29782j055629j178645r52238
$$ 19491055 20544669 21836841 21986280 22776719 22413667 22183885 21128256 19949611 18997373
1733A8997373O4726k359n98847n72036O53466o62723j31056m07652j178393j786090
$$ 18997373 19062099 19059740 18460893 17888857 18542323 17879600 17748544 17340892 16162499 14376409
1723A4376409k21245J350224J096833j53141k62620j354198l67440P55036l66740
$$ 14376409 14155164 15505388 16602221 16449080 16186460 14832262 14464822 15219858 14853118
1714A4853118L0104n25631k08971O63791P91983M69789m87570l69148k42964j79248
$$ 14853118 14883222 14357591 14148620 14812411 15604394 16074183 15586613 15217465 14974501 14795253
1704A4795253J423843M48272o59267r08519n54847N75178N7285r02765j301824
$$ 14795253 16219096 16667368 16008101 15099582 14544735 15119913 15177198 14274433 12972609
1695A2972609j070202m33735L14404J35773O91724p6736q35203Q79933k41082
$$ 12972609 11902407 11468672 11783076 11918849 12610573 12533837 11698634 12578567 12337485
1686A2337485p3558m92566o34211j64898n59006O20101R21108K04872p99414o18079
$$ 12337485 12263927 11771361 11137150 10972252 10413246 11033347 11954455 12159327 11359913 10741834
1676A0741834k33282N17224k44369J71836r95624l97029K63824l84710l49846
$$ 10741834 10508552 11025776 10781407 10953243 9957619 9560590 9824414 9439704 9089858
1667I089858R4623o4363J86746q99097N11443O69879k7615J958498o17509P278
$$ 9089858 9184481 9120118 9306864 8407767 8919210 9589089 9561474 11519972 10902463 10909741
1657A0909741J055797n56359m11714N6551L33646l70892j95621O57724K51819
$$ 10909741 11965538 11409179 10997465 11054016 11387662 11016770 10821149 11478873 11730692
1648A1730692l40921j60625Q0245j207042J558625k66165r11720o25128R11685
$$ 11730692 11389771 11229146 11309391 10102349 11660974 11394809 10483089 9857961 10769646
1639A0769646N62205o910J131960j96335j099008M15215r33987j69994o34276
$$ 10769646 11331851 11324941 12456901 12260566 11161558 11576773 10642786 10472792 9838516
1630I838516m9870L8260K20728O38500L27905J82866J92796J96716n35856J052364
$$ 9838516 9788646 9826906 10047634 10686134 11014039 11196905 11389701 11586417 11050561 12102925
1620A2102925P87633M54694J78618j1351O15682p14220j138496p51280L15703
$$ 12102925 12890558 13345252 13523870 13512519 14128201 13413981 12275485 11524205 11839908
1611A1839908O00364J5955K75384J425411K72609m12666J239008J149293M71253
$$ 11839908 12440272 12456227 12731611 14157022 14429631 14016965 15255973 16405266 16876519
1602A6876519m7435j087850j24095n75314l30528m125j538234L93908M37152O77776
$$ 16876519 16829084 15741234 15617139 15041825 14711297 14707172 13168938 13562846 13999998 14677774
1592A4677774r8410k63080q57491n3324P69240m3033N2500P77059r7233r4752
$$ 14677774 14579364 14316284 13458793 13405469 14174709 14131676 14184176 14961235 14864002 14769250
1582A4769250O07269R64946k86595q1300p67523K62236L10156p14811J78488k11281
$$ 14769250 15376519 16341465 16054870 15973570 15206047 15468283 15778439 15063628 15242116 15030835
1572A5030835J058585k86811k2013N22179j072735J300016K63425l01430l07927
$$ 15030835 16089420 15802609 15780596 16302775 15230040 16530056 16793481 16492051 16184124
1563A6184124O78213L32230q77172q01843L07534l26071n53128J153174o8320
$$ 16184124 16862337 17194567 16317395 15515552 15823086 15497015 14943887 16097061 16028741
1554A6028741R57082R24698J02280L30088N05717R76002O30192J4874P04879R63480
$$ 16028741 16985823 17910521 18012801 18342889 18848606 19824608 20454800 20469674 21174553 22138033
1544B2138033R25304P69454j024034j131409p9188J730937J478376m99025K26561
$$ 22138033 23063337 23832791 22808757 21677348 21598160 23329097 24807473 24308448 24535009
1535B4535009p00668m05105P45388p77815K25700j33236R16727L14223l29845
$$ 24535009 23834341 23429236 24174624 23396809 23622509 23489273 24406000 24720223 24390378
1526B4390378N48668J542729Q40888J186067q44283N45388P41644K51670K538439
$$ 24390378 24939046 26481775 27322663 28508730 27664447 28209835 28951479 29203149 31741588
1517C1741588Q42658p55769L88053O70570J19423J693983J419603j38392R7968
$$ 31741588 32584246 31828477 32216530 32887100 33006523 34700506 36120109 35981717 36079685
1508C6079685N75046J654700N26947K5629J146092k56295l85976j571483p20198
$$ 36079685 36654731 38309431 38836378 38862007 40008099 39751804 39365828 37794345 37074147
1499C7074147L4387R55904p9839K52407O25514n48678k38403k28521K15958M59066
$$ 37074147 37108534 38064438 37984599 38237006 38862520 38313842 38075439 37846918 38062876 38521942
1489C8521942P77468O71347j28912J54641R91291O87953Q59120J537740M40142
$$ 38521942 39299410 39970757 39841845 39996486 40987777 41675730 42534850 44072590 44512732
1480D4512732J424805K705096L39358L31090n79657k206585p09123Q95510p51045
$$ 44512732 45937537 48642633 48981991 49313081 48733424 46526839 45817716 46713226 45962181
1471D5962181j017782n51166n68997m73235r72823L0735n63812j363513j238450
$$ 45962181 44944399 44393233 43824236 43351001 42378178 42408913 41845101 40481588 39243138
1462C9243138q45960r93580J74724Q53918P02633m37788r34523O98767Q72081
$$ 39243138 38397178 37403598 37578322 38432240 39134873 38697085 37762562 38461329 39333410
1453C9333410j546892m55723j043018M81029r39052o54506p29335L52691R27796
$$ 39333410 37786518 37330795 36287777 36768806 35829754 35175248 34445913 34798604 35726400
1444C5726400p89430J343356J318291J9867J073103O0075L55315j755108k416372
$$ 35726400 34936970 36280326 37598617 37618484 38691587 38751662 39106977 37351869 34935497
1435C4935497n52279o08256k131856j200062j313086j118465q74248r21714j093568
$$ 34935497 34383218 33774962 31643106 30443044 29129958 28011493 27137245 26215531 25121963
1426B5121963j63185j283698j56030l63252l64270J089827M54277l37263j67263
$$ 25121963 24958778 23675080 23519050 23155798 22791528 23881355 24335632 23998369 23831106
1417B3831106K6717j968166m32153j388094k223380o2386k08774n53907J110068
$$ 23831106 23857823 21889657 21457504 20069410 17846030 17783644 17574870 17020963 18131031
1408A8131031m95943k91036m99057L92061m68851l10265l63078P76531o25847
$$ 18131031 17635088 17344052 16844995 17237056 16768205 16457940 16094862 16871393 16245546
1399A6245546j391891k73346k47859o61614r62952j84749j28605m75895M33243
$$ 16245546 14853655 14580309 14332450 13670836 12707884 12523135 12394530 11918635 12351878
1390A2351878l26160j473410j161236n59891K17521M96426m34839R18483j10544
$$ 12351878 12025718 10552308 9391072 8831181 9048702 9545128 9110289 10028772 9918228
1381I918228o5144K86926l48181r91049n22939j92581k09895N22179N44085k01885
$$ 9918228 9853084 10140010 9791829 8800780 8277841 8085260 7875365 8397544 8941629 8739744
1371H739744j614291K95998J87771p35231j02344j355050N30669Q24833Q2968
$$ 8739744 7125453 7421451 7609222 6873991 6771647 5416597 5947266 6772099 6855067
1362F855067j80851q15367K99223m05492P16755q7710O64982P6288p67400M2588
$$ 6855067 6674216 5858849 6158072 5752580 6469335 6381625 7046607 7122895 6355495 6398083
1352F398083q24571n32761r13335O96829J48297Q85222j8479j160503M12586N65384
$$ 6398083 5573512 5040751 4127416 4824245 4972542 5857764 5839285 4678782 5091368 5656752
1342E656752j61430j93217K23081j487401k86482j51696k80754O83020M11276
$$ 5656752 5495322 5302105 5525186 4037785 3751303 3599607 3318853 4001873 4413149
1333D413149k06804L46529P23952M04015j47652j217802L41286p43743m4266R9815
$$ 4413149 4206345 4552874 5276826 5680841 5533189 4315387 4656673 3912930 3868664 3968479
1323C968479M28642l440j404518J085594M52512o13954O70270n19176l52537N08827
$$ 3968479 4397121 4393681 2989163 4074757 4527269 3913315 4583585 4064409 3711872 4220699
1313D220699q69131j63436J75749K30233O47551m31756J31192l00957P7865L38555
$$ 4220699 3351568 3188132 3363881 3594114 4241665 3809909 3941101 3640144 3718009 4056564
1303D056564J019145j30216j191878p42210m1623P63493r50156K32189L69253
$$ 4056564 5075709 4945493 3753615 3011405 2969782 3733275 2783119 3015308 3384561
1294C384561J18462n8103p7462L29500j214213P32578L35163j18332L95617J474170
$$ 3384561 3503023 3444920 3367458 3696958 2482745 3215323 3550486 3432154 3827771 5301941
1284E301941k15236j159166q47651j40840J047510j59787j045368O88554J73166
$$ 5301941 5086705 3927539 3079888 2939048 3986558 3826771 2781403 3469957 3643123
1275C643123J27544k82240j355571J152572K12874R55338j057495j64467K6257
$$ 3643123 3770667 3488427 2132856 3285428 3498302 4453640 3396145 3231678 3257935
1266C257935m10020P97003O67444L19151r42546N20662O30563j348600m69333
$$ 3257935 2847915 3644918 4312362 4631513 3688967 4209629 4840192 3491592 3022259
1257C022259J37155M77116J304557J172628l07094j897835q45923R78290k49941
$$ 3022259 3159414 3636530 4941087 6113715 5806621 3908786 3062863 4041153 3791212
1248C791212J710510Q68249j41132j44036m16169L78213Q6911j369469o81493
$$ 3791212 5501722 6369971 6228839 6084803 5668634 6046847 6133758 4764289 4082796
1239D082796l82662M15928p55233k54913j86397K61592r14327K41297K87235R79988
$$ 4082796 3700134 4116062 3360829 3105916 2919519 3181111 2266784 2508081 2795316 3775304
1229C775304N76088o75504j17562k9912j27293J071611j88340O44687o92442k46050
$$ 3775304 4351392 3675888 3558326 3528414 3401121 4472732 4284392 4929079 4236637 3990587
1219C990587q51364q20576Q83709p24211R66353l25808O79813k44682O8134l4494
$$ 3990587 3139223 2318647 3202356 2478145 3444498 3118690 3798503 3553821 3621955 3587461
1209C587461j82547q16232J3294L85984J60654j834856l53498P37761O58649M32081
$$ 3587461 3404914 2588682 2601976 2987960 3148614 1313758 960260 1698021 2356670 2788751
1199B788751p18875J351369m23251l08946Q72953j008036l40408J028798O97634
$$ 2788751 2069876 3421245 2997994 2689048 3562001 2553965 2213557 3242355 3939989
1190C939989n41156r31185R13024O71653J52550Q04432l3644o10722m29436N03891
$$ 3939989 3398833 2467648 3380672 4052325 4204875 5009307 4975663 4364941 3935505 4439396
1180D439396n58927j14401K16897p8834r64475k68878l03206o00634J80537J927212
$$ 4439396 3880469 3766068 3982965 3904131 2939656 2670778 2367572 1766938 1947475 3874687
1170C874687n08187k32218N96788P8330q06262O04873j176757p14867J702171
$$ 3874687 3366500 3134282 3731070 3809400 3003138 3608011 2431254 1716387 3418558
1161C418558J06268J8141K88876r0435Q58822j074403K52915J532253J28554p13406
$$ 3418558 3524826 3542967 3831843 3741408 4600230 3525827 3778742 5310995 5439549 4726143
1151D726143j002377l67396R24424J56576J05428J78070q98431P28122J67878
$$ 4726143 3723766 3356370 4280794 4437370 4542798 4720868 3822437 4550559 4718437
1142D718437Q48325q89093j321325o7929m13420k09465J058213M27075j380551
$$ 4718437 5566762 4677669 3356344 3288415 2874995 2665530 3723743 4150818 2770267
1133B770267l8311O22703J088077M04573L36078J109921N15927N5270q05841n76730
$$ 2770267 2731956 3354659 4442736 4847309 5183387 6293308 6809235 6864505 6058664 5481934
1123E481934p07423M71220N9147p36031p66986M35503O74466M03413k96853l2223
$$ 5481934 4774511 5245731 5304878 4568847 3801861 4237364 4911830 5315243 5018390 4986167
1113D986167r67459l24781N70911P31403k594K90695J506344k68136j228362N48616
$$ 4986167 4018708 3693927 4264838 4996241 4993647 5284342 6790686 6522550 5294188 5842804
1103E842804O67166j540738p9167N99414J93413M18770K73883p53363n37240p38525
$$ 5842804 6509970 4969232 4890065 5489479 5682892 6101662 6375545 5622182 5084942 4346417
1093D346417L16728l1289o62596J504080N57559L41004n16263j182o73127J65813
$$ 4346417 4663145 4631856 3969260 5473340 6030899 6371903 5855640 5854458 5181331 5347144
1083E347144l1298n10898Q12485j03616L396L11726j28787m76413k6912j05821
$$ 5347144 5315846 4804948 5617433 5513817 5517213 5828939 5700152 5223739 5196827 5091006
1073E091006N85224Q24964L49588O6466j20599n14842O65844q12713j63380L17110
$$ 5091006 5676230 6501194 6850782 6917248 6796649 6281807 6947651 6134938 5971558 6288668
1063F288668k03026M44227n39530P59339N3675J99820N93147O98353p41514m29528
$$ 6288668 6085642 6529869 5990339 6749678 6803353 7003173 7596320 8294673 7553159 7123631
1053G123631j114481K28931J309714M89279j02162j026805M84717r39106L82004
$$ 7123631 6009150 6238081 7547795 8037074 7934912 6908107 7392824 6453718 6835722
1044F835722Q90408m53155J171613k6055R26346K61281P67524j116615p43641
$$ 6835722 7726130 7272975 8444588 8418533 9344879 9606160 10373684 9257069 8513428
1035H513428J089662o133R4109O10234R51207l42799J308n19057J49922K59589
$$ 8513428 9603090 9596957 9691066 10301300 11252507 10909708 10911016 10391959 10541881 10801470
1025A0801470m33546J65739l31293M95429N40546P07232J562228j045682j672163
$$ 10801470 10367924 10533663 10202370 10697799 11238345 11945577 13507805 12462123 10789960
1016A0789960J169920J603505J2963Q81957J81349j60696N52113J792400j5962
$$ 10789960 11959880 13563385 13576348 14458305 14639654 14478958 15031071 16823471 16807509
1007A6807509K4532J09388R31451L81845J366431J365962J368814R36001N42122
$$ 16807509 16832041 16941429 17872880 18254725 19621156 20987118 22355932 23291933 23834055
998B3834055J130874O38122J667460K052527J960390K522431K371357Q07253J848022
$$ 23834055 24964929 25603051 27270511 29323038 31283428 33805859 36177216 36984469 38832491
989C8832491J522908L448230K071270K816284K805538L572681M121966N014270
$$ 38832491 40355399 43803629 45874899 48691183 51496721 55069402 59191368 64205638
981F4205638O277456M937007O387686O584041N148948M863383P557622R815167
$$ 64205638 70483094 75420101 81807787 88391828 93540776 98404159 105961781 115776948
973A15776948J2263824J5588767K1229231K7710575L5047821L5007379M2614773
$$ 115776948 128040772 143629539 164858770 192569345 227617166 262624545 305239318
966C05239318N6155086N5954346M3863093R963449n8539533r3100561p0470985
$$ 305239318 361394404 417348750 461211843 471175292 412635759 319535198 249064213
959B49064213m3652220l0273266k3252537j7800995j4154890j1111984r999432
$$ 249064213 205411993 175138727 151886190 134085195 119930305 108818321 98818889
952I8818889p711597n909974m411742m193670k835942k511678m143849o232133
$$ 98818889 91107292 85197318 80785576 76591906 73755964 71244286 67100437 60868304
944F0868304n390060l547326l607473k295791k060540k434460j443523j209087
$$ 60868304 55478244 51930918 48323445 46027654 43967114 41532654 40089131 38880044
936C8880044j530507k106777j193444n51427l67498k206903j553789o00925m53795
$$ 38880044 37349537 35242760 34049316 33497889 33130391 30923488 29369699 28768774 28314979
927B8314979j036901m59876l89419m55851k000908q91775J06826j643066j219050
$$ 28314979 27278078 26818202 26428783 25972932 23972024 23080249 23187075 21544009 20324959
918B0324959j784162k97834L54887J65013k67449n22584j066910j435469L27669
$$ 20324959 18540797 18242963 18597850 18762863 18495414 17972830 16905920 15470451 15798120
909A5798120J57862m33584j161806n32300l41169J03249J131646k97710j024918
$$ 15798120 15955982 15522398 14360592 13828292 13487123 13590372 14722018 14424308 13399390
900A3399390j372746K84878m25532k56965N76940k03873l1624p7090O54599n26182
$$ 13399390 12026644 12311522 11885990 11629025 12205965 12002092 11970468 11893378 12547977 12021795
890A2021795o59562q12534q69888O11136j139110p27305J089467l07285j65186
$$ 12021795 11362233 10549699 9679811 10290947 9151837 8424532 9513999 9206714 9041528
881I041528R2343M04685l94112K05559p00276r82287L91642N97230O23085n70573
$$ 9041528 9133871 9538556 9144444 9350003 8649727 7667440 8059082 8656312 9279397 8708824
871H708824r46786q25706N10991m04914n64471n9661M74849p70293J264917J94990
$$ 8708824 7762038 6936332 7447323 7042409 6477938 6418277 6893126 6122833 7387750 7582740
861G582740n06818p22676j402511P6856O64323J69615R19164p6754L76659j94431
$$ 7582740 7075922 6353246 4950735 5027591 5691914 5861529 6780693 6703939 7080598 6886167
851F886167k07346l21724j497261L26366M05337k52609j001127k2310O07604M53871
$$ 6886167 6678821 6357097 4859836 5186202 5591539 5338930 4337803 4315493 4923097 5376968
841E376968j016878J69668J054935P31212n19389j04468j110228j041107Q85152
$$ 5376968 4360090 4529758 5584693 6315905 5796516 5692048 4581820 3540713 4425865
832D425865k60917j20079N30642K98595o31290k05540J37421q05225J646923K40005
$$ 4425865 4164948 4044869 4575511 4874106 4242816 4037276 4174697 3369472 5016395 5256400
822E256400o62618K20658K2256j180972l96745j392830O51064l41034j103738
$$ 5256400 4593782 4814440 4836696 3655724 3258979 1866149 2517213 2176179 1072441
813A072441o22843J080007L00168R78475Q36948j447987J85881L94508J052999
$$ 1072441 449598 1529605 1829773 2808248 3645196 2197209 2383090 2777598 3830597
804C830597M46182r18062J75689n37645j55818N69687L56865N74815j179717k02768
$$ 3830597 4276779 3358717 3534406 2996761 2840943 3410630 3767495 4342310 3162593 2959825
794B959825j05831J34079j387684j9063R82502O18571p70490l71638p8498M91484
$$ 2959825 2853994 2988073 1600389 1581326 2563828 3182399 2411909 2040271 1961773 2453257
784B453257O58776L72576p24487n0482j070604J70401m02736J166759n81457m4958
$$ 2453257 3112033 3484609 2760122 2709640 1639036 1809437 1406701 2573460 1992003 1947045
774A947045L55936P98575o66988j1238Q07282j350131m26808k51804J119817J18457
$$ 1947045 2302981 3101556 2434568 2423330 3230612 1880481 1453673 1201869 2321686 2440143
764B440143j27113p95682L85372l57733L43536n51894n31060J092934R52396N00370
$$ 2440143 2313030 1517348 1902720 1544987 1888523 1336629 805569 1898503 2850899 3351269
754C351269j033464o18270n65679k42287R09820L44500L66453k19141j902893
$$ 3351269 2317805 1699535 1133856 891569 1801389 2145889 2512342 2293201 390308
745C90308J0068M61345n31246p52307j099128J28198J152818J040078J147413
$$ 390308 400376 861721 330475 -421832 -1520960 -1392762 -239944 800134 1947547
736A947547R12817Q54187o73871j618732l48525N71562K94698M20789K76035p3279
$$ 1947547 2860364 3714551 3040680 1421948 1073423 1644985 1939683 2360472 2636507 2563228
726B563228O57329r82210j18926k37178M58847q24055j0894m6322j399607J368426
$$ 2563228 3220557 2238347 2119421 1882243 2341090 1517035 1506141 1459819 60212 1428638
716A428638N91717j104830n54446N78861R35448j057936l81708N97177K04916
$$ 1428638 2020355 915525 361079 939940 1875388 817452 435744 1032921 1237837
707A237837M00005J32211K16111J3237l42820n1665j209191N31361n39718K818
$$ 1237837 1637842 1770053 1986164 1999401 1656581 1604916 395725 927086 387368 390186
697C90186N9938k31582L27694J507978Q95636j086503k118108L23509R33386o52699
$$ 390186 450124 218542 546236 2054214 2949850 1863347 -254761 68748 1002134 349435
687C49435p7880L41599l49877n75753m82238Q48812J528907Q62412l3962L44730
$$ 349435 271555 613154 263277 -312476 -794714 54098 1583005 2445417 2411455 2756185
677B756185M75292n33182O08048o99384j492139o32527l33726Q26179J078228
$$ 2756185 3231477 2698295 3306343 2606959 1114820 482293 148567 974746 2052974
668B052974o47405l1757M77271L56208q91561j543156P97477j29946K3389O14000
$$ 2052974 1405569 1373812 1851083 2207291 1315730 -227426 570051 440105 463494 1077494
658A077494r33850q583n3479J62375j66370l11128R67937M41389m81921O8807
$$ 1077494 143644 135061 81582 243957 77587 -233541 734396 1175785 693864 762671
648G62671o52568l83671Q56336j015835P3083J304217j054709O23673j38523m57251
$$ 762671 110103 -273568 582768 -433067 -359984 944233 -110476 513197 374674 -82577
638h2577r2200M52189q09843J868597j67784j240867m3477Q205N38732k12101
$$ -82577 -174777 277412 -532431 1336166 1168382 -72485 -115962 -107757 430975 218874
628B18874j595563l38722L14625O80972Q46598J26875k2013M2443j14996J9028
$$ 218874 -1376689 -1715411 -1400786 -719814 126784 253659 231646 274089 159093 178121
618A78121k99736j622508J639138P45007q44000K64996j317489P40300J159456
$$ 178121 -121615 -1744123 -104985 640022 -203978 61018 -1256471 -516171 643285
609F43285r7735J73556p84782r7533p18001Q98257r4610j591555K48207J459566
$$ 643285 545550 719106 -65676 -163209 -881210 17047 -77563 -1669118 -1420911 38655
599C8655L7647O7134j73244O52279R79365j380901n37375o10861N96155J70374
$$ 38655 76302 143436 -29808 622471 1601836 220935 -316440 -927301 -331146 -160772
589a60772j503141R94026N27507q4377M39028k42762N19392j96637k30196j92574
$$ -160772 -1663913 -669887 -142380 -226757 212271 -30491 488901 292264 62068 -130506
579a30506O77412j17367j453191k56043Q75083K31689j96356j048878J199248
$$ -130506 546906 429539 -1023652 -1279695 -404612 -172923 -369279 -1418157 -218909
570b18909Q53649J68228k17783j31867J05415O8397Q1747m28014m22851j261723
$$ -218909 634740 802968 585185 453318 558733 627130 708877 280863 -141988 -1403711
560a403711K88171j18639m9062J306342k73090o06058L70712J26162M39013K2460
$$ -1403711 -1115540 -1234179 -1283241 23101 -249989 -856047 -485335 -359173 79840 102300
550A02300R36016m80891L57992j176563j48800L4865m65351O3332o41650Q92271
$$ 102300 1038316 557425 915417 -261146 -409946 -375081 -840432 -777100 -1418750 -526479
540e26479Q7788K78569k97083k20421j54148J368151L19359j479160m79860j083365
$$ -526479 -438691 -160122 -457205 -677626 -831774 536377 855736 -623424 -1103284 -2186649
530b186649J67749J960955P85813k69071o7125j175933O59119n45174P50191R3231
$$ -2186649 -2018900 -57945 727868 458797 391672 -784261 -125142 -670316 79875 173106
520A73106j363023J03809N71232J20906J365376j151495P66947r98883j497723
$$ 173106 -1189917 -1086108 -514876 -393970 971406 -180089 586858 -412025 -1909748
511a909748K90524n74710n87173J303887Q21424o20343J964713m23838p54355
$$ -1909748 -1619224 -2193934 -2781107 -1477220 -655796 -1276139 688574 264736 -489619
502d89619P1705J44882O90742O02443j933660L5751O30566j151938p54005N14610
$$ -489619 -417914 -273032 417710 1020153 -913507 -877756 -247190 -1399128 -2153133 -1638523
492a638523R2314o6098K27668O79537J432545O66067m15539q96399o77595j603395
$$ -1638523 -1546209 -1612307 -1384639 -705102 727443 1393510 977971 81572 -596023 -2199418
482b199418o88725J278829J198839j68374j528053J424141R10621j573175j577683
$$ -2199418 -2888143 -1609314 -410475 -578849 -2106902 -682761 227860 -1345315 -2922998
473b922998j11318J508729J68629k48134K66444M3950J044382j088268k85665
$$ -2922998 -3034316 -1525587 -1356958 -1605092 -1338648 -1294698 -250316 -1338584 -1624249
464a624249N28254k9798P6437j54418j68361M19111J80990j34289K91586q32517
$$ -1624249 -1095995 -1125793 -1049356 -1203774 -1372135 -953024 -772034 -906323 -614737 -1447254
454a447254l09863Q89508N73074m90370l20017p5339Q94240o21229m5244n33395
$$ -1447254 -1757117 -867609 -294535 -784905 -1104922 -1180261 -286021 -907250 -952494 -1485889
444a485889N77772P80379l07862o43987n20100j05436M10592J67204m76888L44995
$$ -1485889 -908117 -127738 -435600 -1079587 -1599687 -1705123 -1294531 -1127327 -1604215 -1259220
434a259220L24047k59820j101009J637453m54768q41595l32698n90715o5841O92683
$$ -1259220 -935173 -1194993 -2296002 -658549 -1113317 -1954912 -2287610 -2878325 -2944166 -2251483
424b251483K91749N26883J88353J54406K16331j65803J14349L49320n92121m5700
$$ -2251483 -1959734 -1432851 -1244498 -1090092 -873761 -1039564 -925215 -575895 -1168016 -1213716
414a213716K88438l79197J93187n16185N57712o1096j06771n35143p52256p84025
$$ -1213716 -925278 -1304475 -1111288 -1627473 -1069761 -1130857 -1237628 -1772771 -2525027 -3309052
404c309052M26628J14155J36246K77366R81230J8979m54693o21979P45620J536249
$$ -3309052 -2882424 -2768269 -2632023 -2354657 -1373427 -1354448 -1809141 -2431120 -1685500 -149251
394a49251j523808j53343o37427m64512O33851J080685m5908j152045j568338
$$ -149251 -1673059 -1826402 -2463829 -2928341 -2294490 -1213805 -1259713 -2411758 -3980096
385c980096Q96696J231547o9380P7079q7188M03464O17950q04364o84744m2920
$$ -3980096 -3083400 -1851853 -1921233 -1844154 -1931342 -1527878 -909928 -1714292 -2399036 -2441956
375b441956j005O88036R39070j17664n02076n51357j298369L12685J473125j47201
$$ -2441956 -2442961 -1754925 -815855 -933519 -1435595 -1986952 -3285321 -2972636 -1499511 -1646712
365a646712r23404k11705Q96569O11975p25353p60863k33643j84958L95427M30088
$$ -1646712 -2570116 -2781821 -1885252 -1273277 -1998630 -2759493 -2993136 -3178094 -2782667 -2352579
355b352579O3024K35435J68433j8832M70888P94353j98448j013253k8275o45645
$$ -2352579 -2289555 -2054120 -1885687 -1904519 -1433631 -639278 -837726 -1850979 -1879254 -2524899
345b524899o07267N44322N99936j271340n2283j72053J553954K86192O0771P2875
$$ -2524899 -3132166 -2587844 -1987908 -3259248 -3311531 -3483584 -1929630 -1643438 -1582667 -1509792
335a509792O65295q10372q15074K99353K50145k11905l68499R03315j183997J56200
$$ -1509792 -844497 -1654869 -2469943 -2170590 -1920445 -2132350 -2500849 -1597534 -2781531 -2625331
325b625331q71261P86742N8119r64873R39331J108711q54296j9919n93647M53021
$$ -2625331 -3496592 -2709850 -2651731 -3616604 -2677273 -1568562 -2422858 -2442777 -3036424 -2583403
315b583403J05175m61004l75731M6134M93992K11683k01237L84727M41990Q7328
$$ -2583403 -2478228 -2939232 -3314963 -3268829 -2774837 -2563154 -2764391 -2379664 -1937674 -1850346
305a850346j216158o67468o20142J330994K85171j1640J90630m22612J251J253045
$$ -1850346 -3066504 -3733972 -4354114 -3023120 -2737949 -2749589 -2558959 -2981571 -2980320 -1727275
295a727275p02707j24599O78772q72011M25964K89579l11926L22093R21092l81795
$$ -1727275 -2429982 -2554581 -1875809 -2747820 -2321856 -2032277 -2344203 -2022110 -1101018 -1482813
285a482813q53859q89026K98261O70139M05898N45742j81553O1655m26878o41590
$$ -1482813 -2336672 -3225698 -2927437 -2257298 -1851400 -1305658 -1487211 -1425556 -1852434 -2494024
275b494024j162071Q49789R49696o73122l07230N62179l85156R84369K98997q11313
$$ -2494024 -3656095 -2806306 -1856610 -2529732 -2836962 -2274783 -2659939 -1675570 -1376573 -2187886
265b187886j197224J64618R26066L60981L72969j036049j047641p11891Q41946
$$ -2187886 -3385110 -3220492 -2294426 -1933445 -1560476 -2596525 -3644166 -4356057 -3514111
256c514111n23545O46698P79662m31987L36495L80457o86317j199414J042008
$$ -3514111 -4037656 -3390958 -2611296 -3043283 -2706788 -2326331 -3012648 -4212062 -3170054
247c170054O94485p23554k06419P3994p12127n60025J934462P55561j08567j100169
$$ -3170054 -2475569 -3199123 -3405542 -3331548 -4043675 -4603700 -2669238 -1913677 -2022244 -3122413
237c122413o9681Q4947P58695J96110l87351m13105P21210m1732o98250j51996
$$ -3122413 -3192094 -3107147 -2348452 -2152342 -2539693 -2952798 -2231588 -2273320 -2971570 -3123566
227c123566R38210Q4877J8251q53560L97539J494278l68733j232695n93606J132289
$$ -3123566 -2185356 -2100479 -2082228 -2935788 -2538249 -1043971 -1412704 -2645399 -3239005 -2106716
217b106716P53337j205372j068833M81862K79784k9360L00506l04364p50218k20176
$$ -2106716 -1353379 -2558751 -3627584 -3145722 -2865938 -2895298 -2594792 -2899156 -3649374 -3869550
207c869550O28922O34101n69333o05343P56740P17204o95167n60180n0619n6764
$$ -3869550 -3240628 -2606527 -3175860 -3781203 -3024463 -2307259 -3002426 -3562606 -3613225 -3669989
197c669989n38679O70890n48105l68153J642157m72414l83635q8381P07111q50526
$$ -3669989 -4208668 -3537778 -4085883 -4454036 -2811879 -3284293 -3667928 -3756309 -3049198 -3899724
187c899724O16455O68713j218467O81958l24175j103258N68170j29780J257007
$$ -3899724 -3283269 -2614556 -3833023 -3151065 -3475240 -4578498 -4010328 -4140108 -2883101
178b883101O170j4541K64553N03435l72280n03133j10194k57115P24435L3500
$$ -2883101 -2876931 -2891472 -2626919 -2123484 -2495764 -2998897 -3109091 -3366206 -2641771 -2608271
168b608271n21488J16282K00744o18659j25922n03164J166778J253050o04177
$$ -2608271 -3129759 -3013477 -2812733 -3431392 -3557314 -4060478 -2893700 -1640650 -2244827
159b244827m11475n64401q87804J32415J21312P50497j82592K81324M20715l54179
$$ -2244827 -2656302 -3220703 -4108507 -3976092 -3854780 -3104283 -3286875 -3005551 -2584836 -2939015
149b939015n58415J27310N70442Q51785N62134k79520k423854q16475N00859J193564
$$ -2939015 -3497430 -3370120 -2799678 -1947893 -1385759 -1665279 -4089133 -4905608 -4404749 -3211185
139c211185O13273m56687l09578Q77229n30133P65409l56873o76999N44453k12336
$$ -3211185 -2597912 -3054599 -3364177 -2486948 -3017081 -2251672 -2608545 -3285544 -2741091 -2953427
129b953427m00236k90496j42585R4160j7135j110558K76188J82444M73775J94034
$$ -2953427 -3353663 -3644159 -3786744 -3692584 -3709719 -4820277 -4544089 -4361645 -3887870 -3693836
119c693836K50512R45752K15244p15222o16425N3583Q57684K49542k69989q7520
$$ -3693836 -3443324 -2497572 -2282328 -2997550 -3613975 -3560392 -2702708 -2453166 -2723155 -2810675
109b810675L73601n6168j16242m35748m35761L3142P5900R04897o54616Q35490
$$ -2810675 -2437074 -2493242 -2609484 -3045232 -3480993 -3447851 -3371951 -2467054 -3121670 -2286180
99b286180k33643k99439j07221n6980l21512j524046K80045L3306L99364J43057
$$ -2286180 -2519823 -2819262 -2926483 -2983463 -3304975 -4829021 -4548976 -4515670 -4116306 -3973249
89c973249j5077K98438j90151l35316L97296r35818L17165J57488M65769J56014
$$ -3973249 -3988326 -3689888 -3880039 -4215355 -3818059 -4753877 -4436712 -4279224 -3813455 -3657441
79c657441q94203Q20331q60645n7994R73622p82635J64519J708392o56274n72959
$$ -3657441 -4551644 -3731313 -4591958 -4649952 -3676330 -4458965 -4294446 -2586054 -3242328 -3815287
69c815287o65573K42133J83046o63598Q16156J97649N44256L89160r27510J86523
$$ -3815287 -4480860 -4238727 -4055681 -4719279 -3903123 -3705474 -3161218 -2772058 -3699568 -3513045
59c513045o68425R04769N44464r11773K27358k34417J835Q1367k90814m01558
$$ -3513045 -4181470 -3276701 -2732237 -3644010 -3416652 -3651069 -3649234 -3567867 -3858681 -4260239
49d260239m84464M90360O02663N5032M3583j31693m32337j2750k19209R90133
$$ -4260239 -4744703 -4254343 -3651680 -3596648 -3553065 -3684758 -4117095 -4129845 -4349054 -3358921
39c358921P41647j75283r3032j12481j38965l71562L40638j90802P3756j42206
$$ -3358921 -2617274 -2792557 -2885589 -2998070 -3137035 -3508597 -3167959 -3358761 -3285005 -3427211
29c427211q00613q91140N96166Q17631p97767j88150Q76822p21747m59615m07513
$$ -3427211 -4227824 -5118964 -4522798 -3705167 -4502934 -4691084 -3814262 -4536009 -4995624 -5403137
19e403137P82747M11613k67150L92881O99170m9249K50377m14060l97909l07401
$$ -5403137 -4620390 -4208777 -4475927 -4083046 -3383876 -3433125 -3182748 -3596808 -3994717 -4302118
9d302118l23254J8827N35641L43817L1192l10725L69820O86972k37143
$$ -4302118 -4625372 -4606545 -4070904 -3727087 -3695895 -4006620 -3636800 -2949828 -3186971
0c186971
$$ -3186971
$$ Imaginary data points
##PAGE= N=2
##DATA TABLE= (X++(I..I)), XYDATA
16383a6333277R54821P97823J68794K30607k70662m24922J16343m3852K86279
$$ -16333277 -15378456 -14580633 -14411839 -14181232 -14451894 -14876816 -14760473 -14804325 -14518046
16374a4518046M01332J22517m45701L28513m08375Q77355K81528j64857J25714
$$ -14518046 -14116714 -13994197 -14439898 -14111385 -14519760 -13642405 -13360877 -13525734 -13400020
16365a3400020R29239M28763l54900k71296O42554q4096O37513N74045o56063
$$ -13400020 -12470781 -12042018 -12396918 -12668214 -12025660 -12109756 -11472243 -10898198 -11554261
16356a1554261m10219M52207R73218K2135k40264R26248k24614m93902J071965
$$ -11554261 -11964480 -11512273 -10539055 -10516920 -10757184 -9830936 -10055550 -10549452 -9477487
16347i477487O07819k74835n57310M25173k65692L64937O41214P09601K5266r69413
$$ -9477487 -8869668 -9144503 -9701813 -9276640 -9542332 -9177395 -8536181 -7826580 -7801314 -8770727
16337h770727J80231J81878O08995O13m75757O99177M26920l60158m16352J09945
$$ -8770727 -8590496 -8408618 -7799623 -7799010 -8274767 -7575590 -7148670 -7508828 -7925180 -7815235
16327g815235O96330P02973J94518K96489k15563L29576O01912J20266K61587
$$ -7815235 -7118905 -6415932 -6221414 -5924925 -6140488 -5810912 -5209000 -5088734 -4827147
16318d827147j44571l18591Q82849L86911k66074L66136R1878P611N31062J49775
$$ -4827147 -4971718 -5290309 -4407460 -4020549 -4286623 -3920487 -3828609 -3820998 -3289936 -3140161
16308c140161n81810m26618K69493P02321J29266O65526Q55566l25261j006725
$$ -3140161 -3721971 -4148589 -3879096 -3176775 -3047509 -2381983 -1526417 -1851678 -2858403
16299b858403L93319J79791J017125p59822k69432N64388j44828R74756K04808
$$ -2858403 -2465084 -2285293 -1268168 -2027990 -2297422 -1733034 -1877862 -903106 -698298
16290f98298L40447N92609k55969j056781J97083J802577o25808l31286K35742
$$ -698298 -357851 234758 -21211 -1077992 -880909 921668 295860 -35426 200316
16281B00316M6430J048262K1682q03502r41908J324208J089926j032588l57559
$$ 200316 246746 1295008 1316690 513188 -428720 895488 1985414 952826 595267
16272E95267P07339R21037j47445K99959J92794J33194L34390o21403m01884J29184
$$ 595267 1302606 2223643 2076198 2376157 2568951 2702145 3036535 2415132 2013248 2142432
$$ [...]
##END NTUPLES=NMR SPECTRUM
##END=
