##TITLE=1H_EC-3252(II-25)
 CDCl3,8 sc, 
 1.04.2021
##JCAMPDX= 6.0         $$ Bruker NMR JCAMP-DX V2.0
##DATA TYPE= NMR SPECTRUM
##DATA CLASS= NTUPLES
##ORIGIN= UXNMR, Bruker Analytische Messtechnik GmbH
##OWNER= root
$$ XWIN-NMR		Version 3.5
$$ Thu Apr  1 12:53:54 2021 Russian Standard Time (UT+4h)  she@DPX200
##.OBSERVE FREQUENCY= 200.131506
##.OBSERVE NUCLEUS= ^1H
##.ACQUISITION MODE= SIMULTANEOUS
##.ACQUISITION SCHEME= undefined
##.AVERAGES= 8
##.DIGITISER RES= 18
##SPECTROMETER/DATA SYSTEM= spect
##.PULSE SEQUENCE= zg30
##.SOLVENT NAME= CDCl3
##.SHIFT REFERENCE= (INTERNAL, CDCl3, 0, 15.9616)
##AUDIT TRAIL= $$ (NUMBER, WHEN, WHO, WHERE, WHAT)
$$ ##TITLE= Audit trail, XWIN-NMR		Version 3.5
$$ ##JCAMPDX= 5.01
$$ ##ORIGIN= Bruker BioSpin GmbH
$$ ##OWNER= she
$$ F:/spectra/data/she/nmr/H-F/1/pdata/1/auditp.txt
$$ ##AUDIT TRAIL=  $$ (NUMBER, WHEN, WHO, WHERE, WHAT)
(   1,<2021-04-01 12:52:42.39 +0400>,<she>,<DPX200>,
      <created by zg, POWCHK disabled, PULCHK disabled
       configuration hash MD5:
       00 E9 B6 7A A2 85 ED C7 34 08 36 98 17 FE 4E 26
       data hash MD5: 16K
       5A F5 98 DA 57 50 DC B8 33 D1 E9 2F 3B 94 10 42>)
(   2,<2021-04-01 12:52:44.79 +0400>,<she>,<DPX200>,
      <Start of raw data processing
       efp BC_mod = 2 LB = 0.24 FT_mod = 6 PKNL = 1 PHC0 = -11122.07 PHC1 = 14.60093 SI = 16K 
       data hash MD5: 16K
       C0 33 09 C1 07 8D B6 B6 62 97 C8 D2 E1 78 24 57>)
(   3,<2021-04-01 12:53:04.03 +0400>,<she>,<DPX200>,
      <pk PHC0 = -0.826039 PHC1 = -1.6 
       data hash MD5: 16K
       16 D7 C8 6A F3 F2 B9 18 34 D4 A2 3D 3B AC B8 42>)
(   4,<2021-04-01 12:53:06.79 +0400>,<she>,<DPX200>,
      <abs ABSG = 5 
       data hash MD5: 16K
       89 09 9E AF BA E9 D8 8F 9B 67 EA 5A E8 46 B9 A3>)
$$ ##END=
$$ 
$$ hash MD5
$$ 25 F0 E3 4F 7F D8 C6 2D A6 A9 D4 41 D9 86 FE 26
##$RELAX= 
##$RELAX= 
##$RELAX= 
##$RELAX= 
##$RELAX= 
##$RELAX= 
$$ Bruker specific parameters
$$ --------------------------
##$DU= <F:/spectra>
##$EXPNO= 1
##$NAME= <H-F>
##$PROCNO= 1
##$TYPE= <nmr>
##$USER= <she>
##$AMP= (0..31)
100 100 100 100 100 100 100 100 100 100 100 100 100 100 100 100 100 100 
100 100 100 100 100 100 100 100 100 100 100 100 100 100 
##$AQSEQ= 0
##$AQ_mod= 1
##$AUNM= <au_zg>
##$AUTOPOS= <>
##$BF1= 200.13
##$BF2= 200.13
##$BF3= 200.13
##$BF4= 200.13
##$BF5= 200.13
##$BF6= 200.13
##$BF7= 200.13
##$BF8= 200.13
##$BYTORDA= 1
##$CFDGTYP= 0
##$CFRGTYP= 5
##$CHEMSTR= <none>
##$CNST= (0..31)
1 1 145 1 1 1 1 1 1 1 1 1 1 1 1 1 1 1 1 1 1 1 1 1 1 1 1 1 1 1 1 1 
##$CPDPRG= <>
##$CPDPRG1= <>
##$CPDPRG2= <>
##$CPDPRG3= <>
##$CPDPRG4= <mlev>
##$CPDPRG5= <mlev>
##$CPDPRG6= <mlev>
##$CPDPRG7= <mlev>
##$CPDPRG8= <mlev>
##$CPDPRGB= <>
##$CPDPRGT= <>
##$D= (0..31)
0 1.2 0 0 0 0 0 0 0 0.06 0 0.03 0 0 0 0 0.0002 0 0 0 0 0 0 0 0 0 0 0 0 
0 0 0 
##$DATE= 1617267161
##$DBL= (0..7)
120 120 120 120 120 120 120 120 
##$DBP= (0..7)
150 150 150 150 150 150 150 150 
##$DBP07= 0
##$DBPNAM0= <>
##$DBPNAM1= <>
##$DBPNAM2= <>
##$DBPNAM3= <>
##$DBPNAM4= <>
$$ [...]
##$SUBNAM3= <"">
##$SUBNAM4= <"">
##$SUBNAM5= <"">
##$SUBNAM6= <"">
##$SUBNAM7= <"">
##$SUBNAM8= <"">
##$SUBNAM9= <"">
##$SW= 16.9725357007746
##$SWIBOX= (0..15)
0 0 2 0 0 0 0 0 0 0 0 0 0 0 0 0 
##$SW_h= 3396.73913043478
##$TD= 16384
##$TD0= 1
##$TE= 0
##$TE2= 300
##$TE3= 300
##$TEG= 300
##$TL= (0..7)
0 120 120 120 120 120 120 120 
##$TP= (0..7)
150 150 150 150 150 150 150 150 
##$TP07= 0
##$TPNAME0= <>
##$TPNAME1= <>
##$TPNAME2= <>
##$TPNAME3= <>
##$TPNAME4= <>
##$TPNAME5= <>
##$TPNAME6= <>
##$TPNAME7= <>
##$TPOAL= (0..7)
0.5 0.5 0.5 0.5 0.5 0.5 0.5 0.5 
##$TPOFFS= (0..7)
0 0 0 0 0 0 0 0 
##$TUNHIN= 0
##$TUNHOUT= 0
##$TUNXOUT= 0
##$USERA1= <user>
##$USERA2= <user>
##$USERA3= <user>
##$USERA4= <user>
##$USERA5= <user>
##$V9= 5
##$VALIST= <valist>
##$VCLIST= <CCCCCCCCCCCCCCC>
##$VD= 0
##$VDLIST= <DDDDDDDDDDDDDDD>
##$VPLIST= <PPPPPPPPPPPPPPP>
##$VTLIST= <TTTTTTTTTTTTTTT>
##$WBST= 1024
##$WBSW= 4
##$XGAIN= (0..3)
0 0 0 0 
##$XL= 0
##$YL= 0
##$YMAX_a= 361661
##$YMIN_a= -367923
##$ZGOPTNS= <>
##$ZL1= 120
##$ZL2= 120
##$ZL3= 120
##$ZL4= 120
##$ABSF1= 15.9761
##$ABSF2= -0.996562
##$ABSG= 5
##$ABSL= 3
##$ALPHA= 0
##$AQORDER= 0
##$ASSFAC= 0
##$ASSFACI= 0
##$ASSFACX= 0
##$ASSWID= 0
##$AUNMP= <proc_1d>
##$AZFE= 0.1
##$AZFW= 0.1
##$BCFW= 0
##$BC_mod= 2
##$BYTORDP= 0
##$COROFFS= 0
##$CY= -3
##$DATMOD= 1
##$DC= 0
##$DFILT= <>
##$DTYPP= 0
##$F1P= 0
##$F2P= 0
##$FCOR= 1
##$FTSIZE= 16384
##$FT_mod= 6
##$GAMMA= 0
##$GB= 0
##$INTBC= 1
##$INTSCL= 2.992141e-10
##$ISEN= 128
##$LB= 0.24
##$LEV0= 0
##$LPBIN= 0
##$MAXI= 10000
##$MC2= 0
##$MEAN= 0
##$ME_mod= 0
##$MI= 1.114404
##$NCOEF= 0
##$NC_proc= -7
##$NLEV= 6
##$NOISF1= 3.799351
##$NOISF2= 2.8
##$NSP= 0
##$NTH_PI= 0
##$NZP= 0
##$OFFSET= 15.9616
##$PC= 1
##$PHC0= -11122.9
##$PHC1= 13.00093
##$PH_mod= 1
##$PKNL= yes
##$PPARMOD= 0
##$PSCAL= 0
##$PSIGN= 0
##$REVERSE= no
##$SF= 200.130009974629
##$SI= 16384
##$SIGF1= 3
##$SIGF2= 2
##$SINO= 5.538805
##$SIOLD= 16384
##$SREGLST= <1H.CDCl3>
##$SSB= 0
##$STSI= 16384
##$STSR= 0
##$SW_p= 3396.73913043479
##$SYMM= 0
##$S_DEV= 0
##$TDeff= 16384
##$TDoff= 0
##$TI= <>
##$TILT= no
##$TM1= 0
##$TM2= 0
##$TOPLEV= 0
##$USERP1= <user>
##$USERP2= <user>
##$USERP3= <user>
##$USERP4= <user>
##$USERP5= <user>
##$WDW= 1
##$XDIM= 16384
##$YMAX_p= 488916440
##$YMIN_p= -656475
$$ End of Bruker specific parameters
$$ ---------------------------------
##NTUPLES= NMR SPECTRUM
##VAR_NAME=  FREQUENCY,     SPECTRUM/REAL,   SPECTRUM/IMAG
##SYMBOL=    X,             R,               I
##VAR_TYPE=  INDEPENDENT,   DEPENDENT,       DEPENDENT
##VAR_FORM=  AFFN,          ASDF,            ASDF
##VAR_DIM=   16384,         16384,           16384
##UNITS=     HZ,            ARBITRARY UNITS, ARBITRARY UNITS
##FACTOR=    0.207333158178282, 1,           1
##FIRST=     3194.3952279805, 0,             0
##LAST=      -202.343902454294, 0,           0
##MIN=       -202.343902454294, -656475,     0
##MAX=       3194.3952279805, 488916440,     0
$$ Real data points
##PAGE= N=1
##DATA TABLE= (X++(R..R)), XYDATA
$$ [...]
5219A424139K3015L211k10881m8338J54183J77357R3063m0960k06008j10142K53484
$$ 1424139 1447154 1450365 1239484 1191146 1345329 1522686 1615749 1574789 1368781 1258639 1512123
5208A512123L11743j10827O7026M7718j29153Q2320R7747j28357q901K59655o1878
$$ 1512123 1823866 1713039 1780065 1827783 1698630 1780950 1878697 1750340 1741439 2001094 1939216
5197A939216J59144Q7637k53236J77616k7343j46115M3r6716N3102q273n7568
$$ 1939216 2098360 2185997 1932761 2110377 2083034 1936919 1936962 1840246 1893348 1885075 1827507
5186A827507J50941j21456o7759J9519q4188n1801q3850M4992N4637K1728P31
$$ 1827507 1978448 1856992 1789233 1808752 1724564 1672763 1588913 1633905 1688542 1710270 1711001
5175A711001O3896Q6476o0174j27468J50111k6313Q5461J45527j20500j63960
$$ 1711001 1774897 1861373 1801199 1673731 1823842 1797529 1882990 2028517 1908017 1744057
5165A744057p5306L5593N6228o6612O1230M4228r4034n7532q5273O8247j06849
$$ 1744057 1668751 1704344 1760572 1693960 1755190 1799418 1705384 1647852 1562579 1630826 1523977
5154A523977Q0422J67055L7341l5719k51837k0001m6525j50753K94683O6124J0433
$$ 1523977 1604399 1771454 1808795 1773076 1521239 1501238 1454713 1303960 1598643 1664767 1675200
5143A675200J62798j90521o5314N4899p1063J40560Q8394L8629L0385J39997q951
$$ 1675200 1837998 1647477 1582163 1637062 1565999 1706559 1794953 1833582 1863967 2003964 1995013
5132A995013j76380M0483L3852m9979l2055j26542J53480o3104k07576J33063
$$ 1995013 1818633 1859116 1892968 1842989 1810934 1684392 1837872 1774768 1567192 1700255
5122A700255N0790r617M1352J78045p2842j59798J7342J43837J13952j53548j40771
$$ 1700255 1751045 1741428 1782780 1960825 1887983 1728185 1745527 1889364 2003316 1849768 1708997
5111A708997K85668O2150l3145J06384n2934j58015J66837l4622P4901l0669p5076
$$ 1708997 1994665 2056815 2023670 2130054 2077120 1919105 2085942 2051320 2126221 2095552 2020476
5100B020476k5662m5395q4509j38048n1700K8653l5127K40518R7230o1031J90247
$$ 2020476 1994814 1949419 1864910 1726862 1675162 1703815 1668688 1909206 2006436 1945405 2135652
5089B135652K9746j33277j09985K8096L5740J20955J38188k22778J72862N0816
$$ 2135652 2165398 2032121 1922136 1950232 1985972 2106927 2245115 2022337 2195199 2246015
5079B246015n1084l9122J38653L0383j50688L4625J14735n261J6676M4281K5839
$$ 2246015 2194931 2155809 2294462 2324845 2174157 2208782 2323517 2318256 2334932 2379213 2405052
5068B405052N5485J32945r5334M2185K49177m6451o9355R1510M810j46411L782
$$ 2405052 2460537 2593482 2498148 2540333 2789510 2743059 2673704 2765214 2770024 2623613 2627395
5057B627395j0880k15625J97773P5844j86569J68012J00884o6197k1590M8245
$$ 2627395 2616515 2400890 2598663 2674507 2487938 2655950 2756834 2690637 2669047 2717292
5047B717292j67968j18070K54496o659o4745K53471j3846J1224J39998M3090P2993
$$ 2717292 2549324 2431254 2685750 2679091 2614346 2867817 2853971 2865195 3005193 3048283 3121276
5036C121276J55866L1397M6168p6157o9516n9696J44662J69827K65827k9439J9774
$$ 3121276 3277142 3308539 3354707 3278550 3209034 3149338 3294000 3463827 3729654 3700215 3719989
5025C719989k24993J10438K52059M58j34024J75427R9869J5897J6785m4394J65966
$$ 3719989 3494996 3605434 3857493 3857951 3723927 3899354 3999223 4015120 4031905 3987511 4153477
5014D153477K05206j67917l7642K01786p9081q5202R1487Q2210J33490k9992J22922
$$ 4153477 4358683 4190766 4153124 4354910 4275829 4190627 4282114 4364324 4497814 4467822 4590744
5003D590744n2362Q7582P2066k8920J23060L32564j276J20457K49184j3468j80617
$$ 4590744 4538382 4625964 4698030 4669110 4792170 5124734 5123458 5243915 5493099 5479631 5299014
4992E299014j14322J77690J50022K98308L33684P3198K69004J70887J15224K66224
$$ 5299014 5184692 5362382 5512404 5810712 6144396 6217594 6486598 6657485 6772709 7038933
4982G038933K37617J35072K02874J31741J28026J15673J34915m1602M1716L6684
$$ 7038933 7276550 7411622 7614496 7746237 7874263 7989936 8124851 8083249 8124965 8161649
4972H161649k74241O0737k03638J7215m7471l9094J55912J98329J96313n0114
$$ 8161649 7887408 7948145 7744507 7761722 7714251 7675157 7831069 8029398 8225711 8175597
4962H175597R0509J93851J54471K85137J99135J88506R9064J82090M32086N12074
$$ 8175597 8266106 8459957 8614428 8899565 9098700 9287206 9386270 9568360 10000446 10512520
4952A0512520J86020K72082M03153L37620J23468L33510N52664N29674K70676
$$ 10512520 10698540 10970622 11373775 11711395 11834863 12168373 12721037 13250711 13521387
4943A3521387M93933K34744J69497J88172M2466L11574J34778P9282K93618m913
$$ 13521387 14015320 14250064 14419561 14607733 14650199 14961773 15096551 15175833 15469451 15464538
4933A5464538M4731J40614L21475j4336L13114O84616J58403K63759M53925M63652
$$ 15464538 15509269 15649883 15971358 15957022 16270136 16954752 17113155 17376914 17830839 18294491
4923A8294491N07961P24032Q86475Q84933J008274Q81597J135169J405411J537792
$$ 18294491 18802452 19526484 20412959 21297892 22306166 23187763 24322932 25728343 27266135
4914B7266135J695859J840062J653516K084649K352976K605142K701851K747057
$$ 27266135 28961994 30802056 32455572 34540221 36893197 39498339 42200190 44947247
4906D4947247K548553K250199J648752P41582m54997j435566j938307k311848
$$ 44947247 47495800 49745999 51394751 52136333 51681336 50245770 48307463 45995615
4898D5995615k234220j986019j505954j384858j280621n77315m89997j26883L95792
$$ 45995615 43761395 41775376 40269422 38884564 37603943 37026628 36536631 36409748 36805540
4889C6805540K52664O34552Q20124Q31357J543240J660744J716148K340215K496866
$$ 36805540 37058204 37692756 38512880 39344237 40887477 42548221 44264369 46604584 49101450
4880D9101450K848616L101932L071229L324435L508330L844115M028633L827802
$$ 49101450 51950066 55051998 58123227 61447662 64955992 68800107 72828740 76656542
4872G6656542L502675K663884K006422L77895j448400k943305l885291n018521
$$ 76656542 80159217 82823101 84829523 85207418 83759018 80815713 76930422 71911901
4864G1911901n420413n009749m471928m236163l296844l096576k407041j681137
$$ 71911901 66491488 61481739 57009811 52773648 49476804 46380228 43973187 42292050
4856D2292050j682771j237841p12926n91740m36962k36578L99497M30026M61079
$$ 42292050 40609279 39371438 38658512 38066772 37629810 37393232 37792729 38222755 38683834
4847C8683834J082579Q64596Q19831J251566J399686J608273J485828J518809
$$ 38683834 39766413 40631009 41450840 42702406 44102092 45710365 47196193 48715002
4839D8715002J718189J446906J315750N61102k48731j432292k499299l323099
$$ 48715002 50433191 51880097 53195847 53756949 53508218 52075926 49576627 46253528
4831D6253528l547699l898108l717832k948059k619179k484866j846232j589447
$$ 46253528 42705829 38807721 35089889 32141830 29522651 27037785 25191553 23602106
4823B3602106j597953j250136j044930q54035o29096p89471m41411j88840m12803
$$ 23602106 22004153 20754017 19709087 18855052 18225956 17436485 16995074 16806234 16393431
4814A6393431l51794k44022m8421j99560R3003j37070k65007R4421l4874m73021
$$ 16393431 16041637 15797615 15749194 15549634 15642637 15505567 15240560 15334981 15300107 14827086
4804A4827086k91837m52627q67026r28937o14485o81232p95203m50863l95577
$$ 14827086 14535249 14082622 13215596 12286659 11672174 10990942 10195739 9744876 9349299
4795I349299n38671l94086l91614n50857k63727j36028k17589j5164k01712m53065
$$ 9349299 8810628 8416542 8024928 7474071 7210344 7074316 6856727 6841563 6639851 6186786
4785F186786p6565j34724k67732j45825J69779n667n27029o3651J71545l06003
$$ 6186786 6110221 5975497 5707765 5561940 5731719 5726052 5199023 5135372 5306917 5000914
4775E000914k16172j06111m7308M3821j63105L8713j1005Q5555j81320j31577
$$ 5000914 4784742 4678631 4631323 4675144 4512039 4550752 4539747 4625302 4443982 4312405
4765D312405p7434l0135j58511k5450n3366m86404J42181L91184j06480l62714
$$ 4312405 4234971 4204836 4046325 4020875 3967509 3481105 3623286 4014470 3907990 3545276
4755C545276Q2078K9088l02093j88693M0131j38210L4821J15214L2973n098o599
$$ 3545276 3627354 3656442 3354349 3165656 3205787 3067577 3102398 3217612 3250585 3245487 3238888
4744C238888K1235j15742j18055J4824j64897k5029K71687j70363j99141J87257
$$ 3238888 3260123 3144381 3026326 3041150 2876253 2851224 3122911 2952548 2753407 2940664
4734B940664O3036j67682q0598J25317m2174J44066l7994j12712j0389J3453j18652
$$ 2940664 3003700 2836018 2755420 2880737 2838563 2982629 2944635 2831923 2821534 2834987 2716335
4723B716335J05606K35176n2568j91199M1532K1184j64763Q6407K20680j68763
$$ 2716335 2821941 3057117 3004549 2813350 2854882 2876066 2711303 2797710 3018390 2849627
4713B849627K7425J71743j64411j24622j66484p4458q0768O6904O4443p9901n2750
$$ 2849627 2877052 3048795 2884384 2759762 2593278 2518820 2438052 2504956 2569399 2489498 2436748
4702B436748k01290O8584K58753m9456k77727R0596J05750j00999p5324J45457
$$ 2436748 2235458 2304042 2562795 2513339 2235612 2326208 2431958 2330959 2255635 2401092
4692B401092m7702m2154J99919J76237j84773p625J00233j04685o2157L00238
$$ 2401092 2353390 2311236 2511155 2687392 2502619 2494994 2595227 2490542 2428385 2728623
4682B728623J48715j36167K3046J7372j01151o6883P3379Q1965k08405K0225J4587
$$ 2728623 2877338 2741171 2764217 2781589 2680438 2613555 2686934 2768899 2560494 2580719 2595306
4671B595306J8602N4452o296K33738K1324j66489R750K36181q3800j995o7566
$$ 2595306 2613908 2668360 2662064 2895802 2917126 2750637 2760387 2996568 2912768 2910773 2843207
4660B843207k7289N3280K74083k04972J01016O3645j6293j44588Q1832O631p9086
$$ 2843207 2815918 2869198 3143281 2938309 3039325 3102970 3086677 2942089 3023921 3030552 2951466
4649B951466K44310Q2188j6985J5814J01055j91669Q5535R7865j96573j3020Q6497
$$ 2951466 3195776 3277964 3260979 3276793 3377848 3186179 3271714 3369579 3173006 3159986 3246483
4638C246483K66540k65926P5417K10094j30357J07018N1862J42260l4424P4345
$$ 3246483 3513023 3247097 3322514 3532608 3402251 3509269 3561131 3703391 3668967 3743312
4628C743312j03143M6630J55961j04807J56573n7290j53179J68851O0012J41101
$$ 3743312 3640169 3686799 3842760 3737953 3894526 3837236 3684057 3852908 3912920 4054021
4618D054021J9469k05197J00784k232j14941N1052J41212L215L6580K22460j4767
$$ 4054021 4073490 3868293 3969077 3966845 3851904 3902956 4044168 4047383 4083963 4306423 4291656
4607D291656n123J85382O2525O2660J4454k01887J85482L23631j43552N072J38651
$$ 4291656 4286533 4471915 4534440 4597100 4611554 4409667 4595149 4918780 4775228 4780300 4918951
4596D918951M8265Q6303J09874J20291M0657J25446J99560Q6959j2616l2433K48314
$$ 4918951 4967216 5053519 5163393 5283684 5324341 5449787 5649347 5736306 5723690 5691257 5939571
4585E939571J22659o4339K27115K09214K44353L9709j22988K81483J72306n5159
$$ 5939571 6062230 5997891 6225006 6434220 6678573 6718282 6595294 6876777 7049083 6993924
4575F993924K44097Q7828J05119J624J95214K19307J18522O4655J90132K85311
$$ 6993924 7238021 7325849 7430968 7432592 7627806 7847113 7965635 8030290 8220422 8505733
4565H505733J52145M056J05344K62476K27416J52535J731K16294K60069J08211
$$ 8505733 8657878 8661934 8767278 9029754 9257170 9409705 9411436 9627730 9887799 9996010
4555I996010L43603J62877M4355J86987J80894K10843K40284N319L47133N59777
$$ 9996010 10339613 10502490 10546845 10733832 10914726 11125569 11365853 11371172 11718305 12278082
4545A2278082J28657K14273N69418O84775J18788J38422L61709N59416K52412
$$ 12278082 12406739 12621012 13190430 13875205 13993993 14132415 14494124 15053540 15305952
4536A5305952L18711O79942N02317L93599M96191N94239O21093P09065R57994
$$ 15305952 15624663 16304605 16806922 17200521 17696712 18290951 18912044 19621109 20579103
4527B0579103J081483P71492Q42908J128523J097817J259899J207119J411674
$$ 20579103 21660586 22432078 23274986 24403509 25501326 26761225 27968344 29380018
4519B9380018J373203J548996J815816J864096K039101K037861K502223K626445
$$ 29380018 30753221 32302217 34118033 35982129 38021230 40059091 42561314 45187759
4511D5187759K869967L473029L691594L804558M554484N211086N384275N750146
$$ 45187759 48057726 51530755 55222349 59026907 63581391 68792477 74176752 79926898
4503G9926898O618021O798304P035234P344975P048503P045184O488628N820668
$$ 79926898 86544919 93343223 100378457 107723432 114771935 121817119 128305747 134126415
4495A34126415M908182L695079K229919O2741k042014m420969o502690p725381
$$ 134126415 139034597 142729676 144959595 145022336 142980322 138559353 132056663 124331282
4487A24331282q125582q427436q303944p700117p766420p437250p111381o527974
$$ 124331282 116205700 107778264 99474320 91774203 84007783 76570533 69459152 62931178
4479F2931178n901588n138897m229603l946256l495568k968448k562500j948764
$$ 62931178 57029590 51890693 47661090 43714834 40219266 37250818 34688318 32739554
4471C2739554k119501j906155j279745j352278j331498j198811q47232j033943
$$ 32739554 30620053 28713898 27434153 26081875 24750377 23551566 22704334 21670391
4463B1670391j103369q31379n94843o48078p14218o81767n83481o43984m21858
$$ 21670391 20567022 19735643 19140800 18492722 17778504 17096737 16513256 15869272 15447414
4454A5447414o63224n85841m58976m75850m00257l03236n11570m19023j24890
$$ 15447414 14784190 14198349 13739373 13263523 12863266 12560030 12048460 11629437 11504547
4445A1504547l49672n12234l01967p6711j92519k32314l78478j51459j46295k43002
$$ 11504547 11154875 10642641 10340674 10263963 10071444 9839130 9460652 9309193 9162898 8919896
4435H919896j05022k16583j28739p7899k48274k02639j71064k59171j4076j48822
$$ 8919896 8814874 8598291 8469552 8391653 8143379 7940740 7769676 7510505 7496429 7347607
4425G347607k80545j47240M1684j05829k05915j93712j95980j15253j0321j00334
$$ 7347607 7067062 6919822 6961506 6855677 6649762 6456050 6260070 6144817 6134496 6034162
4415F034162k11395p3837k48062O9214P4973q6761m23515J2454J970j66216k1034
$$ 6034162 5822767 5748930 5500868 5570082 5645055 5558294 5134779 5147233 5149203 4982987 4961953
4404D961953k68610j83478J11471M0470K6711j06359j71216o8859L7626J09477
$$ 4961953 4693343 4509865 4621336 4661806 4688517 4582158 4410942 4342083 4379709 4489186
4394D489186r0806j54443p5197P5929m857J68291K24025k22922j16833j09013
$$ 4489186 4398380 4243937 4168740 4244669 4239812 4408103 4632128 4409206 4292373 4183360
4384D183360j36614j03928N5609J8352j02701o3265J27942j78976j62736m9926
$$ 4183360 4046746 3942818 3998427 4016779 3914078 3850813 3978755 3799779 3637043 3587117
4374C587117l0347l0349k4195k8209j43137M527K21463k48833k26359J91727o8918
$$ 3587117 3556770 3526421 3502226 3474017 3330880 3335407 3556870 3308037 3081678 3273405 3204487
4363C204487j50117n9321j1670J2543m7977n9741J53216k38377k16040L09936
$$ 3204487 3054370 2995049 2983379 2995922 2947945 2888204 3041420 2803043 2587003 2896939
4353B896939J20137k89966m1604K51892p3849M3536P8829o8649K32695n1432j7762
$$ 2896939 3017076 2727110 2685506 2937398 2863549 2907085 2985914 2917265 3149960 3098528 3080766
4342C080766N8354j55358j22286m218n1690J5561j10269k9274m2069p4760K5318
$$ 3080766 3139120 2983762 2861476 2857258 2805568 2821129 2710860 2681586 2639517 2564757 2590075
4331B590075Q1691J82984L969k71740M4231K3917J3203m6513j01115j18439j57282
$$ 2590075 2671766 2854750 2858719 2586979 2631210 2655127 2668330 2621817 2520702 2402263 2244981
4320B244981K32976L085P2025J93947j21857j9549r7728K5591j70173j53172J08345
$$ 2244981 2477957 2481042 2553067 2747014 2625157 2605608 2507880 2533471 2363298 2210126 2318471
4309B318471j08925j34243J54693R1113j22630K6829J44613P1370j00070j71410
$$ 2318471 2209546 2075303 2229996 2321109 2198479 2225308 2369921 2441291 2341221 2169811
4299B169811n728J42130J33075j12449K35232J1953l32310J17959K9592n9214
$$ 2169811 2164083 2306213 2439288 2326839 2562071 2574024 2241714 2359673 2389265 2330051
4289B330051J54339n1696R4401m3201j81049L7140k5071m8524j03204N153J96030
$$ 2330051 2484390 2432694 2527095 2483894 2302845 2339985 2314914 2266390 2163186 2168339 2364369
4278B364369j09799n931L21472J30326k51504m3631P9725J29920p9399j54095
$$ 2364369 2254570 2248639 2570111 2700437 2448933 2405302 2485027 2614947 2535548 2381453
4268B381453Q4139J67506j72882j6591K55118l6665j9955k25973K28330L44487
$$ 2381453 2465592 2633098 2460216 2443625 2698743 2662078 2642123 2416150 2644480 2988967
4258B988967j87940n141K97268N5265j52610n8638J72713L4459j05396j1635L25951
$$ 2988967 2801027 2795886 3093154 3148419 2995809 2937171 3109884 3144343 3038947 3027312 3353263
4247C353263J85711K1605j2776J46356l08676l25445o6681J04963j56800k46603
$$ 3353263 3538974 3560579 3547803 3694159 3385483 3060038 2993357 3098320 2941520 2694917
4237B694917k3657j29256k74394J23556K35819Q3162j06066q3206K2420j16033
$$ 2694917 2671260 2542004 2267610 2391166 2626985 2710147 2604081 2520875 2543295 2427262
4227B427262n7510R3543J7664K2286j10162J73851m6848r4770J4435N1453K28181
$$ 2427262 2369752 2463295 2480959 2503245 2393083 2566934 2520086 2425316 2439751 2491204 2719385
4216B719385j35770k50634J30518J68105J41426r5228j54105M8054J3744r4113
$$ 2719385 2583615 2332981 2463499 2631604 2773030 2677802 2523697 2571751 2585495 2491382
4206B491382j4365M9284p9620j81365K0586L09780L4755j67122k2033P2755r5458
$$ 2491382 2477017 2526301 2446681 2265316 2285902 2595682 2630437 2463315 2441282 2514037 2418579
4195B418579j42492J83451j9788k54780P2177J36232Q3326k4344p1578J21639
$$ 2418579 2276087 2459538 2439750 2184970 2257147 2393379 2476705 2452361 2380783 2502422
4185B502422K12445j66478J08375K88413K6838k55499K74398j29782o7031J61591
$$ 2502422 2714867 2548389 2656764 2945177 2972015 2716516 2990914 2861132 2794101 2955692
4175B955692k55964K69382L8275J01679P9624j70498J26508j561L2894L0710l5788
$$ 2955692 2699728 2969110 3007385 3109064 3188688 3018190 3144698 3143137 3176031 3206741 3170953
4164C170953k23336J46161J13901l4543J0590P107j46435j48076K030J31254j65817
$$ 3170953 2947617 3093778 3207679 3173136 3183726 3190833 3044398 2896322 2898352 3029606 2863789
4153B863789Q3286M7491J16026k12930K4170J39663j5888M6915l0793J81093p2085
$$ 2863789 2947075 2994566 3110592 2897662 2921832 3061495 3045607 3092522 3061729 3242822 3170737
4142C170737o8028j83403J75888K2515M9586J52247Q1623J21060j26213j04122
$$ 3170737 3102709 2919306 3095194 3117709 3167295 3319542 3401165 3522225 3396012 3291890
4132C291890L1010o1409Q7051J58997M7675j06621J24096J99840P9602J5415J63424
$$ 3291890 3322900 3261491 3348542 3507539 3555214 3448593 3572689 3772529 3852131 3867546 4030970
4121D030970k6676k38694j11822j0099j68529m6635J03146l17077m7109l434j00505
$$ 4030970 4004294 3765600 3653778 3643679 3475150 3428515 3531661 3214584 3167475 3164041 3063536
4110C063536q6697M8106J1519J04064p3819j58278Q5758l39011l51239R3918L38373
$$ 3063536 2976839 3024945 3036464 3140528 3066709 2908431 2994189 2655178 2303939 2397857 2736230
4099B736230n1549j69531J72366o2278j73542L1166N1362j07932P2963J30301
$$ 2736230 2684681 2515150 2687516 2625238 2451696 2482862 2534224 2426292 2499255 2629556
4089B629556K33283j87079j99971J57883q1661o2387m0585J85795J56991j10392
$$ 2629556 2862839 2675760 2475789 2633672 2552011 2489624 2449039 2634834 2791825 2681433
4079B681433J40551N5416k41131l1345Q0510J66895l6769P2993J48219K7318r8709
$$ 2681433 2821984 2877400 2636269 2604924 2685434 2852329 2815560 2888553 3036772 3064090 2965381
4068B965381j57646K40596M9799q1169o8858p50J48154J9754l629J7683K4572
$$ 2965381 2807735 3048331 3098130 3016961 2948103 2947353 3095507 3115261 3111632 3129315 3153887
4057C153887J00959K12065l732m7810n296n391m0342J31776J38966j6285j71274
$$ 3153887 3254846 3466911 3463179 3415369 3410073 3404682 3364340 3496116 3635082 3618797 3447523
4046C447523k3551j91381K09545j54504J4544J26077n653P4455k14851j37072
$$ 3447523 3423972 3232591 3442136 3287632 3302176 3428253 3422600 3497055 3282204 3145132
4036C145132m6584J18406K04513k9567k0090M4387j24258J0300J55239J10742
$$ 3145132 3098548 3216954 3421467 3391900 3371810 3416197 3291939 3302239 3457478 3568220
4026C568220j77997j20623J98561j55998k48511K49763J32443L0054j49370j72198
$$ 3568220 3390223 3269600 3468161 3312163 3063652 3313415 3445858 3475912 3326542 3154344
4016C154344R5137J44289j61092J3970R5806M1435K34247m3853J56229o5119j81338
$$ 3154344 3249481 3393770 3232678 3246648 3342454 3383889 3618136 3574283 3730512 3665393 3484055
4005C484055J0372R8208p1849k392J81274l04267k54242J88361j51435J30810
$$ 3484055 3494427 3592635 3520786 3518394 3699668 3395401 3141159 3329520 3178085 3308895
3995C308895L9524n6315K08073j98428J11030L1407k19064J35316j28252q6069
$$ 3308895 3348419 3292104 3500177 3301749 3412779 3444186 3225122 3360438 3232186 3146117
3985C146117J14869k9056o4794K37692J6574J13150J00975P1609j10807r1665
$$ 3146117 3260986 3231930 3167136 3404828 3421402 3534552 3635527 3707136 3596329 3504664
3975C504664J94004j41983K1263R2461Q6299P9364q0702o2715J0782L420J45206
$$ 3504664 3698668 3556685 3577948 3670409 3756708 3836072 3755370 3692655 3703437 3706857 3852063
3964C852063l0185J36498J44383M1567j60946K26992M9346m2032o6508P9757j05816
$$ 3852063 3821878 3958376 4102759 4144326 3983380 4210372 4259718 4217686 4151178 4230935 4125119
3953D125119O4188k05571P8925P7157k06800m6892J03995R3563O7617l01812L9268
$$ 4125119 4189307 3983736 4062661 4139818 3933018 3886126 3990121 4083684 4151301 3849489 3888757
3942C888757K83639R8272j01805r5334Q2819J37316j60400j16281J54711J3145
$$ 3888757 4172396 4270668 4168863 4073529 4156348 4293664 4133264 4016983 4171694 4184839
3932D184839j48988M8235K59523K6518j14527J35660J34575q5840O4138J05098
$$ 4184839 4035851 4084086 4343609 4370127 4255600 4391260 4525835 4439995 4504133 4609231
3922D609231j31858P6084J41218R1212K93459n8339k0425K5130k01853n185J23996
$$ 4609231 4477373 4553457 4694675 4785887 5079346 5021007 5000582 5025712 4823859 4818674 4942670
3911D942670j0959M9712p8478k1922q1744J47333L10829j84574j46461L63591
$$ 4942670 4931711 4981423 4902945 4881023 4799279 4946612 5257441 5072867 4926406 5289997
3901E289997k01027k19394K61477J64366r6114M3847K85695J69198k25739J72677
$$ 5289997 5088970 4869576 5131053 5295419 5199305 5243152 5528847 5698045 5472306 5644983
3891E644983M8180j13098Q3077J64526O2514n2715j03073P0042L62089J25487
$$ 5644983 5693163 5580065 5663142 5827668 5890182 5837467 5734394 5804436 6166525 6292012
3881F292012p2296J3140P6475J3075J98426O4905J99975k755q7946K13199R5567
$$ 6292012 6219716 6232856 6309331 6322406 6520832 6585737 6785712 6782957 6695011 6908210 7003777
3870G003777J65833J4804J03789J53026J28942J55789J59660j16452N2331J14031
$$ 7003777 7169610 7184414 7288203 7441229 7570171 7725960 7885620 7769168 7821499 7935530
3860G935530K09460P867j62805K24025J22439J86512K12629J2141M72971J91366
$$ 7935530 8144990 8152857 7990052 8214077 8336516 8523028 8735657 8747798 9220769 9412135
3850I412135R9984M90122N4169R8353K08208N6575M12772M54874p1153n3146L39765
$$ 9412135 9512119 10002241 10056410 10154763 10362971 10419546 10832318 11287192 11216039 11162893 11502658
3839A1502658n7662K4776j8790K19096J8370K48107K89887j01185M8136M45216
$$ 11502658 11444996 11469772 11450982 11670078 11688448 11936555 12226442 12125257 12173393 12618609
3829A2618609K47433J54556J44712O7879K78655L71405J2138L08908O21847K67608
$$ 12618609 12866042 13020598 13165310 13233189 13511844 13883249 13895387 14204295 14826142 15093750
3819A5093750L87570O52366P45371N78705R26886J192627R36655J243204J393213
$$ 15093750 15481320 16133686 16879057 17457762 18384648 19577275 20513930 21757134 23150347
3810B3150347J045976Q20625M0511q20338j043053j089491j286853o61140n53766
$$ 23150347 24196323 25016948 25057459 24237121 23194068 22104577 20817724 20156584 19602818
3801A9602818n16575m2717J89548j1336o0510J37277L21665o1843J68955J95979
$$ 19602818 19086243 19043526 19233074 19221738 19161228 19298505 19620170 19558327 19727282 19923261
3791A9923261N3164J95494L85761O5738K54103M21594J46504M46732N00401L28206
$$ 19923261 19976425 20171919 20557680 20623418 20877521 21299115 21445619 21892351 22392752 22720958
3781B2720958K48749O25785M65847M30366N97673L24004M16980N87194N81868
$$ 22720958 22969707 23595492 24061339 24491705 25089378 25413382 25830362 26417556 26999424
3772B6999424O74223O55466P70038O31367M75545P90684O36101N33691O09323
$$ 26999424 27673647 28329113 29099151 29730518 30206063 30996747 31632848 32166539 32775862
3763C2775862P85201L31434O20361P80431Q72188R44104J020669J090030J315577
$$ 32775862 33561063 33892497 34512858 35293289 36165477 37109581 38130250 39220280 40535857
3754D0535857J714189J477196J903674J941643J760973K113148J838647J108628
$$ 40535857 42250046 43727242 45630916 47572559 49333532 51446680 53285327 54393955
3746E4393955O50159P15672O13111L95638O08681J183831J586853J786163K203578
$$ 54393955 55044114 55759786 56372897 56768535 57377216 58561047 60147900 61934063 64137641
3737F4137641K812288K947101L402187L642494L827150M308737M491113M789761
$$ 64137641 66949929 69897030 73299217 76941711 80768861 85077598 89568711 94358472
3729I4358472N336819N300475N728326O039874O419010P164995P461327P829033
$$ 94358472 99695291 104995766 110724092 116763966 123182976 130347971 137809298 145638331
3721A45638331Q357720Q796160R321622R628104R569305R547750R340685R120005
$$ 145638331 153996051 162792211 172113833 181741937 191311242 200858992 210199677 219319682
3713B19319682Q344296O954556N584176L633762J057278k164518n194147p513676
$$ 219319682 227663978 234618534 240202710 243836472 244893750 242729232 237535085 230021409
3705B30021409j0062042j1746184j2064323j2030023j1470536j0466929r886651
$$ 230021409 219959367 208213183 196148860 184118837 172648301 162181372 152294721
3698A52294721r548788r549607r865082r983573r588264q740659p880036o853387
$$ 152294721 142745933 133196326 123331244 113347671 103759407 95018748 87138712 80285325
3690H0285325n776135m894001m265536l283617l024153k834871k445590k314663
$$ 80285325 74509190 69615189 65349653 62066036 59041883 56207012 53761422 51446759
3682E1446759j921159j819795j612834j604656j188276j371558j186646j174030
$$ 51446759 49525600 47705805 46092971 44488315 43300039 41928481 40741835 39567805
3674C9567805j164000j145360j080401j134301j191855j415084j227769q33289
$$ 39567805 38403805 37258445 36178044 35043743 33851888 32436804 31209035 30375746
3666C0375746p27350j063101p81164p97929o64993m62844n31416n59161n03960
$$ 30375746 29648396 28585295 27804131 27006202 26341209 25878365 25346949 24787788 24283828
3657B4283828m94796m18640k37986m60575m82105m11303m19962n62865m60117
$$ 24283828 23789032 23370392 23132406 22671831 22189726 21778423 21358461 20795596 20335479
3648B0335479k00473l59974p45639n00536j90409k88528m29939k33630o06005
$$ 20335479 20135006 19775032 19029393 18528857 18338448 18049920 17619981 17386351 16780346
3639A6780346m80145J14516O4943k51555l15226L2594J3603k92226l28070j1206
$$ 16780346 16300201 16414717 16479660 16228105 15912879 15945473 15959076 15666850 15338780 15327574
3629A5327574k5741J8097j56357J08142M7776k78486o3460R1308l2377n7375j02915
$$ 15327574 15301833 15319930 15163573 15271715 15319491 15041005 14977545 15068853 15036476 14979101 14876186
3618A4876186j22171k91030j37180k54826p2885J4222k71337k27891J96073j11496
$$ 14876186 14754015 14462985 14325805 14070979 13998094 14012316 13740979 13513088 13709161 13597665
3608A3597665k75231L5983q4609O2950J36980R1971k9672J44407m4889n9014J0984
$$ 13597665 13322434 13358417 13273808 13336758 13473738 13565709 13536037 13680444 13635555 13576541 13587525
3597A3587525K50760j62196j11359K50172o7092j86188J19723K20085O0285p395
$$ 13587525 13838285 13676089 13564730 13814902 13747810 13561622 13681345 13901430 13961715 13954320
3587A3954320K5813K3324J68658j23666J4407R6076j2517P6117O0173K92123k16203
$$ 13954320 13980133 14003457 14172115 14048449 14062856 14158932 14146415 14222532 14282705 14574828 14358625
3576A4358625r6393N67237M07171K37078K23229J88390N2160M89069K05239N9984
$$ 14358625 14262232 14829469 15236640 15473718 15696947 15885337 15937497 16426566 16631805 16691789
3566A6691789K77830K96268J77589K76803L00860K81790N51801L71113p372K08345
$$ 16691789 16969619 17265887 17443476 17720279 18021139 18302929 18854730 19225843 19218471 19426816
3556A9426816N39389M74382L98425O38769K18019J58393L34967O21210N55120
$$ 19426816 19966205 20440587 20839012 21477781 21695800 21854193 22189160 22810370 23365490
3547B3365490M17583N72895M54890N30359Q37546L85563M11501O97172M78811
$$ 23365490 23783073 24355968 24810858 25341217 26178763 26564326 26975827 27672999 28151810
3538B8151810O49921R83794R69281R74460J437341J371628J525528J991637K119232
$$ 28151810 28801731 29785525 30754806 31729266 33166607 34538235 36063763 38055400 40174632
3529D0174632K362940K747826K778809K886313K642413K751310K101270J177503
$$ 40174632 42537572 45285398 48064207 50950520 53592933 56344243 58445513 59623016
3521E9623016L54771n30503j207526j765126j849786j671095j364575r20671m46846
$$ 59623016 59977787 59447284 58239758 56474632 54624846 52953751 51589176 50668505 50221659
3512E0221659k65418k88872K03380K21197L45866M79451L89598Q50321J189790
$$ 50221659 49956241 49667369 49870749 50091946 50437812 50917263 51306861 52157182 53346972
3503E3346972J142256J178448J841234K061252K276895K484025K824259K995732
$$ 53346972 54489228 55667676 57508910 59570162 61847057 64331082 67155341 70151073
3495G0151073L544230M170641M603211N040887M786281M668649L937239K147537
$$ 70151073 73695303 77865944 82469155 87510042 92296323 96964972 100902211 103049748
3487A03049748K87806j658774l465376m788605n060370m917243m080112l541797
$$ 103049748 103337554 101678780 98213404 93424799 88364429 83447186 79367074 75825277
3479G5825277k766495j842792j850583j477405j090329p63071n00659m38296j65556
$$ 75825277 73058782 71215990 69365407 67888002 66797673 66034602 65533943 65095647 64930091
3470F4930091K37198P37428R53589J259090J440070J882011K310650K500173K649019
$$ 64930091 65167289 65904717 66858306 68117396 69557466 71439477 73750127 76250300 78899319
3461G8899319L047395L615884L809950M190790M452093M427392L875266L475448
$$ 78899319 81946714 85562598 89372548 93563338 98015431 102442823 106318089 109793537
3453A09793537L142559K084976R58754R45164P31842J627131K567458L588565
$$ 109793537 112936096 115021072 115979826 116924990 117656832 119283963 121851421 125439986
3445A25439986M909714O115277P836443R520906J1403827J3753297J5960009J8515853
$$ 125439986 130349700 136464977 144301420 153822326 165226153 178979450 194939459 213455312
3437B13455312K1115152K2672250K1833256J8261042J2438850L230544q884407
$$ 213455312 234570464 257242714 279075970 297337012 309775862 313006406 304121999
3430C04121999k1805702l0891240l2948632k9806899k4812779j9457039j5193807
$$ 304121999 282316297 251425057 218476425 188669526 163856747 144399708 129205901
3423A29205901j2188669r533473p690379o245088n474469m683142m306375l531021
$$ 129205901 117017232 107483759 99793380 93548292 88073823 83390681 79084306 75553285
3415G5553285l038912l053934k708525k113861j485758j492235j447239q60596
$$ 75553285 72514373 69460439 66751914 64638053 63152295 61660060 60212821 59352225
3407E9352225j163518r00337j050103j248509j150002j160616j069868j026681
$$ 59352225 58188707 57288370 56238267 54989758 53839756 52679140 51609272 50582591
3399E0582591r93514j099580p31296o74074n77535p73068n31675k54454l29804
$$ 50582591 49589077 48489497 47758201 47084127 46506592 45733524 45201849 44947395 44617591
3390D4617591k70123L1648M9467j9770J06397M01034L70958K72041J51808K90766
$$ 44617591 44347468 44379116 44428583 44408813 44515210 44916244 45287202 45559243 45711051 46001817
3380D6001817M55893M26606M10008O73062O73887N24329O24738P23462O34007
$$ 46001817 46457710 46884316 47294324 47967386 48641273 49165602 49790340 50513802 51147809
3371E1147809J24083K98844j33231k91756k81420k83838j88611j8030j59520J52167
$$ 51147809 51271892 51570736 51437505 51145749 50864329 50580491 50391880 50373850 50214330 50366497
3361E0366497K75987N15650P81889P87343J073906Q00118J342815J352441J243993
$$ 50366497 50642484 51158134 51940023 52727366 53801272 54601390 55944205 57296646 58540639
3352E8540639J560720J478134J577800J932360K044545K320416K517812L097786
$$ 58540639 60101359 61579493 63157293 65089653 67134198 69454614 71972426 75070212
3344G5070212L138284L585103M020619M350669M694228N227945N398870N595000
$$ 75070212 78208496 81793599 85814218 90164887 94859115 100087060 105485930 111080930
3336A11080930N476754N855825O031145N904947O331190O471041P291136Q479083
$$ 111080930 116557684 122413509 128444654 134349601 140680791 147151832 154442968 162922051
3328A62922051R692952J2193911J5018209J7641870J9866680K1201568K1581110
$$ 162922051 172615003 184808914 199827123 217468993 237335673 258537241 280118351
3321B80118351J8918077J3237225N262397l929953j2597728k0905120k6735170
$$ 280118351 299036428 312273653 317536050 313606097 301008369 280103249 253368079
3314B53368079k9092219k9138742k6885725k2704767j8227324j3749961j0802403
$$ 253368079 224275860 195137118 168251393 145546626 127319302 113569341 102766938
3307A02766938q371648o674566n797107n124725m448294m094185l585065l113653
$$ 102766938 94395290 87720724 81923617 76798892 72350598 68256413 64671348 61557695
3299F1557695k747841k694086k290572j747909j794209j312510j404747j482342
$$ 61557695 58809854 56115768 53825196 52077287 50283078 48970568 47565821 46083479
3291D6083479j239029j043624j229698j250129j146716j191414r72777q58902
$$ 46083479 44844450 43800826 42571128 41320999 40174283 38982869 38010092 37151190
3283C7151190j019650o62870r39591q13431o16713p75938n48188l42519o12279
$$ 37151190 36131540 35468670 34529079 33715648 33098935 32322997 31774809 31432290 30820011
3274C0820011k32001m66091m99397k22392n58307l48155j41823l08530l57035
$$ 30820011 30588010 30121919 29622522 29400130 28841823 28493668 28351845 28043315 27686280
3265B7686280N3288k4504j80616j4732k56265j42423K28090J95302o642K53179
$$ 27686280 27739568 27715064 27534448 27519716 27263451 27121028 27349118 27544420 27537778 27790957
3255B7790957K9382M59114M19934N86411M60292Q00352R12700J053640J108503
$$ 27790957 27820339 28279453 28699387 29285798 29746090 30546442 31459142 32512782 33621285
3246C3621285J112867J423165J236435J376211J854323K108392K139733K753481
$$ 33621285 34734152 36157317 37393752 38769963 40624286 42732678 44872411 47625892
3238D7625892K630446K501325J648162L38874m29592p05253j672352k484125l395630
$$ 47625892 50256338 52757663 54405825 54744699 54315107 53609854 51937502 49453377 46057747
3229D6057747l909953l691336l247464k527027j696914j625898j054776q45356
$$ 46057747 42147794 38456458 35208994 32681967 30985053 29359155 28304379 27459023
3221B7459023o64018m96819m71218k85045l38633o4048o30298q0337j71361m59161
$$ 27459023 26795005 26298186 25826968 25541923 25203290 25139242 24508944 24428607 24257246 23798085
3211B3798085k01397m34724k52192l94049n20800l90725m55151l14888l00055
$$ 23798085 23596688 23161964 22909772 22515723 21994923 21604198 21149047 20834159 20534104
3202B0534104n12779n72242j46811k38461l60190k82379k51324k32915j57425
$$ 20534104 20021325 19449083 19302272 19063811 18703621 18421242 18169918 17937003 17779578
3193A7779578j64543l12970k2891j21869j24447j07948r0215J21592K3612j15498
$$ 17779578 17615035 17302065 17279174 17157305 17032858 16924910 16834695 16956287 16979899 16864401
3183A6864401P961J1441j60150L81112R1901j08839J71078K6077R7887J02388
$$ 16864401 16872362 16883803 16723653 17104765 17196666 17087827 17258905 17284982 17382869 17485257
3173A7485257q73J83519K82724n6796J49069N78593N5087P3901L78159K54029
$$ 17485257 17484384 17667903 17950627 17893831 18042900 18621493 18676580 18750481 19128640 19382669
3163A9382669L28270K68818N7869Q5850M96778R5031J19206M56126M54020L78525
$$ 19382669 19710939 19979757 20037626 20123476 20620254 20715285 20834491 21290617 21744637 22123162
3153B2123162K65071L35323M02604L53156M70707J98126K28945J10133l405L47094
$$ 22123162 22388233 22723556 23126160 23479316 23950023 24148149 24377094 24487227 24483822 24830916
3143B4830916L80206K83685M50360P77197P89950J410294J509215J680713J816084
$$ 24830916 25211122 25494807 25945167 26722364 27512314 28922608 30431823 32112536 33928620
3134C3928620K117986K103354J592545J139388M27283k6816p56304j170703j783319
$$ 33928620 36046606 38149960 39742505 40881893 41309176 41282360 40526056 39355353 37572034
3125C7572034k046868k150191k190152j239567p80873o32715l28190J25061L11025
$$ 37572034 35525166 33374975 31184823 29945256 29164383 28531668 28203478 28328539 28639564
3116B8639564N24351N55000Q61401J028081J018559J302771J204571P94006L33190
$$ 28639564 29163915 29718915 30580316 31608397 32626956 33929727 35134298 35928304 36261494
3107C6261494k63460p87259j080148j145010m09603l29598K67096N72942P42019
$$ 36261494 35998034 35210775 34130627 32985617 32576014 32246416 32513512 33086454 33828473
3098C3828473R90941J444915J844278K613613K740150L091237L168703K981841
$$ 33828473 34819414 36264329 38108607 40722220 43462370 46553607 49722310 52704151
3090E2704151K408337J298105n25555k672558l943884m849903m460209l741677
$$ 52704151 55112488 56410593 55885038 53212480 49268596 44418693 39958484 36216807
3082C6216807l157330k288383j799197j480132r26929j102208p30269l39962n27411
$$ 36216807 33059477 30771094 28971897 27491765 26564836 25462628 24732359 24392397 23864986
3073B3864986k81072k80557l76501j06133M7781m8751J86253K32640M30266M69504
$$ 23864986 23583914 23303357 22926856 22820723 22868504 22819753 23006006 23238646 23668912 24138416
3063B4138416N58602L54235k09870n26563p60291o08131q89139o31280n24660
$$ 24138416 24697018 25051253 24841383 24314820 23554529 22946398 22057259 21425979 20901319
3054B0901319p08407r9842j80017j28268J67030l05510j93400J77508o397M6244
$$ 20901319 20192912 20093070 19913053 19784785 19951815 19646305 19452905 19630413 19624016 19670260
3044A9670260J63168k23307k5229K29549J80167l2991J94784J13859j64211J38784
$$ 19670260 19833428 19610121 19584892 19814441 19994608 19961617 20156401 20270260 20106049 20244833
3034B0244833J86438L06875R8562K66812L84977J31966L35707O8708N44644N84741
$$ 20244833 20431271 20738146 20836708 21103520 21488497 21620463 21956170 22024878 22569522 23154263
3024B3154263L22153K48270M47844N07482P30368P47741M42348M67628K98394
$$ 23154263 23476416 23724686 24172530 24680012 25410380 26158121 26600469 27068097 27366491
3015B7366491M79851L38338M08225P1966M9529N35908M25248L49676M61382O00168
$$ 27366491 27846342 28184680 28592905 28664871 28714400 29250308 29675556 30025232 30486614 31086782
3005C1086782M10367R60497O37242M62243J011787Q78466P39781J042983J112045
$$ 31086782 31497149 32457646 33094888 33557131 34568918 35447384 36187165 37230148 38342193
2996C8342193J069127R94112J094023J369253J222436J365393J396177J386298
$$ 38342193 39411320 40405432 41499455 42868708 44091144 45456537 46852714 48239012
2988D8239012J544794J508401J501944J656889J718773J828434J943033J860292
$$ 48239012 49783806 51292207 52794151 54451040 56169813 57998247 59941280 61801572
2980F1801572J818816K191840K240230K052524K211170K228254K196827K457095
$$ 61801572 63620388 65812228 68052458 70104982 72316152 74544406 76741233 79198328
2972G9198328K434406K403700K557458K242290K487415K636541K273260K122298
$$ 79198328 81632734 84036434 86593892 88836182 91323597 93960138 96233398 98355696
2964I8355696K418086K558225K447128K495542K632429K350534K018638J985933
$$ 98355696 100773782 103332007 105779135 108274677 110907106 113257640 115276278 117262211
2956A17262211K215161J795302J545497J711232J717469J251223J192654Q63354
$$ 117262211 119477372 121272674 122818171 124529403 126246872 127498095 128690749 129554103
2948A29554103P45683Q39329Q81895M07298J12594K00829P2279o2601n32856p66351
$$ 129554103 130299786 131139115 132021010 132428308 132540902 132741731 132814010 132751409 132218553 131452202
2938A31452202j062156j322805j848959j627196j799102j970525j814747j990541
$$ 131452202 130390046 129067241 127218282 125591086 123791984 121821459 120006712 118016171
2930A18016171k124411k010906k367030k340266k504061k616638k523229k794188
$$ 118016171 115891760 113880854 111513824 109173558 106669497 104052859 101529630 98735442
2922I8735442l067286k822416k801826k921638k769410k707553k664591k812764
$$ 98735442 95668156 92845740 90043914 87122276 84352866 81645313 78980722 76167958
2914G6167958k486911k343597k515918k675676k145676k125546k159693k212979
$$ 76167958 73681047 71337450 68821532 66145856 64000180 61874634 59714941 57501962
2906E7501962k444931k000182j868566j916685j702824j460287j672664j589699
$$ 57501962 55057031 53056849 51188283 49271598 47568774 46108487 44435823 42846124
2898D2846124j233564j211011j456489j101748j077571p55353q53175r65853p98884
$$ 42846124 41612560 40401549 38945060 37843312 36765741 36010388 35157213 34191360 33392476
2889C3392476p96623o65481n37339o10262n54200k71751j60317n03317j90436
$$ 33392476 32595853 31930372 31393033 30782771 30228571 29956820 29796503 29293186 29102750
2880B9102750j35167k06122j84711k1389m0105j54222j48403L24728K84423R9672
$$ 29102750 28967583 28761461 28576750 28555361 28515256 28361034 28212631 28537359 28821782 28921454
2870B8921454K54037N44951K28150L35547N36553N97791K91892M46415O52259
$$ 28921454 29175491 29720442 29948592 30284139 30820692 31418483 31710375 32156790 32809049
2861C2809049O41886L24128J94643M40862n8146l76828k12278j59640m08963k35659
$$ 32809049 33450935 33775063 33969706 34410568 34352422 33975594 33763316 33603676 33194713 32959054
2851C2959054l33453K44427m2901l05778K68337M48358K11384K77939M51984O37964
$$ 32959054 32625601 32870028 32827127 32521349 32789686 33238044 33449428 33727367 34179351 34817315
2841C4817315N70974P35786Q78251J078883J019306J283143J427112J534237J991155
$$ 34817315 35388289 36124075 37002326 38081209 39100515 40383658 41810770 43345007 45336162
2832D5336162J791266J832775K141351J967894K103259J777946J586197Q02999
$$ 45336162 47127428 48960203 51101554 53069448 55172707 56950653 58536850 59339849
2824E9339849L66767j89364q67979j089036j583402j824710j272002j295503j285179
$$ 59339849 59706616 59517252 58649273 57560237 55976835 54152125 52880123 51584620 50299441
2815E0299441p52774o55909p24889k54653l6863j8339K23043L57427L50593O35108
$$ 50299441 49546667 48890758 48165869 47911216 47874353 47856014 48079057 48436484 48787077 49422185
2805D9422185N73025Q07299R99212J313359J382309J540181J838334K007295K322465
$$ 49422185 49995210 50802509 51801721 53115080 54497389 56037570 57875904 59883199 62205664
2796F2205664K214501K437907K112474J905466J657786J106083K41756q70764
$$ 62205664 64420165 66858072 68970546 70876012 72533798 73639881 73881637 73010873
2788G3010873j633617k023557k550181k624022k359632k120900j975406j973590
$$ 73010873 71377256 69353699 66803518 64179496 61819864 59698964 57723558 55749968
2780E5749968j519831j389211j321313r14749q02377o09396o47249l00159k0699
$$ 55749968 54230137 52840926 51519613 50604864 49802487 49193091 48545842 48245683 48224984
2771D8224984k14214j42897M8809M18075L71892L66514P95586J013764J127393
$$ 48224984 48010770 47867873 47916682 48334757 48706649 49073163 49868749 50882513 52009906
2762E2009906J235701J063637J249764J022874O35625O45067j3736o18677j064349
$$ 52009906 53245607 54309244 55559008 56581882 57217507 57862574 57848838 57230161 56165812
2753E6165812j534950j709065j758328j957849j568381j600383j463881j384005
$$ 56165812 54630862 52921797 51163469 49205620 47637239 46036856 44572975 43188970
2745D3188970j069340p39787p98152p97791o58802o01197p42892o33389n18386
$$ 43188970 42119630 41379843 40581691 39783900 39125098 38523901 37781009 37147620 36629234
2736C6629234o15121p21667m03458o05744n80466l45698l18820j06570l6575j14487
$$ 36629234 36014113 35292446 34888988 34283244 33702778 33357080 33038260 32931690 32895115 32780628
2726C2780628k17625j34692j27240j84649j87600k53320l26289m04739n05310
$$ 32780628 32563003 32428311 32301071 32116422 31928822 31675502 31349213 30944474 30439164
2717C0439164l56510p83695o16494m01349n25167l30593l25310k9713L5305j45759
$$ 30439164 30082654 29298959 28682465 28281116 27755949 27425356 27100046 27070333 27105638 26959879
2707B6959879j75258j42484k2449j38115m7212m18588l44517n6019m85625k82681
$$ 26959879 26784621 26642137 26619688 26481573 26434361 26015773 25671256 25615237 25129612 24846931
2697B4846931M2k90724l96920o9451k92879q0734j82030k85589N872m7001k05980
$$ 24846931 24846973 24556249 24159329 24089878 23796999 23716265 23534235 23248646 23254518 23207517 23001537
2686B3001537K63935K5496k52746J50688Q7133J6286M8723J51535J05297J29533
$$ 23001537 23265472 23290968 23038222 23188910 23276043 23292329 23341052 23492587 23597884 23727417
2676B3727417O6793K76711L06028L9542O8008J43393J50984L01224O2038J78953
$$ 23727417 23794210 24070921 24376949 24416491 24484499 24627892 24778876 25080100 25142138 25321091
2666B5321091M90874n3855J2127L37665R5566J68376K78671J66261K07639O12859
$$ 25321091 25811965 25758110 25770237 26107902 26203468 26371844 26650515 26816776 27024415 27637274
2656B7637274Q8566L14343L00035J41568M42435N23523K85842L66633M98797O16001
$$ 27637274 27725840 28040183 28340218 28481786 28924221 29447744 29733586 30100219 30599016 31215017
2646C1215017K92210M62761P07945N01231L46162M75077Q48029P84523Q16981
$$ 31215017 31507227 31969988 32677933 33179164 33525326 34000403 34848432 35632955 36449936
2637C6449936N82846O24522Q71028J025441R60273R51798J120836J247977J017861
$$ 36449936 37032782 37657304 38528332 39553773 40514046 41465844 42586680 43834657 44852518
2628D4852518J190772J316285J399707J318595J612436J558527J649719J544134
$$ 44852518 46043290 47359575 48759282 50077877 51690313 53248840 54898559 56442693
2620E6442693J614930J642116J681305J546698J358812J725504J721659J616963
$$ 56442693 58057623 59699739 61381044 62927742 64286554 66012058 67733717 69350680
2612F9350680J638159J510476J790247J611189J607586J737157J629654J758649
$$ 69350680 70988839 72499315 74289562 75900751 77508337 79245494 80875148 82633797
2604H2633797J742722J738433J670635J696958J630878J491896J340486J509362
$$ 82633797 84376519 86114952 87785587 89482545 91113423 92605319 93945805 95455167
2596I5455167J857430J760257J804516J717738J976662K174205J868849K010988
$$ 95455167 97312597 99072854 100877370 102595108 104571770 106745975 108614824 110625812
2588A10625812K336697K497852K437488K717197L077573L118046L382804L589819
$$ 110625812 112962509 115460361 117897849 120615046 123692619 126810665 130193469 133783288
2580A33783288L631356L602414L195442K956109K536902K446730K292013K140718
$$ 133783288 137414644 141017058 144212500 147168609 149705511 152152241 154444254 156584972
2572A56584972J943877K361168K572544L021893L526782L803345M271970M682691
$$ 156584972 158528849 160890017 163462561 166484454 170011236 173814581 178086551 182769242
2564A82769242M683254M387283N058562M610455L938283M302393L679759L569972
$$ 182769242 187452496 191839779 196898341 201508796 205447079 209749472 213429231 216999203
2556B16999203L680232L303395L806072M055049M178679M535097M796856M823888
$$ 216999203 220679435 223982830 227788902 231843951 236022630 240557727 245354583 250178471
2548B50178471N215596N491691N541172N432305N225925M972452N079099N013447
$$ 250178471 255394067 260885758 266426930 271859235 277085160 282057612 287136711 292150158
2540B92150158M993944M813080M613904N031475M763123N104414N715589N613281
$$ 292150158 297144102 301957182 306571086 311602561 316365684 321470098 327185687 332798968
2532C32798968O024135O366802O381844O819093P182378P504224Q449427Q820114
$$ 332798968 338823103 345189905 351571749 358390842 365573220 373077444 381526871 390346985
2524C90346985R679885J0538401J1383648J1966060J1811449J1700650J0750383
$$ 390346985 400026870 410565271 421948919 433914979 445726428 457427078 468177461
2517D68177461R247695O454806L815667J220811j934832m364488o377784p678247
$$ 468177461 477425156 483879962 487695629 488916440 486981608 482617120 476239336 468561089
2509D68561089q280046q455706q406687q057595p699489p861495p734766q586981
$$ 468561089 460281043 451825337 443418650 435361055 427661566 419800071 412065305 403478324
2501D03478324r890843j1754561j3813906j6155612j8248561j9374920k0473838
$$ 403478324 393587481 381832920 368019014 351863402 333614841 314239921 293766083
2494B93766083k0871275k0270348j8784457j7452175j5860160j3967812j2412667
$$ 293766083 272894808 252624460 233840003 216387828 200527668 186559856 174147189
2487A74147189j0904572r589920q419081p174507o632831n651712n136113m730675
$$ 174147189 163242617 153652697 145233616 138059109 131426278 125774566 120638453 115907778
2479A15907778l951869l380324l267738k869953k691858k487758k258612k022398
$$ 115907778 111955909 108575585 105307847 102437894 99746036 97258278 94999666 92977268
2471I2977268j909557k248258j806638j787902j923505j513343j415008j439338
$$ 92977268 91067711 88819453 87012815 85224913 83301408 81788065 80373057 78933719
2463G8933719j115403r68568j147839j164036r36624j293575j189917j388582
$$ 78933719 77818316 76849748 75701909 74537873 73601249 72307674 71117757 69729175
2455F9729175j396993j302099j363551j904017j811791j567376j605600j527396
$$ 69729175 68332182 67030083 65666532 63762515 61950724 60383348 58777748 57250352
2447E7250352j521276j449205j544565j551443j191266j434586j297409j515188
$$ 57250352 55729076 54279871 52735306 51183863 49992597 48558011 47260602 45745414
2439D5745414j385539j101277j574239j416146j489805j518865j557181j247512
$$ 45745414 44359875 43258598 41684359 40268213 38778408 37259543 35702362 34454850
2431C4454850j147450j061681j077213j008083q49087r53494p76840q15974p39609
$$ 34454850 33307400 32245719 31168506 30160423 29311336 28357842 27581002 26765028 26025419
2422B6025419n14474o33583p42752m44086n17586m40317o01015o42310m38920
$$ 26025419 25510945 24877362 24134610 23690524 23172938 22732621 22131606 21489296 21050376
2413B1050376m11771n33907l63565j67558m84477m70343j39468m36697n94123
$$ 21050376 20638605 20104698 19741133 19573575 19089098 18618755 18479287 18042590 17448467
2404A7448467r1419k01845l73667k54764o17603l31119k11518l09698P2104j88436
$$ 17448467 17357048 17155203 16781536 16526772 15909169 15578050 15366532 15056834 15128938 14940502
2394A4940502m98202n89902n6660k14896l95723k08395k00255l28437j81391o2533
$$ 14940502 14442300 13852398 13795738 13580842 13185119 12976724 12776469 12448032 12266641 12204108
2384A2204108j79367j23938j31418l27118o5587j4947J8183j27133p4871k61313
$$ 12204108 12024741 11900803 11769385 11442267 11376680 11361733 11379916 11252783 11177912 10916599
2374A0916599l16159J7812j59182l33038q7330O01j68097j62145j37616j02428
$$ 10916599 10600440 10618252 10459070 10126032 10038702 10039303 9871206 9709061 9571445 9469017
2364I469017P5638j5507j87186m2734J43394o5518l45768j61202K7248j72852
$$ 9469017 9544655 9529148 9341962 9299228 9442622 9377104 9031336 8870134 8897382 8724530
2354H724530j56710r7998j71414r7102o9476n1323J95280J1730l4052o3733k5658
$$ 8724530 8567820 8469822 8298408 8201306 8131830 8080507 8275787 8287517 8253465 8189732 8164074
2343H164074r3659j01972k04493j98386K3531j4920L0672p7673m08592J4145L6288
$$ 8164074 8070415 7968443 7763950 7565564 7589095 7574175 7604847 7527174 7118582 7132727 7169015
2332G169015m66946K22495j807j09122n7717j13754m9826k34548N1706J00329
$$ 7169015 6702069 6924564 6922757 6813635 6755918 6642164 6592338 6357790 6409496 6509825
2322F509825j32684p8764M3686j19313R7579K9333L0377N7583j38088j27175R2562
$$ 6509825 6377141 6298377 6342063 6222750 6320329 6349662 6380039 6437622 6299534 6172359 6264921
2311F264921p9898j94514Q9943O2660q3199O5662J32064m9221M5085j85068m6084
$$ 6264921 6185023 5990509 6080452 6143112 6059913 6125575 6257639 6208418 6253503 6068435 6022351
2300F022351m03805j81040K25194j28779j00012J67804p6137j99388k8636J38927
$$ 6022351 5618546 5437506 5662700 5533921 5433909 5601713 5525576 5326188 5297552 5436479
2290E436479J04166K261P0634j45814P0434r5548j90387O7037j11540O2814K55027
$$ 5436479 5540645 5542906 5613540 5467726 5538160 5442612 5252225 5319262 5207722 5270536 5525563
2279E525563N6592j46826l47857J24134j6586k16966J60388l6050k1719n8604
$$ 5525563 5582155 5435329 5087472 5211606 5195020 4978054 5138442 5102392 5080673 5022069
2269E022069l71455P011J66127q1589k6466o8343k5922r9061J3814j15957K6936
$$ 5022069 4650614 4657625 4823752 4742163 4715697 4647354 4621432 4522371 4536185 4420228 4447164
2258D447164P9428M7444L2648J14150p0275j4124l9272K12557O0568m1183O0318
$$ 4447164 4526592 4574036 4606684 4720834 4650559 4636435 4597163 4809720 4870288 4829105 4889423
2247D889423r3285J0752J0110l3782M3652J72892j04344L15146J14900j29179
$$ 4889423 4796138 4806890 4817000 4783218 4826870 4999762 4895418 5210564 5325464 5196285
2237E196285J98032J26067K5709k19110n3406N2664l138o0319O341n942O6994
$$ 5196285 5394317 5520384 5546093 5326983 5273577 5326241 5323103 5262784 5269125 5263183 5330177
2226E330177j44978R6057J19377j29791M829Q1208Q2030j00809L88400J77474
$$ 5330177 5185199 5281256 5400633 5270842 5275671 5356879 5438909 5338100 5726500 5903974
2216E903974k24974L43454j68438K4161J94917j55968L550J96238J67555o0497
$$ 5903974 5679000 6022454 5854016 5878177 6073094 5917126 5920676 6116914 6284469 6223972
2206F223972k1422L72401j2871q2863K95959p6264L8452R5673J86951K28090J94992
$$ 6223972 6202550 6574951 6562080 6479217 6775176 6698912 6737364 6833037 7019988 7248078 7443070
2195G443070l3064K09405K32119l123L7602K14593j33027k42725j8396l7202O6773
$$ 7443070 7410006 7619411 7851530 7848407 7886009 8100602 7967575 7724850 7706454 7669252 7736025
2184G736025l01377n83936l43256l25273n7893m13932l28963J583k18668k93085
$$ 7736025 7434648 6850712 6507456 6182183 6124290 5710358 5381395 5382978 5164310 4871225
2174D871225m9595p9179n6401l45454j73849k1380l5047P6247j02144p3901J45844
$$ 4871225 4821630 4742451 4686050 4340596 4166747 4145367 4110320 4186567 4084423 4010522 4156366
2163D156366k5134j43970j84990o3091j35509j14544J89307j63467j19752J13865
$$ 4156366 4131232 3987262 3802272 3739181 3603672 3489128 3678435 3514968 3395216 3509081
2153C509081j19809n7103R442P5021m3172j17819J09458o2094l07794r9467j50515
$$ 3509081 3389272 3332169 3341611 3416632 3373460 3255641 3365099 3303005 2995211 2895744 2745229
2142B745229J14125M5570o7700J8527N9101j61429o6038K50766j80169j24306
$$ 2745229 2859354 2904924 2837224 2855751 2914852 2753423 2687385 2938151 2757982 2633676
2132B633676L18818p1566j0940Q6130k52258P5937l45591k43912J05942o9483
$$ 2633676 2952494 2880928 2869988 2956118 2703860 2779797 2434206 2190294 2296236 2226753
2122B226753N0155J5430k07831j8583p474j40250N3043J382j76044P1201J21303
$$ 2226753 2276908 2292338 2084507 2065924 2058450 1918200 1971243 1972625 1796581 1867782 1989085
2111A989085J23370o9075p3151j70668k478q1082o3247R0930m6948L4393j0165
$$ 1989085 2112455 2043380 1970229 1799561 1797083 1716001 1652754 1743684 1696736 1731129 1720964
2100A720964q5615o1467k9856L87307R4002j87236j80584n3143j03588k46037
$$ 1720964 1635349 1573882 1544026 1931333 2025335 1838099 1657515 1604372 1500784 1254747
2090A254747m6264L1115L25783k12944m4108L1912M1495J0664J34393l993k63084
$$ 1254747 1208483 1239598 1565381 1352437 1308329 1340241 1381736 1392400 1526793 1522800 1259716
2079A259716R4516J19725Q7483j61882J24186K24578Q4458j57363l09696j34756
$$ 1259716 1354232 1473957 1561440 1399558 1523744 1748322 1832780 1675417 1365721 1230965
2069A230965J68153J29514K5096o6577l9455k12500J4025J32056j64633M8863
$$ 1230965 1399118 1528632 1553728 1487151 1447696 1235196 1249221 1381277 1216644 1265507
2059A265507r3121j98616L19186J6977Q3621K8074j21983o0215n7550k47602n4512
$$ 1265507 1172386 973770 1292956 1309933 1393554 1421628 1299645 1239430 1181880 934278 879766
2048H79766J28404Q3238N4467K02025r6636k16137J44022P5685j68951j77783
$$ 879766 1008170 1091408 1145875 1347900 1251264 1035127 1179149 1254834 1085883 908100
2038I08100L37126k1361j76566R3529P4953M3429J9285j1767k9939O7403j06422
$$ 908100 1245226 1223865 1047299 1140828 1215781 1259210 1278495 1266728 1236789 1304192 1197770
2027A197770L7101K8463L041r224Q4389M3445r1573M6456j60295k99109j51817
$$ 1197770 1234871 1263334 1266375 1257151 1341540 1384985 1293412 1339868 1179573 880464 728647
2016G28647N1375J50110j2316r9323L45348p8269p7287J58402O095j04655j24625
$$ 728647 780022 930132 917816 818493 1163841 1085572 1008285 1166687 1172782 1068127 943502
2005I43502j22335n7664p1447k5092J64692m6k22192K5267K34359K24450J15980
$$ 943502 821167 763503 692056 666964 831656 831610 609418 634685 869044 1093494 1209474
1994A209474M0243O8624j89105m5979M6082L169r2020J18427J17685j11370j51936
$$ 1209474 1249717 1318341 1129236 1083257 1129339 1132508 1040488 1158915 1276600 1165230 1013294
1983A013294j85534Q0283J37182J18036j45686j08880j4134r6369J94758R3810
$$ 1013294 827760 908043 1045225 1163261 1017575 908695 894561 798192 992950 1086760
1973A086760k80912J8327N7166M7640r8959k08373o5687R2090k8198M4174p462
$$ 1086760 805848 824175 881341 928981 830022 621649 555962 648052 619854 664028 656566
1962F56566J30642k03962o0078L59114k799r2083M45980o9390j0658j90295n417
$$ 656566 787208 583246 523168 882282 879483 787400 1233380 1163990 1153332 963037 957620
1951I57620J43535j73480K5715M7R9879M7743L2930L2819r3724Q569J33617L6505
$$ 957620 1101155 927675 953390 953437 1053316 1101059 1133989 1166808 1073084 1081653 1215270 1251775
1939A251775j75053j35456j3623J33398J19721L0854l9387P3524J88908p1936
$$ 1251775 1076722 941266 927643 1061041 1180762 1211616 1172229 1245753 1434661 1362725
1929A362725j14436j97333k36888J12428M4406K86167N8704r0928j09916j75070
$$ 1362725 1248289 1050956 814068 926496 970902 1257069 1315773 1224845 1114929 939859
1919I39859K98942l92408l0204K79630P9470J38246r0493L0983j5214l02619J00250
$$ 939859 1238801 846393 816189 1095819 1175289 1313535 1223042 1254025 1238811 936192 1036442
1908A036442J6984j71604o2709J87935J87844K8561k5159r1369o6942M83666r7818
$$ 1036442 1053426 881822 819113 1007048 1194892 1223453 1198294 1106925 1039983 1523649 1425831
1897A425831m2381K26976n6740j057L29801p559n3624k762J44329j01982j51416
$$ 1425831 1383450 1610426 1553686 1552629 1882430 1874871 1821247 1818485 1962814 1860832 1709416
1886A709416j3301l3812j40159p7507L554R8647J01661m0092j41295N7830l29503
$$ 1709416 1696115 1662303 1522144 1444637 1448191 1546838 1648499 1608407 1467112 1524942 1195439
1875A195439k60974R2558Q3109p369l4284J47493J24817J15503j59777j84580
$$ 1195439 934465 1027023 1110132 1102763 1068479 1215972 1340789 1456292 1296515 1111935
1865A111935J85326Q5835O3418M4696K1140J46748J11336j42417o2185j1948R8999
$$ 1111935 1297261 1383096 1446514 1491210 1512350 1659098 1770434 1628017 1565832 1553884 1652883
1854A652883K67626n1444k04869J03603Q2913k47975M6615l5963J42584l36732
$$ 1652883 1920509 1869065 1664196 1767799 1850712 1602737 1649352 1613389 1755973 1419241
1844A419241j22562R9344j76084k6987P9475j25033J8317o6198p7082P8440p4177
$$ 1419241 1296679 1396023 1219939 1192952 1272427 1147394 1165711 1099513 1022431 1100871 1026694
1833A026694O6349K05630k90541J70973R5063P0639p3039J62029J07454p3209
$$ 1026694 1093043 1298673 1008132 1179105 1274168 1344807 1271768 1433797 1541251 1468042
1823A468042o5198J8109q646j44204l653J02992q0400j46450J35299O5676k15743
$$ 1468042 1402844 1420953 1412307 1268103 1264450 1367442 1287042 1140592 1275891 1341567 1125824
1812A125824J9144K67568R856J1785j01517k05544J05754n7688j59453J38045
$$ 1125824 1144968 1412536 1422392 1434177 1332660 1127116 1232870 1175182 1015729 1153774
1802A153774j87122Q5592J31332q2350j65823J23557L22983m7558o2586q3293
$$ 1153774 966652 1052244 1183576 1101226 935403 1058960 1381943 1334385 1271799 1188506
1792A188506p3284N2995j26086P3915K03598o6428o6994O4185j60618k12888O2413
$$ 1188506 1115222 1168217 1042131 1116046 1319644 1253216 1186222 1250407 1089789 876901 939314
1781I39314p7708R9582K1822O7107L21028l2463j32464K1418P0357k03492R7741
$$ 939314 861606 961188 983010 1050117 1371145 1338682 1206218 1227636 1297993 1094501 1192242
1770A192242O2620j69532o3169J14j08361j56762J49338N6395j24779O5019r3343
$$ 1192242 1254862 1085330 1022161 1022275 913914 757152 906490 962885 838106 903125 809782
1759H09782l95723j1709J04209P0108J90967j49398q5049K27717O0645k45436
$$ 809782 414059 402350 506559 576667 767634 618236 533187 760904 821549 576113
1749E76113M9943Q2329o9236q9974J58470K9042k1413j30983K15256j5191r3240
$$ 576113 626056 708385 639149 549175 707645 736687 715274 584291 799547 784356 691116
1738F91116K31934o7618j45986j48475o6129J09096m4674j74686J37422O4121
$$ 691116 923050 855432 709446 560971 494842 603938 559264 384578 522000 586121
1728E86121m8941k34640O4889J73880o2246Q0528N3882j67528k0525k9876p1079
$$ 586121 537180 302540 367429 541309 479063 559591 613473 445945 425420 395544 324465
1717C24465j07641J3367j18840J0732J05941j57486M7636K37179j18589J214J57615
$$ 324465 216824 230191 111351 122083 228024 70538 118174 355353 236764 237978 395593
1706C95593j11987P9013J68176n7897k87351J20243K35279n7490j30206j43505
$$ 395593 283606 362619 530795 472898 185547 305790 541069 483579 353373 209868
1696B09868N8050P4997n1394j80854L4360K26722o5311r8091Q1080k2025j55136
$$ 209868 267918 342915 291521 110667 145027 371749 306438 208347 289427 267402 112266
1685A12266M1353k09087K8166K10068p2465n0889r4296J12605J88108P7943K5693
$$ 112266 153619 -55468 -27302 182766 110301 59412 -34884 77721 265829 343772 369465
1674C69465m5612j73634r945m6836m8698j31158J2872j1103K5779M6467J85208
$$ 369465 323853 150219 140274 93438 44740 -86418 -73546 -84649 -58870 -12403 172805
1663A72805J35980j11253j17949J5475J32530k6625j03009p4894J93694Q3815
$$ 172805 308785 197532 79583 95058 227588 200963 97954 23060 216754 300569
1653C00569j25913P4583J22174k3483N8794j96193R728J58390m9005j10276K0369
$$ 300569 174656 249239 371413 347930 406724 210531 220259 378649 329644 219368 239737
1642B39737O1233k05471p5254J24888k6769j56792J5124N4687r1555M2271l4666
$$ 239737 300970 95499 20245 145133 118364 -38428 -23304 31383 -60172 -17901 -52567
1631e2567q849P1034o2548N1432J63226j28630m335M8027K06631o9919k34830
$$ -52567 -61416 9618 -52930 -1498 161728 33098 28763 76790 283421 213502 -21328
1620b1328J93011M0818n6755N6125j00132Q6388p2133L1059N7516m6861j93031
$$ -21328 171683 212501 155746 211871 111739 198127 125994 157053 214569 167708 -25323
1609b5323r722K54459J15012j7731j72003n9441j4853R1509j76657N3881J23961
$$ -25323 -35045 219414 334426 316695 144692 85251 70398 161907 -14750 39131 163092
1598A63092P372n6354n3496J22211p6854O501L4472N786n7709q6080l540R3693
$$ 163092 170464 114110 60614 182825 105971 112472 146944 152730 95021 8941 5401 99094
1586I9094j30322J75728J47650j67552j43977n2104K07536o9794j68085m7698
$$ 99094 -31228 144500 292150 124598 -19379 -71483 136053 66259 -101826 -149524
1576a49524P3519p352P9241j88776L02532J30904j30292J80018Q7339J826m6781
$$ -149524 -76005 -83357 -4116 -192892 109640 240544 110252 290270 377609 379435 332654
1565C32654n028j80319j82754K72228K5424k69878O0108L4367k3585l0904M0887
$$ 332654 327626 147307 -35447 236781 262205 -7673 52435 86802 63217 32313 73200
1554G3200J23994j18443J89181l40931K4951K40418j71551o4025J41317K3816
$$ 73200 197194 78751 267932 -72999 -48048 192370 20819 -43206 98111 121927
1544A21927K6744J33779j41579N8997q9787k48035j3484K06582J72508j17475
$$ 121927 148671 282450 140871 199868 110081 -137954 -151438 55144 227652 110177
1534A10177J80622P3553j01891j50462m4796J29018n5568o9038j52131J7189L01874
$$ 110177 290799 364352 262461 111999 67203 196221 140653 71615 -80516 -63327 238547
1523B38547Q6120q064O8250k45780k3932K61058k12679P4278J2987o6167K31993
$$ 238547 324667 316603 384853 139073 115141 376199 163520 237798 250785 184618 416611
1512D16611o6672L1692J7285j0826k28926K11595K1829j18995n3325l0745n9201
$$ 416611 349939 381631 398916 388090 159164 370759 392588 273593 220268 189523 130322
1501A30322N2191J37691J22049j58684J19111M7528n2604j68150k08063L6654
$$ 130322 182513 320204 442253 283569 402680 450208 397604 229454 21391 58045
1491E8045J88127L8460j55101J81961J97110l6631J00662p4423K0271j1139k63307
$$ 58045 246172 284632 129531 311492 508602 471971 572633 498210 518481 507342 244035
1480B44035J13906K46536N4207k71801N5817J1337l21344O4033J89972k5223j53311
$$ 244035 357941 604477 658684 386883 442700 454037 132693 196726 386698 361475 208164
1469B08164J42966K83634K27170j12093j58727p7845J58548n2692k56534J95644
$$ 208164 351130 634764 861934 749841 591114 513269 671817 619125 362591 558235
1459E58235l1063j03835j03490j66026N8342k7429K83849l6137j47615j46228
$$ 558235 527172 423337 319847 153821 212163 184734 468583 432446 284831 138603
1449A38603j5827j1256R546R2008j23921M7762o574J4927p9046J43497O6252R3870
$$ 138603 122776 111520 121066 213074 89153 136915 130341 145268 66222 209719 275971 369841
1437C69841l04318j14806J05606j19228o115K94219q7079j27700J42561M2186
$$ 369841 65523 -49283 56323 -62905 -69020 225199 138120 10420 152981 195167
1427A95167l5737j7236o0845J28023j96736j23148Q9464K9707j54739N5020j90712
$$ 195167 159430 142194 81349 209372 12636 -110512 -21048 8659 -146080 -91060 -281772
1416b81772J7385L7707j6549J30188j63853O7178J59113K01613o2752j43834q7602
$$ -281772 -264387 -226680 -243229 -113041 -276894 -209716 -50603 151010 88258 -55576 -143178
1405a43178J2242r126M5667J68451j92225j42680L01524L5167j22994j6054J84918
$$ -143178 -130936 -140062 -94395 74056 -118169 -260849 40675 75842 -47152 -63206 121712
1394A21712K24493k27767q1440l4560p1903J50953l8261l5765L5599J4009l051
$$ 121712 346205 118438 36998 2438 -69465 81488 43227 7462 43061 57070 54019
1383E4019J01631L717j01461M9862k7825m4120N5494j26037l523p7441l8339l3541
$$ 54019 155650 159367 57906 107768 79943 35823 91317 -34720 -38243 -115684 -154023 -187564
1371a87564N6673k4503Q4402l2478M3949M9702k02499J67114J1619o2645L2884
$$ -187564 -130891 -155394 -70992 -103470 -59521 -9819 -212318 -45204 -33585 -96230 -63346
1360f3346J47283K7915J43595j26192J3226k386l09958j11677J75062J19009j89281
$$ -63346 83937 111852 255447 129255 142481 140095 -169863 -281540 -106478 12531 -176750
1349a76750J09517K3325l680R5880J28438k17880M8962j57451j9691j16361J60118
$$ -176750 -67233 -43908 -47588 48292 176730 -41150 7812 -149639 -169330 -285691 -125573
1338a25573K49630l22111j15505L78884K9956j70648J52690q8354k8429o8714
$$ -125573 124057 -198054 -313559 65325 95281 -75367 77323 -11031 -39460 -108174
1328a08174l6638J19767J9456j2847P8777K2109m888j18326J26952P4761o624
$$ -108174 -144812 -25045 -5589 -18436 60341 82450 77562 -40764 86188 160949 154325
1317A54325r2212l4371l55211p466Q1706M612J53472K8949j73592R5932j37697
$$ 154325 62113 27742 -327469 -334935 -253229 -248617 -95145 -66196 -239788 -143856 -281553
1306b81553N8362J46531r0636J9232N6925R6680q0823J2761J24758j7928o0208
$$ -281553 -223191 -76660 -167296 -148064 -91139 5541 -75282 -62521 62237 44309 -15899
1295a5899Q4746J12461k4596L579R2097r8549j39178l748P1607n5171o054r059
$$ -15899 68847 181308 156712 160291 252388 153839 14661 10913 82520 27349 21295 12236
1283A2236J73891o1655J29116P409j64757n6251r7921l0415l887o3938M5714J15188
$$ 12236 186127 124472 253588 260997 96240 39989 -57932 -88347 -92234 -156172 -110458 4730
1271D730r211j10103J43856K8074M6870O3277N1228k01435K0139J41365p9481
$$ 4730 -4481 -114584 29272 57346 104216 167493 218721 17286 37425 178790 99309
1260I9309J51050N0503j73523J04212k8885J63100J42253k58750j16163k9588
$$ 99309 250359 300862 127339 231551 202666 365766 508019 249269 133106 103518
1250A03518J40130j53744k2777J40928M2730j96902J4247P5149k31978r5956j14167
$$ 103518 243648 89904 67127 208055 250785 53883 68130 143279 -88699 -184655 -298822
1239b98822K36765K56637l8897J488j66337j32730J24411m6755k22463Q4093N6265
$$ -298822 -62057 194580 155683 157171 -9166 -141896 -17485 -64240 -286703 -202610 -146345
1228a46345j52186j85362J29244L07843N5451Q976J63900j05849R1108O0874K8677
$$ -146345 -298531 -483893 -354649 -46806 8645 17621 181521 75672 166780 227654 256331
1217B56331J72262k22981j29590J67087k7827m2043j07786j38341Q8470O6213
$$ 256331 428593 205612 76022 243109 215282 173239 65453 -72888 15582 81795
1207H1795o6610M7087n3423r9973K8158J73590N8174k07779k01101K69732o7947
$$ 81795 15185 62272 8849 -91124 -62966 110624 168798 -38981 -240082 29650 -38297
1196c8297k09512J03596Q4129K27450j98161L9227L50856l12603j03070J8732
$$ -38297 -247809 -144213 -60084 167366 -30795 8432 359288 46685 -56385 -37653
1186c7653J13427Q2265R113J56183L7621r5598o6250p6929o936J15514k24419
$$ -37653 75774 158039 167152 323335 360956 265358 199108 122179 115243 230757 6338
1175F338J17293J42649k6964k60292J35983K9456M5402o9771r8315J70275R9541
$$ 6338 123631 266280 239316 -20976 115007 144463 189865 120094 21779 192054 291595
1164B91595m6579j676j06371k28006k2592Q688J64837j39723J22736k6628k5211
$$ 291595 245016 243340 136969 -91037 -113629 -104941 59896 -79827 42909 16281 -8930
1153h930k066l9765Q4308K20372R088j70581J79765l4164l7188K87263n3955q3829
$$ -8930 -10996 -50761 33547 253919 263007 92426 272191 238027 200839 488102 434147 350318
1141C50318L6565M2356J26776k41322K6272J04142j61694l4585m3832K16531n5938
$$ 350318 386883 429239 556015 314693 340965 445107 283413 248828 204996 421527 365589
1130C65589j11576Q879q207l20910j09094J48581j8837J83032q6649R9295R506
$$ 365589 254013 262892 254685 -66225 -175319 -26738 -45575 137457 50808 150103 159609
1119A59609N709m0218M7329O8579j46960R9575K2799m1642O406j590J92886K1407
$$ 159609 165318 125100 172429 241008 94048 193623 216422 174780 181186 179596 372482 393889
1107C93889k35968L329J35069l0192K44509n1090r8765K30870K54775k08119p2095
$$ 393889 157921 161250 296319 266127 510636 459546 360781 591651 846426 638307 566212
1096E66212K19093N1233j73865Q0100P5251k02143J043J53245M7946m4251R6278
$$ 566212 785305 836538 662673 742773 818024 615881 616924 770169 818115 773864 870142
1085H70142M3104j89514M4462Q1232j45727K3587j7314P8466K79895j01692o9374
$$ 870142 913246 723732 768194 849426 703699 727286 709972 788438 1068333 966641 897267
1074H97267J94653m929J62246n9092j05430l9278O7302k12808J62386J55388O7143
$$ 897267 1091920 1086991 1249237 1190145 1084715 1045437 1112739 899931 1062317 1217705 1284848
1063A284848J8470O7730P4835l0917n6091J51834P3063n6568J26447O4415p6738
$$ 1284848 1303318 1371048 1445883 1414966 1358875 1510709 1583772 1527204 1653651 1718066 1641328
1052A641328J22450j7947l2534J22892k9200j76706K8162J39587r3742J10233
$$ 1641328 1763778 1745831 1713297 1836189 1806989 1630283 1658445 1798032 1704290 1814523
1042A814523p3424K06796O9022J41671M2808j78975j06353Q447p2512n912K0127
$$ 1814523 1741099 1947895 2016917 2158588 2201396 2022421 1916068 1924515 1852003 1846091 1866218
1031A866218J2743m1975J56625J71618N6999K30407L8512k6826k1712J46275J67953
$$ 1866218 1878961 1836986 1993611 2165229 2222228 2452635 2491147 2464321 2442609 2588884 2756837
1020B756837j06820J23156J40883P2185K44836l5931m2490K05527M33161K74808
$$ 2756837 2650017 2773173 2914056 2986241 3231077 3195146 3152656 3358183 3791344 4066152
1010D066152J64324K58905J30802J47687N25213M28645p7679L71701K95909L90191
$$ 4066152 4230476 4489381 4620183 4767870 5293083 5721728 5644049 6015750 6311659 6701850
1000F701850M18824N90254J11277N57401O24889M65897P08646P20359P90693R71864
$$ 6701850 7120674 7710928 7822205 8379606 9004495 9470392 10179038 10899397 11690090 12661954
990A2661954J041964N75301Q50604R73696J637260J553789J900348K606716K762881
$$ 12661954 13703918 14279219 15129823 16103519 17740779 19294568 21194916 23801632 26564513
981B6564513M104753N522500O902195P290941P633966P658078N101717o72233
$$ 26564513 30669266 36191766 43093961 50384902 58018868 65676946 70778663 70106430
973G0106430r849325j3723300j1182400p606973n096397l639422k514616j884100
$$ 70106430 60257105 46533805 35351405 27744432 22648035 19008613 16493997 14609897
965A4609897j776406q83819o25746o36430n83330l84679m83940o12980n07505
$$ 14609897 12833491 11949672 11323926 10687496 10104166 9719487 9235547 8622567 8115062
956H115062n89356n59939m34821n89750l23278k56348l13140k35269o2294l12239
$$ 8115062 7525706 6965767 6530946 5941196 5617918 5361570 5048430 4813161 4750867 4438628
946D438628k31570q9450j50300j89045j60566j22913o330k42689j53453j01322
$$ 4438628 4207058 4117608 3967308 3778263 3617697 3494784 3488454 3245765 3092312 2990990
936B990990k58748k47665k6016J68160k46217J67357j39390m58283j3802M5361
$$ 2990990 2732242 2484577 2458561 2626721 2380504 2547861 2408471 1950188 1936386 1981747
926A981747l84714L953K87843Q9718n2984n996Q5093l16426k77665l159K26138
$$ 1981747 1597033 1600986 1888829 1978547 1925563 1919567 2004660 1688234 1410569 1407410 1633548
915A633548M5075k37931O6927j52057n5303k59765K786J93226j61065J3315J51025
$$ 1633548 1678623 1440692 1507619 1355562 1300259 1040494 1043280 1236506 1075441 1088756 1239781
904A239781j84365L2969j93728l6043N2002J18414r0268J57880k08962k17572
$$ 1239781 1055416 1088385 894657 858614 910616 1029030 938762 1096642 887680 670108
894F70108J53051l9850L5731Q6093j3751k42867Q0156R8242j71305m2727J7991
$$ 670108 823159 783309 819040 905133 891382 648515 728671 826913 655608 612881 630872
883F30872J03163J6182j14817Q920K05774j0094j38942n3410J74328J05816j87303
$$ 630872 734035 750217 635400 644320 850094 840000 701058 647648 821976 927792 740489
872G40489l1311J01928j57386N6461q207j65262l4749l9706O7469l0355R039j81370
$$ 740489 709178 811106 653720 710181 701974 536712 501963 462257 529726 499371 508410 327040
860C27040k4163J5421K0005m7964j30713M7686J04446p1645n6714M996Q0926j66386
$$ 327040 302877 318298 338303 290339 159626 207312 311758 240113 183399 188395 269321 102935
848A02935J7094N5506L7618O4067J151j54754J0365N7343k81567j08912K19178
$$ 102935 120029 175535 213153 277220 278371 123617 133982 191325 -90242 -199154 20024
837B0024n999R1431K663Q8100q7612K91675P3674r3767j80975J70198j739k37262
$$ 20024 14025 105456 108119 196219 108607 400282 473956 380189 199214 369412 367673 130411
825A30411J29877m2446Q6053l2690l8242K4246J8344k47439j60551P596K0218
$$ 130411 260288 217842 303895 271205 232963 257209 275553 28114 -132437 -124841 -104623
814a04623M9299K55178k30441m5516p3268r9476J70579o263J35997P9018l3363
$$ -104623 -55324 199854 -30587 -76103 -149371 -248847 -78268 -84531 51466 130484 97121
803I7121j02648K8980J80038l1483n5668J19460Q7601l68882l326J34601K07467
$$ 97121 -5527 23453 203491 172008 116340 235800 323401 -45481 -48807 85794 293261
792B93261l327p5698J46916j649l29287j9987N1055K03794M9226j19810K38606
$$ 293261 289934 214236 361152 359503 30216 10229 61284 265078 314304 194494 433100
781D33100k0428j76041p3691J08169j86382j32340J65160M5439j61850K09802
$$ 433100 412672 236631 162940 271109 84727 -47613 117547 162986 1136 210938
771B10938n3174k204p9799k21088J23396J21063k1504j2516j0295Q3422o2246
$$ 210938 157764 155560 75761 -145327 -21931 99132 77628 65112 54817 138239 75993
760G5993R2525K6791k11202L0916K810Q5524L3345o8001j20584J97938Q99r7618
$$ 75993 168518 195309 -15893 15023 17833 103357 136702 68701 -51883 146055 146954 49336
748D9336P2488o4698N0733j09875j36733p3721n411J7711j05370n3806J91654
$$ 49336 121824 57126 107859 -2016 -138749 -212470 -217881 -200170 -305540 -359346 -167692
737a67692O5865J27602K0350J17606L2073j57592m6619K202O0872j30834R8236
$$ -167692 -101827 25775 46125 163731 195804 38212 -8407 -6205 54667 -76167 22069
726B2069m6701m8332m9457J89731J53409k33396l8310N0478J05175O2786J57668
$$ 22069 -24632 -72964 -122421 67310 220719 -12677 -50987 -509 104666 167452 325120
715C25120k54618r1038J48789R2231P5664j33944k66369q5118n8985k42614J01404
$$ 325120 70502 -20536 128253 220484 296148 162204 -104165 -189283 -248268 -490882 -389478
704c89478K29706o5532N6990J58808R5143j71456j71232J85733K23616j27893
$$ -389478 -159772 -225304 -168314 -9506 85637 -85819 -257051 -71318 152298 24405
694B4405q4849N4545N0300J17896O6163J79655M6859M4000m125j50062k42087
$$ 24405 -60444 -5899 44401 162297 228460 408115 454974 498974 494849 344787 102700
683A02700k0150j54206j22790K05740L1276k18888Q284J69344N7220N8932j00649
$$ 102700 82550 -71656 -194446 11294 42570 -176318 -168034 1310 58530 117462 16813
672A6813r7025K12855j56576N791J43843j57511k55967K68130Q0150j64257j28451
$$ 16813 -80212 132643 -23933 -18142 125701 -31810 -287777 -19647 60503 -103754 -232205
661b32205R2227R2007p761Q7565J03284r0520p7860J69542l553k34252k2678J01508
$$ -232205 -139978 -47971 -55732 31833 135117 44597 -33263 136279 132726 -101526 -124204 -22696
649b2696J27689k6913r7215J12309n686j96120q857K43970j4659j13300J14904
$$ -22696 104993 78080 -19135 93174 87488 -108632 -117489 126481 111822 -1478 113426
638A13426k4953j09600j66428N8509j00724j49759R0582j31130J44562K39633
$$ 113426 88473 -21127 -187555 -129046 -229770 -379529 -288947 -420077 -275515 -35882
628c5882J2155l5848L2480m0160L6686q2248M1036j49335l967n8242k7694J04256
$$ -35882 -23727 -59575 -27095 -67255 -30569 -112817 -71781 -221116 -225083 -283325 -311019 -206763
616b06763n9498J52877J82144j16052j2133K74166k1358k35259P185M2312M8242
$$ -206763 -266261 -113384 68760 -47292 -59425 214741 193383 -41876 -34691 7621 55863
605E5863l156j87116J4427J50274k43230J16466J52485j05205j45078l6461r04
$$ 55863 52707 -134409 -119982 30292 -212938 -96472 56013 -49192 -194270 -230731 -231635
594b31635k36410P0653J94600j0020P8012o0311J56164O6898j34808J4371j6095
$$ -231635 -468045 -397392 -202792 -212812 -134800 -195111 -38947 27951 -106857 -92486 -108581
583a08581q8033q9097L01845L4086k66786L6021K10044N055j11683N3263j67614
$$ -108581 -196614 -285711 16134 50220 -216566 -180545 29499 34554 -77129 -23866 -191480
572a91480M2077K088j00135l7742J59061n3122j13823L9342N5129n3800N480p3253
$$ -191480 -149403 -147315 -247450 -285192 -126131 -179253 -293076 -253734 -198605 -252405 -246925 -320178
560c20178O5180j438P8557j63697j25962L24131K5670N4968j8494j81880k97803
$$ -320178 -254998 -256436 -177879 -341576 -467538 -143407 -117737 -62769 -81263 -263143 -560946
549e60946L22792J14037R2630o0322r0421K4813J27511R0885K5699K0783P2j66541
$$ -560946 -238154 -124117 -31487 -91809 -182230 -157417 -29906 60979 86678 107461 107533 -59008
537e9008K2122q1552K9414O9933J08565m6382k28704J36539N2347N7875l00358
$$ -59008 -36886 -118438 -89024 -19091 89474 43092 -185612 -49073 3274 61149 -239209
526b39209p4769q9491j86971k047K34154K18350k23451l2465N9546rl7833O3419
$$ -239209 -313978 -403469 -590440 -592487 -358333 -139983 -363434 -395899 -336353 -336362 -374195 -310776
514c10776J05281k3034p1046J09810n1223Q8389j52450P0194K05315j87918J59362
$$ -310776 -205495 -228529 -299575 -189765 -240988 -152599 -305049 -234855 -29540 -217458 -58096
503e8096K08709P9505m8690j8323l5493r0149j23071K13975r4714k08522L9831
$$ -58096 150613 230118 181428 163105 127612 37463 -85608 128367 33653 -174869 -135038
492a35038m3900n8812j61168J36115R5646J4287k32081J3452J22687j87527O5247
$$ -135038 -178938 -237750 -398918 -262803 -167157 -152870 -384951 -371499 -248812 -436339 -371092
481c71092o7525M1720L11022J21577n3661j51919k32110J80400Q9456j8564J04041
$$ -371092 -438617 -396897 -85875 35702 -17959 -169878 -401988 -221588 -132132 -150696 -46655
470d6655j75825K8725L2588M9530K73907k69634j08751O1885j04964L6204J76091
$$ -46655 -222480 -193755 -161167 -111637 162270 -107364 -216115 -154230 -259194 -222990 -46899
459d6899J33359j3205j50918K32612K6996j7600J0395k06840o7016K02727j03832
$$ -46899 86460 73255 -77663 154949 181945 164345 174740 -32100 -99116 103611 -221
448b21q4583L7819m4673L2562k29192p1225L33617P0274j3437j53991k04558n4388
$$ -221 -84804 -46985 -91658 -59096 -288288 -359513 -25896 44378 30941 -123050 -327608 -381996
436c81996O1600k1055J87361l3557r5399J28357J9688r7587j38865l0861O3528
$$ -381996 -320396 -341451 -154090 -187647 -283046 -154689 -135001 -232588 -371453 -402314 -338786
425c38786J01164j33191L40L02034J72568l66132r1268M7728J22874j1608M4917
$$ -338786 -237622 -370813 -370473 -68439 104129 -262003 -353271 -305543 -182669 -194277 -149360
414a49360P7208n0527j52486J25860k4473n8452J09658J00726o3696l1887l6859
$$ -149360 -72152 -122679 -275165 -149305 -173778 -232230 -122572 -21846 -85542 -117429 -154288
403a54288J32441j29088L9604n4093R869o2M0209p5724p1171j15825o9551o7136
$$ -154288 -21847 -150935 -111331 -165424 -155555 -155617 -115408 -191132 -262303 -378128 -447679 -514815
391e14815K22370J11023p4018R3213O3122j35407J0408J80307m00216N9302J36394
$$ -514815 -292445 -181422 -255440 -162227 -99105 -234512 -224104 -43797 -444013 -384711 -248317
380b48317o088R3561q5383K4937P4685j00217J552J03338J33524J43812k12331
$$ -248317 -254405 -160844 -246227 -221290 -146605 -246822 -245270 -141932 -8408 135404 -76927
369g6927j3764J91139k6947L2115k00610J59752j03667j65108J66318k8997j59677
$$ -76927 -90691 100448 73501 105616 -94994 64758 -38909 -204017 -37699 -66696 -226373
358b26373N7277J15814J17990m0437m3163L2939j18577k14734J15687m6636j9234
$$ -226373 -169096 -53282 64708 24271 -18892 14047 -104530 -319264 -203577 -250213 -269447
347b69447J36328j02650P8861j44305k945L7194j18106J96448J05192J22259l15506
$$ -269447 -133119 -235769 -156908 -301213 -304158 -266964 -385070 -188622 -83430 38829 -276677
336b76677J54092l5526j20417o8801J4788K00518j03739j91208Q3086r7147R0133
$$ -276677 -122585 -158111 -278528 -347329 -332541 -132023 -235762 -426970 -343884 -441031 -350898
325c50898K8618M2673J8732r5003J36759q073k5414r059k5083o6439J74124n5819
$$ -350898 -322280 -279607 -260875 -355878 -219119 -227192 -252606 -261665 -286748 -353187 -179063 -234882
313b34882K23462q5291j31662J29678j07577K4892j79260j19572K29208j21523
$$ -234882 -11420 -96711 -228373 -98695 -206272 -181380 -360640 -480212 -251004 -372527
303c72527k4662P2101L436j27113M048J47109n6524K44075q7313J7947j05874
$$ -372527 -397189 -325088 -321652 -448765 -444717 -297608 -354132 -110057 -197370 -179423 -285297
292b85297m6691J72586Q6921k45130J25190K34526j52820j14673K71189N0639
$$ -285297 -331988 -159402 -72481 -317611 -192421 42105 -110715 -225388 45801 96440
282I6440k31951M6765P1376j59837N7827l5543j76531J49025j86550K26810M2394
$$ 96440 -135511 -88746 -17370 -177207 -119380 -154923 -331454 -182429 -368979 -142169 -99775
271i9775j79306l2976J88607o3138j76419l1158Q3579J47002k11350P6073J37676
$$ -99775 -279081 -312057 -123450 -186588 -363007 -394165 -310586 -163584 -374934 -298861 -161185
260a61185l59253j6005J30160j178j9850K49701q1817M4498q0527q2115Q2907
$$ -161185 -520438 -536443 -406283 -407461 -427311 -177610 -259427 -214929 -295456 -377571 -294664
249b94664K31829K2331L4444Q2233J254m1053j37072p0146N429j10095N4483K46904
$$ -294664 -62835 -40504 -6060 76173 77427 36374 -100698 -170844 -165415 -275510 -221027 25877
237B5877k09107o0898o2095j58521J63251j01763J8378Q4439j2597j4533j49768
$$ 25877 -183230 -244128 -306223 -464744 -301493 -403256 -384878 -300439 -313036 -327569 -477337
226d77337J38152j2018J11344O8832q2369j80340O1430J49957k56518k1044O9893
$$ -477337 -339185 -351203 -239859 -171027 -253396 -433736 -372306 -222349 -478867 -499911 -430018
215d30018K10149m4885M3590J7734o3998l6663n9380K98940k138K7546p923q5627
$$ -430018 -219869 -264754 -221164 -203430 -267428 -304091 -363471 -64531 -66669 -39123 -47046 -132673
203a32673j14969j09466K161J28148l3938k78787N0229J28742J27883K0038K6782
$$ -132673 -247642 -357108 -354947 -226799 -260737 -539524 -489295 -360553 -232670 -212632 -185850
192a85850J49654j80960j09389o1001o9997P3747l8252K37947o2512M6279j38
$$ -185850 -36196 -217156 -326545 -387546 -457543 -383796 -422048 -184101 -246613 -200334 -200472
181b00472k50306J33265J30450j21401j40169M1106N170J55729o253j0296P684
$$ -200472 -450778 -317513 -187063 -308464 -448633 -407527 -402357 -246628 -252881 -263177 -255493
170b55493o5869Q4966J89735j83217j39457k8921J01982k5278q5900J52124j15104
$$ -255493 -321362 -236396 -46661 -229878 -369335 -398256 -296274 -321552 -407452 -255328 -370432
159c70432j32771J61331J18217j18518j51775O9060K73411j6840k20900J07064
$$ -370432 -503203 -341872 -223655 -342173 -493948 -424888 -151477 -168317 -389217 -282153
149b82153k4175J0654n4807Q7730J2728k70521J48881J16425j07901O2017O5000
$$ -282153 -306328 -295674 -350481 -262751 -250023 -520544 -371663 -255238 -363139 -301122 -236122
138b36122n7735K3967L6160j85094m6785J43097o4170j33091l6943P8961L2468
$$ -236122 -293857 -269890 -233730 -418824 -465609 -322512 -386682 -519773 -556716 -477755 -445287
127d45287j3327Q2835J6628M595Q4997J20644L0578O2096k35022j27136J8441
$$ -445287 -458614 -375779 -359151 -354556 -269559 -148915 -118337 -56241 -291263 -418399 -399958
116c99958l6441J40670J13448j02466j68836j04028K40382K9683n9448M1986p8673
$$ -399958 -436399 -295729 -182281 -284747 -453583 -557611 -317229 -287546 -346994 -305008 -383681
105c83681L7627j64709q1767J36950P3189m2369R3380R0601j85577j43201M3677
$$ -383681 -346054 -510763 -592530 -455580 -382391 -424760 -331380 -240779 -426356 -569557 -525880
94e25880L452O2141K03911R0106N5295r2518o145l8024o3174P4131q6312j1794
$$ -525880 -522428 -460287 -256376 -166270 -110975 -203493 -209638 -247662 -310836 -236705 -323017 -334811
82c34811J8723N6477m5711R2981N8913j39133Q5158l3532j73209l0459K33943
$$ -334811 -316088 -259611 -305322 -212341 -153428 -292561 -207403 -240935 -414144 -444603 -210660
71b10660m8897j05632l08r4509R7061J02554q4000j0250R6117q0869k03985J50302
$$ -210660 -259557 -365189 -365497 -460006 -362945 -260391 -344391 -354641 -258524 -339393 -543378 -393076
59c93076j368n1428M8395K7112l9564O6338J58130j74487j59918P4595J37491
$$ -393076 -394444 -445872 -397477 -370365 -409929 -343591 -185461 -359948 -519866 -445271 -307780
48c07780j98710m8470P2600P3946j3855o0869o521J72156m6343M2886k5506p2099
$$ -307780 -506490 -554960 -482360 -408414 -422269 -483138 -489659 -317503 -363846 -320960 -346466 -418565
36d18565r0870J66636m5401k4111J26178l3967j04260j5045k853j6556M7735r5233
$$ -418565 -509435 -342799 -388200 -412311 -286133 -320100 -424360 -439405 -442258 -458814 -411079 -506312
24e06312O2209k1943p6676J00483P7977m9001j16395J7453M4236N1245K787R6550
$$ -506312 -444103 -466046 -542722 -442239 -364262 -413263 -529658 -512205 -467969 -416724 -413937 -317387
12c17387l8294j99341J68884O7959j86196M6555L3570J17276o5940N1904J18279
$$ -317387 -355681 -555022 -386138 -318179 -504375 -457820 -424250 -306974 -372914 -321010 -202731
1b02731o8364
$$ -202731 -271095
0b71095
$$ -271095
$$ Imaginary data points
##PAGE= N=2
##DATA TABLE= (X++(I..I)), XYDATA
16383d875280K27537o361m4038K38609J00367o4158k6865R4916O9282M625R5024
$$ -4875280 -4647743 -4654104 -4698142 -4459533 -4359166 -4423324 -4450189 -4355273 -4285991 -4281366 -4186342
16372d186342m7794L6412J17718K9258J48085K52948j15591q4658J12331p6640
$$ -4186342 -4234136 -4197724 -4080006 -4050748 -3902663 -3649715 -3765306 -3849964 -3737633 -3814273
16362c814273P4266J87828p7999J62860R8279L4749J02985J87777M4777M3227
$$ -3814273 -3740007 -3552179 -3630178 -3467318 -3369039 -3334290 -3231305 -3043528 -2998751 -2955524
16352b955524j2589m8416M4700J73952M2996o7303o2146L2647j18818K14274J52240
$$ -2955524 -2968113 -3016529 -2971829 -2797877 -2754881 -2822184 -2884330 -2851683 -2970501 -2756227 -2603987
16341b603987K7338J67143K3990k8652r181O3279J52882L4438k535M7002O0509
$$ -2603987 -2576649 -2409506 -2385516 -2414168 -2423349 -2360070 -2207188 -2172750 -2175285 -2128283 -2067774
16330b067774J20975k2559P9188L2591M5584J35497R6610Q0661L7182p9044M0479
$$ -2067774 -1946799 -1969358 -1890170 -1857579 -1811995 -1676498 -1579888 -1499227 -1462045 -1541089 -1500610
16319a500610J51246m5936O8896J2119p0582J03162J88762q5374o1821R3117J05750
$$ -1500610 -1349364 -1395300 -1326404 -1314285 -1384867 -1281705 -1092943 -1178317 -1240138 -1147021 -1041271
16308a041271M7802l1496K21533K26580q3351l4748N3271P893o3659J81201N943
$$ -1041271 -993469 -1024965 -803432 -576852 -660203 -694951 -641680 -633787 -697446 -516245 -510302
16297e10302j570j81557J435J77590J293J66224J43101P6732L1699n3921p9911
$$ -510302 -511872 -693429 -691994 -514404 -513111 -346887 -203786 -127054 -95355 -149276 -229187
16286b29187K08202J5628N0168p7198o0857J15583J2444j25862J68038Q591R9934
$$ -229187 -20985 -5357 44811 -32387 -93244 22339 34783 -91079 76959 85550 185484
16275A85484m878J68502M1782J53728L7913j16281L3791O3223O8599P2878J11881
$$ 185484 180606 349108 390890 544618 582531 466250 500041 563264 631863 704741 816622
16264H16622N3315r2675J76572J26049n7326n2883J9483R052K06983O9701r8814
$$ 816622 869937 777262 953834 1079883 1022557 969674 989157 998209 1205192 1274893 1176079
16253A176079R034J41889o9486r7512J09687l3662J7312p285M4084j79385k0127
$$ 1176079 1185113 1327002 1257516 1160004 1269691 1236029 1253341 1246056 1290140 1110755 1090628
16242A090628O4265J03503K2579J43825J72660j13800J44923J7866O8390m1410
$$ 1090628 1154893 1258396 1280975 1424800 1597460 1483660 1628583 1646449 1714839 1673429
16232A673429N2865J54710Q2024N2503o6591Q7340k7083n1679j20150K91176k22979
$$ 1673429 1726294 1881004 1963028 2015531 1948940 2036280 2009197 1957518 1837368 2128544 1905565
16221A905565n3613J91871Q5008N81J1359N5510j11821O0719k7861L2619K8893
$$ 1905565 1851952 2043823 2128831 2129412 2140771 2196281 2084460 2145179 2117318 2149937 2178830
16210B178830p2832J25386q5596J2337J55786J2453K4348n0896l01j1227J24402
$$ 2178830 2105998 2231384 2145788 2158125 2313911 2326364 2350712 2299816 2299515 2288288 2412690
16199B412690q9357J92447j35424p1306J14745k2722L1350R6444j42891J15650
$$ 2412690 2323333 2515780 2380356 2309050 2423795 2401073 2432423 2528867 2385976 2501626
16189B501626n3511J49273K4910J160j325j16294K42998O6451n7810k60860R2313
$$ 2501626 2448115 2597388 2622298 2623458 2622133 2505839 2748837 2815288 2757478 2496618 2588931
16178B588931J92891P7221k08115R4022K3521L8040p25o9349l3540J16193N7960
$$ 2588931 2781822 2859043 2650928 2744950 2768471 2806511 2805786 2736437 2702897 2819090 2877050
16167B877050J22280N5012o3615Q5288O6800l1854N2399j57400j10578J341K9321
$$ 2877050 2999330 3054342 2990727 3076015 3142815 3110961 3163360 3005960 2895382 2896723 2926044
16156B926044P0716J68678j745o0581l3804J59364r1186m3845P5183j92528K29497
$$ 2926044 2996760 3165438 3163693 3103112 3069308 3228672 3137486 3093641 3168824 2976296 3205793
16145C205793J71986o4801j93796J98084L3394J06257o5912j99634M0309J02028
$$ 3205793 3377779 3312978 3119182 3317266 3350660 3456917 3391005 3191371 3231680 3333708
16135C333708M8841O7489j32558q5516j541M8785K2727p2336L4980R8774m5481
$$ 3333708 3382549 3450038 3317480 3231964 3230423 3279208 3301935 3229599 3264579 3363353 3317872
16124C317872j57671L17011j24814j87208L3624J96547p6234l9992K27733j86893
$$ 3317872 3160201 3477212 3352398 3165190 3198814 3395361 3319127 3279135 3506868 3319975
16114C319975N776j7427j33094K18912m1224J84476l4819j27032R5242J08j49583
$$ 3319975 3325751 3308324 3175230 3394142 3352918 3537394 3502575 3375543 3470785 3470893 3321310
16103C321310o3310l1377J39430J44443k05592J6001m1039K7210Q8567j2927J77331
$$ 3321310 3258000 3226623 3366053 3510496 3304904 3320905 3279866 3307076 3395643 3382716 3560047
16092C560047J1175M4719M3189j23929p8724J3856J4241K28190l3640k60998O2721
$$ 3560047 3571222 3615941 3659130 3535201 3456477 3470333 3484574 3712764 3679124 3418126 3480847
16081C480847J30373j04466j54408j58168l6459Q7782J65076J83607j0466l8404
$$ 3480847 3611220 3506754 3352346 3194178 3157719 3245501 3410577 3594184 3583718 3545314
16071C545314j62016L4626m6244L03717K6261j06338j26198j94708K49568O4170
$$ 3545314 3383298 3417924 3371680 3675397 3701658 3595320 3469122 3274414 3523982 3588152
16061C588152j36617J15959N8745p0435j79955N2869R9890p815L6824n4667J25579
$$ 3588152 3451535 3567494 3626239 3555804 3375849 3428718 3528608 3520793 3557617 3502950 3628529
16050C628529J0808j02562J4927R9242q7764j1737l4503k8208j1700j78103J25913
$$ 3628529 3639337 3536775 3551702 3650944 3563180 3551443 3516940 3488732 3477032 3298929 3424842
16039C424842m1567j1458J16343j93515n7767J28725R1636r4727R063N7880j77705
$$ 3424842 3383275 3371817 3488160 3294645 3236878 3365603 3457239 3362512 3371575 3429455 3251750
16028C251750K8416K7105K4020N1132J04491Q6487j13587o7344P7499k9055Q0147
$$ 3251750 3280166 3307271 3331291 3382423 3486914 3573401 3459814 3392470 3469969 3440914 3521061
16017C521061J38936j41164Q8368J3066o3172J26970m6316j4777R1414j2976O0516
$$ 3521061 3659997 3518833 3607201 3620267 3557095 3684065 3637749 3622972 3714386 3701410 3761926
16006C761926j28278l3458p5926j46970K27718k01420J37008K37064j10198j21913
$$ 3761926 3633648 3600190 3524264 3377294 3605012 3403592 3540600 3777664 3667466 3545553
15996C545553J56190L0792J8994m0381r6563Q2668j58795j36442J13078k06452
$$ 3545553 3701743 3732535 3751529 3711148 3614585 3697253 3538458 3402016 3515094 3308642
15986C308642l9318J7727J28217r5388r3846L76621K8624l2328L2267R0647o7409
$$ 3308642 3269324 3287051 3415268 3319880 3226034 3602655 3631279 3598951 3631218 3721865 3654456
15975C654456n0125n431j74064K2102q3258J36364J95881j85832j0546Q7806m9298
$$ 3654456 3604331 3598900 3424836 3446938 3363680 3500044 3695925 3510093 3499547 3587353 3538055
15964C538055Q480J62983K870j30943o0985K41207j10235l68260J98730o9092
$$ 3538055 3546535 3709518 3712388 3581445 3520460 3761667 3651432 3283172 3481902 3412810
15954C412810k4287O3501o2676J31856k4715o4272j29788R6899J78081o3059j15771
$$ 3412810 3388523 3452024 3389348 3521204 3496489 3432217 3302429 3399328 3577409 3514350 3398579
15943C398579j6469m1879l1286J76078j4766j2468K2094n0960J79215J59652j34552
$$ 3398579 3382110 3340231 3308945 3485023 3470257 3457789 3479883 3428923 3608138 3767790 3633238
15932C633238j30332L5376J22604K3537j2955N5615n9623N4817N5132p9184q5724
$$ 3633238 3502906 3538282 3660886 3684423 3671468 3727083 3667460 3722277 3777409 3698225 3612501
15921C612501k1831r989J00071j61345K31839J29461k2168r7068o1397j63815
$$ 3612501 3590670 3580681 3680752 3519407 3751246 3880707 3858539 3761471 3700074 3536259
15911C536259J22612J55974K7911k93055J44243M2608O540J5100j2190l9267j58287
$$ 3536259 3658871 3814845 3842756 3549701 3693944 3736552 3743092 3758192 3746002 3706735 3548448
15900C548448L7509J36093M4516k02626L1403q1442J05395N2717Q1988M1749k79557
$$ 3548448 3585957 3722050 3766566 3563940 3595343 3513901 3619296 3672013 3754001 3795750 3516193
15889C516193p4808O7653J9048J87246m0695M5487r8584j26872J60625N4175j14176
$$ 3516193 3441385 3509038 3528086 3715332 3674637 3720124 3621540 3494668 3655293 3709468 3595292
15878C595292o1243K13610q341j21634j10420J29218j90028K4351K75940j96653
$$ 3595292 3534049 3747659 3739318 3617684 3507264 3636482 3446454 3470805 3746745 3550092
15868C550092j66039R5263J08115L5819m072R5088j0813j11423k0374J60177O5086
$$ 3550092 3384053 3479316 3587431 3623250 3619178 3714266 3703453 3592030 3571656 3731833 3796919
$$ [...]
##END NTUPLES=NMR SPECTRUM
##END=
