##TITLE=1H_EC-3252(II-24)
 CDCl3,8 sc, 
 31.03.2021
##JCAMPDX= 6.0         $$ Bruker NMR JCAMP-DX V2.0
##DATA TYPE= NMR SPECTRUM
##DATA CLASS= NTUPLES
##ORIGIN= UXNMR, Bruker Analytische Messtechnik GmbH
##OWNER= root
$$ XWIN-NMR		Version 3.5
$$ Wed Mar 31 12:06:25 2021 Russian Standard Time (UT+4h)  she@DPX200
##.OBSERVE FREQUENCY= 200.131506
##.OBSERVE NUCLEUS= ^1H
##.ACQUISITION MODE= SIMULTANEOUS
##.ACQUISITION SCHEME= undefined
##.AVERAGES= 8
##.DIGITISER RES= 18
##SPECTROMETER/DATA SYSTEM= spect
##.PULSE SEQUENCE= zg30
##.SOLVENT NAME= CD3CN
##.SHIFT REFERENCE= (INTERNAL, CD3CN, 0, 15.9751)
##AUDIT TRAIL= $$ (NUMBER, WHEN, WHO, WHERE, WHAT)
$$ ##TITLE= Audit trail, XWIN-NMR		Version 3.5
$$ ##JCAMPDX= 5.01
$$ ##ORIGIN= Bruker BioSpin GmbH
$$ ##OWNER= she
$$ F:/spectra/data/she/nmr/H-F/1/pdata/1/auditp.txt
$$ ##AUDIT TRAIL=  $$ (NUMBER, WHEN, WHO, WHERE, WHAT)
(   1,<2021-03-31 12:05:08.00 +0400>,<she>,<DPX200>,
      <created by zg, POWCHK disabled, PULCHK disabled
       configuration hash MD5:
       00 E9 B6 7A A2 85 ED C7 34 08 36 98 17 FE 4E 26
       data hash MD5: 16K
       E6 0B 79 0B 1C 87 95 4B E2 71 6E D1 D8 28 65 63>)
(   2,<2021-03-31 12:05:10.21 +0400>,<she>,<DPX200>,
      <Start of raw data processing
       efp BC_mod = 2 LB = 0.24 FT_mod = 6 PKNL = 1 PHC0 = -11138.86 PHC1 = 30.80093 SI = 16K 
       data hash MD5: 16K
       EF 2F B0 7A BC 84 9B DC D6 76 81 3E 11 2A 79 B2>)
(   3,<2021-03-31 12:05:33.73 +0400>,<she>,<DPX200>,
      <pk PHC0 = 10.345 PHC1 = -5.6 
       data hash MD5: 16K
       43 6A E0 09 10 3E 04 D6 18 F4 A3 EB E8 BB C5 FA>)
(   4,<2021-03-31 12:05:37.25 +0400>,<she>,<DPX200>,
      <abs ABSG = 5 
       data hash MD5: 16K
       CD 89 6D A9 62 74 A2 16 59 F4 B5 50 D2 50 B9 02>)
$$ ##END=
$$ 
$$ hash MD5
$$ E5 34 EE 72 72 65 98 F6 42 21 72 F6 8D 48 EA C5
##$RELAX= 
##$RELAX= 
##$RELAX= 
##$RELAX= 
##$RELAX= 
##$RELAX= 
$$ Bruker specific parameters
$$ --------------------------
##$DU= <F:/spectra>
##$EXPNO= 1
##$NAME= <H-F>
##$PROCNO= 1
##$TYPE= <nmr>
##$USER= <she>
##$AMP= (0..31)
100 100 100 100 100 100 100 100 100 100 100 100 100 100 100 100 100 100 
100 100 100 100 100 100 100 100 100 100 100 100 100 100 
##$AQSEQ= 0
##$AQ_mod= 1
##$AUNM= <au_zg>
##$AUTOPOS= <>
##$BF1= 200.13
##$BF2= 200.13
##$BF3= 200.13
##$BF4= 200.13
##$BF5= 200.13
##$BF6= 200.13
##$BF7= 200.13
##$BF8= 200.13
##$BYTORDA= 1
##$CFDGTYP= 0
##$CFRGTYP= 5
##$CHEMSTR= <none>
##$CNST= (0..31)
1 1 145 1 1 1 1 1 1 1 1 1 1 1 1 1 1 1 1 1 1 1 1 1 1 1 1 1 1 1 1 1 
##$CPDPRG= <>
##$CPDPRG1= <>
##$CPDPRG2= <>
##$CPDPRG3= <>
##$CPDPRG4= <mlev>
##$CPDPRG5= <mlev>
##$CPDPRG6= <mlev>
##$CPDPRG7= <mlev>
##$CPDPRG8= <mlev>
##$CPDPRGB= <>
##$CPDPRGT= <>
##$D= (0..31)
0 1.2 0 0 0 0 0 0 0 0.06 0 0.03 0 0 0 0 0.0002 0 0 0 0 0 0 0 0 0 0 0 0 
0 0 0 
##$DATE= 1617177907
##$DBL= (0..7)
120 120 120 120 120 120 120 120 
##$DBP= (0..7)
150 150 150 150 150 150 150 150 
##$DBP07= 0
##$DBPNAM0= <>
##$DBPNAM1= <>
##$DBPNAM2= <>
##$DBPNAM3= <>
##$DBPNAM4= <>
$$ [...]
##$SUBNAM3= <"">
##$SUBNAM4= <"">
##$SUBNAM5= <"">
##$SUBNAM6= <"">
##$SUBNAM7= <"">
##$SUBNAM8= <"">
##$SUBNAM9= <"">
##$SW= 16.9725357007746
##$SWIBOX= (0..15)
0 0 2 0 0 0 0 0 0 0 0 0 0 0 0 0 
##$SW_h= 3396.73913043478
##$TD= 16384
##$TD0= 1
##$TE= 0
##$TE2= 300
##$TE3= 300
##$TEG= 300
##$TL= (0..7)
0 120 120 120 120 120 120 120 
##$TP= (0..7)
150 150 150 150 150 150 150 150 
##$TP07= 0
##$TPNAME0= <>
##$TPNAME1= <>
##$TPNAME2= <>
##$TPNAME3= <>
##$TPNAME4= <>
##$TPNAME5= <>
##$TPNAME6= <>
##$TPNAME7= <>
##$TPOAL= (0..7)
0.5 0.5 0.5 0.5 0.5 0.5 0.5 0.5 
##$TPOFFS= (0..7)
0 0 0 0 0 0 0 0 
##$TUNHIN= 0
##$TUNHOUT= 0
##$TUNXOUT= 0
##$USERA1= <user>
##$USERA2= <user>
##$USERA3= <user>
##$USERA4= <user>
##$USERA5= <user>
##$V9= 5
##$VALIST= <valist>
##$VCLIST= <CCCCCCCCCCCCCCC>
##$VD= 0
##$VDLIST= <DDDDDDDDDDDDDDD>
##$VPLIST= <PPPPPPPPPPPPPPP>
##$VTLIST= <TTTTTTTTTTTTTTT>
##$WBST= 1024
##$WBSW= 4
##$XGAIN= (0..3)
0 0 0 0 
##$XL= 0
##$YL= 0
##$YMAX_a= 133588
##$YMIN_a= -185445
##$ZGOPTNS= <>
##$ZL1= 120
##$ZL2= 120
##$ZL3= 120
##$ZL4= 120
##$ABSF1= 15.97817
##$ABSF2= -0.9944916
##$ABSG= 5
##$ABSL= 3
##$ALPHA= 0
##$AQORDER= 0
##$ASSFAC= 0
##$ASSFACI= 0
##$ASSFACX= 0
##$ASSWID= 0
##$AUNMP= <proc_1d>
##$AZFE= 0.1
##$AZFW= 0.1
##$BCFW= 0
##$BC_mod= 2
##$BYTORDP= 0
##$COROFFS= 0
##$CY= -3
##$DATMOD= 1
##$DC= 0
##$DFILT= <>
##$DTYPP= 0
##$F1P= 0
##$F2P= 0
##$FCOR= 1
##$FTSIZE= 16384
##$FT_mod= 6
##$GAMMA= 0
##$GB= 0
##$INTBC= 1
##$INTSCL= 2.992141e-10
##$ISEN= 128
##$LB= 0.24
##$LEV0= 0
##$LPBIN= 0
##$MAXI= 10000
##$MC2= 0
##$MEAN= 0
##$ME_mod= 0
##$MI= 1.114404
##$NCOEF= 0
##$NC_proc= -9
##$NLEV= 6
##$NOISF1= 3.799351
##$NOISF2= 2.8
##$NSP= 0
##$NTH_PI= 0
##$NZP= 0
##$OFFSET= 15.97506
##$PC= 1
##$PHC0= -11128.52
##$PHC1= 25.20093
##$PH_mod= 1
##$PKNL= yes
##$PPARMOD= 0
##$PSCAL= 0
##$PSIGN= 0
##$REVERSE= no
##$SF= 200.130007279356
##$SI= 16384
##$SIGF1= 3
##$SIGF2= 2
##$SINO= 5.538805
##$SIOLD= 16384
##$SREGLST= <1H.CDCl3>
##$SSB= 0
##$STSI= 16384
##$STSR= 0
##$SW_p= 3396.73913043479
##$SYMM= 0
##$S_DEV= 0
##$TDeff= 16384
##$TDoff= 0
##$TI= <>
##$TILT= no
##$TM1= 0
##$TM2= 0
##$TOPLEV= 0
##$USERP1= <user>
##$USERP2= <user>
##$USERP3= <user>
##$USERP4= <user>
##$USERP5= <user>
##$WDW= 1
##$XDIM= 16384
##$YMAX_p= 500827829
##$YMIN_p= -4914898
$$ End of Bruker specific parameters
$$ ---------------------------------
##NTUPLES= NMR SPECTRUM
##VAR_NAME=  FREQUENCY,     SPECTRUM/REAL,   SPECTRUM/IMAG
##SYMBOL=    X,             R,               I
##VAR_TYPE=  INDEPENDENT,   DEPENDENT,       DEPENDENT
##VAR_FORM=  AFFN,          ASDF,            ASDF
##VAR_DIM=   16384,         16384,           16384
##UNITS=     HZ,            ARBITRARY UNITS, ARBITRARY UNITS
##FACTOR=    0.207333158178282, 1,           1
##FIRST=     3197.08896673867, 0,            0
##LAST=      -199.650163696122, 0,           0
##MIN=       -199.650163696122, -4914898,    0
##MAX=       3197.08896673867, 500827829,    0
$$ Real data points
##PAGE= N=1
##DATA TABLE= (X++(R..R)), XYDATA
$$ [...]
5544 1592624 736393 2142432 1127855 522553 2302302 76803 890092 2748549 1698876
5535 1698876 1113393 890273 -79041 1661806 1997190 2352026 2016688 1078077 1538545
5526 1538545 2994410 1711713 1051927 1662125 1012565 1098585 1217507 1997248 1884537
5517 1884537 1249538 1811224 2481666 3886312 1830248 2016547 2650982 2585614 1574804
5508 1574804 309824 1322060 1017292 121806 1124170 1934407 1679538 1027046 1430598
5499 1430598 1551904 1876326 420265 291930 880013 -2695 620363 2533410 1836371
5490 1836371 1603336 3562091 2549726 2850258 1429502 1865956 1869245 986901 2072445
5481 2072445 2401222 2866284 2181535 1275242 1816267 2142828 2573806 2701697 2617881 2787786
5471 2787786 2573993 1466787 1431803 1457484 1406495 888560 1197754 1548382 2188387 3064109
5461 3064109 4131512 2871291 2991587 2344989 1127033 807931 1059807 1689181 3002853
5452 3002853 1295019 1703906 4250236 3916247 3643932 3467074 2697061 2310429 1891099
5443 1891099 1283130 618400 820100 1223866 709255 2508165 3257368 2893061 3543186
5434 3543186 3080219 2995597 2651389 1798101 1702609 1733940 2859421 3546379 2852834 1643279
5424 1643279 3071855 3621601 3616977 4038977 3072951 2732505 2951471 1843747 2686795 2539965
5414 2539965 2316806 2650300 1945483 2887609 4285536 4184371 4494919 4093520 3999395 4384197
5404 4384197 3952569 3075303 3155358 2678791 1069365 3492481 4046505 4028082 4635484 3565406
5394 3565406 4487916 5374666 3875269 3253306 2927051 943050 2488170 3615606 3618618
5385 3618618 3681558 3896093 3156941 3201001 4229279 4050862 3580758 3407429 3385016 3956150
5375 3956150 2766707 2313828 2398611 2575735 4141395 4236075 4277392 3960241 3727382 3915320
5365 3915320 3333374 3249431 2642753 1867789 2485535 1272353 2384317 2988054 3019607 2606554
5355 2606554 2832973 4007587 3342929 2864478 2068435 1114522 2333229 3131056 3487421
5346 3487421 3676754 4416105 3177808 3532150 3967336 3006632 2633018 2621368 1490236
5337 1490236 1603898 3188038 1647478 2770264 3623532 3329199 4311288 3711308 3580260
5328 3580260 3280618 2998008 4237675 3708796 1678855 3060108 4146048 3843209 3010877
5319 3010877 3381667 2770286 3625715 6204742 4268445 3485334 3117741 2084116 2618845
5310 2618845 3634080 3498897 3249270 2835122 2261661 2777099 3025831 3029322 4809843 4682701
5300 4682701 4648689 4178077 2644411 2628952 1837218 968323 2037142 2251607 2977930 2401055
5290 2401055 3221089 5392696 5097517 3295608 3747163 4865919 4366866 3913267 5244027
5281 5244027 5631011 3835116 2886248 2624900 2921529 3159866 3156360 4573597 5655670
5272 5655670 4828701 4372832 3955928 4106982 3186724 3507697 4761225 2937422 2146682
5263 2146682 3282578 4214141 4327173 4090057 4558426 6009842 5353404 5645412 6852205
5254 6852205 6757620 4493226 4077431 5324230 5158474 4212242 4370925 4820029 5110706
5245 5110706 6268581 6371136 5873759 6041762 5653929 4862116 5013902 4965367 5515049 4394973
5235 4394973 2816674 3077828 5233193 4398659 3982106 4882934 4661083 5218653 6397262
5226 6397262 6614569 4409542 3629972 4669709 5110706 4651050 4976673 5165484 5420443
5217 5420443 6701708 5735596 5730731 6575872 5764911 5316715 5816128 6034747 5995002 5874394
5207 5874394 5062120 5656855 5748444 4004396 6442989 6513299 5899704 6759303 7352402 7412034
5197 7412034 7971507 6397625 6835352 7564925 5520647 6845479 6799559 6325298 5793496
5188 5793496 5346481 7746346 8701433 7122573 5927624 6994919 6075694 6463321 6334546
5179 6334546 6009433 7235191 7206333 7044845 7827743 7025336 5971718 7759458 7115684
5170 7115684 7372954 6611083 6237562 6231774 6863833 6325195 7405666 8042248 8019658 8561191
5160 8561191 8610249 7667040 8049731 6252108 5875832 7763319 5192193 6172281 7606899
5151 7606899 6471892 7603380 7590062 7738709 9246611 9424266 9449831 9365277 8965249 7875183
5141 7875183 7919323 7856518 7901745 8070637 7429232 6786216 6916937 7036167 9243462 10991034
5131 10991034 9560356 9653630 9237207 8718690 8988390 8515526 8391388 7458693 6688983
5122 6688983 7546503 7253379 7947457 8497979 8019572 7732945 6817215 6537877 5952800 6694774
5112 6694774 7718674 7591310 9006886 8709530 7906466 8536169 8769381 7886051 8148855
5103 8148855 7203500 7286744 7837996 6232255 7593006 8878059 8012131 8616726 8704922
5094 8704922 6520763 7340556 7477577 8413492 9285369 8124333 6617171 7554369 7777061
5085 7777061 7342760 7948145 9070857 8438401 8247041 8590233 8321277 7183330 6198450
5076 6198450 7892233 9500341 8447539 8894287 10301033 10906844 11575501 10378721 10244775
5067 10244775 10774592 9994132 9734066 10961592 10801834 9032752 9651812 9904155 11104817
5058 11104817 11159620 9967326 11331157 10461582 9740108 9768483 8806409 9671057 9897354
5049 9897354 8851607 9157509 9139250 10024530 11862900 10915470 11038457 10133274 9972960
5040 9972960 10095032 10947087 12208760 11526001 11997611 11196804 10672335 10890290 12059770
5031 12059770 13650055 14231544 14528781 15688010 16151974 15808303 13856395 14441710 15202742
5022 15202742 14745524 14760281 16865695 16378435 17453889 17568864 16226302 17868597 18497030
5013 18497030 16447160 17830993 17977775 16200701 16190846 16065649 16730972 16261401 15226484
5004 15226484 15409575 16163647 16027544 16063235 17770765 17796087 17489502 18178693 18851916 18354013
4994 18354013 18072764 17543077 18069526 18996445 18042076 21046477 22440193 24030103 25041564
4985 25041564 25282408 25941833 26039496 24190592 23171186 23555928 21239432 21441720 20912483
4976 20912483 20545436 19066456 17792834 19327521 19926041 19916144 18105983 17376231 17376321 16843066
4966 16843066 16306646 14942111 15736588 14742369 16166141 16219140 16555843 17798057 17858075
4957 17858075 17990771 17414577 18309154 17632800 17483769 17786027 18177194 17435212 17159654
4948 17159654 17183345 18079225 18155140 18270867 18832465 18533308 18106580 16899177 16813074 15873208
4938 15873208 15243727 14811460 13700773 14452041 13189587 14233464 16093478 15629005 15399456
4929 15399456 15828925 15466565 15346300 15314779 13978599 14886990 15596729 15066809 16648724
4920 16648724 16934838 17211830 17582847 18201967 18302351 20098550 19061410 18550280 19168383
4911 19168383 20057434 20324660 21753969 23620694 23028988 24515048 25560663 25583942 26045881
4902 26045881 26488030 26569365 26760713 26406530 25932338 24956738 23849602 23998454 23316696
4893 23316696 23913836 23603643 22754281 22149408 20545475 20522727 21093902 20814420 22816617
4884 22816617 23095425 24397128 25909641 27247621 29406430 30439226 29214827 28711307
4876 28711307 31701809 34001254 35350109 36226371 38132352 40081103 42447457 43932065
4868 43932065 45015009 44107887 42666858 42116792 40249349 38530077 35804250 34661961
4860 34661961 33409522 32059006 30514561 28292427 27467098 26667476 26163675 25448466 26107475
4851 26107475 25371725 24727649 24866911 26282932 26764816 25962940 25956181 27000612 27667061
4842 27667061 28194396 29580543 30290935 29855712 31350486 32488559 33347396 33377116 33534441
4833 33534441 34237346 34876938 34128359 32907842 31500134 29900718 27089815 25452725 24711664
4824 24711664 23275844 22242709 20772222 19868995 20040570 18511367 19243824 18343244 17824658
4815 17824658 19153500 17283549 16220555 16754904 15270762 14882610 15637022 14197895 13847522
4806 13847522 14531337 13759046 14236918 14254428 14118041 16320936 16590975 15498386 15640602
4797 15640602 13828325 13648060 13142766 12658081 12333777 11272819 10952715 10701124 10216353
4788 10216353 9355272 8251269 9423121 9646827 8865965 10081309 8855038 8557941 8879496
4779 8879496 9162081 10145290 9748079 10077939 9111140 7543394 7841235 8018324 8090986 8415427
4769 8415427 7929080 8321939 8646123 7506911 7136564 7417542 6836742 7323852 8630415
4760 8630415 8772923 8114755 7721848 7203052 6418367 7264307 8482744 7348687 5565276
4751 5565276 7081338 7919037 6463771 6036592 6861341 6366278 6302056 6954146 7330247
4742 7330247 6378418 7264782 6898803 8713181 8040251 6191743 6760283 5693817 6211177
4733 6211177 6807649 5338377 6918709 6586195 5290550 6819177 8335795 7456700 6303020
4724 6303020 6333859 5953457 5885368 5166521 4593356 6142545 6296211 5722137 5636574 6545844
4714 6545844 6596609 6695537 7350386 7442042 6901522 6405702 5158525 5387861 5291753 4993588
4704 4993588 6226270 6610925 6010139 6369865 6577706 6628717 6348923 6876918 6894558 7755669
4694 7755669 6742949 5428575 6269855 6289639 5583673 6681102 6289963 4942245 5834366
4685 5834366 5973548 5829608 7371762 7380403 6809346 7061400 6179405 7024430 8124977 6542324
4675 6542324 6073246 6464037 5953694 8101941 7363522 6126825 6086726 6562191 8262253
4666 8262253 8389920 7173267 7369085 7170655 8397733 8310792 8727913 7938499 8082067
4657 8082067 8954261 8723435 9866627 10374308 9218704 8879436 8388783 7940716 9374596
4648 9374596 10046182 10690951 10134512 9113385 9051760 8390399 8431392 6346920 4855041
4639 4855041 6253343 7208510 7639389 7073603 7890487 7762730 7604014 7364795 7946415
4630 7946415 9551309 8110824 9360587 10844875 9619498 9389818 9287365 7534258 8138164
4621 8138164 6727290 6623704 7742688 7411165 8308434 8464959 7889033 8837513 8289527
4612 8289527 9555907 9634330 9425595 9060067 8417048 8060968 9107375 9751103 9849246 10616558
4602 10616558 12166844 12461416 12888223 14438503 14350456 13255916 11652554 12193411 13019991
4593 13019991 12033476 11899257 11849702 11572028 11711709 11901447 11721580 12571967 12622059 11730642
4583 11730642 13067146 12868292 13115543 13666075 13212121 14054024 14763749 13964566 15122716
4574 15122716 14777115 12619780 14873223 15364146 15520502 17210827 14866950 15616307 17978187
4565 17978187 18315129 20019968 20445039 19291979 17326305 16755017 17433984 15444577 13752848
4556 13752848 13695104 14283261 14498915 14961145 15604467 15579125 15669763 16156122 15689639 17400719
4546 17400719 15821463 16194621 17811227 18519039 17773193 16004030 16659201 18203148 19051672
4537 19051672 20305679 22575797 22793957 23716820 24883562 25696072 26756880 27495904 26523020
4528 26523020 26285874 25431379 24741454 25931079 24911927 24883239 26434488 27984862 28952489
4519 28952489 29704385 29107000 29912711 31195914 31854412 33263535 35277012 36880321 40197916
4510 40197916 44101374 49113901 51298330 53340227 55711867 59000115 61843587 66455129
4502 66455129 69556082 71207814 73104537 73170161 71757372 71099657 68650208 65189947 62560211
4493 62560211 58510193 53865584 52360681 49949746 47599075 44959347 42656358 41575859
4485 41575859 38712295 37402310 36145943 35213729 34601322 34101937 33674646 34104916 33357567
4476 33357567 32706973 34831784 35978332 34634278 35374048 35736603 36547670 38322577 37580797
4467 37580797 36291712 37185169 34834121 33819551 32561424 32291614 31093376 30659482 30988889
4458 30988889 29476196 27058695 24913125 23184179 23655525 23966498 22117592 21515627 20267694
4449 20267694 19097119 21290583 20188530 20678546 21603144 18735271 17965181 19486923 19609003
4440 19609003 18845962 18188690 18161569 19406857 19542016 19555906 19840692 20128939 20411983 19082626
4430 19082626 18530811 18655931 19710703 19634301 20938209 21795602 22795300 24177438 23485838
4421 23485838 25144608 26792383 27521947 29484874 30819805 31144937 33150052 34669587
4413 34669587 35323611 37338039 39388243 40039524 42304658 41406830 40367310 39914575 36813903
4404 36813903 33701604 33168731 31230278 28278105 26371869 24391484 24929089 24083421 22139848
4395 22139848 22492118 22077206 20028330 20833524 18633109 18360658 17705415 16363164 16921610
4386 16921610 16502003 15193355 15630074 15588526 14476375 15996458 14657358 15575560 17418415
4377 17418415 15092504 15435754 15675637 13407630 15075652 14853399 14122104 13711399 13955429
4368 13955429 14380797 13978076 14017828 14319589 14358865 14138142 14168147 15148260 14689450 13759038
4358 13759038 14580845 15869750 16560528 15709580 17518050 18854444 17782071 19310791 19358019
4349 19358019 18812442 18495316 17812281 20334441 21076240 20417532 21363762 21729633 21352891
4340 21352891 21765667 22981169 25032072 24558420 22850326 24185199 26976920 26137708 25960506
4331 25960506 28555506 30743294 32420314 34224744 36294557 39952193 41844332 43057632
4323 43057632 48707118 53745653 60098501 67803341 76798335 89371867 101104701 113864770
4315 113864770 128438180 138014320 141959776 133027900 115730224 94587564 75924894
4308 75924894 62303111 51328908 45821779 39950676 35588968 32679396 29695153 28836462
4300 28836462 27023795 24494781 24313920 23822349 21702833 21301532 20120917 20243313 19859892
4291 19859892 18101331 17356553 17118623 16489844 16456337 15589725 14474240 15590814 15612435
4282 15612435 14852546 15528507 13192268 14395459 15201819 13086807 12763682 11808134 12356096
4273 12356096 13350367 11829116 11715864 12484714 12618553 11802099 11355910 12345830 12107605
4264 12107605 11071549 10746707 10342949 10636093 10307153 9431743 11017379 10505663 10693487
4255 10693487 11624208 9916832 9771908 11631417 10569226 10837934 10328529 8892535 8772108
4246 8772108 8488364 9816524 10574141 10967971 11176652 11541530 9780063 8701285 8895944
4237 8895944 8545390 9686857 8362436 8763059 8207449 7860369 8732480 8513494 9831935
4228 9831935 12229260 9053038 9499322 10819801 9177832 10017216 9448993 9149526 9748759
4219 9748759 8512773 7769262 6945326 7208555 7495383 8011947 9319374 7798475 7788944
4210 7788944 10015018 9411268 8807739 8898170 9307752 10682352 9946460 9829797 10365448
4201 10365448 8743163 7462336 7788238 8909812 8290141 8057286 9298697 8524635 8059099
4192 8059099 6606464 7691744 8156005 7090551 7452700 8064858 7341101 8316071 8043912
4183 8043912 7096539 7119526 6701379 8221847 7472424 8198733 9040886 8536009 8336260 8861326
4173 8861326 7990465 8615141 9354117 10779065 11476923 10295252 9679510 9273299 9141504
4164 9141504 9156077 9635374 9399904 8604537 9503708 8731256 9380494 10073330 8608898 8972835
4154 8972835 7790392 7925244 8811315 7940470 8652361 8848362 8189982 8429625 9682488
4145 9682488 10609510 10708719 11032355 10765406 10521880 10082832 11415314 10505945 9487334
4136 9487334 8785045 9074932 10857510 10494464 9042730 9402616 10182565 10336932 11594869
4127 11594869 10776001 10081294 9892555 8772084 8618976 8072428 6432650 7073405 7884970
4118 7884970 6040190 5764380 7344167 7826878 6704716 7349111 7830783 8573130 7543010
4109 7543010 7057334 7490198 6525342 5531361 6162697 6332280 5900472 7003261 7453853
4100 7453853 7338507 8331423 8228895 8214686 7715143 7072105 6927390 7537287 5848726 4449687
4090 4449687 5341346 6492460 7820529 8919397 8980462 8620914 7786557 8406546 7626553
4081 7626553 7595349 7975765 6322439 6724506 6907133 5792657 6855422 7165330 7835689
4072 7835689 8649281 7739161 8594078 8822860 7441869 7049725 6726778 7533625 8554093
4063 8554093 7396545 7206376 6771275 8047614 7369991 6893599 7647466 7468589 6965759
4054 6965759 9187615 8699033 8683898 8813506 7952406 7673993 6700513 6499912 6368217 7194242
4044 7194242 7160451 7073001 7673717 8665327 8159790 8916876 9152412 9839170 8587039 6748038
4034 6748038 7952139 8089638 8934331 8565288 8133207 8179611 9226954 9634239 10314934
4025 10314934 10972104 10682091 10667375 11287478 10605784 11207852 11799802 10854302 10897287 11299481
4015 11299481 11140420 12698900 14132858 14971830 16364956 16447708 15992734 13911273 12031551
4006 12031551 11816170 11618309 10994271 9861481 9493631 10781201 12301974 11766825 10227031
3997 10227031 10298167 13672741 12682221 12311556 12925652 10970367 11544529 10137651 10348098
3988 10348098 10502527 10025600 9048006 9450294 10649433 9235720 10357743 11723939 11112089
3979 11112089 11101216 11030964 12566061 12870063 11052184 9444264 10361371 9580480 10365567
3970 10365567 9738978 9991576 11751775 11169898 12565664 11786475 11427974 10645975 11485602
3961 11485602 10749586 10380753 10533440 9514450 10930776 10512559 10166748 11186528 11870213
3952 11870213 12073696 13655751 12453055 13024740 13816706 12333938 12380867 13413640 12447221
3943 12447221 12265596 12888249 11296523 13332142 14352780 14562732 15535067 15620521 15725978
3934 15725978 16421242 16205042 15992702 15655898 16667563 16834064 16515422 16883013 17910632
3925 17910632 18502429 20295041 20169626 20650011 22900390 23082636 21974766 20834039 21672090
3916 21672090 20859503 21959276 21943602 20796554 21938207 21021340 22291435 24737234 23934547
3907 23934547 24362750 24841305 24685579 26279699 25802643 25920357 26129019 26647632 27195699
3898 27195699 26521252 27474893 27030010 26990257 26945269 28223641 28825219 28203590 29058096 29092994
3888 29092994 27487929 28864345 30168050 29127695 29225358 29752827 31447162 32079769 30465247
3879 30465247 31272708 29999335 30208199 30922311 30954312 33490851 32677020 31851332 34112992
3870 34112992 34727583 34216757 33499212 33439462 33435102 31861439 29084170 29481772 28345153
3861 28345153 26949295 25275495 24834839 25967730 26416878 27488960 26407485 26714501 25751197
3852 25751197 24811052 25573557 25249289 24990425 25596455 24742945 25506920 24830604 25566709
3843 25566709 26645192 25656797 25601180 26370410 25823770 26207689 27395282 27129778 26512421
3834 26512421 26620690 26443397 26725588 28240047 28740321 28782354 29033880 29175321 29634771
3825 29634771 30638450 29405407 30210760 31950772 35016967 36298167 36339229 38613321 38265159
3816 38265159 38021498 36701778 33440421 31363123 28402742 26808473 27131057 26698360 25517365
3807 25517365 24831659 24660665 24441906 24494145 26491067 25725757 25072156 25555368 24622163
3798 24622163 25637295 26067895 25306347 25790282 26105670 25819738 26691859 26835259 26834715 27379689
3788 27379689 28343477 28131002 29608892 28778794 27655168 29678563 29678479 28891960 30358060
3779 30358060 30749886 30553409 30688882 30288228 29466606 32070525 31456697 31492201 32368689
3770 32368689 32215973 31858043 32099151 33899264 35168101 35656420 35342900 35753074 38240158
3761 38240158 39124927 39586965 41228770 41793076 43762173 44796104 45613094 47688131 49445925
3752 49445925 51437292 55456915 58237261 60623566 62593527 64464233 64680419 63130297
3744 63130297 62037984 60092871 59457587 59787947 58267961 61047632 62805972 64801989
3736 64801989 68309714 70815468 73877138 76673662 79244054 83401156 87449168 90291952
3728 90291952 93786600 100490654 106615313 111930258 117808917 122653978 128072250 133451821
3720 133451821 137556719 140952703 141605528 139492737 137682523 134596923 130855218 125942052
3712 125942052 118473942 114558734 108640526 100603081 96477074 92332981 88012133 83895120
3704 83895120 82098827 81969873 80944674 79895706 79926426 79819446 79478180 78748939 79513649
3695 79513649 81045519 79389291 77673834 76327676 73969170 72529019 70079727 67568257
3687 67568257 64904702 61661876 59755240 56465353 52887214 49223824 45575168 45850458
3679 45850458 45610297 43049718 41311039 40883890 39947992 38218729 36655730 37287533 36688314
3670 36688314 35833698 34306748 34782602 32739681 30391058 31615607 31639600 31788661 32034435
3661 32034435 31697017 30984247 30772536 29932376 31359564 31792937 29885502 28913385 30151290
3652 30151290 30001435 27608271 28190159 27333374 26700192 28630675 27025547 27748162 28236688
3643 28236688 25968574 27642960 29268307 28922068 28119275 27454982 28257881 28759065 29130647
3634 29130647 29775919 29860897 28823728 29763208 31164399 30543355 29968642 30539885 29532368
3625 29532368 28833821 29326433 29276179 28252423 27771969 26140222 27227450 28590332 27706641
3616 27706641 28929411 28295346 28869962 29375471 28319059 27800484 28135932 28157779 29397211
3607 29397211 29365704 28029063 28934393 29564776 30477654 31409539 31054987 31584602 31678820 30895777
3597 30895777 32371920 34478200 33230329 31659087 31965982 32664939 33478921 33610133 34106885
3588 34106885 34929513 33451268 33413403 33986222 33905148 34681514 33550337 33236059 33131416
3579 33131416 32711897 32938760 33319047 32806428 32484334 33633710 34381151 32406929 32938573
3570 32938573 34000238 32531087 32939163 32132603 31558403 33074999 33535655 34214347 33478026
3561 33478026 33450150 34569048 33667297 34781758 34712438 35031107 35556187 35904401 36383360
3552 36383360 35559366 35664161 36378322 35513133 37181555 38445919 35708178 35766654 37719019
3543 37719019 37303494 37077922 37236280 37149196 37044310 35988809 35778750 37903557 36774826
3534 36774826 35120093 36935261 36075002 33976289 33898257 33690801 34979983 34327239 31136698
3525 31136698 31617200 33222370 33198589 33086022 33842291 34907202 33493377 32593175 33741627
3516 33741627 34009720 35302117 34896822 35138916 35385630 35228286 36165007 36390548 36029815
3507 36029815 36046375 35971493 37062130 38524072 38567563 39522455 40015738 40168672 40426087 39411755
3497 39411755 40833157 41778552 42559208 44547457 44955091 45157124 47900316 48734633 51862283
3488 51862283 52860404 50355156 48655362 46825594 44786568 42529498 42982111 42359834 42366985
3479 42366985 43402735 43111646 44657528 45717384 45565004 46739298 47346916 47921316 49085995
3470 49085995 49186246 48587883 49841792 50003915 49823931 50905174 51961217 52179430 54632199
3461 54632199 55619209 55760082 56242463 57123990 58529429 60284961 62841451 66080964 68314661
3452 68314661 71263457 74316709 77490663 81148312 84699345 89892462 92876265 98953550
3444 98953550 105394861 111147217 119679526 129018026 138482975 147862569 157961811 165711685
3436 165711685 170939148 171165312 165415557 157044048 144911004 134409914 126557468 118427541
3428 118427541 113772428 110849885 105585037 104297678 102256958 99706633 99478059 99484893 100816754
3419 100816754 100365109 100089076 101185383 100911840 100232750 98246755 96107045 93454410 87886042
3410 87886042 83998401 81274621 79289204 77266639 73901081 72063601 70346577 67920109
3402 67920109 67306009 66326403 66392415 64819344 61858809 61375293 61458266 60268256 59655708
3393 59655708 59463778 60372682 58586910 58837929 58413426 57666896 57629249 57259945 57897281
3384 57897281 57369856 57258848 58776428 59584925 60110143 59687709 58780420 59681933 60261147
3375 60261147 60016714 58796969 57995065 58050550 56301106 56146390 56542751 55348610 56091835
3366 56091835 54374962 54973603 55541984 53804982 53763897 54668211 54305677 55307110 56130540
3357 56130540 55162642 55555732 56053970 56256973 57543880 56863941 57751790 58537241 59678253
3348 59678253 60535076 61487917 62063920 62572074 63927188 65479720 66106289 68275780 68851251
3339 68851251 69887859 72233649 71986140 74817156 77224322 80436562 83534965 85185725
3331 85185725 85457715 88604800 92941842 98467498 103442207 108112733 113879380 119866602
3323 119866602 125411443 132030897 142141717 151986377 164248839 175715868 186333046
3316 186333046 199467839 212806662 224086181 232758835 235845719 232638933 227183287 217834802
3308 217834802 204668685 190459388 175016916 161682058 151048219 142984547 137317125
3301 137317125 131706978 127770214 126268590 125213015 123251952 122767147 122524757 121249421
3293 121249421 122590596 122935681 122224217 122464611 121711941 121337252 121353944 116599073 112932419
3284 112932419 108147237 102435291 98507992 95291291 90044814 85894997 82053866 77904274
3276 77904274 75854730 73276076 70789117 67447355 66809539 65540911 65853861 65669523 64484856
3267 64484856 63086322 62539490 61522420 59805582 58318968 57218531 55660704 55863792
3259 55863792 55798359 54541540 55005143 54837898 54283647 54116397 52359158 50876647 50741636
3250 50741636 50656843 50309073 49160875 49513367 49705659 48770810 50323961 51511464 50906800
3241 50906800 51780393 52593849 51197847 50012880 49832312 51078100 51488228 49843312 49229266
3232 49229266 50568560 52104561 50834878 52890044 54259877 54836023 56035572 56050130 57980717
3223 57980717 56884999 55078236 57999689 58387593 57477177 59955527 61011332 61777915 61019838
3214 61019838 61086013 64199275 62400202 59794761 59301246 57933102 56446888 56366810 58197633
3205 58197633 56769865 56633616 56820220 58160365 59561035 58597941 59268962 61632089 60016310
3196 60016310 60755795 60308642 59645006 61494696 61662489 62999025 65038747 66100150 67461980
3187 67461980 70762099 71920156 73565009 76098444 78263566 78752737 82360960 84410104
3179 84410104 86140846 88956156 90011671 94544360 99974934 102690996 109025452 115635851
3171 115635851 120238425 126849577 133359191 140933709 146481138 149511947 151949297 151467055
3163 151467055 148935981 145951065 142623637 140469840 138867719 138476817 140007636 141622171
3155 141622171 145561212 150555930 156094126 161628056 165988646 169281057 170696516 169988559
3147 169988559 166767406 161448487 155466148 148383626 143400549 138564887 134435700 129834243
3139 129834243 127215215 125469321 122948141 122037180 121679083 121392723 120800187 123404176 127168642
3130 127168642 129878578 132358085 134407369 135174871 133902908 129735234 127549642 123433977
3122 123433977 115535962 110365286 105395313 101031979 97625058 93323376 91454054 90171058
3114 90171058 88836575 87463782 87951963 85634335 83463986 83095341 81125524 80691066 80387017
3105 80387017 79066042 79218013 77860436 78021385 80220005 79337490 78527820 78771121 79507502
3096 79507502 81583410 83360739 83260301 84877312 84764830 85536102 87777372 90104387 92438514
3087 92438514 95192620 97656855 100392888 102921467 104523419 105918381 106930223 107235716
3079 107235716 106813031 105241906 101592379 97854141 95000033 92391379 91080643 88472195
3071 88472195 85792290 84626675 82419484 82307275 81720178 79764143 78279741 78596232 77601499
3062 77601499 76255911 76657379 76933001 75705137 75815329 74510053 74010161 74754818 74680397
3053 74680397 75231163 76073683 76950877 75956632 75255209 75307784 76658042 77145296 75479806
3044 75479806 75803730 76505390 76629478 77651655 78748056 78335472 78441560 78739584 79722193
3035 79722193 82514483 81438471 81720699 81599699 81670171 82713146 82233171 82357430 83732864
3026 83732864 83906603 85108444 86736618 87365278 88644931 90136499 92296825 93442262
3018 93442262 93858447 95251604 95609551 96159473 96746467 96990251 99250490 100339344 103121168
3009 103121168 105720725 108056102 109356317 109743659 110788130 113673919 114989566 114807931
3001 114807931 116021513 117921438 119032296 120194885 123302314 125579247 128185953 130868291
2993 130868291 133141897 134682028 135612144 136488637 137996539 140149222 141136592 142145518
2985 142145518 144504768 147039172 148080571 149680143 151524524 152088506 153325368 155173207
2977 155173207 158159045 159133291 160026035 161084208 161151906 162482689 163247533 163483633 166619320
2968 166619320 168370596 168233853 169620516 170365755 170445178 171582138 172592129 173576988 173358561
2959 173358561 172048359 172766237 172467412 172875770 173920409 173728548 173280715 173909212 173166554
2950 173166554 173628644 173717873 171923554 170491065 169606546 166567660 165209406 165100774 163060682
2941 163060682 162544455 161783688 161794931 160745126 159040724 158436472 156280116 154135230 152939336
2932 152939336 151438475 148092835 145621872 145435168 143723268 142878194 141513972 139308441
2924 139308441 137957890 137894948 136708060 134861938 132612110 128833962 127428251 125266031
2916 125266031 121871990 119851397 119088549 118479918 117121601 116665651 116398463 114906524 113955501
2907 113955501 113426278 110574389 109558917 105777596 101762241 101178414 98633184 97725686
2899 97725686 96647422 94844215 95467038 93735202 92697322 93273021 90710891 89375661
2891 89375661 88338552 86584447 86513220 85888203 83795674 83279328 83155576 83518502 84195294
2882 84195294 84746015 84574800 84030318 82206416 81658812 82364709 79573089 79821135 80295362
2873 80295362 78426895 79051850 79675058 78903839 80036473 81298542 81253897 81143882 80170183
2864 80170183 79016823 78188647 76676013 76831638 79235296 78359398 77360766 76950670 76479389
2855 76479389 77140647 77306044 76540646 78199121 75722450 74683611 76798755 74882251 77038641
2846 77038641 77153221 74515359 75854815 76289618 75510799 75823395 73746293 74277288 75125761
2837 75125761 73955240 74464575 73943492 72814601 76257494 76782262 76513718 76111977 76226716
2828 76226716 76571706 76499029 75911777 76414997 76323017 76273890 77963232 78735559 80114977 80446296
2818 80446296 80854999 81595301 81850819 81037455 79994411 80611062 79339534 79742211 80574574
2809 80574574 80570998 82719984 83615166 85276248 87334581 88086099 86435600 87141636 87076716
2800 87076716 88665426 89616518 89885558 92685980 93835884 95295867 97885603 101924849
2792 101924849 103619394 105352605 108170706 110014705 113202723 114448630 115042142 115534540
2784 115534540 117074833 117508292 118979515 120002701 119653049 119671269 122044276 122708317 121702129
2775 121702129 121093898 120567858 121486241 120555729 119639472 118971434 117747772 116764378 116018595
2766 116018595 115720577 113726334 111738680 110164428 108727562 107616652 106153719 104271372
2758 104271372 100874764 100490892 99045941 97137215 96491325 95331331 95346961 95110407 94873253
2749 94873253 92857348 93328353 93207018 92129200 92215136 90228580 89770340 89677154 87840796
2740 87840796 87015739 87323629 87777549 88303297 87665119 85468763 85834260 85909229 84690121
2731 84690121 84523000 83969210 83599508 84338824 83591817 83326573 83644970 81533138 80147620
2722 80147620 81185560 81528340 80864502 80879508 79433124 80232006 80069175 79762046 81537735
2713 81537735 79595960 78033846 77836728 76566309 77215594 77050413 78162985 79160795 78609725
2704 78609725 79835709 80513746 79691032 79470095 79253779 79627908 80054587 80084568 81779185
2695 81779185 83064359 83425574 83233319 84864038 86895271 88493142 92136341 93603556
2687 93603556 93340200 94312002 96193136 97976356 100743195 103269447 104870574 107950346
2679 107950346 112773457 114904796 117473629 120665911 123274122 126379528 128425808 129627262
2671 129627262 131306950 132770847 134428818 135921115 137048514 139556341 141937705 145020094
2663 145020094 146698031 149758773 152061914 153366752 155793822 157289144 160067673 161375368
2655 161375368 163908118 168948609 172592264 176383336 182814157 187369199 192759483 199267139
2647 199267139 206048553 214468710 221936371 229533123 237072822 243408928 249186176 254936947
2639 254936947 260584902 265249187 269358149 273750707 278384224 281710750 284538929 290398474
2631 290398474 295412218 298291690 303160558 307111310 310625172 314657596 315106910 314463322
2623 314463322 313668991 311833162 307966503 301024865 294936410 290931514 287507041 281639193
2615 281639193 277674840 274093157 269699926 267544851 264652117 260341247 258051018 254197387
2607 254197387 249177453 246015083 239362412 233284554 229149334 223112852 218018330 214206537
2599 214206537 208944489 205150860 199740826 196994577 193885252 190201596 189745664 187432929
2591 187432929 185694246 185371614 183255291 181627802 180784667 179025499 179124567 178871216 177707976
2582 177707976 176794446 177644312 177753874 177252662 179504419 181890634 183249062 184953271 186882041
2573 186882041 188038730 188890561 190003938 193187093 195487042 198146265 201044305 204068807
2565 204068807 209098834 214079257 219976454 225156961 229937286 235690446 241682652 246788335
2557 246788335 250774170 256123023 262421943 268705635 274761586 282488297 289255552 294921712
2549 294921712 301620925 308047068 314494217 320445565 324891617 328817280 333871223 337655453
2541 337655453 341529394 345467428 346861646 349664624 353432689 355100419 357544110 359541505
2533 359541505 359275132 359198700 357679472 356246151 355579950 352982497 350448199 347406132 342839949
2524 342839949 339604589 334732710 329351746 326209006 320435738 314259421 309916208 304251086
2516 304251086 298248697 290825776 286084420 280157695 274694287 268517398 261571476 256317348
2508 256317348 249410601 242507376 236950566 230343476 223721811 217635659 212238867 206034037
2500 206034037 200313550 194740323 188181508 181479196 178092774 173979420 167530764 164252742
2492 164252742 160643113 156647011 152356443 148392573 144032857 139387344 135681925 133727539
2484 133727539 130666204 127095188 123876391 120819821 118312598 115528844 113854659 113856166
2476 113856166 109908409 106843358 107380406 105882738 103326216 103025371 101647604 99656051
2468 99656051 98208334 96009401 95915361 95637846 93012041 92267744 90347160 89754408 88448882
2459 88448882 86185836 86506539 85744694 83061428 81900771 80062752 79718707 77908192 78013478
2450 78013478 77372424 75461622 74033417 73602165 74216608 72613495 70212662 67091921 65496202
2441 65496202 64442433 64476136 62031272 60167199 60946337 60111301 60524232 59368795 57244050
2432 57244050 58002512 54832085 54328137 55202536 52950193 51137904 50995012 49593977 48936042
2423 48936042 48058305 46761923 46542232 45152373 46578512 47667116 46779126 44431232 43397646
2414 43397646 43434081 44049462 42036952 40894007 39997777 39569445 40380590 40916032 40828539
2405 40828539 41048000 39366601 38846098 40631294 38913352 37155782 37243176 36434855 36126262
2396 36126262 35891301 35354289 36188406 35665989 36296130 35894609 36761265 37085740 35569164
2387 35569164 36166820 35748770 36147002 35997375 35021773 34918242 33624002 33701420 35540504
2378 35540504 36569568 37075800 36117670 35577924 36627799 36173343 35105534 33316962 30982276
2369 30982276 31534405 34418202 33813504 33466604 31979235 32228555 34142911 34742184 34009498
2360 34009498 34301798 33336560 32561145 32017352 33118442 32022837 31394197 33376222 33554853
2351 33554853 33648264 35014851 35036026 36459888 37467385 36812583 38480610 38365826 37817655
2342 37817655 36890889 37201782 37637540 37352484 39161627 39246772 40225217 41001499 41711362
2333 41711362 42074921 41469477 42795605 44905015 44139797 42948027 43316924 45020957 46463035
2324 46463035 47960073 51581562 53725133 55831505 57738971 60058448 65325351 68408056
2316 68408056 70880281 72545738 74683294 78987543 79146898 78513034 77966121 74540305 71191245
2307 71191245 66609157 62778417 60389337 56232518 53726424 51415279 48597604 47985432
2299 47985432 46326687 44035808 44674064 44242422 44538450 44431733 43441564 42318008 42741373
2290 42741373 42119654 42053805 41071193 40684785 39758324 39124337 39175712 39511845 39837551 39387776
2280 39387776 39740399 40875172 41259429 40869984 40662726 41586550 41631922 41383114 40854303
2271 40854303 41821396 41933991 42698823 42464950 42427877 43715312 44708025 44194599 43884232
2262 43884232 43892661 43083045 43767629 43809299 44013572 45168287 45177165 45439508 46090393 46778727
2252 46778727 46721521 48648859 49852731 49115691 49360402 49299342 50941870 50130916 51190785
2243 51190785 50649944 52515724 54811760 56519932 56897273 56957550 56802220 57205358 57475629
2234 57475629 58202136 60003072 60031695 61684342 62216339 62146064 63547643 64384026 66851412
2225 66851412 67918530 68108609 69427497 70276536 70892245 70897384 72480758 75207152 76513293
2216 76513293 77171998 79222089 80843312 82527964 83382842 85732322 88780299 89818985
2208 89818985 90435944 92671551 96069839 95537298 96908170 100591079 104525719 107974287
2200 107974287 110674921 114419074 118138210 122643443 126730820 132899584 138805653 143647265
2192 143647265 148405774 155220217 161211720 166054395 172632625 180532767 189870747 198241662
2184 198241662 206761174 216294958 225449111 237390990 245535306 251450392 258325028 262526641
2176 262526641 263903014 261153871 255525743 249530906 239721500 227543610 217251323 208522781
2168 208522781 198234444 187768416 180162975 173601567 167609570 163661322 160839228 157555202
2160 157555202 155463136 152575364 148634621 146133432 142417354 137138865 133320365 129668511
2152 129668511 126358287 121902674 120620807 120385582 117243449 114219420 112731599 111884921
2144 111884921 110017779 109061059 106837207 105093009 104099767 101788425 99738927 98079996
2136 98079996 96000124 92990432 90691042 89769568 89181707 87985819 88475566 86726882 84626125
2127 84626125 84481397 83304063 81663933 79701140 77545712 76492545 73486709 72307015
2119 72307015 71800791 70732696 69273060 67218333 65301564 64432137 62683236 61560170
2111 61560170 59857065 59010311 58370360 57734394 58502496 55760456 56074774 56285505 55232048
2102 55232048 55606367 53807651 53222925 52034944 49849214 50147069 50529393 49359244 48768308
2093 48768308 48334142 47412298 47672841 46655982 47812310 46782096 46045713 46087652 45341559
2084 45341559 44771680 43352852 42695870 42309933 42484635 40642368 42479706 45078714 43076468
2075 43076468 41828915 43376137 43570544 42368260 40850444 40577851 40380956 40307548 38902511
2066 38902511 39580388 39656504 37254180 38797573 39389854 36665293 36099957 35890532 34648175
2057 34648175 35056351 33709230 34278428 34667833 34180714 34867175 35427189 34597187 34306795
2048 34306795 34398634 34278762 33297765 32399349 32497194 33896046 33643788 33882989 33906486 32586355
2038 32586355 32725872 33607813 32350241 33048770 33681039 33373653 32764222 31393156 31129142
2029 31129142 31484248 31597332 30989499 32145910 33111147 32911277 31989554 30865937 30889618
2020 30889618 32806177 31917251 30954962 31462689 31807667 31847806 31895266 31317695 32111706 32499433
2010 32499433 32106304 32244077 32591747 33403381 33300371 33320965 32253639 32032737 32020917 32770304
2000 32770304 34030716 34672625 34451028 33472664 34176681 33414716 31875979 31857774 32287419
1991 32287419 32760824 33503394 33995980 33455707 33794353 33846369 33533143 33540911 34112329 32613543
1981 32613543 33540129 34078701 32984448 33990665 34798749 36122548 36858375 37027931 37119812
1972 37119812 35950916 35082641 36459170 36246094 36896308 36433212 36319865 36442831 38595167
1963 38595167 39112529 39412518 40903776 41341385 42116988 42785460 44043870 43366890 43027791
1954 43027791 44183797 44342327 45860381 48321433 47907018 48729254 49478344 51534790 53537330
1945 53537330 55371212 57221192 58372025 58287779 59352805 60698534 62378811 64132739
1937 64132739 64495693 67052922 68452102 70267092 74138329 76811244 80707985 85242480
1929 85242480 88720831 91684325 96359024 100491481 105571435 112937589 117929366 125456468
1921 125456468 133747973 140397411 147465826 153463615 160272291 165243755 167962904 170144385
1913 170144385 169689979 168464182 166693536 163744275 161999446 161019723 157211865 152352502
1905 152352502 149168879 146932576 143663263 142186682 138767081 136300280 136619266 136427962
1897 136427962 138556122 141289663 143115423 147942626 153284232 158081061 164579596 172091494
1889 172091494 179657537 188577052 199048859 210577481 223391686 237247069 252229077
1882 252229077 268512369 284190075 299816144 312545819 322439652 329232199 330889512
1875 330889512 327985584 318675615 305439474 292594047 277779059 266483096 256322447
1868 256322447 244004657 233523668 219490123 205512188 193679790 181677620 172149039
1861 172149039 165451063 160687684 159030079 156421446 154344058 154228146 154608821 156208675
1853 156208675 158008568 159859847 163770638 168954747 173534954 179400087 185955063 192714147
1845 192714147 201686635 210550117 219677215 226727022 232408231 237197842 238946204 237026325
1837 237026325 233527784 228524163 220928617 212436532 204178633 197019106 189425773 180690818
1829 180690818 172026462 163864415 157078864 147864653 142403003 137828721 132684341 132389966
1821 132389966 131171355 129207044 128000152 125727882 126445056 127199891 126068977 126889950
1813 126889950 124162173 120728110 118897747 115773392 112676311 110195794 104981876 102682867
1805 102682867 99692179 95987041 96066492 94749460 92985887 93923211 94192097 94108216 96244655
1796 96244655 98153831 97902319 97845244 98051323 99392049 101676049 103756215 106273526 107340620
1787 107340620 106636420 106798437 108869225 107961153 107043056 106256502 103611419 102072080 97805933
1778 97805933 95121655 93800202 88272863 84978814 84029101 81268864 79339040 78483440
1770 78483440 76597121 77026839 77249932 75149661 74781865 73617843 74074780 75557665 75228463
1761 75228463 75977390 75167381 75383147 74574946 72802326 70968047 68409813 64671221 64533761
1752 64533761 62153408 60415419 59628891 55965065 53493491 52906188 52411545 51457772 49214208
1743 49214208 46154891 44764443 43353277 43206899 42177483 40492897 39387092 38526544
1735 38526544 39159270 38350167 39670330 39671948 38038499 37691954 37667412 36399667 33390221
1726 33390221 32828841 31554910 31423983 29710050 29078519 29091114 27805536 29155123 30285917
1717 30285917 28473721 28543807 27405594 26795023 27550551 25176181 24765750 24705639 23269348
1708 23269348 23366400 22965286 22675123 23370854 23648816 23642262 23899161 22771300 20891291 19638753
1698 19638753 19333139 19502801 18597780 19175053 20049776 19440984 20825253 21011188 20945138
1689 20945138 20102347 21069028 20492226 19781962 17980898 18268469 18231259 17778843 18180479
1680 18180479 18036181 17877934 16554740 17868048 17118447 16807482 17115701 15388924 16329575
1671 16329575 15749645 14946835 14828764 15089449 15098214 14799696 15624834 16310032 16379414 16441929
1661 16441929 16681451 15789279 15399465 13624786 13879848 14104626 13765081 13535196 12703437
1652 12703437 13000339 13014526 13841018 14597479 13633054 13181480 14083873 14992867 14108679 13352656
1642 13352656 11981811 12128129 12036715 11526287 11572601 11854754 12460553 12252050 12374465 12674881
1632 12674881 13439035 13730589 13969060 15110051 13706609 13245680 13435264 13346005 12219623
1623 12219623 13003922 12432012 12632483 12906369 12786454 14294762 13705176 14052726 15057387
1614 15057387 15737280 13878965 12863944 14881048 14301685 14469144 13821759 13692013 14336403
1605 14336403 15342980 15006134 15058047 15247319 14234844 14641997 13441108 12917240 13567188
1596 13567188 13248418 14747408 14314327 14633953 16356465 17018841 17092729 18387481 17688948
1587 17688948 16751505 18927667 17684207 16628720 17174612 17406161 18513723 20369035 18999306
1578 18999306 19611136 21264376 21437827 20892495 21094220 21464575 22680235 22672694 22582993 23358061
1568 23358061 22406374 21867255 24752951 26433667 27219636 27872361 27577076 27504034 28516293
1559 28516293 28761890 29495155 30946077 30455490 31918993 33735008 34799479 36046351 36611375
1550 36611375 38796121 40477883 40212830 41897537 43656509 43865275 46368849 48802881
1542 48802881 51086687 52529656 53904888 54710657 54278397 55732397 56544971 56086483 56176952
1533 56176952 56760333 58117849 57064975 58451476 59980520 60559519 61543869 61529298 62886675
1524 62886675 65006728 65394841 67625867 69686240 72546706 75795005 78031495 80708839
1516 80708839 82926230 86813659 88990241 91488988 93964173 94982916 94519921 95995503
1508 95995503 98519390 99308296 101288293 101984174 104340210 105047428 103225363 103452158 102274357
1499 102274357 102367763 101585976 101474031 99541456 98136787 98554203 98143924 99711214 99697574
1490 99697574 100573686 101135096 101166526 103923742 105281838 106097772 109013826 111840658 114316761
1481 114316761 118374026 121051197 125758139 129920586 133346823 137199442 140306796 139817601
1473 139817601 136726792 133601775 130645235 126652714 123435160 120973028 117577368 114905034
1465 114905034 113261876 110952067 108495262 105292392 103562292 102550831 101910031 101602755
1457 101602755 101297546 101553995 100964275 99375353 98202993 96917437 96681107 96154158 94096285
1448 94096285 93403882 93536340 94012760 95257570 95571282 96733186 98940939 99786819 102210254
1439 102210254 104042819 105192501 105725564 105273135 102338179 98754797 94883814 90359078
1431 90359078 86045594 80985528 76429858 72994193 69582750 65507801 63404437 63543650
1423 63543650 61636969 59759733 59375329 60454027 59388469 59275156 57833921 56223528
1415 56223528 55952458 53442199 50472507 48799383 47092430 44682105 44600416 44126538 44015255
1406 44015255 42825910 42994411 43891291 44482726 43444682 41695680 41946691 40004604 38677345
1397 38677345 39353525 37757149 35426187 34107619 32890994 32645547 32136301 28190651 26894325
1388 26894325 26299473 24711119 24327273 21972057 22415188 22234556 21587969 21313433 21318160
1379 21318160 20106130 19315400 19600648 20225278 19439465 18261611 19821150 19123266 17098937
1370 17098937 15498758 14683964 14810537 14841699 13933743 13415918 13900923 13536051 12759884
1361 12759884 12736145 13201664 12727681 13349748 13152745 12412022 11555772 10916431 10052117 10292050
1351 10292050 10688561 10814944 11078959 11322286 9772414 10969976 10844449 11137497 11565633
1342 11565633 10576247 10812947 9637046 9694657 9775941 8254436 8907142 9743009 9969609
1333 9969609 10974782 9347099 8073035 8658843 7445376 7225175 7810504 6471905 6776694
1324 6776694 6751247 6715813 7034380 7666406 7023763 7925256 8527050 8364782 7346800 8314101
1314 8314101 7226498 7698198 7257021 5996067 6219721 5593052 5152333 6735487 6181240
1305 6181240 5651927 6418377 5957286 6133804 7049107 7720709 6178896 5367727 4661841
1296 4661841 4702849 4942378 6377831 6162789 5542032 6564758 7685033 6525643 5608298
1287 5608298 6151318 5974499 6548752 4739711 5115758 5411587 5299790 6583628 5891809
1278 5891809 5954050 5990454 5391846 4560564 4493742 4278029 4699443 3929283 4666744 4037528
1268 4037528 3125114 5105936 5069411 5066146 5086028 5660932 6153814 6065466 6094321 6402771
1258 6402771 5882216 5376061 4724326 4760455 4073565 4056016 5397088 6889160 7073279 8208109
1248 8208109 7135729 8107224 8699378 8556613 8730349 6843693 4196903 2878613 4460005
1239 4460005 4830577 4261404 4536586 4603437 4221486 4545452 5772257 6468817 5115658
1230 5115658 4686598 5409034 5446279 3870377 4232361 4451287 5505130 5092514 4812976
1221 4812976 4545318 5562699 6036678 5911492 7020872 6690024 5401221 4494085 5014576
1212 5014576 4946759 3205983 4215928 5334367 4929887 4531696 5437484 5198040 5073022
1203 5073022 5699574 6743812 5998931 5035762 4673551 3607565 2673052 2308730 3535313
1194 3535313 2522113 1899866 2582640 3709884 4503816 3804038 4503092 4611199 4503258
1185 4503258 3793134 3676481 3849591 3881362 3745131 4992327 4680731 4020699 3935295 3348891
1175 3348891 4928527 5254097 3129600 2239330 3105519 3287013 4232944 3979666 3905410
1166 3905410 3595043 2833898 2473708 3154359 4398927 3971231 4994595 5514326 4730225
1157 4730225 4420561 2241983 1554247 3432366 4233563 4501308 3628788 3776672 3408869
1148 3408869 2722805 4184517 5018191 4696049 4810709 4933030 4511958 3903553 2258826
1139 2258826 2027596 2498338 2440793 2348764 3735391 4195758 3543228 3889788 4198258 3684507
1129 3684507 4641263 3755613 3851057 4622493 4980849 4741820 4385425 4494717 4778814 4682385
1119 4682385 4804344 4443115 3896110 4668996 5486318 5739896 4485997 3924218 5932364
1110 5932364 5943537 5309209 4462251 4326241 4522482 5376842 5567895 6434484 6147563 5781778
1100 5781778 6601162 5929357 5108633 4785370 5318816 4511366 4948395 4143234 4366500 4521625
1090 4521625 4589319 5429369 5164454 6978050 6552998 5973087 6157744 5971585 6116590 5468002
1080 5468002 5454816 4231617 4505911 5484800 6097733 6646956 6877814 8098782 8175043 8378996
1070 8378996 8351380 8554029 7820973 7787308 7993403 8232573 8117263 6567337 6923819 5920331
1060 5920331 7415704 8034710 7032370 8209587 9155018 9555852 9409222 9688509 9163614
1051 9163614 9995855 9355585 8119532 8829915 9022513 9031281 10171159 12032603 12542205
1042 12542205 12618607 10084512 10610584 11621328 10852173 9690793 11377585 12667448 12635154
1033 12635154 13158696 12408526 12697721 13790110 13281731 13266032 12455748 13093072 12625319
1024 12625319 12476823 12532184 12289654 12270664 12685462 13244649 13392552 13942693 14666338 17620162
1014 17620162 18848042 17661498 17833732 20352422 20540631 20113975 20228989 21229024 21938944
1005 21938944 21221581 21859349 24285968 25861070 27882546 29610083 30871580 32195028
997 32195028 33943380 35985212 36888264 37386235 38264065 39202966 41112150 44092421 44388625
988 44388625 46542308 51079375 53751393 56907504 61621701 65777956 71094830 76643848
980 76643848 82139560 89526413 95158755 101008006 110145035 117204457 127083144 142599907
972 142599907 158143622 177103234 202973594 235352141 281202843 329314939 374869445
965 374869445 424787129 471068592 500827829 481601549 425442527 349413909 277630320
958 277630320 224163324 186617173 160537523 139237926 123014025 110728864 100861866
951 100861866 94273665 88276779 82326242 78947129 76978628 74288143 70685604 66431992
943 66431992 61719404 58031585 53074554 50124034 48483045 44454738 41724419 40209513
935 40209513 37459361 36843322 34705285 33787247 34265483 34213702 31595558 31454609 29970294
926 29970294 27272771 26644072 25871060 24972537 23352821 22866729 22822525 21799806 20332791
917 20332791 20460131 21125176 20545812 20701879 20613168 20781161 19351723 17220156 15623859
908 15623859 16279663 16322560 15895143 16780795 16193278 16761684 16610703 16338381 17230951 16348192
898 16348192 14951841 14990673 14301881 13147823 13128622 12716254 12085447 11843208 12285069 11617787
888 11617787 12698039 13087716 11559914 12174682 10464222 9558365 11777660 10181224 9016409
879 9016409 10510168 8512530 8556813 10226405 9859654 9875864 8805642 8403885 8526165
870 8526165 8688952 7067116 6747784 7646488 7189453 6500299 6746199 7367123 9250481
861 9250481 8211058 7802699 7037396 5947788 5829257 5619970 5712610 6071884 6753671 7393871
851 7393871 6471658 3950829 5226934 6117658 6371956 5716676 5008436 5270563 5186262 6228480
841 6228480 5826746 6165542 6914670 4690201 5083909 6009326 6514615 6341935 4814765
832 4814765 4236397 4814497 4487062 5406776 4979093 3661074 3740455 3463713 4221783 4150086
822 4150086 4646314 5371372 4503785 4146431 4178160 5176129 4351866 3766233 4230750 3173403
812 3173403 2120048 4150830 4132079 4744460 6237836 6243932 6078451 4743007 4796103 5172196
802 5172196 4432099 1819712 2331938 3267749 2103797 3538800 3534474 3349480 4238688 3234832
792 3234832 3933587 4822479 2586181 2759183 3755539 3589912 2297397 1362085 1574436
783 1574436 2533915 1484702 2590868 3178782 3069515 2204038 3658974 4271736 3010499
774 3010499 2976037 2639227 3360550 2877829 2732331 3231092 2217261 2362986 3786276 4872983
764 4872983 4556638 3137217 3221255 4426852 4546807 2550314 3408524 4170175 2802072
755 2802072 2071391 2596204 2688170 2124442 1177086 2064783 1997099 1861166 2777572 2111222
745 2111222 1372978 2282124 3356381 2464827 1362397 352256 610987 2176628 1804267
736 1804267 -96246 436167 1598759 1369559 2876950 2265250 1835366 1109822 1160321
727 1160321 2042912 1532917 644369 1133275 1598559 448495 256240 1807334 1293880
718 1293880 1113138 2378322 2680238 3001453 2627456 1897831 1594531 716314 -74666 530886
708 530886 1418190 1929569 2545439 1927685 3189044 3963540 3688578 3583866 4317065 1853543
698 1853543 827925 1205339 259521 768575 1329516 1180238 2017682 2443830 643787
689 643787 1793598 2736315 3447690 3266334 640878 828879 1475120 1582082 1891807 1764474
679 1764474 2341975 4896731 3998766 4634157 5124169 3926090 4337473 4085692 1614631
670 1614631 1185218 868249 447574 2101081 1147830 -67090 1149973 625608 1147362
661 1147362 1806161 919304 2596053 3661933 1057295 863541 2053271 746098 1740188
652 1740188 524626 1307409 1664722 1889832 843191 1486825 1541733 1085935 97891 706566
642 706566 1281638 1911080 1543946 359272 1500523 1532870 2742318 2750498 355643 990104
632 990104 41631 1038700 2480497 638766 541771 578350 1456824 2651620 1635877 2006877
622 2006877 2039861 998419 1583050 -253312 138234 1152329 470431 232321 -213151
613 -213151 824619 519574 369872 700721 548702 1161286 1330854 1643047 1353163 965864
603 965864 -412164 -1081624 -1202613 -1308443 -1109497 -43806 804871 983490 1880501 1780118
593 1780118 2718039 2151937 1256686 637298 110694 -973041 -1562165 -1314363 -856803 -682251
583 -682251 36227 1172103 1824488 981308 2025402 1647761 954157 1247971 424071 -455082
573 -455082 -532713 -659783 -882641 94484 1201239 1385441 1823154 2156324 1222440 978145
563 978145 -459879 -587855 -72747 -1754041 -1152260 -2058681 -2730566 -170224 -669255
554 -669255 975215 2218724 1502745 1014592 593632 198847 400826 580418 -217478 -1839202
544 -1839202 -130806 366613 -100041 206123 -587020 1203566 654998 -951151 728009
535 728009 152213 -224123 683052 920431 -99969 -481747 -261036 1357885 651651 563064
525 563064 845915 -132257 -1849317 -1555194 -727929 -1301835 -197024 -1305777 -1802305
516 -1802305 216553 -128011 -50280 457334 323298 -88091 14120 182013 -456759 976911
506 976911 -200483 497743 127243 146407 827548 -641864 -1075589 319462 1735322
497 1735322 -645959 -493635 -1969438 -2534572 -2394420 -1928955 -695236 442087 -623365
488 -623365 -500837 1386063 1195864 637617 -320657 -1291262 65835 -758017 -1955731
479 -1955731 -1464745 -1597666 -1114404 642287 1348557 341199 440910 525681 694150 -1341257
469 -1341257 -1741636 -1759706 -1164498 -1096447 -987741 489596 577454 -584997 107907 232912
459 232912 1195975 534429 -169290 -1579596 -2454816 -2150393 -1871582 -433199 -978035 -819220
449 -819220 -267927 1122551 1178226 -543013 397195 -201308 -2232511 -2103589 -1527798 -2083215
439 -2083215 -2298355 -1703985 -1272640 -143232 109277 -913413 111293 1285150 554565
430 554565 276424 -46685 -826478 -275955 -1119307 -634403 -82199 -1864698 -626086 -691728
420 -691728 -1465692 -1363612 -502022 -292868 -1577771 -2174867 -1399353 -1092128 -1528722 -906476
410 -906476 -808641 -696722 -698536 46910 -736768 -1642154 -2059881 -561320 -171097 -1846912
400 -1846912 -2603277 -2642394 -2262735 -2237063 -1323957 -1232817 -1569042 -1715965 -2069226 -256877
390 -256877 -855607 -3053703 -1349160 -992050 -2044286 -2146223 -2482141 -2051923 -2328836
381 -2328836 -1858387 -953023 -331800 -1119220 -953170 -1168773 -1544318 -1593410 -1644188 -1256417
371 -1256417 -1853737 -1577679 -2249418 -1372239 -1493591 -366279 -1084445 -1649498 -2068311 -3292712
361 -3292712 -3558383 -2709272 -1791705 -124339 -1144200 -1595956 285908 -940247 -1215089
352 -1215089 -554509 -665407 -1124943 -1443747 -1485556 -480238 15156 -455046 -1135338 -689960
342 -689960 -1866639 -1323231 -2106837 -2742850 -1973102 -2954525 -2784159 -1929990 -2743203 -2285332
332 -2285332 -1320569 -264343 1024675 -754680 -1436858 1760556 1007726 -1292606 -1073701
323 -1073701 -166314 -1402770 -2272511 -2719149 -1150073 -1628879 -3263956 -2260077 -634774
314 -634774 -1458861 -1578102 -435057 -2176726 -1893201 -2025974 -1491379 -2085435 -3672263
305 -3672263 -3435390 -1488601 -1469313 -1239472 -813180 -477752 -1002317 -2652660 -3024403 -1424927
295 -1424927 -2332151 -3110784 -2532637 -2219040 -1879376 -2950798 -3135686 -1604785 -458263
286 -458263 -1062055 -1337350 -484536 -931865 -2799280 -2920058 -2198957 -2086466 -2436248 -2652799
276 -2652799 -756312 -912792 -1707324 -1063293 -980708 -2549908 -2477285 -1538998 -1686675 -2880709
266 -2880709 -2886258 -3128691 -2127952 -1812988 -2309265 -333689 -620761 -2467 1346007 -204096
256 -204096 -1558051 -2102317 -1734474 -2370027 -2620837 -2142453 -2898106 -1907752 -2622780 -2100704
246 -2100704 -663499 -1221104 -1545858 -1059444 -797967 -1698665 -2022325 -2005905 -2645338 -3560783
236 -3560783 -2703451 -2234863 -2524192 -3346183 -2929485 -974269 -1264280 -3070974 -1355529
227 -1355529 -2211731 -2222040 -2525661 -2729623 -2319004 -2513586 -3665900 -3504630 -1806814 -2595996
217 -2595996 -2661224 -2271058 -1754415 -2331826 -666932 -401043 -1365593 -2546072 -3072546 -2131113
207 -2131113 -1646344 -3173763 -3094936 -3040790 -2858099 -2417300 -1562372 -846886 -836433 -1232892
197 -1232892 -837437 -1876090 -2545442 -2842171 -2385942 -771503 -1745110 -1364488 -1064540
188 -1064540 -975312 -1122728 -276636 -125993 -1544909 -1756216 -1474765 -1055614 -1749430 -2468474
178 -2468474 -2556089 -560994 -1313285 -1962641 -2104333 -1497150 -162573 548627 393833 -637040
168 -637040 -2999388 -2134793 -1853511 -3172577 -2402913 -2139251 -2965586 -1948829 -1822569
159 -1822569 -1911390 -271399 -732852 -960630 -994306 -2344309 -3794835 -3737998 -4148500 -3008992
149 -3008992 -2074327 -1624053 -757964 -767585 -222533 -510361 -1219124 -1952492 -3856563 -3573950
139 -3573950 -3321804 -4200721 -3230083 -2641214 -3069442 -2294209 -2904935 -2122494 -711638 -654743
129 -654743 -1004324 -1702192 -2449953 -4010355 -3259888 -3027376 -3507398 -3806150 -3373211 -2151705
119 -2151705 -1439351 -2489465 -2273927 -2320731 -3667863 -3276844 -3081434 -3729159 -2674323
110 -2674323 -1813476 -1899038 -2195773 -2912527 -1949664 -1087993 -1757619 -1930058 -2256509 -2690094
100 -2690094 -2635245 -3022519 -2779322 -3053726 -4176541 -3092488 -1928109 -2437725 -2583800
91 -2583800 -2736915 -2190889 -2387268 -2779964 -3474172 -3028125 -2969364 -2594742 -1395844 -1723702
81 -1723702 -1942710 -1454350 -2041347 -1728486 -1310665 -1935294 -1836609 -2009691 -3579303 -2386030
71 -2386030 -2651293 -2504153 -2026185 -1528088 -1126865 -1435411 -2260087 -2122911 -1716035 -2404338
61 -2404338 -2907468 -2736788 -3509019 -3184333 -3168020 -3235288 -1551503 -745669 -681949 -903563
51 -903563 -1040998 -2497160 -2538216 -2788957 -2384283 -2609540 -3579404 -3430245 -3078530 -3176266
41 -3176266 -3085954 -2512568 -3184935 -2126658 -2266721 -2064413 -853880 -1020451 -2142536 -1768910
31 -1768910 -2153213 -2684854 -2251095 -2605418 -2901199 -2135790 -3081220 -2872599 -2200746 -2967446
21 -2967446 -2825659 -2989622 -3043131 -2495511 -2816973 -2610078 -1815081 -2114560 -940349 -1918117
11 -1918117 -2542236 -2696369 -2538761 -2113615 -2751712 -2743513 -2816340 -3335508 -3455597 -3661044
1 -3661044 -2336723
0 -2336723
$$ Imaginary data points
##PAGE= N=2
##DATA TABLE= (X++(I..I)), XYDATA
16383 -12329880 -12084299 -13036568 -13476111 -13325717 -12413165 -12286886 -12367502 -11482778 -11333929
16374 -11333929 -11345361 -11089559 -10740335 -10171273 -10697503 -10784330 -9669983 -10474165 -10706525
16365 -10706525 -10797850 -10419215 -10616364 -10940277 -10460926 -9955225 -8851108 -8932321 -8181453
16356 -8181453 -8604387 -9494902 -8057293 -7967425 -8750792 -7956743 -8021099 -7918213 -6682384
16347 -6682384 -8303603 -8063072 -7805252 -9029782 -8685816 -7297222 -7521820 -8044963 -7374855
16338 -7374855 -8032247 -7851852 -7459790 -6277512 -5354720 -6463210 -7575710 -5334065 -6032600
16329 -6032600 -7081524 -5554810 -5712587 -4566694 -4876000 -5306708 -4227173 -3732750 -4257458
16320 -4257458 -3894972 -3926303 -4805513 -5430076 -5353505 -5556769 -4765278 -4574433 -4330651 -2968857
16310 -2968857 -3732465 -3513489 -2192626 -3081312 -3903128 -3606497 -3604530 -2554216 -2733881
16301 -2733881 -3153970 -3021735 -2667362 -2502530 -1382412 -2623842 -2285248 -1901255 -1853254
16292 -1853254 -1536688 -1988909 -2404619 -2103997 -2695865 -2630357 -430147 -453050 -1737828
16283 -1737828 -1051908 -870143 -401070 -239758 -1450506 -1370042 -63082 -1085459 -752544
16274 -752544 404882 637568 635617 555995 2289603 1105105 -329523 -234916 585030 1467287
16264 1467287 1383927 235233 -393228 717367 523084 1518602 2357243 2306165 1641217
16255 1641217 1709135 2551079 2642149 935576 713128 2003373 1003912 602746 2694871
16246 2694871 2839997 2354063 2205665 2428749 3796478 3502148 2887655 1832370 2401516
16237 2401516 2369108 1907198 2451118 2954176 5324369 4701133 4818077 4658534 3777251
16228 3777251 4388756 3724695 3784486 4342752 3566465 2869160 2983620 3094778 4947890
16219 4947890 3830152 3559806 4065357 4496339 5436940 4420734 4205586 3734023 3087214
16210 3087214 3892896 3244132 3566820 3538473 5045238 6013723 4272200 5187628 6113666
16201 6113666 5168829 4604067 3770141 4334048 3966763 2150895 3826487 4499919 4547993
16192 4547993 5782693 5811696 6028496 4854477 4825932 5472708 4782746 3728833 3782998
16183 3782998 5505087 4486912 4276395 5113529 5597760 7970656 7422134 6100782 8688089
16174 8688089 7905817 6115767 7294715 4971852 4414015 4913921 6003452 6349772 6802789
16165 6802789 6584318 7009260 7982026 6206965 6452165 5897204 5797388 6684986 7982172
16156 7982172 6190902 5420946 5164714 4451109 6998982 6862262 7807538 7630555 6252597
16147 6252597 6121427 6891198 6664790 7221131 6899279 5389370 5725889 5298464 6600192
16138 6600192 8968738 7451054 6483356 6886423 7045310 6457784 5640653 6841415 7224840
16129 7224840 6370009 6802379 7932634 7618030 7503837 7375045 6143830 6106944 6766300
16120 6766300 6684175 7406772 7870940 6785010 5909233 5756931 5582901 6161070 6323032
16111 6323032 5926617 5672794 6488036 6344818 6474756 6761721 6533494 7091718 6325734
16102 6325734 5974886 7052365 7162034 6320123 5276123 3910897 5289011 5865024 6295581
16093 6295581 8021656 8989476 8367475 7305660 8124648 7356455 7218061 6627132 6773494
16084 6773494 6248608 7118464 7456070 7082392 8224945 8260917 9494202 9388762 8213163
16075 8213163 7731433 8863526 9100189 6998327 6767161 4992123 5281200 6737249 5791732
16066 5791732 6283002 7753382 8366374 7828048 7953089 8062445 9176257 9257402 8689599
16057 8689599 7612483 5767798 6104934 6498042 7055629 6788686 6461589 7228329 8204073
16048 8204073 8372655 8337552 8379408 7440090 7898229 8430351 7707144 7127942 7759773 7967690
16038 7967690 8583750 7774982 6888106 8280646 6630740 7210650 8300299 8144491 7507680
16029 7507680 7813855 8543461 7765934 5990712 6537594 6893270 5698524 7060279 7909711
16020 7909711 8341339 8832220 7503069 7694950 9006420 8040450 7509342 8056618 7030821
16011 7030821 5676323 5781536 6682726 6938516 6400575 6210818 8227883 8451410 6026699
16002 6026699 6806596 7480761 6786867 6764195 6819055 6777361 6597380 6516432 6885143 7165042
15992 7165042 7242496 7145381 7364428 8720257 8437318 6855434 7859012 7909445 6870802
15983 6870802 7119272 5505513 4782053 5779194 7179283 7416375 7926264 9075434 8748186
15974 8748186 8824715 6297423 7918668 9199473 7474074 6622613 7369976 7588048 6834368
15965 6834368 7508871 8687127 10376979 9341267 9653975 9999887 9027409 7772375 7037004
15956 7037004 8073915 7008373 5452350 5933972 7113682 6824749 7785464 8939808 9836286
15947 9836286 9263893 8558250 9410193 8417055 6773524 4893130 6171759 7922612 7389975
15938 7389975 8708304 7276141 6862417 8907524 8896482 9899360 9105118 6761012 7821549
15929 7821549 7365920 6865725 7269778 6054938 6893630 7171982 6148521 6962105 7311301
15920 7311301 7788338 8894062 7993982 5698644 6888862 5365122 4361751 5040741 5928808
15911 5928808 7239731 8499595 8102696 7386429 9166035 7520632 8654993 9172710 7313133
15902 7313133 7060098 7188022 7507038 7417927 6498357 5700866 7652303 7640610 7880052 9286457
15892 9286457 8409821 6983000 6353782 6460366 8249866 8792574 6724258 7388945 6663152
15883 6663152 6353810 8047179 9005531 8772207 9426179 8952335 8467509 9302454 7117297
15874 7117297 5502819 6595534 6644175 7470908 7545772 7798404 7161900 7652793 6645946
15865 6645946 6736267 8904233 7865775 8249585 8260428 7273677 7488323 8387876 7947806
15856 7947806 8607782 8232521 8558939 9413143 8073558 7965538 7163779 7504649 7670207
15847 7670207 7289051 7170225 8922327 8993255 8038953 9159064 8885952 7984975 6659668
15838 6659668 7853155 8013121 7970032 6993821 6008454 6840166 6248322 7518146 8002582
15829 8002582 6749663 7410449 7976634 9223948 8936593 7643626 8042287 8311526 8517203
15820 8517203 8345514 7525360 6555137 7958483 7754529 8346239 7580071 7629323 8417290
15811 8417290 8070023 7566330 7293436 7436592 6287923 6670872 6168617 7457228 8693666
15802 8693666 7289635 7377469 7550254 6670406 8006518 9668931 8634479 8217183 9358709
15793 9358709 9488046 9230796 7122660 5663248 5620034 5047126 5680980 7319754 8141966
15784 8141966 8890715 8979187 10154922 9701766 8039657 7599219 7567202 7322336 6508646
15775 6508646 6142980 6261540 7064451 7328362 8195700 9488669 9578121 9333311 8827721
15766 8827721 8912201 8612168 7006292 7403024 7121749 7799033 7895724 6804505 7684243
15757 7684243 8091724 6877501 8125706 8105617 6851111 7290060 7131525 8246784 8679332
15748 8679332 7373853 7422300 7751453 7513504 7539194 8158180 8422959 8766621 8220933 8085911
15738 8085911 8624203 9157598 8689080 8639531 8716192 7612470 6883534 6415461 7059306 8070824
15728 8070824 8867189 8678697 8967806 8931232 9368904 8364584 7440887 8361018 9131036
15719 9131036 9108641 9345410 6602793 6374225 7579876 6587317 6156300 6808943 7178365
15710 7178365 8094271 9975038 8970625 7748908 7876615 8145425 8478527 7964154 7822180
15701 7822180 8570320 7327227 5099821 6017951 7932308 8228311 7262718 6953154 7445410
15692 7445410 8914063 9130182 7658661 7651057 7873666 7300867 8871173 9136861 6249442
15683 6249442 7303018 9001137 9025197 7606469 7120178 8677416 8797743 9244649 8005547
15674 8005547 7187847 8318542 6776706 6955267 8400751 7727559 7390928 7623757 8529185
15665 8529185 8262537 8809933 9043952 8693582 7807399 7018867 7000425 8834287 8764808 7912519
15655 7912519 7662624 6895833 6977175 7240355 7167733 7440829 8291820 7673826 8065081 8350814
15645 8350814 7214196 6328981 7274815 7585474 8508437 6714489 6346951 7388158 7732184
15636 7732184 6669104 6536921 6328919 6167625 6408872 7541925 8117099 8747829 8891927
15627 8891927 7119598 7358826 7409752 8470675 7403621 7051041 6778024 7799290 7768226
15618 7768226 5901456 5520042 7556100 8578149 9119787 8554946 7941828 8189984 8329418
15609 8329418 7163318 6849252 9016621 7653858 7864236 8040159 6745168 7285972 7288900
15600 7288900 7318468 7660476 8425349 7890720 8168798 7881673 7912108 8821033 8644050 9203119
15590 9203119 9172529 8918736 7218816 7923170 8234708 7976742 8222437 8146855 8368642 8338032
15580 8338032 7922837 7543835 7502751 7509781 7605767 8618803 6899645 6189744 7111899 7491765
15570 7491765 7784135 9777239 10132208 9484132 7783290 6725421 7238797 8135724 8501744
15561 8501744 6282175 6199856 8292305 7623083 9056126 8963704 7774041 7866539 7305477
15552 7305477 8495534 7403509 7161532 7230739 7069675 8000631 7609102 8175531 8624028
15543 8624028 6888134 7346598 7831021 8406483 7846184 7338829 8122863 6968071 7995273
15534 7995273 7160845 6244846 7604668 7252767 7535955 8196556 8455769 8213184 9017547
15525 9017547 9761766 9110890 7969586 6203397 5407522 6599684 6101491 7613787 8487973
15516 8487973 6973421 7949825 8581281 7920470 8790029 9008977 8262132 8502571 8200746
15507 8200746 6633976 7774482 7171935 6665139 7624303 8432409 9295089 8881187 7889306
15498 7889306 7507370 9002765 9165648 9245735 7943269 6755912 7790461 8922490 9470869
15489 9470869 8192082 7680112 7211458 6666053 7374783 8217114 9624855 9804138 8616421
15480 8616421 9061016 9158761 8960246 7933114 6605647 6583123 5963676 5132865 6068583
15471 6068583 7416302 7039434 7895016 8339840 8315441 9625949 8502668 9272169 8372320
15462 8372320 6632635 6518728 5169568 6481467 7188075 6653644 7974977 7097704 7024817
15453 7024817 8621089 9304212 8724214 6946623 8516975 9871988 7731008 6182229
15445 6182229 6088794 6767487 6433075 5592142 7119322 9134419 9266876 9221530 8970172
15436 8970172 9762077 8227000 7850804 6924188 7164011 6677465 6751353 8339338 7509822
15427 7509822 8354304 8822651 8508858 8466346 7931940 7048664 8042137 6266235 6603767
15418 6603767 7226856 7333217 7712876 7301120 7118689 7532612 7459800 7195898 6784051 7896730
15408 7896730 7850901 5902879 5420055 7315850 8212568 7007812 6357671 7033956 8534390
15399 8534390 7722443 8354294 8275471 9267029 7602161 7095845 6829631 5898202 7053940
15390 7053940 5847023 7349551 8812587 10180860 8571185 7796571 7682553 7544776 8125136
15381 8125136 8118668 7883993 6473955 5996477 7959096 7977920 7974872 7875455 8309486 7414636
15371 7414636 6562328 7426284 8693658 7493141 6973083 8182059 8177957 7877021 7395198
15362 7395198 7310543 7795056 8672165 6968047 6955823 6844388 7043287 7670876 7592440 7690519
15352 7690519 7374700 8815448 8602535 9084703 7537363 7495343 9010255 8582608 8959230
15343 8959230 7836551 7667748 7888340 7966683 7663784 8403466 8213157 7910371 9212110
15334 9212110 8382000 9635028 10256053 9470766 9083047 7047200 6594902 7809603 7805470
15325 7805470 6509145 7775954 7853834 7688978 7474935 8108293 8972691 7669868 7106490
15316 7106490 7879647 7160712 5939807 6270935 7337753 7088857 6638195 7105967 7602738
15307 7602738 7725089 7851022 7673806 8967991 9358895 7660514 9168557 8907384 9540668
15298 9540668 8878067 8102831 9015656 8934227 8441601 9146112 8690301 6728073 6940290
15289 6940290 6089520 6580030 7391950 7310037 8490202 8783824 7407176 7859126 7665880
15280 7665880 7032132 7693861 8790607 8313447 7766617 8649166 9070408 8597957 8907603
15271 8907603 8082166 8549106 7731907 7800805 8104169 9175872 9675788 7991286 8522244
15262 8522244 7340104 8536269 9326907 8721460 7938683 6806453 7117756 6419696 6934519
15253 6934519 7605605 8724905 7688764 7565620 6887456 7269818 8294785 7078720 8600519
15244 8600519 8829805 7530268 8327025 7499733 7889763 8139393 7294709 7288016 8525825
15235 8525825 6518949 6407532 8095491 7936342 8406702 8533781 7980901 7331830 9149465
15226 9149465 7966114 9238540 9643085 8283650 9071179 9875868 9110266 9272736 8812877
15217 8812877 6790287 7108347 6150589 5720470 7314337 7552908 7878497 8995217 9064990
15208 9064990 8407804 8889226 8787049 8933613 9184636 8056359 6420025 6925119 7738252
15199 7738252 7218362 7466250 6831468 7411749 8488928 8198693 8072520 8679222 8390491
15190 8390491 7141679 8054828 7080732 7680065 6874282 6975925 8715324 9258608 8584683
15181 8584683 8718085 10167996 9901687 7869738 5767029 7234688 8085912 7515511 8000949
15172 8000949 8330573 8187458 8994222 8688480 7748890 8784526 9691374 8484430 7566770
15163 7566770 6849744 6519480 7453451 6451341 6454489 7596442 6213829 6764964 8182284
15154 8182284 7535169 9440194 9376153 8460201 8290562 7337648 7609209 8505091 8773505
15145 8773505 8184258 7907357 9007025 9476109 8593643 9611594 8935697 8541809 8577116
15136 8577116 8072975 8846066 8267222 6778142 6219909 7610102 6564090 5715959 7404830
15127 7404830 7556677 7681298 8839493 9690224 9018942 7858358 8407486 8665518 8600449
15118 8600449 6672881 6438900 6645158 6519427 6785268 7946437 9100766 9017010 8414302
15109 8414302 8044273 8619540 8492500 7445795 6733803 6152916 6594760 7382112 7581662
15100 7581662 9382991 8019950 8216752 9958333 8249497 8104279 9527908 8425582
15092 8425582 8307774 7620394 7700322 9673585 8734297 7651355 8469480 7497985 7874915
15083 7874915 9089244 8714123 7074850 6234973 6291696 6088752 7205866 7968667 8411512
15074 8411512 9538592 8900884 9227974 10478208 9618193 8404106 9489648 8699899 8403516
15065 8403516 6582342 6732327 8231756 7099508 5908615 7063291 8924417 8150126
15057 8150126 8803457 8909265 8757372 8047830 7751769 8612942 9805140 7980879 8458555
15048 8458555 8186169 7460108 8439326 7440872 6904411 6025561 6932877 7459612 8746058
15039 8746058 8022466 7454315 8873576 9709766 7795265 8319403 9228584 9185183 10099777
15030 10099777 7702616 5880059 6909351 6470555 7080916 7465364 8540059 9933283
15022 9933283 9603127 9013436 8846156 8973403 8198798 7324294 6567430 6670898 6705872 7483971
15012 7483971 7518514 7877012 8382108 9849956 10938350 10053134 9325524 9327672 9554421 7909320
15002 7909320 6208888 7332439 8996231 7894659 8210530 9239610 8370027 10227397
14994 10227397 9651757 9783417 10386317 9300720 7626071 7766080 7507239 8305939 9396659
14985 9396659 8019656 8707176 9769518 8379990 10831163 10968553 8347210 8033426 8166692
14976 8166692 9182281 8288494 6525480 7005628 7860194 8755188 8602246 10095498 11140218
14967 11140218 9961729 9009062 8224349 7447560 8187421 6992572 5832571 7561702 8165919
14958 8165919 9981332 11373985 10102780 9402806 8419281 7689253 9847697 8448491 7958314
14949 7958314 6505056 6098801 6582742 5879625 6932551 7326764 7549538 7999466 9678201
14940 9678201 9510159 9312360 8756456 7575612 7159614 6093278 6277838 6584464 8970102
14931 8970102 8737364 8494923 9080263 9080328 8047378 8089620 8467755 8537463 9420145 8627159
14921 8627159 8560771 7563463 7558601 6939111 7009479 8263140 8245933 8865096 8489526 8949715
14911 8949715 7874426 8288240 8443818 8520120 9055861 8216404 7834695 8352874 8248423
14902 8248423 7804962 8318171 7403783 7433422 6977190 7273311 6775194 7317715 8303419 9292196
14892 9292196 9178803 10073953 10115151 8978541 7808102 7050170 7723328 7096330 8179497
14883 8179497 8864420 8244817 9222847 9283557 9036118 9203074 8398135 9460310 9454747 7786763
14873 7786763 7671514 8790315 7266336 5848126 6741747 6646793 7744035 8449591 8703864
14864 8703864 8547493 10106599 9004879 7632859 7485232 6547601 7672091 8440750 8826411
14855 8826411 8591849 8840293 9549009 9416634 9405369 8757203 8153641 8806828 7844630 7599822
14845 7599822 7878745 8026779 7990244 7390415 7491277 7900397 8736543 9987367 9441295
14836 9441295 8407953 8554681 8079733 8085498 6579153 6455299 6749129 7231966 7762284
14827 7762284 7676056 7585769 7876759 8807185 9095846 9718033 8788977 8427829 8531620 7277423
14817 7277423 7689922 8818370 8635207 7658253 7111116 8880893 9210086 10267230 9762107
14808 9762107 8869294 8445157 8091705 8299326 9599457 8398275 8060359 8720839 8912092
14799 8912092 9930416 9179211 9040749 7748928 8162908 8613142 8288328 9277551 9838870
14790 9838870 8676255 8299706 9152224 8818149 9107960 7241275 7057997 7763990 6382391
14781 6382391 6147974 6811869 7589629 7761298 8705602 8873451 9539415 10072538 10185186
14772 10185186 9839102 8229478 8579187 7123514 6875729 7407375 8328340 7996355 7717847
14763 7717847 7645605 7798455 8387612 7611900 8004396 8605828 8979543 8269177 7409101 6890063
14753 6890063 6865803 6684595 8191782 9143108 9705442 10525342 10310050 11003401 11016026 9998709
14743 9998709 10306348 9008521 8832636 8324856 8392654 9009479 9425883 9423504 9967311 10816259
14733 10816259 9627671 8794175 8816590 9025080 7487265 8182835 8699782 8751121 7091180
14724 7091180 7492283 10046323 9663751 9564011 9748999 9693032 8595233 7878456 7730337
14715 7730337 8887756 8841072 7422989 8336497 8285055 7437260 7232739 8657945 8493240
14706 8493240 8085592 9488371 9210747 9746208 7515746 6332652 7380335 7042283 8006169
14697 8006169 8405577 8008867 8383555 9823662 10014814 10427222 10142666 8640569 8856498
14688 8856498 8308612 8300036 7796023 7708890 7309404 8720203 7132610 7060458 7970782 8031894
14678 8031894 10196809 10190389 9590836 10376716 9660553 8040655 7663011 7631351 7391750 8165884
14668 8165884 8277217 9192105 8533112 9392359 10131015 9674744 9745116 9065815 10121801
14659 10121801 9893534 8502430 7530106 7933388 8933616 8663008 8754888 8565554 9110350
14650 9110350 9080276 9570394 9836501 9875819 10860576 9074682 9592041 9082331 7972199
14641 7972199 6834006 6732524 7232224 7883900 8973856 9482722 10117687 9548082 9133574
14632 9133574 8673791 7723828 8171574 7680800 7698785 7654690 8339916 8461032 9963479 9878755
14622 9878755 8652070 8722552 9050015 9579164 9774896 9537440 8663645 8129666 7639556
14613 7639556 8245930 8687576 8945663 9250218 8675463 10918260 11141409 9119559 7835373
14604 7835373 8156020 7895522 7661382 7406906 7190500 8011949 7660837 8763669 9205377
14595 9205377 11490727 11418729 9262346 8817481 8167923 8180171 7275719 8188829 8314256
14586 8314256 8936221 8674177 8999635 10648855 10194920 8941182 9605541 10229961 9253166
14577 9253166 8852932 8250697 7215646 7170042 6649261 6399991 8005547 9057086 8619298
14568 8619298 9012245 9385693 9243613 9600119 8995682 9211589 8843794 8514622 7576074
14559 7576074 7183453 6270444 7116433 7929185 7592936 10232096 10397255 10954516 11017014
14550 11017014 8472094 8022556 7535727 6826353 7412237 7065827 8480421 9060419 8319223
14541 8319223 9036232 8822627 7815219 7523127 7904010 7824914 8156426 8723892 7865476
14532 7865476 8401888 9014584 9074195 7742200 6789571 8819341 8276284 8251298 8969593
14523 8969593 8497250 8020499 8741759 8740567 8318488 8200861 7215506 7444524 8230530 8801137
14513 8801137 9238677 8370251 8189434 7479266 8587239 9088724 8817337 7843129 9395965
14504 9395965 9361655 8759715 8510550 9556533 9957857 8476793 8216622 8465813 9035502
14495 9035502 9537928 9709020 9820996 9127493 8747527 7832838 8105621 7441833 6901643
14486 6901643 7672889 8756732 8576680 6688947 7623362 8527017 8217777 8689796 8163423
14477 8163423 7683410 8107233 8797836 9830201 8798099 8456642 8803566 7776433 6499917
14468 6499917 6854096 7873805 7573579 7654457 7726618 6880769 8452218 7731376 8610512
14459 8610512 9405521 9039391 8466541 8397665 8120098 7368396 6092764 7528700 8105891
14450 8105891 9768349 9838277 9542752 11355212 9501423 9158958 9408023 8871867 10105011
14441 10105011 8990653 7807582 8400185 6941054 6548844 6957302 8013424 8110809 8013119
14432 8013119 9590329 11215321 10563679 9410967 9597246 9202744 8814217 7722389 8330344
14423 8330344 8631580 8636707 9696625 9255654 9436033 8585782 9307146 11224415 10686617
14414 10686617 9798633 10204920 8749470 8144855 9176520 8509544 7663810 6483079 7581126
14405 7581126 8375781 8696140 8747396 8036148 9176060 7912597 8431433 7853660 6694446
14396 6694446 8432542 8549669 8280854 7884647 7558361 8375879 8081032 7886274 8234732
14387 8234732 7793143 7687015 8953883 8729664 8805070 8698169 8262205 9515479 8925989
14378 8925989 8952178 8759197 8863149 9116370 8558264 7149717 6634422 7993933 7929115
14369 7929115 7405317 10014153 10341221 8375303 8102485 8354400 7978538 8257291 7391002
14360 7391002 6723163 6856661 6636468 7299729 9015612 8113985 8399250 10106366 8785545
14351 8785545 8766554 9194509 8186069 7660066 7565020 6965436 9116806 9078171 7286761
14342 7286761 8870064 8430077 8664517 9876535 8910697 9588199 9058994 8235453 9410630
14333 9410630 9151414 7293304 7775959 8034821 8737867 9392404 9389242 9792488 8768240
14324 8768240 7760344 8670391 8182493 7485730 9101063 8292463 8288506 8780331 7840985
14315 7840985 8274413 9084905 8691671 8695757 9567355 9114033 9611651 8452420 6750183
14306 6750183 8687856 9227010 8935379 8615294 8306430 9803643 9394872 8526799 9038536
14297 9038536 8392894 9100914 8930081 9603604 9381191 8638446 7972685 7182254 8359850
14288 8359850 7795876 7288675 9055804 8941898 7980897 9263743 10070239 10133139 8278352
14279 8278352 8284500 8009208 7681191 7241398 8208616 9195507 9720780 10072820 10489574 9668629
14269 9668629 8038397 10580613 10200706 9036359 8667252 7481214 7565372 9804318 9927645
14260 9927645 8504811 10014490 8573677 8574829 10594005 9112381 8187478 8354293 7804539
14251 7804539 8833890 9041887 8439680 10468880 9524684 8755637 10384596 9867348 9046880
14242 9046880 8684078 8502786 7310395 7508635 8451106 7434104 7145557 7593300 7431506
14233 7431506 7425862 9039171 8768477 8300684 8782062 9089418 10044789 10837743 9372866
14224 9372866 7227105 7738161 7487774 9663670 10352236 9229555 9653740 8908662 7353085
14215 7353085 8933568 8758855 7837346 9609981 10053015 8730365 8961271 7882899 8017688
14206 8017688 8461539 8871262 9144721 9762452 9683775 8290218 9266241 9910964 9741294
14197 9741294 8888619 9043756 8907533 9981118 9844767 8742755 8150588 8686728 9000921
14188 9000921 9226661 8862995 9610589 10210230 8883970 7811648 8031901 8309358 9158446
14179 9158446 10043883 9992421 8853191 9225004 9573400 8789032 8503608 9108661 9441232
14170 9441232 9689222 9686890 8500818 8846112 9165367 8507997 8442810 9145692 8717279 8909842
14160 8909842 10600926 9288343 8911360 8875436 8341996 9892681 10033282 7734037 8355957
14151 8355957 7783336 7478073 8204446 8655896 8931389 9890494 9564006 9007256 9659450
14142 9659450 9526426 8985741 9208275 9276529 10132177 11057867 10404785 10333133 9764256 9357287
14132 9357287 9463596 8171833 8578501 9724454 9529436 9518033 9428755 8212541 7614831
14123 7614831 9060998 8235282 7944274 8605355 8726594 9127989 8786850 6633222 9127972
14114 9127972 8196283 7395848 7658691 9146362 9525058 8252536 7640042 8813951 10564731
14105 10564731 9508609 9664330 7926382 8398766 8785067 9593106 9543459 9342727 9147319
14096 9147319 9504988 9997188 10254752 9765535 8313558 8819458 8048239 7378853 8860679
14087 8860679 8251606 7065549 8110179 8937035 8780944 8229576 7370851 9253457 9806892
14078 9806892 9171925 10256002 10056737 10253293 8778662 9025116 8145921 7857299 8587895
14069 8587895 8183472 8316303 9448876 10295767 10701748 11575418 10919029 8794692 10069164
14060 10069164 10393951 9205839 8861884 8209850 8822954 9250079 8159724 8640208 9706405
14051 9706405 9454924 9373547 10179083 9258820 9459372 10795964 9792609 8732868 9103678
14042 9103678 8365135 7982230 8002732 8842669 10399926 10079499 8106412 9918639 9336069
14033 9336069 7432722 8709793 7227606 8498173 9448820 8248417 10439009 11279415
14025 11279415 9561941 9050646 9596233 10544424 9520093 9434746 8914773 8812002 8511543
14016 8511543 9938903 10191088 9641225 8980764 9560675 9453082 9449887 9802763 9331066 10175392
14006 10175392 8761197 7641558 8437980 7854076 6985916 8461060 9351299 10100675 9059830
13997 9059830 8877232 10102647 9694282 9164693 8760227 8039277 6945003 7433119 7838662
13988 7838662 7922301 9411439 9416046 9468271 9133768 7137425 8538720 9044690 8429751 8548707
13978 8548707 8290314 8313656 7456225 7915599 8778639 7441942 8185553 8344671 8244648
13969 8244648 9624375 9094286 9197781 10764641 9257671 8904930 9727323 10017834 9446569
13960 9446569 8638497 9091186 8533969 8772817 8590295 9169174 10241362 9435982 9982899
13951 9982899 10014546 9738903 10865098 10594806 9987439 9608111 8686371 9765084 9065134
13942 9065134 9065162 8936925 8460592 9267625 8770110 9008660 9810973 9169562 8182810 8690734
13932 8690734 8676255 8516062 8521454 8339340 8449846 9661032 9792207 9393054 8994153 9462577
13922 9462577 9252896 8712810 8594565 7450676 6932415 8300067 9313950 9759603 9595925
13913 9595925 8886817 9335357 10576026 9352253 9453593 9390371 8683816 7816463 9811395
13904 9811395 8278202 7428465 9137885 8922950 10163429 9083155 8377163 8399065 8464756
13895 8464756 8304769 8776498 10070244 7716995 7634208 9322888 8297717 8374175 8064584
13886 8064584 8804433 10045410 9258048 8740611 9733741 9665961 8639128 7431386 8760400
13877 8760400 8789360 8824489 9221624 9346642 9540799 9477864 10196391 10328026 9426348 9388516
13867 9388516 9939195 8822668 8070899 8752751 9158303 9327664 9539652 9919645 9250122
13858 9250122 9418464 8505327 8499024 9015534 8681053 8608362 7940764 6962745 7036530 8275479
13848 8275479 8845608 10742873 9814564 9669907 9691102 10038017 9740189 8514240 8537071
13839 8537071 8582473 8958102 9612384 9396226 9592108 9411764 10028060 10875021 10258841 9640333
13829 9640333 8986761 9019443 9046222 10003919 10264104 9159229 9294517 9371023 9357771 9112040
13819 9112040 9106539 8602410 9346205 9760025 9296584 10272516 9079067 9315994 9987796 9421530
13809 9421530 9156105 9527626 8378494 8905486 8900483 9090091 9738656 10410226 9886524 10102428
13799 10102428 9969376 9508548 9863599 8462073 8811032 9601199 8809962 7607396 8400076
13790 8400076 7275109 8288833 10395856 8566481 9085255 10488046 8797123 8617177
13782 8617177 8876079 8770256 8354201 8469569 8787348 7966029 8052347 7952729 8473977 8955393
13772 8955393 8307797 8690086 8645511 8441080 8267856 8083747 8283692 6881288 8388382
13763 8388382 10394369 10178883 10625390 9662228 9992978 10712150 8599872 8837590 9791986
13754 9791986 7796270 8539348 8348711 7788485 8237272 9396627 9405304 9615161 10522071
13745 10522071 11005512 11267664 11537467 10773451 9100321 9753815 8814491 7355306 9320344
13736 9320344 9402426 8859032 10309893 9500505 8729609 9038070 9516983 10549666 9607030
13727 9607030 8180542 9399037 9830115 9207118 8972459 11045207 10582597 10199578 10058931
13718 10058931 9951986 10860854 8730404 7568459 8972498 10606778 9708701 9061603 10608899
13709 10608899 9952397 8907792 8725691 9057408 10189768 8362307 7871415 11079888 10642191
13700 10642191 9248007 9102730 8972138 10529073 10749348 10706173 10135795 8220231 8911394
13691 8911394 9653193 7446847 7605670 8020112 8805767 9231580 7952859 9306326 9005938
13682 9005938 9541893 10600857 10581119 9246690 8583265 9796143 10257238 8133142 8486350
13673 8486350 9351453 9138549 8971115 8339021 9109808 9719237 9027843 10380049 10380899 10359564
13663 10359564 9560837 9813991 10075395 9665369 9218999 9020968 9187183 9036890 8982026
13654 8982026 9238353 9558771 8978402 8846534 9243192 9393380 9054728 10296185 11132031
13645 11132031 10794545 9410199 9619762 9126717 8739172 8869814 9166723 9475914 9116890
13636 9116890 8007816 8174726 8799329 9841438 9931748 9931193 9569229 9902371 8768989 7800732
13626 7800732 9771739 9373812 8752236 9862289 9648428 9761532 9682791 9695080 9724542 9503187
13616 9503187 9380435 10374183 9107841 9343684 8193083 7928422 9995304 10765293 10773845
13607 10773845 11636966 10072828 10086657 8745997 7936278 8848186 8052102 7932204 8898338
13598 8898338 8902250 8812255 9659741 9617661 9914795 10419019 10287267 8207496 9322971 9608933
13588 9608933 7880812 8163761 8431466 8986624 9470967 8960800 10037143 10624365 9682944
13579 9682944 10039078 9907426 8669915 9215889 8517973 8603165 10123333 10598997 7678740
13570 7678740 8693398 9806408 10137260 10561396 10827263 10220317 8125383 6942763 8322106
13561 8322106 9323474 9248582 9815849 10115356 10244605 8857367 8108830 7888085 6914923
13552 6914923 7648370 8074163 8770722 9740226 8589467 10069913 11421696 11044770 10617056
13543 10617056 9420270 7915064 8715441 8766939 8853284 9609733 7546220 7734176 7829033
13534 7829033 9460450 10192866 10386789 10511766 10698081 10884493 10232172 10376160 9213444
13525 9213444 8694236 9260187 9031420 8511261 10125341 10494546 10238617 11582250 11725244
13516 11725244 11321388 10946200 9172545 9425909 8396219 6476061 7249856 7675942 7806297
13507 7806297 8897187 10052381 10207776 10546869 9934301 10519291 10725040 8741928 7052786
13498 7052786 7051420 6539128 9067564 10010081 9861778 10956909 9635150 10678411 12190337
13489 12190337 10072998 9936216 10337828 10437725 10199986 9487092 9172016 10031039 10250500
13480 10250500 10390208 11698687 11111233 10361111 10474295 10131579 9978431 10612473 8317972
13471 8317972 9257878 9599146 9436946 9153926 11357944 11163939 9690246 9489834 10421570
13462 10421570 10674196 8222392 7799163 8006325 8752936 9164823 8625851 9793342 10401145
13453 10401145 10112946 9951868 9461602 9083846 9940844 8201804 8041215 9315555 9038959
13444 9038959 9796858 9623032 9156109 9938863 10559452 9950078 9479493 9535926 8992999 9148146
13434 9148146 10034107 8138852 9686321 11008968 9323030 9355391 9874162 10608538 10574949
13425 10574949 9817872 8874669 7407593 9249041 8965615 7971107 10009931 9913115 9589708
13416 9589708 9832668 9318089 9775485 10059437 10195078 9756218 9853729 9958128 8337945
13407 8337945 8687235 9879599 9003466 9291439 9304609 9393544 10034925 8124934 8721723
13398 8721723 9698538 6734364 7220610 8924913 9656577 9286630 8443552 9730173 10263854
13389 10263854 10328931 10049284 9902841 10228389 8387320 8579001 9271825 8319263 8523891
13380 8523891 9027218 10340564 9974274 9633831 9722650 10532703 10321024 9555695 8794607
13371 8794607 10057577 8421068 7815732 9885060 8627994 9902575 11001533 9138448
13363 9138448 10877471 10461744 9796752 10295670 8677554 9028639 8198317 8249604 8190526
13354 8190526 10242110 10185282 8910467 9757683 8822996 8878131 8631752 8781453 9865503
13345 9865503 9972017 8273202 9423594 8945844 9832109 10418432 10343000 9606983 8965255
13336 8965255 9716359 9114562 9382740 9016215 9511001 9862965 9568611 8775108 9869568
13327 9869568 9230712 10305473 9970917 9220377 10040646 9253147 8181631 9149845 9898067
13318 9898067 9679392 9479438 9820300 11437365 11772520 9841848 10344044 11630518 9933399
13309 9933399 9548364 9253093 8195761 8073133 8471478 9998042 10614706 8706006 8847894
13300 8847894 10911244 9595179 10578706 10568998 9503351 9264871 9226611 9123122 10245988
13291 10245988 10202012 9469579 11057055 10277002 9530608 11110604 11100719 9645426 10208692
13282 10208692 9773692 9165420 10357867 9871091 9765758 10975455 10611658 10202966 10279662
13273 10279662 8704457 8918968 10686726 9607567 10784183 9669368 8685209 10427776
13265 10427776 9239530 8585646 9420074 7876365 7404135 7576420 8420937 11087800 9756138
13256 9756138 8651664 9879454 11064368 10049543 10400322 9656985 8557018 9116538 9354749
13247 9354749 9001364 8527849 9227412 9043164 8589141 8810006 9288694 9718747 9580979
13238 9580979 9906637 10898712 10843862 10077645 9540961 9122263 8962210 10403578 9996561
13229 9996561 9533968 10239148 10044923 9949189 10823173 10264220 9381652 9711309 9681292 8941675
13219 8941675 8268886 8332095 9249416 9021934 9135127 8787389 10558879 11105816 11560830
13210 11560830 11148074 10705783 10330508 9807909 8871739 9286759 9235417 8055466 9513910
13201 9513910 11044144 11099345 11253497 10592871 9122111 9698517 10219661 9278924 8641818
13192 8641818 7239022 8826342 9194864 9730634 9760293 9055508 10860403 10309643 10092852
13183 10092852 9831986 9151956 7800600 9227831 9258596 8539905 9625955 9390494 10861067
13174 10861067 11854914 9589445 9749424 10945199 11449117 11645464 9446865 9861565 10561919
13165 10561919 9888556 9784410 9802309 11297648 11167188 10935840 10778734 10531181 11871060
13156 11871060 10413408 10243835 10518290 9466815 8711122 8804167 9509845 8651203 9734460
13147 9734460 9292793 8649084 9118647 9907406 9699951 10173531 8539092 8372049 10040386
13138 10040386 9879042 10689595 10700817 11466441 10662204 10162199 10942011 10157333 9556947
13129 9556947 9557581 9242604 8408203 8613559 8534355 10162644 9436357 9342306 9645357 8895533
13119 8895533 8951650 9510586 9765975 8427634 8582886 8187571 8073095 9267836 8588715
13110 8588715 9748066 10766072 11396718 9769433 10647533 10007621 8842138 9359917 10155967
13101 10155967 8051784 8123011 8624537 8136016 9126550 8523181 10015883 10979566 10220005
13092 10220005 9814646 9637866 10038768 8657782 7872797 8126165 9337232 9372747 9860106
13083 9860106 10715270 10761019 11752796 11452062 11971793 11324813 10402315 8475030 8763770
13074 8763770 7986958 7908313 9061985 9090772 9968239 11557112 10036046 10802744 10456316
13065 10456316 10697626 9400636 9370046 8785805 8606996 7914094 8441082 8666323 9752426
13056 9752426 11203012 10414990 11739218 11055421 9104874 10237374 10543062 9132965 10607687
13047 10607687 10157157 9511644 10979325 8826872 8771982 11550108 10815725 11898480 13349994
13038 13349994 12053845 11343423 10766164 10350322 11044618 9553202 9030475 9865664 10443641
13029 10443641 9833983 9779409 9957200 9603599 10773215 10903671 11191445 10698947 9897506
13020 9897506 9601229 10358686 10674764 10909402 10818356 10863014 11712583 10255445 10304363 10419486
13010 10419486 8496795 8951599 9392512 9500496 10642611 10092662 9395436 10525044 11649924
13001 11649924 9945956 10679552 9891910 9767687 11438109 9754326 10744185 10605944 9685017
12992 9685017 11932068 11964491 9774901 9388118 9719484 9671993 9932028 10655149 11487279
12983 11487279 9678915 8392889 10855329 11322363 11114790 11802828 9781914 9563883 9275917
12974 9275917 9071791 9848568 9890504 8839903 9881232 11919030 10731770 10711449 11283371
12965 11283371 10065025 10382383 9827928 9570532 10365004 9255099 7517768 8226719 8614998
12956 8614998 8940151 9896333 10218870 10623331 10536293 11621422 10390442 9387855 9866663
12947 9866663 9748636 9470749 9143658 9597759 9819899 11119788 10816227 9753369 10388192
12938 10388192 10279633 10262848 11469073 9667610 9684395 9401938 8487274 10237049 9919971
12929 9919971 10641812 11255770 11067592 10721430 10497582 12884571 12733638 10158524 9120705
12920 9120705 9570211 9386769 8899563 10284039 8845862 8325841 9622067 10912635 12046011
12911 12046011 9741775 10427912 11782495 10489973 9167395 8882387 8705515 9115284 9083062
12902 9083062 8954590 10151264 10521188 11496239 11503785 10089908 9452281 10326985 9845028
12893 9845028 8817248 9827080 10307704 9573169 10335052 10830482 10235251 9747398 8894978
12884 8894978 10318084 9563097 10273024 10087530 8897173 10544928 9666627 9620901 10484303
12875 10484303 10485659 10482479 10715850 9614051 9112111 10516031 9494729 8867560 9468877
12866 9468877 8643258 9854938 10100013 10223550 10908715 11437288 9898012 10533544 9868499
12857 9868499 9837132 10481851 10100789 10760734 10102526 10220222 10757688 10107726 10564814 10256433
12847 10256433 10523541 11711793 11678727 10366330 9197015 10349485 11192204 10460097 10984903
12838 10984903 9908668 9557772 11425164 10161029 10767641 10763739 10996418 10640160 8921603
12829 8921603 8240987 10261167 10548457 10590423 11042278 10403500 11862606 11523935 10165046
12820 10165046 10818069 10920602 9292219 10846201 10716243 9446894 11065748 11190859 10494906
12811 10494906 10827205 10781494 10865792 10921776 11539027 11566218 11531442 10690101 10203885 10453797
12801 10453797 11838707 12467247 10957609 10376966 10108621 10051192 10397669 10611334 9535664
12792 9535664 8979901 9458550 10542181 11814943 12117058 10492181 10335530 11516279 11193688
12783 11193688 10389252 10407402 10320983 9676846 8864825 9479038 10757535 11304046 10485047
12774 10485047 10485814 11562147 10832932 10422368 11310571 10929557 10403972 9963939 10634780 12462909
12764 12462909 10959834 9919093 11323142 10220077 10655986 10342108 10700586 11825898
12756 11825898 11247504 11922943 10851499 9948425 9986916 9017444 8956135 9791750 9786549 11129137
12746 11129137 10923989 9452410 11094224 11754404 10916502 10457299 10134053 9837394 9107471
12737 9107471 8917016 9226639 10125453 10149910 10986074 11260177 9260560 10260843 11508492
12728 11508492 11398160 11013721 10108503 10021077 10480550 10676390 10684054 11466010 11877051 11177177
12718 11177177 10814829 12300293 12114583 10453450 11095904 10441177 9459500 10159033 10329226
12709 10329226 9700047 9758594 9533519 10668029 10207924 9859834 10282466 11213135 10825775
12700 10825775 9304229 10024647 10187429 11043368 11826716 10991042 11566041 12168852 9578950
12691 9578950 9323847 9927753 9348018 11546719 10868278 9029152 9716515 9243069 10037073
12682 10037073 10326166 10095656 11350070 11201259 9069386 10052714 9923700 8282052 10000479
12673 10000479 10515514 9198666 8091503 7588358 8840267 9958788 8400979 8855982
12665 8855982 11028524 8628745 9607329 10531823 10925373 10997127 11171092 11610264 12118023
12656 12118023 10075219 9033730 10725048 9709637 8407133 8976095 10620519 10989018
12648 10989018 10568589 10128757 12363044 12869101 10353755 10287737 10114069 10371835 11123895
12639 11123895 9745601 9752556 10350995 9102036 9532954 9772433 9034581 9956539 10305218
$$ [...]
##END NTUPLES=NMR SPECTRUM
##END=
