##TITLE=1H_EC-3252(II-23)
 CDCl3,8 sc, 
 31.03.2021
##JCAMPDX= 6.0         $$ Bruker NMR JCAMP-DX V2.0
##DATA TYPE= NMR SPECTRUM
##DATA CLASS= NTUPLES
##ORIGIN= UXNMR, Bruker Analytische Messtechnik GmbH
##OWNER= root
$$ XWIN-NMR		Version 3.5
$$ Wed Mar 31 12:12:00 2021 Russian Standard Time (UT+4h)  she@DPX200
##.OBSERVE FREQUENCY= 200.131506
##.OBSERVE NUCLEUS= ^1H
##.ACQUISITION MODE= SIMULTANEOUS
##.ACQUISITION SCHEME= undefined
##.AVERAGES= 8
##.DIGITISER RES= 18
##SPECTROMETER/DATA SYSTEM= spect
##.PULSE SEQUENCE= zg30
##.SOLVENT NAME= CD3CN
##.SHIFT REFERENCE= (INTERNAL, CD3CN, 0, 15.9751)
##AUDIT TRAIL= $$ (NUMBER, WHEN, WHO, WHERE, WHAT)
$$ ##TITLE= Audit trail, XWIN-NMR		Version 3.5
$$ ##JCAMPDX= 5.01
$$ ##ORIGIN= Bruker BioSpin GmbH
$$ ##OWNER= she
$$ F:/spectra/data/she/nmr/H-F/1/pdata/1/auditp.txt
$$ ##AUDIT TRAIL=  $$ (NUMBER, WHEN, WHO, WHERE, WHAT)
(   1,<2021-03-31 12:10:54.04 +0400>,<she>,<DPX200>,
      <created by zg, POWCHK disabled, PULCHK disabled
       configuration hash MD5:
       00 E9 B6 7A A2 85 ED C7 34 08 36 98 17 FE 4E 26
       data hash MD5: 16K
       62 E6 23 F3 3E 2D 8E BB 0A 56 2B A1 EA EC 12 6D>)
(   2,<2021-03-31 12:10:56.04 +0400>,<she>,<DPX200>,
      <Start of raw data processing
       efp BC_mod = 2 LB = 0.24 FT_mod = 6 PKNL = 1 PHC0 = -11128.52 PHC1 = 25.20093 SI = 16K 
       data hash MD5: 16K
       79 7F 6B C9 F0 0A FC B7 6C 18 F7 39 CE C0 4D 28>)
(   3,<2021-03-31 12:11:11.01 +0400>,<she>,<DPX200>,
      <pk PHC0 = -0.1350672 PHC1 = 0.4000002 
       data hash MD5: 16K
       71 28 BE 23 D8 57 58 25 BB 2C 4A 71 57 D8 D5 02>)
(   4,<2021-03-31 12:11:14.50 +0400>,<she>,<DPX200>,
      <abs ABSG = 5 
       data hash MD5: 16K
       E5 98 46 50 40 AE 37 2D 41 94 A6 FB 53 4E 16 22>)
$$ ##END=
$$ 
$$ hash MD5
$$ 2E AD 74 0F 9F 4B 91 C8 BF 46 1F 95 CA CA 1D 2F
##$RELAX= 
##$RELAX= 
##$RELAX= 
##$RELAX= 
##$RELAX= 
##$RELAX= 
$$ Bruker specific parameters
$$ --------------------------
##$DU= <F:/spectra>
##$EXPNO= 1
##$NAME= <H-F>
##$PROCNO= 1
##$TYPE= <nmr>
##$USER= <she>
##$AMP= (0..31)
100 100 100 100 100 100 100 100 100 100 100 100 100 100 100 100 100 100 
100 100 100 100 100 100 100 100 100 100 100 100 100 100 
##$AQSEQ= 0
##$AQ_mod= 1
##$AUNM= <au_zg>
##$AUTOPOS= <>
##$BF1= 200.13
##$BF2= 200.13
##$BF3= 200.13
##$BF4= 200.13
##$BF5= 200.13
##$BF6= 200.13
##$BF7= 200.13
##$BF8= 200.13
##$BYTORDA= 1
##$CFDGTYP= 0
##$CFRGTYP= 5
##$CHEMSTR= <none>
##$CNST= (0..31)
1 1 145 1 1 1 1 1 1 1 1 1 1 1 1 1 1 1 1 1 1 1 1 1 1 1 1 1 1 1 1 1 
##$CPDPRG= <>
##$CPDPRG1= <>
##$CPDPRG2= <>
##$CPDPRG3= <>
##$CPDPRG4= <mlev>
##$CPDPRG5= <mlev>
##$CPDPRG6= <mlev>
##$CPDPRG7= <mlev>
##$CPDPRG8= <mlev>
##$CPDPRGB= <>
##$CPDPRGT= <>
##$D= (0..31)
0 1.2 0 0 0 0 0 0 0 0.06 0 0.03 0 0 0 0 0.0002 0 0 0 0 0 0 0 0 0 0 0 0 
0 0 0 
##$DATE= 1617178253
##$DBL= (0..7)
120 120 120 120 120 120 120 120 
##$DBP= (0..7)
150 150 150 150 150 150 150 150 
##$DBP07= 0
##$DBPNAM0= <>
##$DBPNAM1= <>
##$DBPNAM2= <>
##$DBPNAM3= <>
$$ [...]
##$SUBNAM3= <"">
##$SUBNAM4= <"">
##$SUBNAM5= <"">
##$SUBNAM6= <"">
##$SUBNAM7= <"">
##$SUBNAM8= <"">
##$SUBNAM9= <"">
##$SW= 16.9725357007746
##$SWIBOX= (0..15)
0 0 2 0 0 0 0 0 0 0 0 0 0 0 0 0 
##$SW_h= 3396.73913043478
##$TD= 16384
##$TD0= 1
##$TE= 0
##$TE2= 300
##$TE3= 300
##$TEG= 300
##$TL= (0..7)
0 120 120 120 120 120 120 120 
##$TP= (0..7)
150 150 150 150 150 150 150 150 
##$TP07= 0
##$TPNAME0= <>
##$TPNAME1= <>
##$TPNAME2= <>
##$TPNAME3= <>
##$TPNAME4= <>
##$TPNAME5= <>
##$TPNAME6= <>
##$TPNAME7= <>
##$TPOAL= (0..7)
0.5 0.5 0.5 0.5 0.5 0.5 0.5 0.5 
##$TPOFFS= (0..7)
0 0 0 0 0 0 0 0 
##$TUNHIN= 0
##$TUNHOUT= 0
##$TUNXOUT= 0
##$USERA1= <user>
##$USERA2= <user>
##$USERA3= <user>
##$USERA4= <user>
##$USERA5= <user>
##$V9= 5
##$VALIST= <valist>
##$VCLIST= <CCCCCCCCCCCCCCC>
##$VD= 0
##$VDLIST= <DDDDDDDDDDDDDDD>
##$VPLIST= <PPPPPPPPPPPPPPP>
##$VTLIST= <TTTTTTTTTTTTTTT>
##$WBST= 1024
##$WBSW= 4
##$XGAIN= (0..3)
0 0 0 0 
##$XL= 0
##$YL= 0
##$YMAX_a= 92556
##$YMIN_a= -124863
##$ZGOPTNS= <>
##$ZL1= 120
##$ZL2= 120
##$ZL3= 120
##$ZL4= 120
##$ABSF1= 15.97507
##$ABSF2= -0.997592
##$ABSG= 5
##$ABSL= 3
##$ALPHA= 0
##$AQORDER= 0
##$ASSFAC= 0
##$ASSFACI= 0
##$ASSFACX= 0
##$ASSWID= 0
##$AUNMP= <proc_1d>
##$AZFE= 0.1
##$AZFW= 0.1
##$BCFW= 0
##$BC_mod= 2
##$BYTORDP= 0
##$COROFFS= 0
##$CY= -3
##$DATMOD= 1
##$DC= 0
##$DFILT= <>
##$DTYPP= 0
##$F1P= 0
##$F2P= 0
##$FCOR= 1
##$FTSIZE= 16384
##$FT_mod= 6
##$GAMMA= 0
##$GB= 0
##$INTBC= 1
##$INTSCL= 2.992141e-10
##$ISEN= 128
##$LB= 0.24
##$LEV0= 0
##$LPBIN= 0
##$MAXI= 10000
##$MC2= 0
##$MEAN= 0
##$ME_mod= 0
##$MI= 1.114404
##$NCOEF= 0
##$NC_proc= -9
##$NLEV= 6
##$NOISF1= 3.799351
##$NOISF2= 2.8
##$NSP= 0
##$NTH_PI= 0
##$NZP= 0
##$OFFSET= 15.97507
##$PC= 1
##$PHC0= -11128.65
##$PHC1= 25.60093
##$PH_mod= 1
##$PKNL= yes
##$PPARMOD= 0
##$PSCAL= 0
##$PSIGN= 0
##$REVERSE= no
##$SF= 200.130007279356
##$SI= 16384
##$SIGF1= 3
##$SIGF2= 2
##$SINO= 5.538805
##$SIOLD= 16384
##$SREGLST= <1H.CDCl3>
##$SSB= 0
##$STSI= 16384
##$STSR= 0
##$SW_p= 3396.73913043479
##$SYMM= 0
##$S_DEV= 0
##$TDeff= 16384
##$TDoff= 0
##$TI= <>
##$TILT= no
##$TM1= 0
##$TM2= 0
##$TOPLEV= 0
##$USERP1= <user>
##$USERP2= <user>
##$USERP3= <user>
##$USERP4= <user>
##$USERP5= <user>
##$WDW= 1
##$XDIM= 16384
##$YMAX_p= 501400353
##$YMIN_p= -3301178
$$ End of Bruker specific parameters
$$ ---------------------------------
##NTUPLES= NMR SPECTRUM
##VAR_NAME=  FREQUENCY,     SPECTRUM/REAL,   SPECTRUM/IMAG
##SYMBOL=    X,             R,               I
##VAR_TYPE=  INDEPENDENT,   DEPENDENT,       DEPENDENT
##VAR_FORM=  AFFN,          ASDF,            ASDF
##VAR_DIM=   16384,         16384,           16384
##UNITS=     HZ,            ARBITRARY UNITS, ARBITRARY UNITS
##FACTOR=    0.207333158178282, 1,           1
##FIRST=     3197.09087532715, 0,            0
##LAST=      -199.648255107643, 0,           0
##MIN=       -199.648255107643, -3301178,    0
##MAX=       3197.09087532715, 501400353,    0
$$ Real data points
##PAGE= N=1
##DATA TABLE= (X++(R..R)), XYDATA
$$ [...]
3558A8461955o31203k48190m28897R31535j70909L9231l16678l9694m7622L29604
3548A7879132l84531K066872o76457j090626o5830L19512K16750j195521J048943
3539A8118244J16407j082872l72977K9652O64111J877796q94617j126972l12135
3530A7016637P00323Q16557M09703n0220k49266J28441l92506R7683J164680N33353
3520B0175385q51468K2315J296500o11088M91191L49846J448394J124395l36572
3511B3108898m2495P8821o353j83963P93570J27859M6765J261608k64756M87287
3501B5407241j005713O21981J99222N43904J240204J999541J968626J621653J960190
3492C4556849J802771J555113n72527k475604l411712j987107k480861j116779
$$ y = [18461955, 17830752, 17582562, 17153665, 18085200, 17914291, 17953522, 17636844, 17597150, 17549528, 17879132, 17494601, 19561473, 18885016, 17794390, 17728560, 18048072, 18264822, 17069301, 18118244, 18234651, 17151779, 16778802, 16808454, 17472565, 19350361, 18455744, 17328772, 17016637, 17716960, 18533517, 18943220, 18893000, 18643734, 18772175, 18379669, 18477352, 19642032, 20175385, 19323917, 19346232, 20642732, 20031644, 20522835, 20872681, 22321075, 23445470, 23108898, 23066403, 23145224, 23138871, 22954908, 23748478, 23876337, 23923102, 25184710, 24919954, 25407241, 24401528, 25023509, 25222731, 25766635, 27006839, 29006380, 30975006, 32596659, 34556849, 36359620, 37914733, 37342206, 34866602, 31454890, 29467783, 26986922, 25870143]
3484B5870143j087237J330932J430637j127999o65796j332831j26867L96752m30914
3475B4256820j13616n13243J414511N23833m74826p8537j670166J207806J065382
3466B5617964j99657k03573J922253J732693j68674n47278m41921n64546L00355
3457B7447616N06640P45621j4496p42574J027800O15564P64170P03712P51759
3448C1805812N0209j7519n64911J176033J245103l62098j860529l01035l86980
3439C0784085O59691j326329P53406j9657j22172N82481J306687j472183j113377
3430C0032632O64685L90543q77751M1081R09309j272497J36535j007748n057q5456
3420B8926276J365058n69584j18831k55374k31926K57263L355Q09968p98429J113563
$$ y = [25870143, 24782906, 26113838, 27544475, 26416476, 25750680, 24417849, 24290982, 24687734, 24256820, 24143204, 23629961, 25044472, 25568305, 25093479, 25014942, 23344776, 24552582, 25617964, 25418307, 25214734, 27136987, 28869680, 28701006, 28153728, 27711807, 27147261, 27447616, 27954256, 28699877, 28685381, 27942807, 28970607, 29586171, 30350341, 31054053, 31805812, 31856021, 31838502, 31273591, 32449624, 33694727, 33332629, 31472100, 31171065, 30784085, 31443776, 30117447, 30870853, 30851196, 30729024, 31311505, 32618192, 31146009, 30032632, 30697317, 31087860, 30210109, 30251190, 31160499, 29888002, 30024537, 29016789, 29011732, 28926276, 30291334, 29721750, 29602919, 29347545, 29115619, 29372882, 29376237, 30186205, 29387776, 30501339]
3410C0501339L51774j49087J465653n28603j388591j043651N08496n0469k07509
3401B9459352l54123L20939J039936o21540j32440k4386K23749J72924J35976
3392C0220387l05624k05838k53643N31719J647228J22169k38888j845641p3175
3383B9598694J342511K16969O5333J120019q5669l05915N42735j071535k4027
3374C1399115n36691J247531J218980k0046M06826j808917J004450J151432n29900
3365C3532780j02883R92990J87406M22551N43026j93460O60238j06164k07232
3356C5729252J732470Q2613q3751J711862N59954J34178K10516J699915N08653
3347D2285662M96945J877728K11685L87466P11027K027237J910677M77856j123836
$$ y = [30501339, 30853113, 30704026, 32169679, 31641076, 30252485, 29208834, 29717330, 29666861, 29459352, 29105229, 29426168, 30466104, 29844564, 29712124, 29687738, 29911487, 30084411, 30220387, 29914763, 29708925, 29455282, 29987001, 31634229, 31756398, 31517510, 29671869, 29598694, 30941205, 31158174, 31223507, 32343526, 32257857, 31951942, 32494677, 31423142, 31399115, 30862424, 32109955, 33328935, 33308889, 33715715, 31906798, 32911248, 34062680, 33532780, 33429897, 34422887, 34610293, 35032844, 35575870, 35382410, 36042648, 35936484, 35729252, 37461722, 37544335, 37460584, 39172446, 39732400, 39866578, 40077094, 41777009, 42285662, 42782607, 44660335, 44872020, 45259486, 45970513, 47997750, 49908427, 50386283, 49262447]
3338D9262447J218182M63825j52853R57936Q41003n14263j46411L71707k51630
3329E2049943J897915J266781O95894P73459J217173J377920J484540N26437L50107
3320F1640169J417261L61490J609512J839983K257631K058644R65309K227596
3312G4377595J053546J619319P38240R65840J19117J66582K38594j893290k183539
3303G5202004k14154L24477q43805k354558j250820j762927k105197j298023j048547
3294F4648450k374632j238427o77359k062531j308471j309781j229131q98762
3286E3549356n17845L67466o63533j127248q40272j70531r43545J13402k95702
3277D9471548j555255n93749R01164J35207r51880r44498O73786o38038j498982
$$ y = [49262447, 50480629, 50944454, 50791601, 51749537, 52590540, 52076277, 51929866, 52301573, 52049943, 53947858, 55214639, 55910533, 56683992, 57901165, 59279085, 60763625, 61290062, 61640169, 63057430, 63418920, 65028432, 66868415, 69126046, 71184690, 72149999, 74377595, 75431141, 77050460, 77788700, 78754540, 78873657, 79040239, 79278833, 77385543, 75202004, 74987850, 75312327, 74468522, 72113964, 70863144, 69100217, 66995020, 65696997, 64648450, 62273818, 61035391, 60358032, 58295501, 56987030, 55677249, 54448118, 53549356, 53031511, 53398977, 52735444, 51608196, 50767924, 50597393, 49653848, 49767250, 49471548, 47916293, 47322544, 48223708, 48358915, 47407035, 46462537, 47136323, 46498285, 44999303]
3268D4999303P04034l05966p14956o34761n20396Q31327K87532l39005L38195
3259D4645307p41650Q87061j62435j403813q02715J362070J416524R70695j083259
3250D5087785p02543m49388N22679K71508m23923P09450k78283j71249q34527
3241D3731509J183614P91766Q8653N75133p31997J003501N9258Q9227N69639K07004
3231D7567307n1135M15086J259918j29113N07010M14264J162168J601618n11577
3222E2235546N50861J437673J433015K410890J270006M34432N24909j77479K79337
3213F0399190R7120j425239k069901m56784k36052P79648j231385j363396k456963
3204E2036238n20789L09617j098311j639013q03109L32165k84737o79968j93423
$$ y = [44999303, 45703337, 45397371, 44682415, 44047654, 43527258, 44358585, 44646117, 44307112, 44645307, 43903657, 44790718, 44628283, 43224470, 42421755, 43783825, 45200349, 46171044, 45087785, 44385242, 43935854, 44458533, 44730041, 44306118, 45015568, 44737285, 44566036, 43731509, 44915123, 45706889, 45795542, 46370675, 45638678, 46642179, 46701437, 46790664, 47360303, 47567307, 47516172, 47931258, 49191176, 49062063, 49569073, 49983337, 51145505, 52747123, 52235546, 52786407, 54224080, 55657095, 58067985, 59337991, 59772423, 60297332, 60119853, 60399190, 60496310, 59071071, 57001170, 56544386, 56308334, 57087982, 55856597, 54493201, 52036238, 51515449, 51825066, 50726755, 49087742, 48284633, 48616798, 48332061, 47652093, 47458670]
3195D7458670J35121N51166j306230j081173K72032l7437K42476p71372M69169
3186D5932422q40208l95927L65990Q48836L27924n39463L95981p8538o11029K78365
3176D5684353J4638L71952R62115J094799r08202l77856j36763O60891l16387
3167D7049540Q64909Q8795Q49508K70534l71389o09864J397757J289577o9564
3158E0759803k79478M46837Q57711J079372M94568J131491J284794R08559L73519
3149E7057176n70280Q96248L20694J447940J605510P84718Q25943J594060L75993
3140F4338002P50741O70502J406323Q47966K109503J250937P98750K684776L842515
3131G8700015K925699K879920K118969K537243L124227K397952L87148k111759
$$ y = [47458670, 47593791, 48144957, 46838727, 45757554, 46029586, 45992149, 46234625, 45463253, 45932422, 45092214, 44696287, 45062277, 45911113, 46239037, 45699574, 46095555, 46017017, 45405988, 45684353, 45698991, 46070943, 47033058, 48127857, 47219655, 46841799, 46705036, 47365927, 47049540, 47914449, 48003244, 48852752, 49123286, 48751897, 48142033, 49539790, 50829367, 50759803, 50480325, 50927162, 51784873, 52864245, 53358813, 54490304, 55775098, 56683657, 57057176, 56486896, 57383144, 57703838, 59151778, 60757288, 61542006, 62367949, 63962009, 64338002, 65088743, 65759245, 67165568, 68013534, 70123037, 71373974, 72172724, 74857500, 78700015, 81625714, 84505634, 86624603, 89161846, 92286073, 94684025, 95071173, 92959414]
3123I2959414q72482j184918k474027j622254k500131j170502o9299N73831o23171
3114H3016461j983338r17256j429356k274936j318135k176417j286878j338943
3106G0291202j248220j781143l17476j522596k92280k88346k513077P68057r37152
3097F2158969j296875j000476N40882m08076k97828j101255m52545j12835J464602
3088E9494563j63441j328561k650874j66139J122974l49549l48047P18354l81533
3079E5947747L21099l58987q76729O76150J72499j5263l16140k05124K40043p1756
3069E5513539j52152K77767J306853L39611J184914N77209r58979m39989L96262
3060E8045035J256131l96919n47855j831827J62945R11918k00689j29268J060109
$$ y = [92959414, 92086932, 90902014, 88427987, 86805733, 84305602, 83135100, 83065801, 83639632, 83016461, 81033123, 80115867, 78686511, 76411575, 75093440, 72917023, 71630145, 70291202, 69042982, 67261839, 66944363, 65421767, 65129487, 64841141, 62328064, 63096121, 62158969, 60862094, 59861618, 60402500, 59994424, 59696596, 58595341, 58142796, 58029961, 59494563, 59331122, 58002561, 55351687, 55185548, 56308522, 55958973, 55610926, 56329280, 55947747, 56268846, 55909859, 55033130, 55709280, 55881779, 55866516, 55550376, 55345252, 55585295, 55513539, 55361387, 55639154, 56946007, 57285618, 58470532, 59047741, 58088762, 57648773, 58045035, 59301166, 58904247, 58356392, 56524565, 56687510, 57599428, 57398739, 57269471, 58329580]
3051E8329580l01227N60013J243523J88365N12194M65692k00654R4318J32169
3042F1023973J954468m66684n59025N7099O34989N53481q5633J237526R22294
3033F5272488r7398L29888P73764J069819K520715p4416k46119n68502P3014J563331
3023G0616584N04415J101061O62942P12946J680866l02904n95497m07986J030040
3014G5002467J835075J00961J278550J049126J293403J09884O02630Q55951J046900
3005H3174947Q24938P30799O27414K293983O30315R88433J088704P12203n38811
2996I0532925J218163N68533Q90636J203893j036561P3933J2350K180804J849164
2987I7493840P43612q6242J653989k06408l74444q05515P95960J041574p8169
$$ y = [58329580, 58028353, 58588366, 59831889, 60020254, 60532448, 60998140, 60797486, 60891804, 61023973, 62978441, 62511757, 61952732, 62009831, 62644820, 63198301, 63112668, 64350194, 65272488, 65175090, 65504978, 66278742, 67348561, 69869276, 69794860, 69548741, 68980239, 69053253, 70616584, 71120999, 72222060, 72885002, 73597948, 75278814, 74975910, 74380413, 73972427, 75002467, 76837542, 76938503, 78217053, 79266179, 80559582, 80669466, 81272096, 82128047, 83174947, 83999885, 84730684, 85358098, 87652081, 88282396, 89270829, 90359533, 91071736, 90532925, 91751088, 92319621, 93210257, 94414150, 93377589, 93451522, 93463872, 95644676, 97493840, 98237452, 98151210, 99805199, 99598791, 99224347, 98418832, 99214792, 100256366, 100178197]
2978A00178197N19646j92754n35114O45091J22082q48980j125129o05463K5950
2969I8183526L62453j42148n88824K70314l94721J482450l16752l72151O97563
2960I9181710k67241p92570M73799J604020J83017K23908p42428j59294p96159
2951I8908762L05287O83330J001446M87079J080393q7486N64157K013120r90206
2942A03965882l6152J590507J155810R18909J055753K154135J577845J243740
2934A13626429J818557K542974R78412J599914K571925J046993R23118K49866
2926A25358188J228213N20739p26006n65773j790142n50843k74151R3450O26031
2917A23919706j700621n39207J12941j247723j595628j377611o08597l72075o67025
$$ y = [100178197, 100697843, 100505089, 99969975, 100615066, 100737148, 99888168, 98763039, 98157576, 98183526, 98545979, 98403831, 97815007, 98085321, 97690600, 99173050, 98856298, 98484147, 99181710, 98914469, 98121899, 98595698, 100199718, 100382735, 100606643, 99864215, 99704921, 98908762, 99214049, 99897379, 100898825, 101385904, 102466297, 102378811, 102942968, 104956088, 103965882, 103929730, 105520237, 106676047, 107594956, 108650709, 110804844, 112382689, 113626429, 115444986, 117987960, 118966372, 120566286, 123138211, 124185204, 125108322, 125358188, 126586401, 127107140, 126381134, 125815361, 124025219, 123474376, 123200225, 123293675, 123919706, 122219085, 121679878, 121792819, 120545096, 118949468, 117571857, 116963260, 116591185, 115924160]
2908A15924160k231214j456843j381851j422045o95040j045766j277771j065103
2900A05348527j042040p97852j012131j266613j212040j7039n06561j37794j093355
2891I8263102l5304M59681j24894n48666p56223O67622K86945q46257j196465
2882I6169541L27067k51477R91670L21941M75614q6260J25646M95586R74606M19366
2872I9963300L82750r54321j75162n64819K85273Q947p79667o51067m98913p05138
2862I6311183O313l85304j252054p98986j268932n33507r62633r52422R5367n67514
2852H9691511k658169p82801o0397k264466j054442K77063j356028J970K75716
2843H2069957k433844j799842q33956J864k02694k160089j222009r87804j181458
$$ y = [115924160, 113692946, 112236103, 110854252, 109432207, 108737167, 107691401, 106413630, 105348527, 104306487, 103508635, 102496504, 101229891, 100017851, 100000812, 99494251, 99356457, 98263102, 98227798, 98687479, 98562585, 98013919, 97257696, 97925318, 98212263, 97366006, 96169541, 96496608, 96245131, 97236801, 97558742, 98034356, 97948096, 98073742, 98569328, 99543934, 99963300, 100346050, 99391729, 99216567, 98651748, 98937021, 98945968, 98166301, 97515234, 97016321, 96311183, 96317496, 95932192, 94680138, 93881152, 92612220, 92078713, 91116080, 90163658, 90259025, 89691511, 87033342, 86250541, 86190144, 83925678, 82871236, 83148299, 81792271, 81794241, 82069957, 79636113, 77836271, 77002315, 77004179, 76801485, 74641396, 73419387, 72431583, 71250125]
2834G1250125j223110J5882m93340k76968o89526r6986m41707q73112J70738j8660
2824F7323336o19469k74541n66984Q7059n72111j333173q04783J400824P94050
2815F5434208p86282J90699l96405o93652o22815P5980L15432o7026R85184Q09335
2805F5244658o01925R0689n47305J29804P51877m56699j065673o05577l88198
2796F2551651q56307j78954K13152j73261p4648L85357R19839q47859L59431j66824
2786F2131577k46303N83766l45149l01000n52844J63739N38906j181614j076604
2777E9714474J87690m34548Q00827o36957o96747p37285N69850J402557j583651
2768E8586210N97454R89806J288148l3369J821542O63605J32424J925589O70042
$$ y = [71250125, 70027015, 70042897, 69549557, 69272589, 68583063, 68486077, 68044370, 67171258, 67341996, 67323336, 66703867, 66429326, 65862342, 65949401, 65377290, 64044117, 63239334, 64640158, 65434208, 64647926, 64838625, 64442220, 63748568, 63125753, 63201733, 63517165, 63450139, 64435323, 65244658, 64642733, 64733422, 64186117, 64315921, 65067798, 64611099, 63545426, 62939849, 62551651, 61695344, 61516390, 61729542, 61556281, 61481633, 61866990, 62786829, 61938970, 62298401, 62131577, 61885274, 62469040, 62123891, 61822891, 61270047, 61433786, 61972692, 60791078, 59714474, 59902164, 59467616, 60268443, 59631486, 58934739, 58197454, 58767304, 60169861, 58586210, 59183664, 60173470, 61461618, 61428249, 63249791, 63913396, 64045820, 65971409, 66641451]
2759F6641451J548220j123480N16178J25148K68744M24438Q86256J444080J27016
2750G0858051J902828L75257r20126M09176Q82420N15317J174980o80862o31405
2741G3885636k39128O3316m23462N93484k28041l27968J08508l07559j159863
2732G1964923p79764m22883j276071q83825r06278o7436j638421j347047m54383
2723F4188815m53831r72260j483544j712120l98359k83583j016951J88739n92831
2714E7464075j971434j318755m59795o73918l1485j619372j273859M50214m33635
2705E0132036l33959n68133k55502m84198o6104k6729k098539p0707M99618q56155
2695D5871628j325619r1086j12143j668719O4159j00020p70833M76582K79279
$$ y = [66641451, 68189671, 67066191, 67582369, 67707517, 67976261, 68400699, 69286955, 70731035, 70858051, 72760879, 73136136, 72216010, 72625186, 73507606, 74022923, 75197903, 74517041, 73885636, 73646508, 73709824, 73286362, 73879846, 73651805, 73323837, 73432345, 73124786, 71964923, 71185159, 70762276, 69486205, 68602380, 67696102, 67628666, 65990245, 64643198, 64188815, 63734984, 62762724, 61279180, 59567060, 59168701, 58885118, 57868167, 58056906, 57464075, 55492641, 54173886, 53714091, 53040173, 53008688, 51389316, 50115457, 50565671, 50132036, 49798077, 49229944, 48974442, 48490244, 48424140, 48397411, 46298872, 46228165, 46727783, 45871628, 44546009, 44454923, 44342780, 42674061, 42738220, 42638200, 41867367, 42343949, 42623228]
2686D2623228n42530j07134L29945R20396P20551M70366Q86603K80833j130510
2677D4451748j74473Q97885R34036N69020R35766j9820M57086j03697Q95029L56045
2667D9198625K5871Q92223O87789K41262n67404j640335R94492Q13787J263229
2658E1909539p61587j215175O61138R89391L66121n83401O79122Q07418j1786
2649E2840780P45470p9404J346161O2657o28659N84528J7044J632615J609650
2640E8130842J337919L54527L94205P69851J211253l92482J212823J386473J060411
2631F5465822J231634o11740J742127K655314J596522J393779J241458J372029
2623G6086945L8918P94341J885690J105009R94857J462989J879577K107235J554550
$$ y = [42623228, 42080698, 41973564, 42303509, 43223905, 43944456, 44414822, 45301425, 45582258, 44451748, 44277275, 45175160, 46109196, 46678216, 47613982, 47594162, 48051248, 47947551, 48842580, 49198625, 49224496, 50116719, 50804508, 51045770, 50478366, 48838031, 49832523, 50646310, 51909539, 51147952, 49932777, 50593915, 51583306, 51949427, 51366026, 52045148, 52852566, 52840780, 53586250, 53506846, 54853007, 54915664, 54287005, 54871533, 54888577, 56521192, 58130842, 59468761, 59823288, 60217493, 60987344, 62198597, 61806115, 63018938, 64405411, 65465822, 66697456, 66085716, 67827843, 70483157, 72079679, 73473458, 74714916, 76086945, 76125863, 76920204, 78805894, 79910903, 80905760, 82368749, 84248326, 86355561, 87910111]
2614H7910111J943583R26047N00819R68518J947278J080160K152544J732921J040300
2605A00202281J926247J205686K041317K155411K724425K151703J378387J290827
2597A15076284J888436K393787J792410K854218K294061J239740K570292K155953
2589A32265181L059581K654226P70955L272938L508882K647651L030929L073959
2581A54284302K061909K818725K077132M015553K300301J969415K627253K039061
2573A74193651K039670K451629K698393K939305K458757J174726R11398J396674
2565A90264203J265499k4643K11828k52182r0897K30846m66935j542305l87187
2556A89208227j301660j314685p65929k021204j894211l238100k470443k315374
$$ y = [87910111, 89853694, 90779741, 91280560, 92249078, 94196356, 95276516, 97429060, 99161981, 100202281, 102128528, 103334214, 105375531, 107530942, 110255367, 112407070, 113785457, 115076284, 116964720, 119358507, 121150917, 124005135, 126299196, 127538936, 130109228, 132265181, 135324762, 137978988, 138749943, 142022881, 145531763, 148179414, 151210343, 154284302, 156346211, 159164936, 161242068, 165257621, 167557922, 169527337, 172154590, 174193651, 176233321, 178684950, 181383343, 184322648, 186781405, 187956131, 188867529, 190264203, 191529702, 191505059, 191716887, 191464705, 191373808, 191604654, 191137719, 189595414, 189208227, 187906567, 186591882, 185825953, 183804749, 181910538, 178672438, 176201995, 173886621]
2548A73886621k064107k525539j913414l375636k724943k179588k305816l443336
2540A53354242k784642k291427k199076k288205k265050j770852l063035l154793
2532A33537162k731558r13080k287254j836017k666903l190796j693527j656697
2524A16561330k490521q57840k725169k165067r94892k572838k426257k644576
2516I9684170k380297j966958j928843j083069j502705n79376j569309j592733
2508H7080880j908418l045259j388100r34245k012713j345044r8220j117116k560627
2499G2671138j059310j84401o74900j991045j004449j218016j431285j680034
2491F3427698j004036P7112n95660m55608j613825k269070o90558j20638l69661
$$ y = [173886621, 171822514, 169296975, 167383561, 164007925, 161282982, 159103394, 156797578, 153354242, 150569600, 148278173, 146079097, 143790892, 141525842, 139754990, 136691955, 133537162, 130805604, 129892524, 127605270, 125769253, 123102350, 119911554, 118218027, 116561330, 114070809, 113212969, 110487800, 108322733, 107327841, 104755003, 102328746, 99684170, 97303873, 95336915, 93408072, 92325003, 90822298, 90242922, 88673613, 87080880, 85172462, 82127203, 80739103, 79804858, 77792145, 76447101, 76348881, 75231765, 72671138, 71611828, 71427427, 70752527, 68761482, 67757033, 66539017, 65107732, 63427698, 62423662, 62500774, 61905114, 61449506, 59835681, 57566611, 56876053, 56755415, 56385754]
2482E6385754j518525q63082j13431r26123q73468o64661j120820j770441m8802
2473D8486401l46711n07386m44295k82389k75305j880546l29080q46555j382308
2464D2191826J056189r606n52608k13699r6435N37031j991170j148020k43491
2455C9530017j076220m80662j75337Q99481P7526l18953j006979j73443q09472
2446C6465958j640670j03012k92670j02964M42561O94568n39409r16878M21694
2437C4429178J63283j077017j058390p90437M84180Q0102j086494j8104m20879
2428C0705422J100022m30435j206419N88488m58745L1074K91805m57122l48113
2419B9815977r41399q33188Q42340k60863r37066n85579P39817P59586p20935
$$ y = [56385754, 54867229, 54004147, 53890716, 52964593, 52091125, 51426464, 50305644, 48535203, 48486401, 48139690, 47632304, 47188009, 46905620, 46630315, 44749769, 44420689, 43574134, 42191826, 43248015, 43238409, 42685801, 42472102, 42375667, 42912698, 40921528, 39773508, 39530017, 38453797, 37973135, 37797798, 38697279, 38774805, 38455852, 37448873, 37275430, 36465958, 34825288, 34722276, 34429606, 34326642, 34769203, 35463771, 34924362, 34007484, 34429178, 34592461, 33515444, 32457054, 31666617, 32150797, 32230899, 31144405, 31126301, 30705422, 31805444, 31375009, 30168590, 30757078, 30298333, 30329407, 30621212, 30164090, 29815977, 28874578, 28041390, 28883730, 28622867, 27685801, 27100222, 27840039, 28599625, 27878690]
2410B7878690J1170p88505j135712k51532P6835J40801J03259O2778K4458N22056
2400B6644298q21247L79910K75730J047374p28609j150114L06563L7634j294338
2391B4697201J07765N79635l89720N87887l58361p71012q85274J514796K81643
2382B5364560L70599n21574n66992m34466P90103N1395j012680m90391j176646
2373B2373908L13862P20698J135998M8771m62144M72914J22999j014440M11871
2364B4124437O14908J007100p23078j68389N41676K74014k69743m29762M99939
2355B5471102J109441j43565l24330K17749K23583O52693m95742Q41891J93238
2346B7746060J124807n43992O44654J356888J069344n60869N8979P67033K2083
$$ y = [27878690, 27889860, 27101355, 25965643, 25714111, 25790946, 25931747, 26035006, 26097784, 26122242, 26644298, 25823051, 26202961, 26478691, 27526065, 26797456, 25647342, 25953905, 25991539, 24697201, 24804966, 25384601, 24994881, 25582768, 25224407, 24453395, 23568121, 25082917, 25364560, 25735159, 25213585, 24646593, 24212127, 25002230, 25053625, 24040945, 23550554, 22373908, 22687770, 23408468, 24544466, 24593237, 24131093, 24604007, 24727006, 23712566, 24124437, 24739345, 25746445, 25023367, 24854978, 25396654, 25670668, 25400925, 24971163, 25471102, 26580543, 26436978, 26112648, 26330397, 26553980, 27206673, 26710931, 27552822, 27746060, 28870867, 28326875, 28971529, 30328417, 31397761, 30836892, 30895871, 31662904, 31684987]
2337C1684987k53499Q88374L74818K193598R58106J850066O79438O07957K85447
2328C9269292k2459R02021l66187K35156q43699j140532J91868k98901k065580
2319C5860979k109459j333588J406576k47117j533881j267129r86385o3545q52740
2310B8873711q07894M4323l92763p12633O17651L14225m17328o41003R00237l43714
2300B7434812j073319j21558J579244p88131j385319J474038L95523M67655o88560
2291B7294385N26181j46669L09724k34136J35620Q29696k83262m22868J33414
2282B8142085K63288K65608q55002K02870J042608M95517P93224m82537O19946
2273C0487607J383893j04504N90948N61192m57330j181947o07565Q53874O72128
$$ y = [31684987, 31431488, 32319862, 32694680, 34888278, 35846384, 37696450, 38375888, 38983845, 39269292, 39246833, 40148854, 39782667, 40017823, 39174124, 38033592, 38225460, 37926559, 35860979, 33751520, 32417932, 33824508, 33577391, 32043510, 30776381, 29789996, 29726451, 28873711, 28065817, 28110140, 27717377, 27004744, 27622395, 27936620, 27519292, 26878289, 27778526, 27434812, 26361493, 26239935, 27819179, 27031048, 25645729, 27119767, 27515290, 27982945, 27294385, 27820566, 27673897, 27983621, 27749485, 27885105, 28714801, 28431539, 28008671, 28142085, 28405373, 28670981, 27815979, 28018849, 29061457, 29556974, 30350198, 29867661, 30487607, 31871500, 31766996, 32357944, 32919136, 32461806, 31279859, 30672294, 31526168, 32198296]
2264C2198296J89270J746432K61320Q06985J67844m45946O13937k94825j043119
2255C4200194R95361M8886k7056J327574J016973Q43145R80620J5884R62988M34214
2245D0798783R08677J60646R00964l88498l38966J447041K087358l69625j63667
2236D5042713J040783J013055J617793O49016N40182j16234J443847J843998P7857
2227E3153010m27121M56387K257808O61622m81062J925251J185618O57596J769936
2218F1159045J005944M86507J054332J615516K718356K046526J514342J273693
2210G2874261J522506P18503K857864J855337J239046K710348K287090K454313
2202H8519268L712790L924678K967979L545086L327937L429214L081277L419437
$$ y = [32198296, 32387566, 34133998, 34395318, 35202303, 35370147, 34924201, 35538138, 35243313, 34200194, 35195555, 35244441, 35217385, 36544959, 37561932, 38405077, 39385697, 39401581, 40364569, 40798783, 41707460, 41868106, 42769070, 42380572, 42041606, 43488647, 45576005, 45206380, 45042713, 46083496, 47096551, 48714344, 49363360, 49903542, 49787308, 51231155, 53075153, 53153010, 52725889, 53182276, 55440084, 56101706, 55620644, 57545895, 58731513, 59389109, 61159045, 62164989, 62651496, 63705828, 65321344, 68039700, 70086226, 71600568, 72874261, 74396767, 75115270, 77973134, 79828471, 81067517, 83777865, 86064955, 88519268, 92232058, 96156736, 99124715, 102669801, 105997738, 109426952, 112508229, 115927666]
2194A15927666K968506J996076L569941L851182M680935N094670O708407P898140
2186A52695523P765429P632930Q732391Q536558Q077393R119694Q880595Q770071
2178B20210584P588766M030302K653411j56526k480012o117255o689105p883929
2170B11156236r223458p372989o429737o439507n220244k950575l652473m089582
2162A65777671m885210p577573o990273p700094n884506l763184m708413k305256
2154A21963162k295824k421067k323071k222998j500121k482226j348070k395941
2146A04973844k466898L88860p12073j835758p10712k313113o15206j37259k358336
2137I4213349j603699l65831q02195j751990k30710L29311r83064j494372j4623
$$ y = [115927666, 118896172, 120892248, 124462189, 128313371, 132994306, 138088976, 144797383, 152695523, 160460952, 168093882, 176826273, 185362831, 193440224, 202559918, 211440513, 220210584, 227799350, 231829652, 234483063, 234326537, 231846525, 225729270, 219040165, 211156236, 201932778, 194559789, 188130052, 181690545, 176470301, 173519726, 169867253, 165777671, 160892461, 153314888, 146324615, 138624521, 132740015, 128976831, 124268418, 121963162, 119667338, 117246271, 114923200, 112700202, 111200081, 108717855, 107369785, 104973844, 102506946, 102895806, 102183733, 100347975, 99637263, 97324150, 96708944, 96571685, 94213349, 92609650, 92243819, 91441624, 89689634, 89458924, 89788235, 88805171, 87310799, 87296176]
2128H7296176j273704l356511l376900k941582j873662j008795m85610j839574
2120G1139838m276535k190053k25910j557701r83485r26326m79415r54196j398431
2111E8147786O17176o46363k039564j017562m94511j275813j292055o58850l48957
2102E0991287q03985q71264R49120J92442j656166p96210j176283j276529k76727
2093D5275685p18128K48475Q37049k18210j051161l96237r76398j820563l585
2084D1176927J36357N78722j008126l9269m55408j255370J035012j84785J48337
2075D0132397j042889j329691L52917n75619N27632l00586r63922m42878r17871
2066C5439490P76455p83360q69196q12934M1967J066408Q19075o71945j266599
$$ y = [87296176, 86022472, 82665961, 79289061, 76347479, 74473817, 73465022, 72979412, 71139838, 66863303, 64673250, 64447340, 62889639, 61906154, 60979828, 60500413, 59546217, 58147786, 58764962, 58118599, 56079035, 55061473, 54566962, 53291149, 51999094, 51340244, 50991287, 50187302, 49316038, 50265158, 50457600, 48801434, 48005224, 46828941, 45552412, 45275685, 44557557, 44806032, 45643081, 45424871, 44373710, 43977473, 43001075, 41180512, 41176927, 41313284, 41892006, 40883880, 40844611, 40389203, 39133833, 40168845, 39984060, 40132397, 39089508, 37759817, 38112734, 37537115, 38064747, 37764161, 36800239, 36357361, 35439490, 36215945, 35432585, 34563389, 33750455, 33792422, 34858830, 35677905, 35005960, 33739361]
2057C3739361j569796j469228J2646K75601R51379n32181p62820K84503j31731
2048C0797734K01643m76222L78591q14234r49990J349269R78022j063867j183637
2039B9217309L31261l78087k77310l09489p33827r70391J670572Q85947j13002
2030B9322983l33395m56711n03817O08677n11025M33805l55502K06595Q2908n13117
2020B7981401m08005r19882j0573K4718L81631K84861L212o28541M45087J826511
2010B8980420J01843j774304p882J33167J93492N16087o15318M92751M88432p13688
2000B7795000p42019j0419M80047R29424p55106j078452J43014J590937l26591
1991B8025835O7554m81337n97387m1365O69488n8933j04346j78995J16715J85545
$$ y = [33739361, 32169565, 30700337, 30712983, 30988584, 31939963, 31407782, 30644962, 30929465, 30797734, 30999377, 30523155, 30901746, 30087512, 29137522, 30486791, 31464813, 30400946, 29217309, 29548570, 29170483, 28893173, 28583684, 27849857, 26879466, 28550038, 29435985, 29322983, 28989588, 28532877, 28029060, 28637737, 28126712, 28560517, 28205015, 28411610, 28494518, 27981401, 27573396, 26653514, 26642941, 26667659, 27049290, 27334151, 27337363, 26708822, 27153909, 28980420, 29082263, 27307959, 27300077, 27433244, 27626736, 28142823, 27527505, 28020256, 28508688, 27795000, 27052981, 27042562, 27522609, 28452033, 27696927, 26618475, 26761489, 28352426, 28025835, 28093389, 27612052, 27014665, 26973300, 27642788, 27583855, 27479509, 27300514, 27417229, 27602774]
1981B7602774r49254P44115n4557M50655l40272Q54217J708139L55007J292025
1972C1662849q47426K24618l38290l05070O37747M40305J377191j52880O85479
1963C3384523N17478m14077K38184R45136J1443M7686n8993K23822J329163K344581
1953C8568946n1300P04422O16783K94327N06716J068982L25877J497315J284342
1944D4816410J746653J298378O72888M96439J673193J540006J056314J119545
1936E4419826K228517J855605J204308Q94985L639039L644653R12199K076453
1928G0875585M366643M383574L756484M877646N059787O140880O802126O692528
1920A12955253N139473O983254N283638N723457N965334L657181J562985Q7068
$$ y = [27602774, 26653520, 27397635, 27343078, 27793733, 27453461, 28307678, 30015817, 30370824, 31662849, 30815423, 31040041, 30701751, 30396681, 31034428, 31474733, 32851924, 32699044, 33384523, 33902001, 33487924, 33726108, 34671244, 34682687, 34730373, 34671380, 34895202, 36224365, 38568946, 38517646, 39222068, 39838851, 40133178, 40639894, 41708876, 42034753, 43532068, 44816410, 46563063, 47861441, 48534329, 49030768, 50703961, 52243967, 53300281, 54419826, 56648343, 58503948, 59708256, 60603241, 64242280, 67886933, 68799132, 70875585, 75242228, 79625802, 83382286, 88259932, 93319719, 99460599, 106262725, 112955253, 118094726, 125077980, 130361618, 136085075, 142050409, 145707590, 147270575, 147357643]
1912A47357643L0729k535411o30947j505202k460087k500636k332306m163880
1904A31259903k622991k662399k783637k750014k591247j96060Q80954J02062
1896A18636571J711801L586177K722088M801767L086620M207379N466956N214812
1888A49434171O599212R280557J0795290J0932161J2244758J4049235J4712641
1881B28048025J3895430J4579409J3552508J0706760P342134M838469q15227o091148
1873B86056360q939612j1025290j1260518j0390047r199508q789858j0261353
1866B16190174j1561463j0891476j1981024j0140768r961077n980506m514692
1859A51159168k875244j677063j547987j9296Q60195J55579J831913K175504J623908
$$ y = [147357643, 147388372, 144852961, 144222014, 142716812, 140256725, 137756089, 135423783, 131259903, 128636912, 125974513, 123190876, 120440862, 117849615, 117653555, 118534509, 118636571, 120348372, 123934549, 126656637, 131458404, 134545024, 138752403, 144219359, 149434171, 156033383, 165313940, 176109230, 187041391, 199286149, 213335384, 228048025, 241943455, 256522864, 270075372, 280782132, 288124266, 292962735, 292147508, 286056360, 277116748, 266091458, 254830940, 244440893, 235241385, 226451527, 216190174, 204628711, 193737235, 181756211, 171615443, 161654366, 155673860, 151159168, 148283924, 146606861, 145058874, 145039578, 145899773, 146055352, 147887265, 150062769, 151686677]
1850A51686677L094820L914429N947605N276532N388163O373451P391143Q211128
1842A97283948P023875N851187M711943L574659p65957k218555l031526n011400
1834B07418174o569955o024714o213835o907765p054479p037813o113535o241446
1826A55254632o166766n006466m495827k732712k408589j018467o8085J058930
1818A34416650O25763j86801l55315o24263j161079m449208l111763l571456k824218
1809A18758310m895635m632145l631229l540843k525383k759350j408065M16432
1801I5782092j690553p15496Q27503J23256K48650p52354J04380J461912K069908
1792I7459298K209072L003317J014747K536059K081481J8485j56358p786Q24188
$$ y = [151686677, 154781497, 158695926, 164643531, 169920063, 175308226, 181681677, 189072820, 197283948, 204307823, 210159010, 214870953, 218445612, 217679655, 215461100, 212429574, 207418174, 200848219, 194823505, 188609670, 181701905, 174647426, 167609613, 161496078, 155254632, 149087866, 144081400, 139585573, 136852861, 134444272, 133425805, 133357720, 134416650, 135042413, 134855612, 134500297, 133876034, 132714955, 128265747, 125153984, 121582528, 118758310, 113862675, 109230530, 105599301, 102058458, 99533075, 96773725, 95365660, 95782092, 94091539, 93376043, 94203546, 94326802, 94575452, 93823098, 93927478, 95389390, 97459298, 99668370, 102671687, 103686434, 106222493, 108303974, 108322459, 108166101, 108158315, 108982503]
1783A08982503j092531j952229k158669j909166l298268l751135k578812l090940
1775H9150753l731726k714557k327485k461853l15611j628082j274419J77247
1767G4874267j520841j374885R57059k78185j96255K43731O39986l23898j104319
1758G1916660Q7312n48854j560328r34179j684324k353439k308604l081232j444946
1749E8088066k541680k382909j893716j480091j681561r19925j921316j061436
1741D4205432p06486j552368o66054l86877j296668j116109j057397j582282O24966
1732C6466157r53791j248762k34709L05120q4206j467343r63055j598003p64079
1723B9457329L42829j14109p94552K5976o1117q82701r96907M3522m39415m48029
$$ y = [108982503, 107889972, 105937743, 103779074, 101869908, 98571640, 94820505, 92241693, 89150753, 85419027, 82704470, 80376985, 77915132, 77599521, 75971439, 74697020, 74874267, 73353426, 71978541, 72935600, 72657415, 72461160, 72704891, 73344877, 73020979, 71916660, 72003972, 71455118, 69894790, 68960611, 67276287, 64922848, 62614244, 59533012, 58088066, 55546386, 53163477, 51269761, 49789670, 48108109, 47188184, 45266868, 44205432, 43498946, 41946578, 41280524, 40893647, 39596979, 38480870, 37423473, 35841191, 36466157, 35512366, 34263604, 34028895, 34334015, 34249809, 32782466, 31819411, 30221408, 29457329, 29800158, 29686049, 28891497, 28917473, 28856356, 27973655, 26976748, 27020270, 26580855, 26132826]
1713B6132826l45929j766303j531207N79515p31273n59282M05435q2184j59308
1704B1942290m44240L49082Q15382n7793j177532m68398j135941J661912L51951
1695B1836713j060413o50004j53983j371126J62810J193438l06463r64959l51761
1686A8334252m63727l31543J175883n86812p5348M21687j235195j184760P72300
1677A6826737j56639r27491m69095J761898q65564k247209K41360p7018k43358
1668A3843621J084492L45049q99071K39512Q8981p19882j7114P6761l60737j050877
1658A2630735L73603O04314j5414m85656L6158m5643K8614j39532M67717m45238
1648A3009658o72294k48703O04676O015k71091j206802N38967M76273P08414j65844
$$ y = [26132826, 25786897, 24020594, 22489387, 23068902, 22337629, 21778347, 22183782, 22101598, 21942290, 21498050, 21847132, 22662514, 22604721, 21427189, 20958791, 19822850, 21484762, 21836713, 20776300, 20126296, 19972313, 18601187, 18763997, 19957435, 19650972, 18686013, 18334252, 17870525, 17538982, 18714865, 18128053, 18052705, 18474392, 17239197, 16054437, 16826737, 16670098, 15742607, 15273512, 17035410, 16169846, 13922637, 14163997, 14086979, 13843621, 14928113, 15273162, 14374091, 14613603, 14702584, 13982702, 13965588, 14042349, 13681612, 12630735, 13004338, 13608652, 13593238, 13107582, 13143740, 13098097, 13126711, 12987179, 13454896, 13009658, 12337364, 12088661, 12693337, 12699352, 12428261, 11221459, 11760426, 12236699, 12945113, 12779269]
1638A2779269m53698m17966p42152l33618p35900N03651P27774r15913J55889
1629A0567336J743329j92709M00885j111544p34217m7138N23269M76705N76301
1620A2202217k47071k73991n98568K09093M31896q95907J40429M61937N71245
1611A2001280l75546R23110J288503K29132j529820r29827Q07345J1232l69355
1602A2056054M98379P18684J11542M18724k87944L38532r91730n30986J06334
1593A2437589M22951j17496K421837p55301k16558k16132k67950l69528N93266
1584A3932678l66378q5321N61274N18088R48364n9758p35931J291770J346025
1575A7350811J109668J27254L08572K13421j139162J342069P98539M70074n45865
$$ y = [12779269, 12325571, 11907605, 11165453, 10831835, 10095935, 10599586, 11327360, 10411447, 10567336, 12310665, 12117956, 12518841, 11407297, 10673080, 10625942, 11149211, 11625916, 12202217, 11955146, 11681155, 11082587, 11291680, 11723576, 10827669, 10968098, 11430035, 12001280, 11625734, 12548844, 13837347, 14066479, 12536659, 11606832, 12414177, 12425409, 12056054, 12554433, 13273117, 13384659, 13803383, 13515439, 13853971, 12862241, 12331255, 12437589, 12860540, 12743044, 15164881, 14409580, 14193022, 13976890, 13708940, 13339412, 13932678, 13566300, 13480979, 14042253, 14560341, 15508705, 15448947, 14713016, 16004786, 17350811, 18460479, 18587733, 18896305, 19109726, 17970564, 19312633, 20111172, 20581246, 20035381]
1566B0035381N8978M15819l92374Q46722N22077J15097o15986J664982J904526
1557B4555222l25080L15736J133077R27828M97386J614730K033701J056581Q28717
1548C2637898R20625k10490K149501J935454K786303J159984J29022K675575J680404
1539D5864276J238588k48729O4264L5939j49265J248307q3263m72462K66455J046360
1529D8810470P42736P88849J207071J001310K65948J227226J406079N66298K347933
1520E8363920K968159R5118K013141K628717M036448K737231K377887Q51604K963829
1511G9036054J401004J445120J442192J461006Q30494Q59356J713281J930370
1503I0118877K16374p77761n55840j170323L6344r00559j11571P27117O36297
$$ y = [20035381, 20094359, 20510178, 20117804, 20964526, 21486603, 21601700, 20985714, 22650696, 24555222, 24230142, 24545878, 25678955, 26606783, 27104169, 28718899, 30752600, 31809181, 32637898, 33558523, 33348033, 35497534, 37432988, 40219291, 41379275, 41508297, 44183872, 45864276, 47102864, 46854135, 46918399, 46954338, 46805073, 48053380, 47970117, 47497655, 47764110, 48810470, 49553206, 50342055, 51549126, 52550436, 52816384, 54043610, 55449689, 56015987, 58363920, 61332079, 61427197, 63440338, 66069055, 70105503, 72842734, 75220621, 76072225, 79036054, 80437058, 81882178, 83324370, 84785376, 85615870, 86475226, 88188507, 90118877, 90335251, 89557490, 89001650, 87831327, 87867671, 86967112, 86855541, 87582658, 88218955]
1494H8218955r00648l73051j83415Q43044J024086J17344J54606J018585R50253
1485I0869759J187084J546671J691213K568757L890751L210432L513853M026433
1477A12504953M497744K878311J005228j16102j764901k703153l299845j287253
1469A11714982j946302k803361n25624j469750k949714l071851k969187j514372
1461I4464821j348963j156909n71558l29724J606342p13908j317505j704322k528828
1452H6399446n96679m78528j865110k051604l26711J521421O51282k89625P0545
1443H3034437J621739K333555J133854J866140K546929J702155O34316p7614k210855
1434I2584656l771265l106094l247606m320009l914939m111210l614915j917479
$$ y = [88218955, 87318307, 86945256, 86761841, 87604885, 88628971, 88746315, 88900921, 89919506, 90869759, 92056843, 93603514, 95294727, 97863484, 101754235, 104964667, 108478520, 112504953, 117002697, 119881008, 120886236, 120770134, 119005233, 116302080, 113002235, 111714982, 109768680, 106965319, 106439695, 104969945, 102020231, 98948380, 95979193, 94464821, 93115858, 91958949, 91387391, 91057667, 92664009, 91950101, 90632596, 88928274, 86399446, 85802767, 85324239, 83459129, 81407525, 81080814, 82602235, 83253517, 82963892, 83034437, 84656176, 86989731, 88123585, 89989725, 92536654, 94238809, 94873125, 94795511, 92584656, 88813391, 85707297, 82459691, 78139682, 74224743, 70113533, 66498618, 64581139]
1426F4581139k945884k374255j819975k653813j033440L57547M59286M47035j023107
1417E3994533j204217j376917j566814j428695j647604k486133j446048n39951
1409D2298154r63378m15323q67468n10070j219120j104669o44285J272583l9186
1400C7807238M83916J93519j382763l93987j36658j563358r83562j391063l076017
1391B9557265k217655r50255j187395k199475j038977r53536R16687j64015l01115
1382B1461529r14909q80024j44379J025457J13279j138131K44364n57657j995515
1373A7214014K97783q50999L51491Q15176j418185k068629q70763j04416J02741
1364A3468213L23716k38277n12879j920871l70483N05292n52013J507361r7423
$$ y = [64581139, 61635255, 59261000, 57441025, 54787212, 53753772, 54111319, 54570605, 55017640, 53994533, 52790316, 51413399, 49846585, 48417890, 46770286, 44284153, 42838105, 42298154, 41334776, 40919453, 40051985, 39541915, 38322795, 37218126, 36573841, 37846424, 37807238, 38291154, 38484673, 37101910, 36707923, 36571265, 35007907, 34024345, 32633282, 29557265, 27339610, 26389355, 25201960, 23002485, 21963508, 21009972, 21926659, 21762644, 21461529, 20546620, 19666596, 19522217, 20547674, 20660953, 19522822, 19767186, 19209529, 17214014, 17511797, 16660798, 17012289, 17827465, 16409280, 14340651, 13469888, 13365472, 13468213, 13791929, 13553652, 13040773, 11119902, 10749419, 11254711, 10702698, 12210059, 12112636]
1355A2112636l72527m07628q62890m14215j29664L69238n63595j92738k30298
1346I308319Q35376r49366K98447J407604j224420m16514p86960L17265J449972
1337A0239723r56252q95242J057010M87229m30997k39991j159977l21111l71579
1328G408813p12554m65358L84775m64098O19924p184m76199O96330L68902K43048
1318G596399K27439j183751K10537r4827J44255m5831k82101K06709p75802m33937
1308E569090J256445l44404j20910k74654J328655k04678j547154j14979J238308
1299F785719r78696j327403J260185j202241L06833P19522J293987P46556J56876
1290G761338j395825j078490k3097Q13130n94072p90343L20522N21441N24134
$$ y = [12112636, 11740109, 11332481, 10469591, 10055376, 9925712, 10294950, 9731355, 9538617, 9308319, 10143695, 9194329, 9492776, 10900380, 9675960, 9259446, 8472486, 8789751, 10239723, 9283471, 8388229, 9445239, 9932468, 9501471, 9261480, 8101503, 7780392, 7408813, 6696259, 6230901, 6615676, 6151578, 6771502, 6764318, 6288119, 6984449, 7353351, 7596399, 7823838, 6640087, 6850624, 6755797, 6900052, 6854221, 6572120, 6778829, 6003027, 5569090, 6825535, 6481131, 6360221, 6085567, 7414222, 7209544, 5662390, 5547411, 6785719, 5807023, 4479620, 5739805, 4537564, 4844397, 5563919, 6857906, 7604462, 7761338, 6365513, 5287023, 5263926, 6077056, 5482984, 4692641, 5013163, 5534604, 6058738]
1281F058738O55474M6213m90015l05196m14914o80040J82344J29610r27827J844621
1271F099008J119637o33522k21800j184026q35603j12568m93775Q65253J446389
1262F048993r26506P83422J20909j867154J334813k29178k11452M16086K28674
1253E698607K31400k91408j33518Q12833P15572o53896J717393p61450j691105
1244E644428K39954M80434j799170j237954R67773l43352m58967R16814K14033
1235D623993J005045o08130j007072j3289J01421M08843k09796P920m82492R3403
1225C919846Q96192J180085l25780J71868l63527j147587J13914m02862J52917
1216D195066R52982j148889j195048Q45258J072586J5249j78427J016894q89107
$$ y = [6058738, 6714212, 6760425, 6270410, 5965214, 5550300, 4870260, 5052604, 5182214, 4254387, 6099008, 7218645, 6585123, 6363323, 5179297, 4343694, 4231126, 3737351, 4602604, 6048993, 5122487, 5905909, 6026818, 4159664, 5494477, 5265299, 5053847, 5469933, 5698607, 5930007, 5638599, 5505081, 6317914, 7033486, 6379590, 8096983, 7335533, 5644428, 5884382, 6364816, 4565646, 3327692, 4295465, 3952113, 3493146, 4409960, 4623993, 5629038, 5020908, 4013836, 4000547, 4101968, 4510811, 4301015, 4308935, 3826443, 3919846, 4816038, 5996123, 5670343, 5842211, 5478684, 4331097, 4445011, 4042149, 4195066, 5148048, 3999159, 2804111, 3649369, 4721955, 4737204, 4558777, 5575671, 4686564]
1207D686564j497290J379740k94358l58045l57869m80563r86275R26461J717662
1198D736027j82552L89662j14962k05318o45689M33994K072k90198J98913l10039
1188D011910j358846Q36833P23246K98963q77474j90793P07924r35187R04656
1179D121232k57019q3049O41787n36219j095204J042341k21933k91161J84962
1170C505737k11689K65599N6995L63316K95462j101988j45879n7516P21859J56484
1160C848380o15596o52062R74906k85164Q10560r0438n33855Q41756j064512Q54137
1150D088112M38752L40162j61649r28575P39191j098577m65646K233187p02183
1141D482774k87789m4557N1070q32646j86827L30116R12249N59623r58687k444
$$ y = [4686564, 3189274, 4569014, 4274656, 3916611, 3558742, 3078179, 2091904, 3018365, 4736027, 4553475, 4943137, 4828175, 4622857, 3977168, 4411162, 4413234, 4123036, 4321949, 4011910, 2653064, 3489897, 4213143, 4512106, 3634632, 3443839, 4151763, 3216576, 4121232, 3864213, 3781164, 4422951, 3886732, 2791528, 3833869, 3611936, 3320775, 3505737, 3294048, 3559647, 3616642, 3979958, 4275420, 3173432, 3027553, 2970037, 3691896, 3848380, 3232784, 2580722, 3555628, 3270464, 4081024, 3990586, 3456731, 4298487, 3233975, 4088112, 4526864, 4867026, 4705377, 3776802, 4515993, 3417416, 2951770, 5184957, 4482774, 4194985, 4150428, 4201498, 3368852, 3182025, 3512141, 4424390, 4984013, 4025326, 4022882]
1131D022882M53425n8810l35757p40788R10484M28599k16436o29658J28328K61482
1121D223751M48749l07336L69917J286790l45913j085483n02754Q33812k04612
1112D716921J43043J000758p26425r58384K30753M41413p46685k40466N57323
1103D418251n35252M3182K77976j66991K44939j088j11199L61136L28747J11051
1093D970752r07152J48333L15236l61020R07846Q3638q22091q98397k515O03851
1083D038481N93247P06666n63614l36590J05016q59817J201684O42444j211047
1074D316470K49970l67028q35985J094655J100967r87658p22978O03378M66237
1065D918028o13545N04920R89538R7319O24348j151812N23651N18205O27505j75743
$$ y = [4022882, 4476307, 4417497, 4081740, 3340952, 4251436, 4680035, 4463599, 3833941, 3962269, 4223751, 4672500, 4365164, 4735081, 6021871, 5675958, 4590475, 4087721, 4921533, 4716921, 4859964, 5860722, 5134297, 4175913, 4406666, 4848079, 4101394, 3860928, 4418251, 3882999, 3926181, 4204157, 4037166, 4282105, 4281017, 4169818, 4530954, 4859701, 4970752, 4063600, 4211933, 4527169, 4166149, 5073995, 5157633, 4335542, 3437145, 3434630, 4038481, 4631728, 5338394, 4774780, 4438190, 4543206, 3683389, 4885073, 5527517, 4316470, 4566440, 4199412, 3363427, 4458082, 5559049, 4571391, 3848413, 4451791, 4918028, 4304483, 4809403, 5798941, 5896260, 6520608, 5368796, 5892447, 6410652, 7038157, 6862414]
1055F862414r23549J94519L67393R8728L45169m9048l73475K68782n06946J363424
1045G647411O75607Q23425Q33825P22067j108859K9087n42227j74540J004558
1036I910354J6569K57923P10568p20787m12630L22855N42326j667q33409P44605
1026A0536707J83624K0835J543468O79748k5975N8447l08492j90004M10965J458663
1016A4367986L20851J50781j3423m49530N17389J83464j82115J32698J949135
1007A6977236J059455J153057k98951J69905J777290P53106O41676J614830Q12804
998B4660408K66632K185152J605645J036472P67368J856257J949466J594113K462430
989C8383943K599258J485998K589023K925980J727982L636518M387540L076563
$$ y = [6862414, 5938865, 6133384, 6500777, 6599505, 6944674, 6895626, 6522151, 6790933, 6283987, 7647411, 8323018, 9146443, 9980268, 10702335, 9593476, 9622563, 9080336, 8905796, 9910354, 9926923, 10184846, 10895414, 10174627, 9761997, 10084852, 10627178, 10625511, 9792102, 10536707, 10720331, 10741166, 12284634, 12964382, 12938407, 12996854, 12688362, 12498358, 12909323, 14367986, 14688837, 14839618, 14826195, 14376665, 14894054, 15077518, 14895403, 15028101, 16977236, 18036691, 19189748, 18890797, 19060702, 20837992, 21591098, 22232774, 23847604, 24660408, 24927040, 27112192, 28717837, 29754309, 30521677, 32377934, 34327400, 35921513, 38383943, 40983201, 42469199, 45058222, 47984202, 49712184, 53348702, 57736242, 60812805]
981F0812805M606618N692775N224762O197426N558448N208477O992120Q279374
973A08572805J1665776J4246266J7605329K3220787L2607939M0582584N0911166
966B99412652N3454742N7904719N9380603L1247637k7007165n5190152o3920510
959C55282526p0776476n3674216l6888550k7404543j9278113j4285312j1901896
952A21073420r028071q278881o593517n400464l309115m314397o001181o195104
944G1952690m505189n859350m557094k970566l236627k287986k100288j533346
936D4902244L76890j923149k588057k077545q41250j716268j343135j336999j391477
927C2061254j227800j382230j461788o68314j236620N40567p85574q79994j224217
$$ y = [60812805, 65419423, 71112198, 76336960, 82534386, 88092834, 93301311, 100293431, 108572805, 120238581, 134484847, 152090176, 175310963, 207918902, 248501486, 299412652, 352867394, 410772113, 470152716, 501400353, 474393188, 419203036, 355282526, 284506050, 230831834, 193943284, 166538741, 147260628, 132975316, 121073420, 112045349, 103766468, 97172951, 91772487, 88463372, 84148975, 78147794, 71952690, 67447501, 61588151, 57031057, 54060491, 50823864, 48535878, 46435590, 44902244, 45279134, 43355985, 40767928, 38690383, 37849133, 36132865, 34789730, 33452731, 32061254, 30833454, 29451224, 27989436, 27321122, 26084502, 26625069, 25839495, 24959501, 23735284]
918B3735284o65149q99735j45591j591179l74934R194j362003n62012q17760q62533
908A6463582K91475P58982L12854M2050k89504n78495m31123N25391p89671l31261
898A5974280k14225K98620o26832o06766n12113l82314j550415N63478n82892
889A2360821k15423q51147k10038J76910R09303P10151j07346j012189n80647
880A1180395j16254j173073r57429L24895O27158m44355p81251r95887j408753
871F255446J666916k37600L63927O46786j502022L05907N53743j083946r74958
862E994199K67465M39011K08294J15314J001412j00072O92541L24987j286053
853G657098j737202j38628J079774M63449n28486l40933O53847n35707m8638P11446
$$ y = [23735284, 23070135, 22170400, 22024809, 20433630, 20058696, 20067890, 18705887, 18143875, 17326115, 16463582, 16755057, 17514039, 17826893, 17868943, 17579439, 17000944, 16569821, 17095212, 16305541, 15974280, 15760055, 16058675, 15431843, 14825077, 14312964, 13930650, 12380235, 12943713, 12360821, 12145398, 11294251, 11084213, 11261123, 12170426, 12880577, 12773231, 11761042, 11180395, 11064141, 9891068, 8933639, 9258534, 9885692, 9441337, 8660086, 7664199, 6255446, 7922362, 7684762, 8048689, 8695475, 7193453, 7499360, 8053103, 6969157, 5994199, 6261664, 6700675, 6908969, 7024283, 8025695, 7925623, 8618164, 8943151, 7657098, 5919896, 5781268, 6861042, 7324491, 6796005, 6455072, 7108919, 6573212, 6524574, 7236020]
843G236020k04257o68281K27854j043338o80686j211310J020206m79119l90636
834C806453N7438k23678k43222O31699O22257n20779J172198M94307j09625P2064
824E759112j08185N60373O80519o99617j466786J86469J6605k49816j576033J43856
814C246497P34109K61342O53054j155871N55162j42131k65355j66898K89114Q2387
804D091410K46434j184302r65727k49051j88510Q4307J621577N94430r9148j45102
794C806318p33486j70120P45167j507624N92488M70672K622k75839J10386n68432
784B472152M42695q42038K74718j006883O38072J304791k37365k46710M9177J253229
774D101838p94611j297762o8655n70775O05040R41234p2597N12462m89193J24675
$$ y = [7236020, 7031763, 6363482, 6591336, 5547998, 4867312, 3656002, 4676208, 4197089, 3806453, 3863891, 3640213, 3396991, 4028690, 4650947, 4130168, 5302366, 5796673, 5687048, 5759112, 5650927, 6211300, 6891819, 6192202, 4725416, 4911885, 4928490, 4678674, 3102641, 3246497, 3980606, 4241948, 4895002, 3739131, 4294293, 4152162, 3886807, 3719909, 4009023, 4091410, 4337844, 3153542, 2187815, 1938764, 1750254, 1834561, 3456138, 4050568, 3951420, 3806318, 3072832, 2902712, 3647879, 2140255, 2732743, 3203415, 3206037, 2930198, 3040584, 2472152, 2914847, 2072809, 2347527, 1340644, 1978716, 3283507, 3046142, 2799432, 2848609, 4101838, 3307227, 2009465, 1940810, 1370035, 1975075, 2916309, 2843712, 3356174, 2866981, 2991656]
764B991656j274935R50053Q41681p71914l03022K87561m72527k283L43586O202
754B596058j10676j681205p09574J709235O6562K34143J534228j84728k00752
745C253291J73257j233504j305898N82785N75442l81731L81522M0768n62741P59614
735B282805O91812L81976j180677n59867N16098p87222k67815K70082m67769j77992
725G01431o20476N3150O61998N90227Q73989Q38547j392265n6044m04942K30247
715A475862P93748p91400k12922K5059O1608J51601J094243J5045m24861m29657
705A758326m00224m92238J88701l3304m1951Q06609J070212J66858k63686j163962
695A595341r75944N61086J55218j270729J173563M71352J48533l07617O5356n85762
$$ y = [2991656, 1716721, 2666774, 3508455, 2736541, 2433519, 2721080, 2248553, 2246270, 2589856, 2596058, 2485382, 804177, 94603, 1803838, 1870400, 2104543, 3638771, 3454043, 3253291, 3426548, 2193044, 887146, 1469931, 2045373, 1663642, 2045164, 2085932, 1523191, 2282805, 2974617, 3356593, 2175916, 1616049, 2132147, 1344925, 1077110, 1347192, 879423, 701431, 80955, 134105, 796103, 1386330, 2260319, 3098866, 1706601, 1650557, 1245615, 1475862, 2269610, 1478210, 1265288, 1290347, 1351955, 1503556, 2597799, 2612844, 2187983, 1758326, 1358102, 865864, 1054565, 1021261, 979310, 1785919, 2856131, 3022989, 2759303, 1595341, 619397, 1180483, 1335701, 64972, 1238535, 1709887, 1858420, 1550803, 1616159, 1030397]
685A030397l63080J01520R40814J199893M21435j271429p64340J234557J189867
676C719634N1597K73769k68327K34973k22856p86580n71114J357975j037766j020715
666A730590l69401P08398j602j157022P45887J79695L51422l13228j327911r38440
656c91612K67764Q54841j84710M76985O00909k18794o1586o23878K0099K73864
646A013882Q86310n23170j168987p66768Q10820R48409l0048J91194J129900R84569
636C476111l08485j386134n64726j81825n96232R34649q19416j150700k03713
627h00471m23101O95515N47330M54751O48730j332332q7876J368149P59031p18987
617A110739J99138o01493l14536J266692p54555M59589q28024o9046M60487n93732
$$ y = [1030397, 667317, 768837, 1709651, 2909544, 3330979, 2059550, 1295210, 2529767, 3719634, 3771231, 4045000, 3776673, 4011646, 3788790, 3002210, 2431096, 3789071, 2751305, 1730590, 1361189, 2069587, 2067985, 910963, 1656850, 1836545, 2187967, 1874739, 546828, -391612, -123848, 730993, 546283, 1023268, 1624177, 1405383, 1343797, 719919, 740018, 1013882, 1900192, 1377022, 208035, -558733, 252087, 1200496, 1170448, 1361642, 2491542, 3476111, 3167626, 1781492, 1216766, 1034941, 438709, 1373358, 553942, -596758, -800471, -1223572, -528057, 19273, 474024, 1122754, -209578, -297454, 1070695, 1829726, 1110739, 1309877, 708384, 393848, 1660540, 905985, 1365574, 537550, 468504, 928991, 335259]
607C35259n77779J366846J321731k07081o87135k8722o21128Q01015n36860n94155
597E71991L57730L31809r09183J51146o00111L21881K9943K33809n62468L88438
587C14985P40093J2880N10610j145755m16501L33716J230172J08858N26351j199515
577A015894k36428L74936j661402L0821k62058M34332P64971p34516O56004J135268
567A517822m89038J94455m33898o17724O45121N54065L48633o73198j001876J69537
557B13899k68006n99657l079m67677J67028J020065n11333o9961k0605N95794
547E6468Q21150O46043k03769r48535j75321l06477R07218J57818r19300J09971
537A45266j28313j54415q6653N58994O46130O31324m10350o3246J71671k50606
$$ y = [335259, -242520, 1124326, 2446057, 2238976, 1551841, 1523119, 901991, 1703006, 1166146, 571991, 929721, 1261530, 352347, 503493, -96618, 225263, 255206, 489015, -73453, 314985, 1055078, 1067958, 1578568, 432813, 16312, 350028, 1580200, 1689058, 2215409, 1015894, 779466, 1154402, -507000, -476179, -738237, -303905, 461066, -273450, 382554, 1517822, 1028784, 1223239, 789341, 171617, 816738, 1370803, 1719436, 1046238, 44362, 213899, -54107, -653764, -656843, -1124520, -957492, 62573, -448760, -518721, -539326, 56468, 877618, 1523661, 1319892, 371357, 196036, -110441, 796777, 954595, 35295, 145266, 16953, -137462, -224115, 334879, 981009, 1612333, 1201983, 1138737, 1310408, 1059802]
527A059802J27657r74422K77188J76797j90533R50835n68106J5836k91517q81466
517b97929J77456j61749J960271p31912j318689l0392M48010n81699J032540j94731
507C01176j6072j408801N60855P80423m22140K90267L17722m20111K81064l27314
497f2931k34142J13496l96872o35517K28944K31959P72874J33330q42553R28029
487B36617l37912J58341P49390j669898q30506J275111o94095n59358p54217k16448
477b642975R59698L29549K68260P42000p73194J315562m76368l23195K09832n58844
467i49675N7876j8484J08712o66132O62403Q03775Q8683P46652r94824k95150
457d56164L98409J19867R45817p27780K61628j459481L62164O77483q57926K36460
$$ y = [1059802, 1187459, 213037, 490225, 667022, 476489, 1427324, 859218, 875054, 583537, -297929, -120473, -282222, 1678049, 946137, -372552, -402944, 45066, -536633, 495907, 301176, 285104, -1123697, -562842, 217581, -204559, 85708, 403430, -16681, 264383, -62931, -297073, -183577, -580449, -1215966, -987022, -755063, 17811, 151141, -691412, 236617, -101295, 57046, 806436, -863462, -1693968, -418857, -1112952, -1672310, -2426527, -2642975, -1683277, -1353728, -1085468, -343468, -1116662, 198900, -277468, -600663, -390831, -949675, -891799, -910283, -801571, -1467703, -805300, -1525, 87158, 833810, -161014, -456164, -57755, 62112, 1007929, 280149, 541777, -917704, -555540, 121943, -735983, -499523]
447d99523L27660N30123q89111j082092r95809P99907o9096K57340p02145M36777
437a885969J555970R43K79634j194199J911J3259k40810O98361J034967o2399
427B01668k25347o49695q62821J09753l2190j76254K99304O09874j79401K35986
417f69123m59665J94452R92519K48581j36180l32145p2778k21726m50020n14717
407a420802J54362Q61142k09722k71000k46551j13103j47342q60144K39607K049013
397C5460j568480k44288R60620M53219o47038o76965R31927K44021J322013m30519
387C79970k140169N35632M00741p31033P9208m72560L85428k02584k7097K02554
377a589910M31126Q56405k58731m30398P47054n43473j20832J54116k7400k33323
$$ y = [-499523, -171863, 358260, -530851, -1612943, -2608752, -1808845, -1877941, -1620601, -2322746, -1885969, -329999, -329056, -49422, -1243621, -1241710, -1228451, -1469261, -770900, 264067, 201668, -23679, -673374, -1536195, -1426442, -1458632, -1634886, -1335582, -725708, -905109, -669123, -1128788, -934336, 58183, 306764, 170584, -161561, -234339, -456065, -906085, -1420802, -1266440, -405298, -615020, -886020, -1132571, -1245674, -1393016, -2253160, -2013553, 35460, -1533020, -1777308, -816688, -363469, -1010507, -1687472, -755545, -511524, 810489, 379970, -1760199, -1224567, -823826, -1554859, -1475651, -1948211, -1562783, -1765367, -1792464, -1589910, -1158784, -302379, -561110, -991508, -244454, -787927, -908759, -754643, -782043, -1015366]
367a015366r81546j45132q90823N2286J352752J84843o0553Q208M31587k26376
357a290120M4208m40968j001256j549875J340442J154941K10164R64114p74019
348a342369M58702p57441L61918r97800L58071O30035J390948M80952j091642
339e08626p44629m62295L91542J03021O78026o86940l96177j01336L86833l05053
329a645634M91700o08857k0971K31893m98531J496202k03280k79225p50158Q28067
319i58794O53437j031481P11552N65213q12538q40911O86760K3764p56716J072056
309f87658J66026j497479M50007O36714R182N80129l58630p38383Q4107o16879
299a972864l39658P73525Q33699l04140m43656L45387L82878k91914n6577j031902
$$ y = [-1015366, -1996912, -2142044, -3032867, -2980581, -1627829, -1442986, -1503539, -1495331, -1063744, -1290120, -1245912, -1686880, -2688136, -4238011, -2897569, -1742628, -1532464, -568350, -1342369, -883667, -1641108, -1279190, -2276990, -1918919, -1288884, 102064, 583016, -508626, -1253255, -1715550, -1324008, -1220987, -542961, -1229901, -1626078, -1727414, -1340581, -1645634, -1153934, -1762791, -1783762, -1551869, -2050400, -554198, -757478, -1036703, -1786861, -958794, -305357, -1336838, -625286, -60073, -872611, -1713522, -1026762, -1002998, -1759714, -687658, -521632, -2019111, -1569104, -932390, -923208, -343079, -701709, -1440092, -1355985, -1972864, -2312522, -1538997, -705298, -1009438, -1453094, -1107707, -724829, -1016743, -1073320, -2105222]
289b105222J148343J73993L66842j62147k68864o78077M14700J206018p70825
280f75239p57306o46646M56915N31008K46103l40089k02662L37848n18403Q2931
270a485540N92280q85026N94132O19744k53765n91591j431902P15241n4223n65140
260b745790j10147J17973P71820J92177J74021N61979M68497m09950K99784n10309
250a189945m88622j15301L4524M5294l80619J57855Q51500P89498l07825j084928
240a688569M17990R07246l86873k96157n71051r14148k35625o73955J83508J263178
230a994456J319022o03308k04641q29532m2758n00882R50008J191823o98583j84310
220a597617k30639Q7312L00306j13223l56038n35107J154313k88686j430372J420109
$$ y = [-2105222, -956879, -782886, -416044, -578191, -847055, -1525132, -1110432, 95586, -675239, -1432545, -2079191, -1622276, -1091268, -845165, -1185254, -1387916, -1050068, -1568471, -1485540, -893260, -1778286, -1184154, -564410, -818175, -1409766, -2841668, -2126427, -2180650, -2745790, -2855937, -2737964, -1966144, -1773967, -1599946, -1037967, -569470, -979420, -679636, -1189945, -1678567, -1793868, -1759344, -1714050, -2094669, -1936814, -1085314, -295816, -603641, -1688569, -1270579, -363333, -750206, -1046363, -1617414, -2531562, -2767187, -3441142, -3257634, -1994456, -675434, -1278742, -1483383, -2312915, -2355673, -2856555, -1906547, -714724, -1413307, -1597617, -1828256, -1740944, -1440638, -1553861, -1909899, -2445006, -1290693, -1579379, -3009751, -1589642]
210a589642K45805q44920K16957K948N5462N36304m82951j424135J521363q9297
200a852106R00984k01865r355j29225l23175K6219j07410P95132k85907O60852
190e25856p30774L63590p06466o49028Q32025k34879q27544J101409R90302o42983
180a030204q78624j63919q6571m5443l30470l69540L01994Q2833N0766J372321
170a096857j126284Q87152O11519p58563O53212q37956q02810q6002O46822P9834
160a829933k55930M56594j07393J43904m26128K71431J064727L53554q61090J99916
150i90348J66622Q24779l00448n39905P50814o14288l17427l78888M20568j42306
140a120827q20232R25762l72933Q5055n24078k60485k20870K21345j16369P25034
$$ y = [-1589642, -1343837, -2188757, -1971800, -1968852, -1913390, -1377086, -1860037, -3284172, -1762809, -1852106, -951122, -1152987, -1162342, -1291567, -1614742, -1588523, -1695933, -900801, -1186708, -525856, -1256630, -893040, -1599506, -2248534, -1416509, -1651388, -2478932, -1377523, -387221, -1030204, -1908828, -2072747, -2159318, -2204761, -2535231, -2904771, -2602777, -2519944, -2469178, -1096857, -2223141, -1335989, -724470, -1483033, -829821, -1667777, -2470587, -2556589, -1909767, -1829933, -2085863, -1629269, -1736662, -1592758, -2018886, -1747455, -682728, -329174, -1190264, -990348, -823726, 1053, -299395, -839300, -88486, -702774, -1020201, -1399089, -978521, -1120827, -1941059, -1015297, -1388230, -1303175, -1827253, -2087738, -2308608, -2087263, -2203632, -1478598]
130a478598r9535Q3822q9975K6026M50710m2089l99583k68463M42123l72620l85066
119b133248R8092P02252j9570j2385P05356o09444o09205O0648j20327N76310
109a361521M02301J1910n79419k15084l35227J19667l87084q94997l83902O22928
99c000428O25887L95637q58291J65271L92122O63710J60814J91568O27703j61965
89g97972j305582j3134j59173k96487p22445R28755N03761p762k88064P3206O43919
78a440978k26693L18088M88056l77403K57917r84340k00480M78905l34880K6136
68a995672L51815M13122r11859j24957K79683O57091m62978j084978j41928O60243
58b360418K78002J94413K97648l67740m3857j05169L074j89902O62920l1352l81494
$$ y = [-1478598, -1578133, -1494311, -1584286, -1558260, -1107550, -1149639, -1549222, -1817685, -1375562, -1748182, -2133248, -2035156, -1332904, -1352474, -1364859, -659503, -1268947, -1878152, -1817504, -1937831, -1361521, -959220, -947310, -1526729, -1741813, -2077040, -1957373, -2344457, -3239454, -3623356, -3000428, -2374541, -1978904, -2837195, -2671924, -2279802, -1616092, -1455278, -1263710, -636007, -797972, -2103554, -2116688, -2275861, -2572348, -3294793, -2366038, -1862277, -1870039, -2158103, -2084897, -1440978, -1667671, -1349583, -861527, -1238930, -981013, -1965353, -2165833, -1686928, -2021808, -1995672, -1643857, -1230735, -2142594, -2267551, -1987868, -1330777, -1793755, -2878733, -3020661, -2360418, -2082416, -1888003, -1590355, -1958095, -2001952, -2107121, -2104047, -2293949, -1631029, -1662381, -2043875]
47b043875k58816K18197m80155Q79457l32369q33974N75686J026560k13532r47990
37b410811K57785J60738K1529k48563K39898L20578J29199n60867o8103R06573
27a252044p72630l33001Q10913M43651M4969o19101L50780O02983p87708m50907
17a962095j56457k78537N94012j9186M95965K26702k14505j064652J23816k61334
7b516271P25818O69846j3440j386815j50199j80256j88976
0c040293
$$ y = [-2043875, -2302691, -2084494, -2564649, -1685192, -2017561, -2851535, -2275849, -1249289, -1462821, -2410811, -2153026, -1992288, -1970759, -2219322, -1979424, -1658846, -1529647, -2090514, -2158617, -1252044, -2024674, -2357675, -1546762, -1103111, -1058142, -1677243, -1326463, -723480, -1511188, -1962095, -2118552, -2397089, -1803077, -1822263, -1326298, -1099596, -1314101, -2378753, -2254937, -2516271, -1790453, -1120607, -1134047, -2520862, -2671061, -2851317, -3040293]
$$ Imaginary data points
##PAGE= N=2
##DATA TABLE= (X++(I..I)), XYDATA
16383i061411o7657n93729K40737m7084Q44065p07792j43311q3532j07114N50146
16373i176682l3652j92244J6267n0681J350563N56125n26551L63991q08055J40184
16363h360735K28124j15337O33211o4437Q41372k22690K41046K71379o02542J03202
16353g047407j29669R00639L1238q30778M92646l2588r11759J98228M26060K98144
16343f605246L07509q8283J116621j78077r0513j85042L21906m93515M80953R2656
16333e321031m29717L82556n12085L58793M76817l62543k08734r6454O42446R50110
16323d119842M83218l3247K66143M37205n08819k80386n75804P67983L79909k0368
16313c204008P82504O01545K59733m66753m14276p22560J07150P04423j62142
$$ y = [-9061411, -9129068, -9722797, -9482060, -9529144, -8685079, -9392871, -9536182, -9619714, -9726828, -9176682, -9210334, -9402578, -9386311, -9436992, -8086429, -7530304, -8056855, -7692864, -8500919, -8360735, -8132611, -8247948, -7614737, -7679174, -6837802, -7060492, -6819446, -6548067, -7150609, -7047407, -7177076, -6276437, -6245199, -7075977, -6583331, -6615919, -7527678, -7329450, -6903390, -6605246, -6297737, -6386020, -5269399, -5447476, -5537989, -5723031, -5401125, -5894640, -5413687, -5321031, -5750748, -5368192, -5880277, -5521484, -5044667, -5407210, -5615944, -5712398, -5069952, -4119842, -3636624, -3669871, -3403728, -2966523, -3475342, -3755728, -4331532, -3563549, -3183640, -3204008, -2421504, -1819959, -1560226, -2026979, -2441255, -3163815, -3056665, -2352242, -2514384]
16304b514384m0580N03605R3672k09291K95495o09139k74701O05451m54080j81910
16294b785862R3011J006018J10913j68790j80443l29528O92164M03504k89894
16285a448907k95575O72677r27900M49660k68462k36781P19160J57709o0521m40034
16275a678974K50404O92453O63586r3406n03382q25455M14558Q62103j58664o73596
16265a050373K53862L23166j29939r97800M3487N77921J043262M36659J004995
16256A505240m74977n36579M1397l34716L95363j94503q60261N86337J228110
16247A355411L33479j44410o74652m5184J812552m16577n08999l02124r7852N06181
16237A817825k40508M78871L13474J80316j21713K36829m74337j04661o76749
$$ y = [-2514384, -2554964, -2051359, -1957687, -2166978, -1871483, -2480622, -2755323, -2149872, -2603952, -2785862, -2692851, -1686833, -1575920, -1744710, -1925153, -2254681, -1562517, -1159013, -1448907, -1744482, -1071805, -1999705, -1550045, -1818507, -2055288, -1336128, -1178419, -1238940, -1678974, -1428570, -736117, -72531, -165937, -669319, -1494774, -1080216, -218113, -376777, -1050373, -796511, -473345, -603284, -1601084, -1557597, -979676, 63586, 500245, 1505240, 1030263, 493684, 535081, 200365, 595728, 401225, -459036, 127301, 1355411, 1688890, 1544480, 869828, 824644, 2637196, 2220619, 1711620, 1409496, 1311644, 1817825, 1577317, 2056188, 2369662, 2549978, 2428265, 2665094, 2190757, 2086096, 1409347]
16228A409347J222819M22988P04751P85756j374784j590744M42289L72262j414709
16219I79975L31776J159019r22238K59091N56872N45440k69822p03728P9532M38625
16209B454542K29660l29164K24115N42817o17343J4481O61215K05636l80649J24621
16199C129931M66637O02906l37752j073355Q97049K97553m41351j89469J21445
16190C473594j32028m23161o81583K99116L73526O87286M97417k29891p19816
16181C144460O15761J160062K60767j068142k78064k54532O02328j72264k2630
16172C987746k28833p1519K04025J9266j80913m67000K092926L51580p22236k2473
16162D962569o65523J91723L88713j28684o64252n46481N82057O5008J043599
$$ y = [1409347, 2632166, 3055154, 3759905, 4545661, 3170877, 1580133, 2022422, 2394684, 979975, 1311751, 2470770, 1548532, 1807623, 2364495, 2909935, 2640113, 1936385, 2015917, 2454542, 2684202, 2355038, 2579153, 3121970, 2504627, 2519108, 3180323, 3385959, 3005310, 3129931, 3596568, 4199474, 3861722, 2788367, 3685416, 3982969, 3541618, 3352149, 3473594, 3341566, 2918405, 2236822, 2535938, 2909464, 3596750, 4094167, 3864276, 3144460, 3760221, 4920283, 5181050, 4112908, 3834844, 3580312, 4182640, 4010376, 3987746, 3758913, 3687394, 3891419, 3910685, 3729772, 3262772, 5355698, 5707278, 4985042, 4962569, 4297046, 4488769, 4877482, 4748798, 4084546, 3538065, 4120122, 4185130, 5228729]
16153E228729p1827r31946p17733j89844J86199l54464J230144J403305j578275
16144D204288j37191M56520P51059j078525j063439P70709L13358k04080J95245
16135D207944Q95357o96512j147959O03522L04552j27919M75888p4976p22744
16126C717153r56189Q04817P98007j91080K69418k60265l04808M81367K39416
16117D597836J92544o36492k50097O79486m47336m57862L02727L66394l39939
16108D007261N92177J092243M60290o20298l73803l17703n2507K56694O30036
16099E674390l08692n55741M04145n7666j62731k90200Q89812j39132j156576
16090D297609R85698l31233o23163Q58872l94618j26256p39807J206823j84053
$$ y = [5228729, 5156902, 4224956, 3507223, 3317379, 3503578, 3149114, 4379258, 5782563, 4204288, 4067097, 4523617, 5274676, 4196151, 3132712, 3903421, 4216779, 4012699, 4207944, 5103301, 4406789, 3258830, 3862352, 4166904, 4038985, 4514873, 4439897, 3717153, 2760964, 3565781, 4363788, 4172708, 4442126, 4181861, 3877053, 4358420, 4597836, 4790380, 4153888, 3903791, 4583277, 4135941, 3678079, 3980806, 4347200, 4007261, 4599438, 5691681, 6151971, 5531673, 5157870, 4840167, 4787660, 5044354, 5674390, 5365698, 4809957, 5214102, 5156436, 4993705, 4703505, 5593317, 5454185, 4297609, 5283307, 4952074, 4328911, 5187783, 4793165, 4666909, 3927102, 5133925, 4949872]
16081D949872n96896M95984m51226L98694M14968l9794n78732r45550m76973Q50311
16071D020658Q37055o15126L15368P46819M16637l81944P2453K87856j138163
16062D561613j62951n37079m42373M88287J250765O0683k015109m40880J498526
16053D261482M98143j400519Q75449J057673j994J07286L98972q1575r94115m33556
16043D287246L78683J149427R2017r72076n64896M76108j09270J27646m10221
16034D454664J27651J62161q69143K35073j137750o51098L21250K197960L22332
16025E163100l94825L09440n3955M46975P12192L98083q15488q4292p25810o5310
16015D890110M6182j002046r6569N71751j67667L1460P73330O15013j36291j60810
$$ y = [4949872, 4352976, 4848960, 4397734, 4796428, 5211396, 5171602, 4592870, 3647320, 3170347, 4020658, 4857713, 4242587, 4557955, 5304774, 5721411, 5339467, 5411920, 5699776, 4561613, 4398662, 3861583, 3419210, 3907497, 5158262, 5218945, 3203836, 2762956, 4261482, 4759625, 3359106, 4234555, 5292228, 5290234, 5397520, 5796492, 5714917, 4720802, 4287246, 4665929, 5815356, 5907373, 4935297, 4370401, 4846509, 4737239, 4864885, 4454664, 4582315, 4744476, 3875333, 4110406, 2972656, 2321558, 2642808, 4840768, 5163100, 4768275, 5077715, 5023760, 5470735, 6182927, 6581010, 5765522, 5681230, 4955420, 4890110, 4936292, 3934246, 3837677, 4409428, 4241761, 4273221, 5046551, 5661564, 5525273, 5364463]
16005E364463K38540k94399o15444O6998k77774J841489R7719o91870j251417
15996D478305J48627N93888j056971j62799n61698J663349p0440o02621L74058
15987D803698J020970o94730n93884m97720r05160l35251J795417k45352N53391
15978D901379N43014k80631J74546J36358J54079O5768j293101j61592O2026R14541
15968E216387j17963k31084O08189j155002J60673k2760O37593p14790K76675
15959D657918J174484R54934q04613j346413L45480M70952m79217M82055O0003
15950E515583j077481n49744r9791K71082J672072l76373R6794j76287O09651
15941E885506l67557J009366o19992L55121R1851m9350M93155o18130j519810
$$ y = [5364463, 5603003, 5308604, 4693160, 4760158, 4482384, 6323873, 6421592, 5729722, 4478305, 4626932, 5220820, 4163849, 4001050, 3439352, 5102701, 5032261, 4429640, 4803698, 5824668, 5129938, 4536054, 4038334, 3133174, 2797923, 4593340, 4347988, 4901379, 5444393, 5163762, 5338308, 5474666, 5628745, 5694513, 4401412, 4239820, 4301846, 5216387, 5098424, 4867340, 5475529, 4320527, 4481200, 4458440, 5096033, 4381243, 4657918, 5832402, 6787336, 5982723, 4636310, 4981790, 5452742, 4973525, 5455580, 5515583, 4438102, 3888358, 3788567, 4059649, 5731721, 5355348, 5452142, 5275855, 5885506, 5517949, 6527315, 5907323, 6262444, 6354295, 6304945, 6798100, 6179970, 4660160]
15932D660160j488124J228143R4697J271030K47380o96972j18156p41294k22305
15923D234559o1395O68969k70639L38446o82722L5326M27197M75319M58836q77853
15913D746043M38181O15838r40694L19289N48457m40865r203m09756K51393j451565
15903C667118J89223L51604k13483J637227j53444P21523q05912l84970k56165
15894D752721O1688M15359j101708L81135n80045K19095N95059n33293M81151
15885D691162J58552j067836R34743n66457Q81455K386n25255l2769j034283j22813
15875C318885J445094k05104J78944n56639L91796P09486N69820M38797O01365
15866F892444j484556p77929N88820l88447M46145J069211k58245j485988L55857
$$ y = [4660160, 3172036, 4400179, 4494876, 5765906, 6013286, 5316314, 5198158, 4456864, 4234559, 4173164, 4842133, 4571494, 4909940, 4227218, 4262544, 4689741, 5165060, 5623896, 4746043, 5184224, 5800062, 4859368, 5178657, 5727114, 5286249, 5277046, 4867290, 5118683, 3667118, 3856341, 4207945, 3994462, 5631689, 5478245, 6199768, 5393856, 5008886, 4752721, 4814409, 5229768, 4128060, 4509195, 3929150, 4148245, 4743304, 4210011, 4691162, 4849714, 3781878, 4716621, 4150164, 5031619, 5034005, 4508750, 4475981, 3441698, 3318885, 4763979, 4558875, 4737819, 4181180, 4572976, 5282462, 5852282, 6291079, 6892444, 5407888, 4629959, 5218779, 4830332, 5276477, 6345688, 6087443, 4601455, 4957312]
15857D957312L9885r72440j32934J971686K21511j65103n65660j071316k56392
15848D026549q1441n16117j48508N48182J673692r8391j247741N10539M26448
15839E093212l0052M8388K8832N82044j24925K81867L34938l8815l99751L1899
15829E807637L61276q74234m23076l55835K32309R08621O30218j67232j327031
15820D792653P21845O07242k19802n46512k20890N96956n70349J21077m069r71919
15810D306232Q42419L303k67021K99548j91885j61106o73413Q18585J502038n08358
15800E970342k042396n3536N55772M23156k71702O33218O89986K60890j030601
15791E135129L68910L62365k04951r87980R3251m68940K27049R03488j78566k72683
$$ y = [4957312, 4997197, 4024757, 3891823, 5863509, 6085020, 5919917, 5354257, 4282941, 4026549, 3945108, 3428991, 3280483, 3828665, 5502357, 5403966, 4156225, 4666764, 5093212, 5063160, 5111548, 5140380, 5722424, 5597499, 5879366, 6214304, 6175489, 5775738, 5807637, 6168913, 5294679, 4871603, 4515768, 4748077, 5656698, 6286916, 6119684, 4792653, 5514498, 6121740, 5901938, 5355426, 5134536, 5731492, 5161143, 5282220, 5278151, 4306232, 5148651, 5151954, 4884933, 5184481, 4992596, 4831490, 4158077, 4976662, 6478700, 5970342, 3927946, 3874410, 4430182, 4853338, 4581636, 5214854, 5904840, 6165730, 5135129, 5504039, 5866404, 5661453, 4673473, 4766724, 4297784, 4524833, 5428321, 5249755, 4977072]
15781D977072N65072K4147l54195o45819j02474L98168m96644N1694j021678O68843
15771D064186O86033j049450M97372P30653n26484M48131q606M90230o46102R88816
15761E674779M76329O43838j415907j246376M38291K09299J082192j02856j81544
15752E578045N11809L50213j087470k49723J438708N60714j102386p46653J074058
15743F327315l54394p73128K61955m18083o18493K65391n79445M74582J314556
15734E900256p75496n52117P22903j87713Q54878L00841N83274P65616j019327
15725F593115p44127l81510M41850K36594P23887m04275o38683p11453J45154
15716E260552n08105J059040R93513p58173l18278m01886j13311N32937q89747
$$ y = [4977072, 5542144, 5566291, 5212096, 4566277, 4463803, 4861971, 4365327, 4417021, 3395343, 4064186, 4750219, 3700769, 4198141, 4928794, 4402310, 4850441, 4841835, 5332065, 4685963, 5674779, 6151108, 6794946, 5379039, 4132663, 4570954, 4780253, 5862445, 5759589, 5578045, 6089854, 6440067, 5352597, 5102874, 6541582, 7102296, 5999910, 5253257, 6327315, 5972921, 5199793, 5461748, 5043665, 4425172, 4690563, 4111118, 4585700, 5900256, 5124760, 4572643, 5295546, 5107833, 5962711, 6263552, 6846826, 7612442, 6593115, 5848988, 5467478, 5909328, 6145922, 6869809, 6465534, 5826851, 5115398, 5260552, 4752447, 5811487, 6805000, 6046827, 5728549, 5326663, 5213352, 5746289, 4856542]
15707D856542n91929M51670L53338q33216n63556J410896J73877j140756l76733
15698C740133M96090o667o12814M06972L46852O85959N38936j39670l30721k78781
15688D846289r561J203789L21323r03962N81081M72245j72253j387380L45432
15679E297003k50585P10615K01661l62470r69717o48563p65495K63144k35774
15670C239819R36978K21893M12836K689k09430m71149Q08806O61047j366099n6000
15660D181390L96536l70836J560634J30718L01657N43579o23736L1479m0735l88249
15650E722437o45547J152384k30354j59344l00754M98765m72513j094129M33764
15641D904709J98384M78906N72574n47925O92875j310957K84437O83443j514591
$$ y = [4856542, 4264613, 4716283, 5069621, 4236405, 3672849, 5083745, 5257622, 4116866, 3740133, 4236223, 4229556, 3616742, 4023714, 4370566, 5056525, 5595461, 5455791, 5125070, 4846289, 4836728, 6040517, 6361840, 5457878, 6038959, 6511204, 6338951, 4951571, 5297003, 5046418, 5757033, 5958694, 5596224, 4626507, 3977944, 3212449, 3475593, 3239819, 4176797, 4398690, 4811526, 4814215, 4604785, 4133636, 4942442, 5603489, 4237390, 4181390, 4577926, 4207090, 5767724, 5898442, 6200099, 6743678, 6119942, 6151421, 6110686, 5722437, 5076890, 6229274, 5998920, 5839576, 5538822, 6037587, 5565074, 4470945, 4904709, 5103093, 5581999, 6154573, 5606648, 6299523, 4988566, 5273003, 5956446, 4441855]
15632D441855M42449J277239p6502R44701j468830q39122O86514k3000M47587
15623E832891l49143K87935m06994p10910N16871J57876P63623l62845N10342
15614F239646q70401o20136K63900l6695l88911J90458P04046m62829p15351R97416
15604E301143M88690q29385J364941l45998j644682P26259P2978k89576j3907
15595D830463m74908l882j104920L45140M96299K09834J103938q11592N35302
15586E125674P6617j34664K94247O73265p24770R43778Q5292j321768j390882
15577C626789J29593m00057J582756O57129n74380O98725n55302L59542L2746
15568E557541L7631N40447j16835K61375l52054o38289M5402j9878J380427j047488
$$ y = [4441855, 4884304, 6161543, 6085041, 7029742, 5560912, 4721790, 5408304, 5385304, 5832891, 5483748, 5771683, 5364689, 4653779, 5170650, 5328526, 6092149, 5729304, 6239646, 5369245, 4749109, 5013009, 4976314, 4587403, 4777861, 5481907, 5019078, 4303727, 5301143, 5789833, 4960448, 6325389, 5979391, 4334709, 5060968, 5133946, 4844370, 4830463, 4355555, 4351673, 3246753, 3591893, 4088192, 4298026, 5401964, 4590372, 5125674, 5202291, 5067627, 5361874, 6035139, 5310369, 6254147, 6339439, 5017671, 3626789, 3756382, 3356325, 4939081, 5596210, 5021830, 5720555, 5165253, 5524795, 5557541, 5595172, 6135619, 6018784, 6280159, 5928105, 5289816, 5335218, 5315340, 6695767, 5648279]
15558E648279n15982j45444K97403k18292P99971J82036p34384J782917Q0382
15549G176886j725572R91809n87108k8113N48372O72559l7571j101729j048284
15540D861249M73304n51717J11223n2964J167171j10987J4716q81717j290421
15531C739857J316457m8453r24906n68286j14889K14087R92126n55814o79461
15522C370718M52589k44782J171955l8504j381384M64207J229954j35350j17756
15513D771647o5925o12304m07723J71026k440J422747J99122j215637k68939Q87262
15503D878836M91163R53866L63571o39214j34090j241018P83785k16411K67081
15494E507569j62926O00158J0078K40316m57050j566585K17707M4606J08614L72462
$$ y = [5648279, 5132297, 4986853, 5284256, 5065964, 5865935, 6047971, 5313587, 7096504, 7176886, 5451314, 6443123, 5856015, 5827902, 6376274, 7048833, 7011262, 5909533, 4861249, 5334553, 4782836, 4894059, 4841095, 6008266, 5897279, 5911995, 5030278, 3739857, 5056314, 5007861, 4082955, 3514669, 3399780, 3613867, 4605993, 4050179, 3370718, 3823307, 3578525, 4750480, 4711976, 3330592, 3794799, 5024753, 4889403, 4771647, 4705722, 4093418, 3685695, 3856721, 3854281, 5277028, 5476150, 4260513, 3991574, 4878836, 5369999, 6323865, 6687436, 6048222, 5914132, 4673114, 5456899, 5240488, 5507569, 5344643, 5944801, 5954879, 6195195, 5738145, 4171560, 4389267, 4433873, 4542487, 4914949]
15484D914949j41458P4449Q27998k0496k61078N200l39450M02260N48902r5023
15474E916253q37490M83582O34943M31251p71320J75654m7894m65441Q60897R11324
15464G291759k57991j442300J090050J22222k52748r72177l5530m7502m33519
15455E062264J07713p79259J308021J109678j453705o97847o04502J08530J645142
15446E806035r28110m1811O43112k52564r41062L59575O30850M81458J086479
15437F843962n8133q99158o60452r0038Q31935M99322j043667n30388J226716
15428F120099K02631O6604p65951n54245j544626q1128J343155J112371r60619
15419D938291K25240N32452r6037p88986P28911L95774N4673J22125n37206N1927
$$ y = [4914949, 4773491, 4847940, 5675938, 5655442, 5394364, 5399564, 5060114, 5462374, 6011276, 5916253, 5078763, 5562345, 6197288, 6628539, 5857219, 6032873, 5984979, 5519538, 6380435, 7291759, 7033768, 5591468, 6681518, 6803740, 6550992, 5578815, 5543285, 5495783, 5062264, 5169977, 4390718, 5698739, 6808417, 5354712, 4656865, 4052363, 4160893, 5806035, 4877925, 4836114, 5479226, 5226662, 4285600, 4645175, 5276025, 5757483, 6843962, 6785829, 5886671, 5226219, 5136181, 5968116, 6467438, 5423771, 4893383, 6120099, 6322730, 6389334, 5623383, 5069138, 3524512, 3443384, 4786539, 5898910, 4938291, 5163531, 5695983, 5599946, 4810960, 5539871, 5935645, 5990318, 6112443, 5575237, 5627164]
15409E627164J217033O4361j380212J156035o74836N45274j637088N748j24703
15400D798776m20195Q41590R77855k81798J077144Q38299p55412J20918k5193
15391G171984j012801m23497k42768O76374M13303p25705J062768j53470j193684
15382E572504Q9260l76044J18746L25611k65094o6707K79907o28314J12044N80227
15372E742140j56046Q3885L24558q74135k63147n08828P4891M94018J97924o60743
15362D454517n22696J031021J085539n01481J10063K87188m48733k52581N81886
15353E824723J203649m84017o27664l64122j29313L82949j206412k06586P96838
15344E190045q31692N64448L9140N32935m81858j59584L88436Q7491J38050M26008
$$ y = [5627164, 6844197, 6908558, 5528346, 6684381, 6009545, 6554819, 4917731, 4923479, 4798776, 4378581, 5220171, 6198026, 5916228, 6993372, 7831671, 7076259, 7197177, 7171984, 6159183, 5735686, 5492918, 6169292, 6582595, 5856890, 6919658, 6766188, 5572504, 5661764, 5285720, 5404466, 5730077, 5464983, 5398276, 5678183, 5049869, 5161913, 5742140, 5586094, 5669979, 5994537, 5120402, 4857255, 4348427, 4423318, 4917336, 5115260, 4454517, 3931821, 4962842, 6048381, 5546900, 5656963, 5944151, 5495418, 5242837, 5824723, 7028372, 6544355, 5916691, 5552569, 5423256, 5806205, 4599793, 4393207, 5190045, 4358353, 4922801, 4961941, 5494876, 5013018, 4853434, 5241870, 5329361, 5467411, 5893419]
15334E893419J24319l97051Q53493k69911j180156l44352J13986J814071m7395
15325F560423q74628m68234O24247J196853J242j104927M31738L59673q51112
15316E875275j241944L76747q68812M24307J031250P5142k13409p2866p3645n32470
15306D779575M53380L58068N4588k77777L57440p4105n48519k48931k98674M02796
15296D957841J550243j89255p49836K24487J79013l05003M98577Q38201q35768
15287F168500r89532m88465J013328M30839m31101l2573j283585M75733R75880
15278E839024l61274q1510O65745l27002p205J94383L81323M77811k69422q37803
15268E674070j528110k76280J437941n4490k87685O08847m51022O78437K05584
$$ y = [5893419, 6017738, 5620687, 6474180, 6204269, 5024113, 4679761, 4793747, 6607818, 6560423, 5685795, 5217561, 5841808, 7038661, 7039903, 5934976, 6366714, 6726387, 5875275, 4633331, 5010078, 4141266, 4565573, 5596823, 5671965, 5458556, 5385690, 5312045, 4779575, 5232955, 5591023, 5645611, 5367834, 5725274, 5651169, 5102650, 4853719, 4555045, 4957841, 6508084, 6318829, 5568993, 5793480, 5972493, 5667490, 6166067, 7004268, 6168500, 5178968, 4690503, 5703831, 6134670, 5703569, 5670996, 4387411, 4863144, 5839024, 5477750, 5396240, 6061985, 5734983, 5727778, 5922161, 6303484, 6781295, 6511873, 5674070, 4145960, 3869680, 5307621, 5253131, 4965446, 5574293, 5123271, 5801708, 6007292]
15259F007292k069759K71622O57418N26267j71353o56707J324455R3491k44307
15250E738419r53029k62596J175164P35966n72724j478555m89708k41451J197190
15241D848676Q56215j192769P45291j078796L01J372516J18067m24522j205320
15232D039659Q28129O86227j546351O56092Q77200j350545J041781K96176j91194
15223E337174j291085Q97546K05462O15850L75027L9331N41145j298193m1473
15214E380784o8186R22427o62323O447N0448l6758K93921q72793J80091N04214
15204E698272P20518j069425j043212O02776P24754n86761J104132j133583j004852
15195D012619O53330J568518j123449O8636L47876M96n8277O58638k88174j005424
$$ y = [6007292, 3937533, 4209155, 4866573, 5392840, 5221487, 4564780, 5889235, 5982726, 5738419, 4785390, 4522794, 5697958, 6433924, 5861200, 4382645, 3892937, 3651486, 4848676, 5704891, 4512122, 5257413, 4178617, 4178918, 5551434, 5669501, 5244979, 4039659, 4867788, 5554015, 4007664, 4663756, 5540956, 4190411, 5232192, 5528368, 5337174, 4046089, 4943635, 5149097, 5764947, 6139974, 6179305, 6720450, 5422257, 5380784, 5312598, 6235025, 5572702, 5579149, 5629597, 5592839, 5886760, 5013967, 5194058, 5698272, 6418790, 5349365, 4306153, 4908929, 5633683, 5046922, 6151054, 5017471, 4012619, 4665949, 6234467, 5111018, 5179654, 5527530, 5528026, 5469749, 6128387, 5840213, 4834789]
15185D834789J435028r2860o32372j43795m22037O67930o06946j359013M37616
15176D118340M06138R2101J65147n00722J407015j75306j279024P69593q35162
15167D168120Q72140R1899Q53733O58285o84821o17699K43332j473134k78534
15158C833321O53757J602308J24522P07682k87272k81962j172864p41529n79443
15149C858520j33080J368102k1103n20895K7166P33765j67867m42063L08516J098173
15139F109234k66759J09845k40108l42845J63630P83198j35291j091728j92018
15130D897158j46209J28153N98440J419881l21185Q06893p82066o34584J79242
15121F145723o77657p34337m99504K09061k10884J885482J323568m98012O92799
$$ y = [4834789, 6269817, 6176957, 5544585, 5400790, 4978753, 5646683, 5039737, 3680724, 4118340, 4524478, 4616579, 4781726, 4281004, 5688019, 5512713, 4233689, 5003282, 4168120, 5040260, 5132159, 5985892, 6644177, 5959356, 5341657, 5584989, 4111855, 3833321, 4487078, 6089386, 6213908, 6921590, 6634318, 6352356, 5179492, 4437963, 3858520, 3725440, 5093542, 5072439, 4551544, 4578710, 5312475, 5144608, 4702545, 5011061, 6109234, 5842475, 5952320, 5712212, 5369367, 5532997, 6316195, 6180904, 5089176, 4897158, 4750949, 4879102, 5477542, 6897423, 6576238, 7383131, 6601065, 5966481, 6145723, 5468066, 4733729, 4234225, 4443286, 4232402, 6117884, 7441452, 6943440, 7636239]
15112G636239M9688o61522j296350N35714K5533N94996o42859j055480J300084
15103F486043k93993p45136M82305k53263j87662q07972r4105J650419P27166
15094F963802l82980j962558N74151m99519l64758N27392R67882L52223k54092
15085E921543n75067J45932J26876j72346N03467j4137o07086r57798N77720J372198
15075F321302n24732M33550J82209n86744J3276M73709k94739J52985j103753
15066E067063Q42441M15499j022102l67068n85349j86558L99262O00472p29222
15057D434438J06783L45085q66550J20941Q27273l65794J135980n36373q5820
15048E115963M35710o96657L51641N08094K96147o15374m33703N44583L97041
$$ y = [7636239, 7685927, 7024405, 5728055, 6263769, 6289302, 6884298, 6241439, 5185959, 6486043, 6192050, 5446914, 5929219, 5675956, 5488294, 4680322, 4586217, 6236636, 6963802, 6580822, 4618264, 5192415, 4692896, 4328138, 4855530, 5823412, 6175635, 5921543, 5346476, 5492408, 5619284, 5446938, 5950405, 5936268, 5329182, 4371384, 4949104, 6321302, 5796570, 6230120, 6412329, 5825585, 5838861, 6312570, 6017831, 6170816, 5067063, 5909504, 6325003, 5302901, 4935833, 4350484, 4163926, 4563188, 5163660, 4434438, 4541221, 4886306, 4019756, 4140697, 4967970, 4602176, 5738156, 5201783, 5115963, 5551673, 4855016, 5206657, 5714751, 6010898, 5395524, 4961821, 5506404, 5903445]
15039E903445r2362l83316j53818j089671J100067J20468M24050o23622j942430
15030C262811J165053K77493j33152K03306q64283k33611J853085J314737n30343
15021F315096m77635Q74922r4710j669762J289583R70366m51543r47835j036753
15012D771729J091294N85471r47660j490601J055502J139535m21265j41671o26391
15003E015943J44847R57112m65939Q59207N43002p31182j217776J40411L2128
14994E277753O36164J95940K06298L41323O04965j608583j102102J17508Q58049
14985E527315q28501J258470Q89175q22378P4675L14667M40528J99113o31690
14976F421374l08514j9912p88502K05760m02651Q77579q56069Q95126l05380L72062
$$ y = [5903445, 5811083, 5427767, 5273949, 4184278, 5284345, 5404813, 5828863, 5205241, 3262811, 4427864, 4705357, 4572205, 4775511, 3911228, 3677617, 5530702, 6845439, 6315096, 5837461, 6712383, 6617673, 4947911, 6237494, 7207860, 6756317, 5808482, 4771729, 5863023, 6448494, 5500834, 4010233, 5065735, 6205270, 5784005, 5642334, 5015943, 5160790, 6117902, 5651963, 6511170, 7054172, 6322990, 5105214, 5245625, 5277753, 5913917, 6109857, 6316155, 6657478, 7262443, 5653860, 4551758, 4669266, 5527315, 4698814, 5957284, 6846459, 6024081, 6098756, 6413423, 6853951, 7053064, 6421374, 6112860, 6092948, 5304446, 5510206, 5107555, 5985134, 5129065, 6024191, 5718811, 6090873]
14966F090873Q49972r38204r39655N53828m42081L61206M54444l03321m73352
14957E213710Q1585o29116J89677N18467O18829M220l42754L07427j976635L32941
14947D318351J756001l3574m14862k91079R67285q89873j618710q7859j28319
14938C577361J457244O9491R31951n37814j14494n67722P29999L65219R7653o89983
14928E318905l90153l20802R59092L06239m35439O33627l90056L10354j503468
14919D488299N3257J761707M24295j544491M12562K097787r56134j526013p11878
14910D499391m99125J349301l91103n20578j1621M24386J657510n49560j016936
14901D941665K91157l88112R47808j77491J10852k24420L49873N35481j72776
$$ y = [6090873, 6940845, 6002641, 5062986, 5616814, 5174733, 5535939, 5990383, 5687062, 5213710, 5295295, 4666179, 4855856, 5374323, 5993152, 5997372, 5654618, 5962045, 3985410, 4318351, 6074352, 6040778, 5625916, 5334837, 6302122, 5412249, 3793539, 3705680, 3577361, 5034605, 5104096, 6036047, 5498233, 5383739, 4816017, 5546016, 5911235, 6008888, 5318905, 4928752, 4607950, 5567042, 5873281, 5437842, 6071469, 5681413, 5991767, 4488299, 4541556, 6303263, 6727558, 5183067, 5595629, 7693416, 6737282, 5211269, 4499391, 4000266, 5349567, 4958464, 4437886, 4426265, 4850651, 6508161, 5958601, 4941665, 5232822, 4844710, 5792518, 5615027, 5725879, 5501459, 5851332, 6386813, 6214037]
14892F214037m85121K59303l98049O63026o56468N28495L22438n46558K47474
14883F148577K61831r77423p24238J046639q68222J91215J4273N70064K18682
14874E881398o62865M35744M37658P35054m24485L82780o80407k77865l31787
14865E495225p42762N53666n54986N13798M35076p00353J63496j22975j6836K46943
14855E270292j66361n70615K26490J229738O1463m24860O608l46221l10120Q34828
14845E811242M7368k39383m700j77399L88328J93128J4067j28978N26859p65880
14835E664652k02451M19551r36382J010988Q14492O05304o09844j41219o36625
14826E988466o70305J69256k55760O1600J67609M0488O75059m97044K12662J150416
$$ y = [6214037, 5728916, 5988219, 5590170, 6253196, 5596728, 6125223, 6447661, 5901103, 6148577, 6410408, 5432985, 4708747, 5755386, 4887164, 5078379, 5092652, 5662716, 5881398, 5218533, 5654277, 6091935, 6826989, 6402504, 6785284, 6104877, 5827012, 5495225, 4752463, 5306129, 4751143, 5264941, 5700017, 4999664, 5163160, 5040185, 5023349, 5270292, 5103931, 4533316, 4759806, 5989544, 6051007, 5626147, 5632755, 5286534, 4976414, 5811242, 5858610, 5619227, 5614527, 5437128, 5825456, 6018584, 6032651, 5903673, 6430532, 5664652, 5462201, 5881752, 4945370, 5956358, 6770850, 7376154, 6766310, 6625091, 5988466, 5318161, 5487417, 5231657, 5293257, 5460866, 5501354, 6176413, 5679369, 5892031, 7042447]
14816G042447j76607k77210o71424k37773j14919r35740j47128P58853J40110
14807E380609L92239m47246J56221j11514n5892k37101J14956J045688m65836
14798E772124o5453J33299R39213o38299M9568l05l78953l29136m40508N13797
14788E555347J752685j28482K98102j711001O6914k55610p95587N76669J637166
14779F996203N38068o25871n32861J12061o85014J64767J22140R6106j229460
14770D956139n08481R04785L4771J68218K88217N06621q52569k75516q30255Q31216
14760E223146o30788P80504Q41745N01701r19108k26978J45487k50611p80593
14751D684505J580565L37234j484854k99985N69163Q21869o81729K52937m33080
$$ y = [7042447, 6865840, 6588630, 5917206, 5679433, 5564514, 4628774, 4481646, 5240499, 5380609, 5772848, 5325602, 5481823, 5370309, 5314417, 5077316, 5192272, 6237960, 5772124, 5706671, 5839970, 6779183, 6140884, 6190452, 6190147, 5811194, 5482058, 5041550, 5555347, 7308032, 7179550, 7477652, 5766651, 5833565, 5577955, 4782368, 5359037, 6996203, 7534271, 6908400, 6375539, 6487600, 5802586, 5967353, 6089493, 6185599, 4956139, 4447658, 5352443, 5387214, 5555432, 5843649, 6350270, 5497701, 5222185, 4391930, 5223146, 4592358, 5372862, 6214607, 6716308, 5797200, 5570222, 5715709, 5465098, 4684505, 6265070, 6602304, 5117450, 4817465, 5386628, 6208497, 5526768, 5779705, 5346625]
14742E346625q7527O43289l78860l94082M11467L38320R4365o04023Q15836L64465
14732F549875j024481j123887q09427K66546R45841J164614m7159j6338j34805
14723E770779L28284K78409o07581M40004O13268j129230N55409M78241q95312
14714E832271k03471K09742K90217N08498q08157k00661J038076q77934n79190
14705E209391m8619R06629J110595j74472K39828j22451j182776L15663O03578
14696F857366Q22441R3509r31034k34588j10020K48153o44241l05858j71628j33127
14686E490973K39697j015222K58499K64292M97597K09201N26463m05057l27893
14677E738550L14535l59429K76814n3381N03757j482326o54290M15280L5778p0069
$$ y = [5346625, 5259098, 5902387, 5523527, 5129445, 5540912, 5879232, 5973597, 5369574, 6185410, 6549875, 5525394, 4401507, 3592080, 3858626, 4804467, 5969081, 5921922, 5905584, 5770779, 6099063, 6377472, 5769891, 6209895, 6823163, 5693933, 6249342, 6727583, 5832271, 5628800, 5838542, 6128759, 6637257, 5829100, 5628439, 6666515, 5788581, 5209391, 5160772, 6067401, 7177996, 7003524, 7243352, 7120901, 5938125, 6253788, 6857366, 7679807, 7773316, 6842282, 6607694, 6497674, 6745827, 6101586, 5795728, 5624100, 5490973, 5730670, 4715448, 4973947, 5238239, 5735836, 5945037, 6471500, 6066443, 5738550, 6053085, 5693656, 5970470, 5917089, 6420846, 4938520, 4284230, 4699510, 4735288, 4665219]
14667D665219J517059J97173O8613k92795N24679M83447k61912j043028L2388
14658E890843m9946l35281n1427l74106J9986o48710P12419J35720j47573K66025
14648E417950p72617Q34978M82865N68872L11086r86459j506907n23836r0032
14639C735900P83798R94023M81435K6758o81946L75037K6094k12047K14223O55961
14629F399236j125244j38525R86343p59764m85190K70417J675901K80448k61763
14620F841859L74965q16941k75868o42182M23751L14915j01168p7312M19531K18314
14610F679864M2247l02360n63485r5315Q9728j16745O56103L48002k61482J37168
$$ y = [4665219, 6182278, 6379451, 6448064, 6155269, 6679948, 7163395, 6901483, 5858455, 5890843, 5840897, 5505616, 5454189, 5080083, 5100069, 4451359, 5163778, 5299498, 5151925, 5417950, 4645333, 5480311, 5963176, 6532048, 6843134, 5856675, 4349768, 3825932, 3735900, 4519698, 5513721, 5995156, 6021914, 5339968, 5715005, 5741099, 5529052, 5743275, 6399236, 5273992, 5135467, 6121810, 5362046, 4876856, 5147273, 6823174, 7103622, 6841859, 7216824, 6399883, 6124015, 5481833, 5905584, 6220499, 6119331, 6042019, 6461550, 6679864, 6722111, 6419751, 5856266, 5760951, 5850679, 5733934, 6390037, 6738039, 6476557, 6613725]
$$ [...]
##END NTUPLES=NMR SPECTRUM
##END=
