##TITLE=1H_EC-3252(II-22)
 CDCl3,8 sc, 
 31.03.2021
##JCAMPDX= 6.0         $$ Bruker NMR JCAMP-DX V2.0
##DATA TYPE= NMR SPECTRUM
##DATA CLASS= NTUPLES
##ORIGIN= UXNMR, Bruker Analytische Messtechnik GmbH
##OWNER= root
$$ XWIN-NMR		Version 3.5
$$ Wed Mar 31 11:57:19 2021 Russian Standard Time (UT+4h)  she@DPX200
##.OBSERVE FREQUENCY= 200.131506
##.OBSERVE NUCLEUS= ^1H
##.ACQUISITION MODE= SIMULTANEOUS
##.ACQUISITION SCHEME= undefined
##.AVERAGES= 8
##.DIGITISER RES= 18
##SPECTROMETER/DATA SYSTEM= spect
##.PULSE SEQUENCE= zg30
##.SOLVENT NAME= CD3CN
##.SHIFT REFERENCE= (INTERNAL, CD3CN, 0, 15.9782)
##AUDIT TRAIL= $$ (NUMBER, WHEN, WHO, WHERE, WHAT)
$$ ##TITLE= Audit trail, XWIN-NMR		Version 3.5
$$ ##JCAMPDX= 5.01
$$ ##ORIGIN= Bruker BioSpin GmbH
$$ ##OWNER= she
$$ F:/spectra/data/she/nmr/H-F/1/pdata/1/auditp.txt
$$ ##AUDIT TRAIL=  $$ (NUMBER, WHEN, WHO, WHERE, WHAT)
(   1,<2021-03-31 11:55:28.78 +0400>,<she>,<DPX200>,
      <created by zg, POWCHK disabled, PULCHK disabled
       configuration hash MD5:
       00 E9 B6 7A A2 85 ED C7 34 08 36 98 17 FE 4E 26
       data hash MD5: 16K
       11 BC 49 7A 21 32 FF CB 5C 23 10 6E A5 CC 44 F7>)
(   2,<2021-03-31 11:55:36.53 +0400>,<she>,<DPX200>,
      <Start of raw data processing
       efp BC_mod = 2 LB = 0.24 FT_mod = 6 PKNL = 1 PHC0 = -11124.07 PHC1 = 13.40093 SI = 16K 
       data hash MD5: 16K
       85 22 AC D9 24 16 35 5D FC 0D E4 4E 66 8F A0 A2>)
(   3,<2021-03-31 11:55:55.18 +0400>,<she>,<DPX200>,
      <pk PHC0 = -4.354135 PHC1 = 12.8 
       data hash MD5: 16K
       33 20 9B FA DF A6 6A DF 9C 71 9B 9E 03 67 25 9D>)
(   4,<2021-03-31 11:55:58.34 +0400>,<she>,<DPX200>,
      <abs ABSG = 5 
       data hash MD5: 16K
       5D C1 03 B2 80 E8 10 FF 60 AE 88 5A F0 D6 25 14>)
(   5,<2021-03-31 11:56:44.35 +0400>,<she>,<DPX200>,
      <pk PHC0 = -10.44327 PHC1 = 4.599999 
       data hash MD5: 16K
       D4 FB CB CC 62 BF 2E 66 BA 6C AE C3 CE 77 C8 54>)
(   6,<2021-03-31 11:56:48.03 +0400>,<she>,<DPX200>,
      <abs ABSG = 5 
       data hash MD5: 16K
       EB 43 42 31 B6 51 EB DD 20 16 DC A8 29 95 02 4F>)
$$ ##END=
$$ 
$$ hash MD5
$$ 11 70 C8 AC BD 7C 11 2A 24 A3 49 95 A6 07 F4 AA
##$RELAX= 
##$RELAX= 
##$RELAX= 
##$RELAX= 
##$RELAX= 
##$RELAX= 
$$ Bruker specific parameters
$$ --------------------------
##$DU= <F:/spectra>
##$EXPNO= 1
##$NAME= <H-F>
##$PROCNO= 1
##$TYPE= <nmr>
##$USER= <she>
##$AMP= (0..31)
100 100 100 100 100 100 100 100 100 100 100 100 100 100 100 100 100 100 
100 100 100 100 100 100 100 100 100 100 100 100 100 100 
##$AQSEQ= 0
##$AQ_mod= 1
##$AUNM= <au_zg>
##$AUTOPOS= <>
##$BF1= 200.13
##$BF2= 200.13
##$BF3= 200.13
##$BF4= 200.13
##$BF5= 200.13
##$BF6= 200.13
##$BF7= 200.13
##$BF8= 200.13
##$BYTORDA= 1
##$CFDGTYP= 0
##$CFRGTYP= 5
##$CHEMSTR= <none>
##$CNST= (0..31)
1 1 145 1 1 1 1 1 1 1 1 1 1 1 1 1 1 1 1 1 1 1 1 1 1 1 1 1 1 1 1 1 
##$CPDPRG= <>
##$CPDPRG1= <>
##$CPDPRG2= <>
##$CPDPRG3= <>
##$CPDPRG4= <mlev>
##$CPDPRG5= <mlev>
##$CPDPRG6= <mlev>
##$CPDPRG7= <mlev>
$$ [...]
##$SUBNAM3= <"">
##$SUBNAM4= <"">
##$SUBNAM5= <"">
##$SUBNAM6= <"">
##$SUBNAM7= <"">
##$SUBNAM8= <"">
##$SUBNAM9= <"">
##$SW= 16.9725357007746
##$SWIBOX= (0..15)
0 0 2 0 0 0 0 0 0 0 0 0 0 0 0 0 
##$SW_h= 3396.73913043478
##$TD= 16384
##$TD0= 1
##$TE= 0
##$TE2= 300
##$TE3= 300
##$TEG= 300
##$TL= (0..7)
0 120 120 120 120 120 120 120 
##$TP= (0..7)
150 150 150 150 150 150 150 150 
##$TP07= 0
##$TPNAME0= <>
##$TPNAME1= <>
##$TPNAME2= <>
##$TPNAME3= <>
##$TPNAME4= <>
##$TPNAME5= <>
##$TPNAME6= <>
##$TPNAME7= <>
##$TPOAL= (0..7)
0.5 0.5 0.5 0.5 0.5 0.5 0.5 0.5 
##$TPOFFS= (0..7)
0 0 0 0 0 0 0 0 
##$TUNHIN= 0
##$TUNHOUT= 0
##$TUNXOUT= 0
##$USERA1= <user>
##$USERA2= <user>
##$USERA3= <user>
##$USERA4= <user>
##$USERA5= <user>
##$V9= 5
##$VALIST= <valist>
##$VCLIST= <CCCCCCCCCCCCCCC>
##$VD= 0
##$VDLIST= <DDDDDDDDDDDDDDD>
##$VPLIST= <PPPPPPPPPPPPPPP>
##$VTLIST= <TTTTTTTTTTTTTTT>
##$WBST= 1024
##$WBSW= 4
##$XGAIN= (0..3)
0 0 0 0 
##$XL= 0
##$YL= 0
##$YMAX_a= 58182
##$YMIN_a= -74898
##$ZGOPTNS= <>
##$ZL1= 120
##$ZL2= 120
##$ZL3= 120
##$ZL4= 120
##$ABSF1= 15.97817
##$ABSF2= -0.9944916
##$ABSG= 5
##$ABSL= 3
##$ALPHA= 0
##$AQORDER= 0
##$ASSFAC= 0
##$ASSFACI= 0
##$ASSFACX= 0
##$ASSWID= 0
##$AUNMP= <proc_1d>
##$AZFE= 0.1
##$AZFW= 0.1
##$BCFW= 0
##$BC_mod= 2
##$BYTORDP= 0
##$COROFFS= 0
##$CY= -3
##$DATMOD= 1
##$DC= 0
##$DFILT= <>
##$DTYPP= 0
##$F1P= 0
##$F2P= 0
##$FCOR= 1
##$FTSIZE= 16384
##$FT_mod= 6
##$GAMMA= 0
##$GB= 0
##$INTBC= 1
##$INTSCL= 2.992141e-10
##$ISEN= 128
##$LB= 0.24
##$LEV0= 0
##$LPBIN= 0
##$MAXI= 10000
##$MC2= 0
##$MEAN= 0
##$ME_mod= 0
##$MI= 1.114404
##$NCOEF= 0
##$NC_proc= -9
##$NLEV= 6
##$NOISF1= 3.799351
##$NOISF2= 2.8
##$NSP= 0
##$NTH_PI= 0
##$NZP= 0
##$OFFSET= 15.97817
##$PC= 1
##$PHC0= -11138.86
##$PHC1= 30.80093
##$PH_mod= 1
##$PKNL= yes
##$PPARMOD= 0
##$PSCAL= 0
##$PSIGN= 0
##$REVERSE= no
##$SF= 200.130006657494
##$SI= 16384
##$SIGF1= 3
##$SIGF2= 2
##$SINO= 5.538805
##$SIOLD= 16384
##$SREGLST= <1H.CDCl3>
##$SSB= 0
##$STSI= 16384
##$STSR= 0
##$SW_p= 3396.73913043479
##$SYMM= 0
##$S_DEV= 0
##$TDeff= 16384
##$TDoff= 0
##$TI= <>
##$TILT= no
##$TM1= 0
##$TM2= 0
##$TOPLEV= 0
##$USERP1= <user>
##$USERP2= <user>
##$USERP3= <user>
##$USERP4= <user>
##$USERP5= <user>
##$WDW= 1
##$XDIM= 16384
##$YMAX_p= 387476328
##$YMIN_p= -3064896
$$ End of Bruker specific parameters
$$ ---------------------------------
##NTUPLES= NMR SPECTRUM
##VAR_NAME=  FREQUENCY,     SPECTRUM/REAL,   SPECTRUM/IMAG
##SYMBOL=    X,             R,               I
##VAR_TYPE=  INDEPENDENT,   DEPENDENT,       DEPENDENT
##VAR_FORM=  AFFN,          ASDF,            ASDF
##VAR_DIM=   16384,         16384,           16384
##UNITS=     HZ,            ARBITRARY UNITS, ARBITRARY UNITS
##FACTOR=    0.207333158178282, 1,           1
##FIRST=     3197.7113475054, 0,             0
##LAST=      -199.027782929387, 0,           0
##MIN=       -199.027782929387, -3064896,    0
##MAX=       3197.7113475054, 387476328,     0
$$ Real data points
##PAGE= N=1
##DATA TABLE= (X++(R..R)), XYDATA
$$ [...]
3635A7103454o9781q67259j45929P82006N05218m60566R78028K50528k73538l08466
3625A7493695Q69473k67318r07851j276162P21315o41791J069700n6592j206826
3616A5797643j415358J3262l5776J016202R29223o03206j886519k83297J14795
3607A3646969K25346l12281n27344j03017N67108r23263q71153O46987P3548Q27360
3597A3250260j40152k20524N51607n27551R5037K64003m41991j08581m37416j58406
3587A2126286m0536O64079N811o87336J097164l64947N1652O24913q40004N04817
3577A3141899k09627m61547P15613l01778p51522n61625o49381k98369J93L20992
3567A0944848J267746j85106l11451K0325P35094M37088q86886m32394O36289
$$ plain form
3635 17103454 17033673 16166414 16020485 16802491 17307709 16847143 17825171 18075699 17802161 17493695
3625 17493695 18363168 18095850 17187999 15911837 16633152 15991361 17061061 17004469 15797643
3616 15797643 14382285 14395547 14359771 15375973 16305196 15701990 13815471 13532174 13646969
3607 13646969 13872315 13560034 13032690 12929673 13496781 12573518 11702365 12349352 12422900 13250260
3597 13250260 13110108 12889584 13441191 12913640 13008677 13272680 12830689 12722108 12284692 12126286
3587 12126286 12085750 12749829 12755640 12068304 13165468 12800521 12852173 13477086 12637082 13141899
3577 13141899 12932272 12470725 13186338 12884560 12133038 11571413 10922032 10623663 10623856 10944848
3567 10944848 12212594 12027488 11716037 11736362 12471456 12908544 12021658 11589264 12225553
3558A2225553n37931p1344P69422L53561K1086o11128P45218m73285O92082K2595
3548A3135829n51885K89125J341013R07093m35784q65018R36236j5754j0204O20672
3538A5351323k90242o9564k039955k36852R44860j94480L80787j41220Q66925
3529A4571582Q73566M9183J105916J501196m52933Q9223M33186k37007k493J711475
3519A9642894K999J87176P20727q47267m84692M43609m92960n8616l23269N939
3509A8796540j032645K41682J96132p55981p44542N35146R18555N35101K7114
3500A8717102j57956J395814Q98352P5388O20828Q19900M66543J470545j47490
3491B4159026j121005k376292k098087l47486j815557M27638l362k13093j202444
$$ plain form
3558 12225553 11687622 11616278 12385700 12739261 12760347 12149219 12894437 12421152 13113234 13135829
3548 13135829 12583944 12873069 14214082 15121175 14685391 13820373 14756609 14740855 14730651 15351323
3538 15351323 15061081 14991517 12951562 12714710 13659570 13465090 13845877 13704657 14571582
3529 14571582 15445148 15494331 16600247 18101443 17648510 17737733 18170919 17933912 17931419 19642894
3519 19642894 19645893 19833069 20553796 19706529 19221837 19665446 19172486 19113870 18790601 18796540
3509 18796540 17763895 18005577 18201709 17445728 16701186 17236332 18154887 18689988 18717102
3500 18717102 18559146 19954960 20853312 20928700 21549528 22369428 22835971 24306516 24159026
3491 24159026 23038021 20661729 18563642 18216156 16400599 16828237 16824875 16611782 15409338
3482A5409338j051890k03805j92265k16586O27678P17579l39585Q1438j88771
3473A4643131q19023L08361n28013m59357L50732J60819M49308o1068N92631K06704
3463A4844225M11404K08681o85842L21126m17311L62822M66953m41949O70539
3454A5740648K38209Q35372K63474M77805r81505k6129L51369K02583M57004Q68316
3444A8427146j90674j497249k32909R96087k33004j15217L37327N05163l27498
3435A7669172L00335q75404K74417m2714q04113o8600N46506K43530M69181m05034
3425A7307276P25108J001158Q34141q54518K42845P67102k6905j445361M31500
3416A8982346P98041q59486J302871L85359j185122R42190m12517n9041m95924
$$ plain form
3482 15409338 14357448 14153643 13961378 13744792 14372470 15090049 14750464 14831902 14643131
3473 14643131 13824108 14132469 13604456 13145099 13495831 13656650 14105958 14044890 14637521 14844225
3463 14844225 15255629 15464310 14778468 15099594 14682283 15045105 15512058 15070109 15740648
3454 15740648 15978857 16814229 17077703 17555508 16574003 16547874 16899243 17101826 17558830 18427146
3444 18427146 18236472 16739223 16506314 17502401 17269397 17154180 17491507 17996670 17669172
3435 17669172 17969507 17094103 17368520 17325806 16521693 16453093 16999599 17243129 17712310 17307276
3425 17307276 18032384 19033542 19867683 19013165 19256010 20023112 19996207 18550846 18982346
3416 18982346 19780387 18920901 20223772 20609131 19424009 20366199 19953682 19894641 19398717
3407A9398717M19510R01404p52370R92490m87995j31923j94589J140739M75497
3398B1761480j813147j418913P19612J302417J84799n91952q4466R33618o47488
3389B0345960k54200K46092m47717m91185O37356M64567P71456q37400R24399
3380B1359328j02261p61384J637641L01843j84448m86643M42199L77350j10466
3371B2473159L49519j121006j01686m79825m45190R11050M69881K10969p05405
3362B1561466j52735O98722N46158o20357N52459N51551Q09076j942356L84382
3353B2388366J144145J090057L87037P86766j896725J211463J270841J030006
3345B7411956j32951K03189k2575R98538k25058O30375M53941p93016k92606J840342
$$ plain form
3407 19398717 19818227 20719631 19967261 20959751 20471756 20339833 20145244 21285983 21761480
3398 21761480 19948333 18529420 19249032 20551449 20736248 20144296 20059830 20993448 20345960
3389 20345960 20091760 20337852 19890135 19398950 20036306 20500873 21272329 20434929 21359328
3380 21359328 21257067 20495683 22133324 22435167 22250719 21764076 22206275 22583625 22473159
3371 22473159 22822678 21701672 21599986 21120161 20674971 21586021 22055902 22266871 21561466
3362 21561466 21408731 22107453 22653611 22033254 22585713 23137264 23946340 22003984 22388366
3353 22388366 23532511 24622568 25009605 25796371 23899646 25111109 26381950 27411956
3345 27411956 27279005 27482194 27459619 28458157 28233099 28863474 29317415 28524399 28231793 30072135
3335C0072135J200926j434377L99886J246234J372929M38242J302512j63163N93020
3326C5028344K339254J289609k17224m27568J290090j448389J338666J789190
3318D0981972J065793K261149O39710J393954J797892R44663O52719L6961j524342
3309D8250471p47063j351758j351437l231922k935540j615885o94811j655231
3301C4666824K2039j95489k117357r74077K46299j785117P94756M3784n80118
3292C0121544l71475j9997q80565J29195M76156j71381j399481j226556N14790
3283B7172230j258397l61464n20729j12752j150504J73203l24178r16769k84531
3274B2416109J083117P86205j104470p10770L69379K31161N00301o04203l82318
$$ plain form
3335 30072135 31273061 29838684 30238570 31484804 32857733 33295975 34598487 34435324 35028344
3326 35028344 37367598 38657207 38439983 38012415 39302505 37854116 39192782 40981972
3318 40981972 42047765 44308914 44948624 46342578 48140470 49085133 49737852 49774813 48250471
3309 48250471 47503408 46151650 44800213 41568291 38632751 37016866 36322055 34666824
3301 34666824 34688863 34493374 32376017 31401940 31648239 29863122 30657878 30701662 30121544
3292 30121544 29750069 29730072 28849507 28978702 29454858 29283477 27883996 26657440 27172230
3283 27172230 25913833 25552369 25031640 24918888 23768384 23941587 23617409 22700640 22416109
3274 22416109 23499226 24285431 23180961 22470191 22839570 23070731 23571032 22966829 22584511
3265B2584511J055655q42074L12279J73606j441549j518767O76027l59202R47820
3256B1588306Q35229M59661o18010N52145m02046j578935L61622P95890l64201
3247B1629661Q47221J190274p97525j288468m51458J958707J53832N26011K29299
3238B3997554j365212L74686N16452P76835L35225o87573O28571Q7634q32645
3229B3831527j046k11267m80427J94072J557458n55261O38871l3338l12477j033247
3219B3594865J103308J091471j38702l56097l31999N53741r3249K54917L3227
3210B5711482M09974M78441R53133K21673l96908J97892N0086m66826r11775N50112
3200B6797284M31517k34672k44157N94641M02377j043767j223654o17496L54765
$$ plain form
3265 22584511 23640166 22798092 23110371 23283977 21842428 20323661 20999688 20640486 21588306
3256 21588306 22423535 22883196 22265186 22817331 22415285 20836350 21197972 21993862 21629661
3247 21629661 22476882 23667156 22869631 21581163 21129705 23088412 23242244 23768255 23997554
3238 23997554 22632342 23007028 23523480 24300315 24635540 23947967 24576538 24664172 23831527
3229 23831527 23830481 23619214 23138787 23332859 24890317 24335056 24973927 24940589 24628112 23594865
3219 23594865 24698173 25789644 25650942 25294845 24962846 25516587 25423338 25678255 25711482
3210 25711482 26121456 26599897 27553030 27774703 27377795 27575687 27625773 27158947 26247172 26797284
3200 26797284 27228801 26994129 26749972 27344613 27746990 26703223 25479569 24862073 25216838
3191B5216838N05974L16395q56005k68255P17850K35327n8087k29513n32838R19114
3181B5966800L97478J390812l7871q0541L85193J260647l24049k84279L76803
3172B9050993J26616L70736J68676M32652L80659k74424L12417M00360j47211
3163C0821474j4651O73054J368487Q3526m49203r235K90987N06369M97492l46420
3153C3421880k17609P26527j28554q18528j31305N01232Q6231P05453L71750R25792
3143C5442869j09239P16295m26697R03470P07045k20955J83146J734294J10163
3134C9040391O67562j53881R4885Q4806L74847p61701q54413L71178j261050j169399
3124C6433225J537081o29667j96810n46697K31821m05677k17458J822958j420077
$$ plain form
3191 25216838 25722812 26039207 25183202 24914947 25632797 25868124 25810037 25580524 25047686 25966800
3181 25966800 26364278 27755090 27717219 27636678 28021871 29282518 28958469 28674190 29050993
3172 29050993 29177609 29548345 29717021 30149673 30530332 30255908 30568325 30968685 30821474
3163 30821474 30806823 31479877 32848364 32931890 32482687 32473452 32764439 33270808 33768300 33421880
3153 33421880 33204271 33930798 33802244 32983716 32852411 33353643 33439874 34145327 34517077 35442869
3143 35442869 35333630 36049925 35623228 36526698 37233743 37012788 37195934 38930228 39040391
3134 39040391 39707953 39554072 39648957 39733763 40108610 39346909 38492496 38863674 37602624 36433225
3124 36433225 37970306 37340639 37143829 36597132 36828953 36423276 36205818 38028776 36608699
3115C6608699M87174J272180j33117k001272J270675K8893j489589k47859k19359
3106C5576425m9413r9165j082543n295M4775Q6045q10098Q875j83067O88959J008399
3095C5183897m96805o54538N95768N95169J379866K25300j802687O38433K29366
3086C5893769l55812m72227k63295Q04883r86482M38410M10750J354238M75693
3077C7299927R46944j160481q85101N41719J200976J150676J4829J58275J113371
3068D0381135q29958L61327P05385J425182k19996q95789J22257N59703R31219
3059D2540465L33125N32661K66722J440093P39401L468Q05460J064644o36716
3050D7089323P06995O29736l53792M05569R00683Q95830J10843N16852j53259
$$ plain form
3115 36608699 37095873 38368053 38234936 36233664 37504339 37533232 36043643 35795784 35576425
3106 35576425 35527012 35427847 34345304 34340009 34384784 34470829 33660731 33669606 33486539 34175498 35183897
3095 35183897 34687092 34032554 34628322 35223491 36603357 36828657 35025970 35664403 35893769
3086 35893769 35537957 35065730 34802435 35607318 34620836 35059246 35469996 36824234 37299927
3077 37299927 38246871 37086390 36201289 36743008 37943984 39094660 39109489 39267764 40381135
3068 40381135 39551177 39912504 40617889 42043071 41823075 40927286 41049543 41609246 42540465
3059 42540465 42873590 43406251 43672973 45113066 45852467 45855935 46661395 47726039 47089323
3050 47089323 47796318 48426054 48072262 48477831 49378514 50274344 50385187 50902039 50748780
3041E0748780k39265M19809J041738J211574o4704M67007R4673P28777J540841
3032E5949230Q73943P31355Q8672N64606K26433Q39268K12734R06984P04397j374076
3022E9723546R07368n57711K12768N80496m45540J499123q9016K87486J810603
3013F3929123m78584j034087J286865N42588m29099K45682k53305j16876k83848
3004F3408459L71729q04495m471l24032K8192k64038L40823Q631j386637j569665
2994E9804496k4624j2815n93405K31512L46593l35355K61591j468332j483014
2985E6726647q9981j93258r10852l17157N51654J52764N44625k04419M9649R02493
2975E7212165Q18817j216129J64662O37554J330404J198982o31562j410338Q14861
$$ plain form
3041 50748780 50509515 50929324 51971062 53182636 53117932 53584939 53679612 54408389 55949230
3032 55949230 56823173 57554528 57643200 58207806 58434239 59273507 59486241 60393225 61097622 59723546
3022 59723546 60630914 60073203 60285971 60866467 60420927 61920050 61831034 62118520 63929123
3013 63929123 63450539 62416452 63703317 64245905 63816806 64062488 63809183 63692307 63408459
3004 63408459 63780188 62975693 62971222 62647190 62675382 62411344 62752167 62760798 61374161 59804496
2994 59804496 59779872 59767057 59173652 59405164 59751757 59416402 59677993 58209661 56726647
2985 56726647 56636666 56443408 55532556 55215399 55767053 55919817 56464442 56260023 56309672 57212165
2975 57212165 58030982 56814853 56979515 57617069 58947473 60146455 59514893 58104555 58919416
2966E8919416R60690J610925K285761K18216N09543M67313K347613L540789K260875
2957G3121141L63314J378162J768124J686696J813824K372893L224344K135697
2949H7864195K238106J445313K447388J454252J595345k69621J47330J275456
2941I8197764L44857j66998J24115m51003j427263J39489J01017O91013J38190
2932I7691181O38831j084292m90395j119937N53328q90261q73866j652987k241552
2923I0530050n08962l24981n73214k110362k021639j033325r12445Q43647p60107
2914H3128662j026715q11052q21076r60101p97212p50031m38016K0602l97040
2905G7148021j0243r6349p29136m24192p71918q56852K53996j74369K80511K53298
$$ plain form
2966 58919416 59880106 61491031 63776792 63995008 64504551 64971864 67319477 70860266 73121141
2957 73121141 73484455 74862617 76630741 78317437 80131261 82504154 85728498 87864195
2949 87864195 90102301 91547614 93995002 95449254 97044599 96774978 96922308 98197764
2941 98197764 98542621 98375623 98499738 98048735 96621472 96760961 96861978 97552991 97691181
2932 97691181 98330012 97245720 96755325 95635388 96188716 95298455 94424589 92771602 90530050
2923 90530050 90021088 89696107 89122893 87012531 84990892 83957567 83045122 83888769 83128662
2914 83128662 82101947 81290895 80469819 79509718 78712506 77962475 77524459 77545061 77148021
2905 77148021 77137778 77041429 76312293 75888101 75116183 74259331 74513327 74338958 74619469 74872767
2895G4872767K49863j009808J140852Q62035q21088R14570R54937j78733K3828
2886G7009223N95852J32275P40519J69422j019559q96435l35721l13660j115545
2877G4966371o45832q2726P4575j413530n20799j576179j3286N16161o97048k043774
2867F8563933j249339j772624k027129O95713r62791k232249m96835r63750j109077
2858E8445852q55253k156934k125497j384068j192659l21472m13899j029400l40020
2849D8626650r59876j234688p23105l07085j638947j055086j558590j882830K73014
2840C9539457q05022J19847n47050r25825l07306J400394p10612o85583j349835
2831C5728465o83195m68160r26544K38074R78291j028504o98556o80128j05532
$$ plain form
2895 74872767 75122630 74112822 75253674 76115709 75294621 76209191 77164128 76985395 77009223
2886 77009223 77605075 77737350 78477869 78647291 77627732 76731297 76395576 76081916 74966371
2877 74966371 74320539 74237813 74312388 72898858 72378059 70801880 70788594 71304755 70607707 68563933
2867 68563933 67314594 65541970 63514841 64210554 63247763 61015514 60518679 59554929 58445852
2858 58445852 57590599 55433665 53308168 51924100 50731441 50409969 49996070 48966670 48626650
2849 48626650 47666774 46432086 45708981 45401896 43762949 42707863 41149273 39266443 39539457
2840 39539457 38734435 38854282 38307232 37381407 37074101 38474495 37763883 37078300 35728465
2831 35728465 35045270 34577110 33650566 33888640 34866931 33838427 33139871 32459743 32354211
2822C2354211r42884j458205K156672K27219k96651p93333p66128P57595r12833
2813C0325663P35302M23655o71486j698300J58200Q64654j218017m90428j89193
2804B8240050L63787j15248m68708O12689L56659q93580j288641j187348J388633
2795B7008293L16815r60197l50101M504l39448k55538J35457L43677j2062J86176
2785B6077576o34956Q31872J97157L08532n08420j40828o9954p91436r95513M18554
2775B4692584K018530q02795j047839o26708J012733M13197q97073L87267l96961
2766B4752935P6303p96153K38957K66036M22843L06149j153885n10992J13566
2757B3715759r37673P91123J211694m40703j467764J093229k16403p17888j274409
$$ plain form
2822 32354211 31411327 29953122 32109794 32337013 32040362 31247029 30480901 31238496 30325663
2813 30325663 31060965 31484620 30813134 29114834 29273034 30137688 28919671 28429243 28240050
2804 28240050 28603837 28488589 28019881 28632570 28989229 28095649 26807008 25619660 27008293
2795 27008293 27325108 26364911 26014810 26019314 25679866 25424328 25559785 25903462 25891400 26077576
2785 26077576 25442620 26274492 26471649 26780181 26271761 26130933 26060979 25269543 24274030 24692584
2775 24692584 26711114 25908319 24860480 24233772 25246505 25659702 24762629 25149896 24752935
2766 24752935 24829238 24033085 24272042 24538078 24960921 25267070 24113185 23602193 23715759
2757 23715759 22778086 23569209 24780903 24340200 22872436 23965665 23749262 23031374 21756965
2748B1756965J206843R46691O43475m79104j522779K88898l82576j520493N09868
2739B1447788J118577r02436O68349J732893n61445r48484K67081N03000O78200
2730B4003523k93712M12854j638045M28544P70710O22537o51442l85847J309359
2721B4578481j98250j22106N98635q09293N85852o9151M06024Q5019N90152J358248
2711B7003611j128077j22896k26252k2103l26030n70119J15501J46583N07535
2702B5377753J17446m98587J47478j304088k56547N37372R3226J94481j98906
2693B4209628N65182o21368K08882N57819p28342k84891J10104J45033O38005
2684B4800052n4912m81072O67958K30010J202298P99044j59915k62360p82357
$$ plain form
2748 21756965 22963808 23910499 24553974 24074870 22552091 22840989 22458413 20937920 21447788
2739 21447788 22566365 21663929 22332278 24065171 23503726 22555242 22822323 23325323 24003523
2730 24003523 23709811 24122665 22484620 22913164 23683874 24306411 23654969 23269122 24578481
2721 24578481 24380231 24258125 24856760 24047467 24633319 24564168 24970192 25055211 25645363 27003611
2711 27003611 25875534 25752638 25526386 25504283 25178253 24608134 24723635 24870218 25377753
2702 25377753 25495199 24996612 25144090 23840002 23583455 24120827 24214053 24408534 24209628
2693 24209628 24774810 24153442 24362324 24920143 24191801 23906910 24017014 24162047 24800052
2684 24800052 24745140 24264068 24932026 25162036 26364334 27163378 27003463 26741103 25958746
2675B5958746m05597O57668L55063p47426M3822m50651J985553J20571J036984
2666B8554733N5917j16862M14919J042470o67629l33648J037707q35103J201587
2657C0354091m83988k06451Q02634J434194k04590J018287N45011k0422N68429
2648C3807195O37041P10007n4364R1978J486044Q02230r71132J766983O68953
2639C8944935J423042J022891M74911n32622J563431K533410K83652N33817R78411
2630D7225878J98708J751727K165479J533185K492196K106541J975751Q49255
2622F0298720J085424K747652J480458K592834K364006J899036K357448J449943
2614G6275521L071731K260569J376449K718863K786146K075299K564690K109152
$$ plain form
2675 25958746 25553149 26210817 26565880 25818454 25862276 25411625 27397178 27517749 28554733
2666 28554733 28610650 28493788 28908707 29951177 29283548 28949900 29987607 29152504 30354091
2657 30354091 29870103 29663652 30466286 31900480 31695890 32714177 33259188 33238766 33807195
2648 33807195 34444236 35154243 35099879 35191857 36677901 37480131 36508999 38275982 38944935
2639 38944935 40367977 41390868 41865779 41333157 42896588 45429998 45713650 46247467 47225878
2630 47225878 47424586 49176313 51341792 52874977 55367173 57473714 59449465 60298720
2622 60298720 61384144 64131796 65612254 68205088 70569094 72468130 74825578 76275521
2614 76275521 79347252 81607821 82984270 85703133 88489279 90564578 93129268 95238420
2606I5238420K784660J666974K632378L384450L092523J946868K787432L295541
2598A16829246K815066J842335J858036K076654J350501J703194O46575N51713
2590A29673320K298277R32065R52731L165699J071471L43625J255806p63674q63035
2581A38066285M411L88068j661337o83504m75149l205801l018768j027895j454832
2572A26931478k387403k129718k739609j305283j678634l389886k761619k436366
2564A08102960k546388m91316k723884k544382k670528l078709j657452k087857
2556I0302444k361957j152104k847038k554704j851589j739635j402976k720811
2548G3671630j460326j151932k484950j763080n18957j582992m32244j272637
$$ plain form
2606 95238420 98023080 99690054 102322432 105706882 108799405 110746273 113533705 116829246
2598 116829246 119644312 121486647 123344683 125421337 126771838 128475032 129121607 129673320
2590 129673320 131971597 132903662 133856393 137022092 138093563 138437188 139692994 138929320 138066285
2581 138066285 138070696 138458764 136797427 136113923 135638774 132432973 129414205 128386310 126931478
2572 126931478 124544075 122414357 119674748 118369465 116690831 113300945 110539326 108102960
2564 108102960 105556572 105065256 102341372 99796990 97126462 94047753 92390301 90302444
2556 90302444 87940487 86788383 83941345 81386641 79535052 77795417 76392441 73671630
2548 73671630 72211304 71059372 68574422 66811342 66292385 64709393 64277149 63004512
2540F3004512k441532q95226p25716k516640m01549j261578l48878l68650p24110
2531E3320633j008179j899231j223810j210901J76128j056779j139286j70244
2523D5788331n58260j29571n60035j034490o53367j992951j338308R1100p30679
2514C8881770l22051o9456p12526j19384m79904j371391K08637L52280p25339
2505C5642636q95892j583534p08996j90058n09668o19642j93897l01508J15129
2496C0754570r66225o83100j317825q38484K9502p46036N73162j000504o66585
2487B5138475Q34776r17556j068193n18735j16584j49314J162945r89916n22746
2478B2853152L27685k62811R7010q37014l30249o4958O69495k14594j469275L48134
$$ plain form
2540 63004512 60562980 59667754 58942038 56425398 56023849 54762271 54413393 54044743 53320633
2531 53320633 52312454 50413223 49189413 47978512 48154640 47097861 45958575 45788331
2523 45788331 45230071 45100500 44540465 43505975 42852608 40859657 39521349 39612449 38881770
2514 38881770 38559719 38490263 37777737 37658353 37178449 35807058 36015695 36367975 35642636
2505 35642636 34746744 33163210 32454214 32264156 31754488 31134846 30940949 30639441 30754570
2496 30754570 29788345 29105245 27787420 26948936 26978438 26232402 26805564 25805060 25138475
2487 25138475 25973251 25055695 23987502 23468767 23352183 23202869 24365814 23375898 22853152
2478 22853152 23180837 22918026 23015036 22178022 21847773 21782815 22452310 22237716 20768441 21116575
2468B1116575J424999j163826j602809m95868Q28664l13632l22723J7029J59188
2459A9647597j533162k19616N20565R82455l21253j249750Q2068k8021j457127
2450A6423756m91507L64959J35526m75263j052368J040611Q44276k20219j45697
2441A6424074l10680j596165J5941M93562L46736j175396j50432j38713m03621
2432A3505306K37841Q09146m17361j18163p75385P58926l9563p96231j30434j579404
2422A1454678m3814K21782L84136m21908J006674P15295K9083r5417O37408p77898
2412A3110019j40440j24551j163120L23592N19178M54965o69456j69828J9952
2403A2160311j13983j58838k83590m55652K39274p97920j68265O06183M00007
$$ plain form
2468 21116575 22541574 21377748 19774939 19279071 20107735 19794103 19471380 19488409 19647597
2459 19647597 18114435 17894819 18415384 19397839 19076586 17826836 17908904 17880883 16423756
2450 16423756 15932249 16297208 16432734 15957471 14905103 15945714 16789990 16569771 16424074
2441 16424074 16113394 14517229 14533170 15026732 15373468 14198072 14047640 13908927 13505306
2432 13505306 13743147 14552293 14134932 14016769 13241384 14000310 13960747 13164516 13034082 11454678
2422 11454678 11410864 11632646 12016782 11594874 12601548 13316843 13345926 13250509 13887917 13110019
2412 13110019 12969579 12845028 11681908 12005500 12524678 12979643 12310187 12140359 12160311
2403 12160311 12046328 11887490 11603900 11148248 11387522 10589602 10421337 11027520 11427527
2394A1427527p75198J22769L93184m16770M02535K04893j495464J097341P06367
2385A1667184p05485j31152k87950M63552J91497n03246N60029j253597n93002
2376I407830O42874p89396J572398j9800K35254R03164J37626q87505L97544K15723
2366A1815712q09237J25260Q56957l56539j19971n81202P55731j73133j047229
2357A0466349P66890K52632o80057N4335J275310j84302p20676R36245q88561
2348A1278165O64070l21050n70423j29347l3887M47958k67048R86848j108847
2339A0946439j6950q96333J54132R68527L59082o25772m12541P61439L17749L43402
2329A1899174n57231M66216Q00817J033429J02058j084843m94666M51108O04625
$$ plain form
2394 11427527 10652329 10775098 11168282 10751512 11154047 11358940 9863476 10960817 11667184
2385 11667184 10961699 10830547 10542597 11006149 11197646 10694400 11254429 10000832 9407830
2376 9407830 10050704 9261308 10833706 10813906 11049160 11952324 12089950 11202445 11599989 11815712
2366 11815712 11006475 11131735 11988692 11632153 11512182 10930980 11686711 11513578 10466349
2357 10466349 11233239 11485871 10805814 10860149 12135459 11951157 11230481 12166726 11278165
2348 11278165 11942235 11621185 11050762 10921415 10887528 11335486 11068438 12055286 10946439
2339 10946439 10929489 10033156 10187288 11155815 11514897 10889125 10476584 11238023 11555772 11899174
2329 11899174 11341943 11808159 12608976 13642405 13744463 12659620 12164954 12616062 13220687
2320A3220687l0738J8337j414659J48284P36202J061441l29993m77301K37377
2311A3169637q61252K6523J349921j5827L09857M07773j027403k6769M29830N55958
2301A4318248n53895P33668N40895n44851j304632k88639J313746M46050o77561
2292A3983029J002675K26126n84315m274K12006Q4022j74580m07180K42444J852833
2282A6432786l57603q8797R2596q63023J68565Q16589N16983L46212N56459o8486
2272A7552281N12598M95802n89860N11017l56493m81216J555860l6210J54431
2263A9318210R47484k75932J72743j24380m55631O55654R67366r24606J029913
2254B1310821M96758m59213J201611q20796l85717J342598R55240q78571L509
$$ plain form
2320 13220687 13189949 13208286 11793627 11941911 12678113 13739554 13409561 12932260 13169637
2311 13169637 12308385 12334908 13684829 13669002 13978859 14386632 13359229 13332460 13762290 14318248
2301 14318248 13764353 14498021 15038916 14494065 13189433 12900794 14214540 14660590 13983029
2292 13983029 14985704 15211830 14627515 14623241 14835247 14919269 14744689 14337509 14579953 16432786
2282 16432786 16075183 15986386 16078982 15215959 15384524 16201113 16718096 17064308 17620767 17552281
2272 17552281 18064879 18560681 17970821 18481838 18125345 17644129 19199989 19163779 19318210
2263 19318210 20265694 19989762 20162505 20038125 19582494 20238148 21205514 20280908 21310821
2254 21310821 21807579 21348366 22549977 21729181 21343464 22686062 23641302 22762731 22766240
2245B2766240o07728O67123J692989l50980J222404J09308N173n9599j01679J570664
2235B6913915N20850o3545O54464P15243K25426J071436N09430M06098J115767
2226C2069084M30829p98373N23351J447089J252615K60521n44276L5583J069991
2217C5746414J361309Q36233J101205P74656J523440J533045k82759m15067L80791
2208D2559267K023832K342166R73080K437548J936672J977756K295299K217721
2200E8763341L484304L706849L187231J825303j178599j388569J11274J333989
2192F9845123K345366K567569L604601M379629L471525M878199M278170M558564
2184I9928746O147603N543379N619953N226647N916505N814812M415732M325960
$$ plain form
2245 22766240 22158512 22825635 24518624 24167644 25390048 25499356 25504529 25444930 25343251 26913915
2235 26913915 27434765 27371220 28025684 28740927 28966353 30037789 30547219 30953317 32069084
2226 32069084 32499913 31701540 32224891 33671980 34924595 35185116 34640840 34676423 35746414
2217 35746414 37107723 37943956 39045161 39819817 41343257 42876302 42593543 42178476 42559267
2208 42559267 44583099 46925265 47898345 50335893 52272565 54250321 56545620 58763341
2200 58763341 62247645 65954494 69141725 70967028 69788429 68399860 68511134 69845123
2192 69845123 72190489 74758058 78362659 82742288 86213813 91092012 95370182 99928746
2184 99928746 106076349 111619728 117239681 122466328 128382833 134197645 138613377 142939337
2176A42939337R22669p48890j367307l998975m648974n176665n092547n438368
2168A17390280l757949p91104j346966n13068l91463l704199o709691p429213
2160I2746627o465922o357218m247505k473351k721072j917787j749462k806356
2152F4007954j183854j752721n8079m88640j855097k53342K67656j281889n37991
2143E6863997j421731q76315j826491q86326k32774j088783J036927j24767Q65789
2134E2309526M46604K44195M06946M40167M89950k077172l218070m153029l174107
2125D1715010k149943j958854j588390q38526L39693j26752n11814m35575l71463
2116C4073386j715567p87699j970799p24329J191258j004111m617n78916o86868
$$ plain form
2176 142939337 143862006 143113116 141745809 137746834 133097860 127921195 122828648 117390280
2168 117390280 113632331 112841227 111494261 110981193 110589730 106885531 100175840 92746627
2160 92746627 86280705 79923487 75675982 73202631 70481559 68563772 66814310 64007954
2152 64007954 62824100 61071379 61013300 60524660 58669563 58416221 58683877 57401988 56863997
2143 56863997 55442266 54565951 52739460 51853134 51620360 50531577 51568504 51443737 52309526
2134 52309526 52756130 53000325 53407271 53847438 54337388 52260216 49042146 44889117 41715010
2125 41715010 39565067 37606213 36017823 35179297 35518990 35392238 34880424 34444849 34073386
2116 34073386 32357819 31570120 29599321 28874992 30066250 29062139 29057522 28478606 27791738
2107B7791738J95633p60481q98733q90942l32167m6118l3735j07175n46627l30083
2097B4041310Q9308j457280q38695L80972k54672j534968J113124J50168R19584
2088B2608851J122670j642086k103506r98630K4155K49838M27125k2379q01068
2079A8864970Q63318N9540q30806m10347l97985k91332n33609M71192l76273o40948
2069A6777720K59986M89548J32553l86431n25606J63170j97009n14824j103074
2060A5096033J005133L04963o10723j0178q28069R07403L81544j2628p08190j70555
2050A5354733J26170m910k6822l7439J34742l05563j91085j50034Q53578n48560
2040A5204810J54445p9474m21474P95603j000915M7362J424134K28819J15740
$$ plain form
2107 27791738 27987371 27226890 26328157 25437215 25105048 25058930 25025195 24918020 24371393 24041310
2097 24041310 24130618 22673338 21834643 22215615 21960943 20425975 21539099 21689267 22608851
2088 22608851 23731521 22089435 19985929 18987299 19011454 19261292 19688417 19666038 18864970
2079 18864970 19728288 19787828 18957022 18546675 18148690 17857358 17323749 17794941 17418668 16777720
2069 16777720 17037706 17527254 17659807 17273376 16747770 16910940 16713931 16199107 15096033
2060 15096033 16101166 16406129 15795406 15785228 14957159 15864562 16246106 16233478 15525288 15354733
2050 15354733 15480903 15475993 15449171 15411732 15546474 15240911 15049826 14899792 15753370 15204810
2040 15204810 15359255 15279781 14858307 15653910 14652995 14700357 16124491 16353310 16469050
2031A6469050o12732p59283J30585o1661J41241L26934j55129J287203q50518
2022A5915690j202713k85976O13079j97459l76575m52482r90324J704335J933217
2013A6660792L2736m36773K60278J900301j05037j073551R51779o23011m76770
2004A7090744J78867L13293J55782J218686R74395N69764K5913R72572Q65860
1995B2365876j12608J151609N38867O2061n43090l91018j076956j13587j803687
1986B0077467N76957L29465J052479N4491j743836o19367k17990k04948L44054
1977A9648772O12877l58496M51757J57295j17805N74726Q10255M48076N20623
1968B2748080P93493M89491L24868J033225J072867Q58175N19986M61266M14247
$$ plain form
2031 16469050 15856318 15097035 15227620 15165959 15307200 15634134 15479005 16766208 15915690
2022 15915690 14712977 14427001 15040080 14842621 14466046 14013564 13023240 14727575 16660792
2013 16660792 16693528 16256755 16517033 18417334 18312297 17238746 18190525 17567514 17090744
2004 17090744 17269611 17582904 17738686 18957372 19931767 20501531 20527444 21500016 22365876
1995 22365876 22253268 23404877 23943744 24005805 23462715 23071697 21994741 21881154 20077467
1986 20077467 20654424 20983889 22036368 22090859 20347023 19727656 19509666 19304718 19648772
1977 19648772 20261649 19903153 20354910 20512205 20394400 20969126 21779381 22227457 22748080
1968 22748080 23541573 24031064 24355932 25389157 26462024 27320199 27840185 28301451 28715698
1959B8715698M75017k23419r27370j555357m46530j218952q43138L47730Q2676
1950B4406355R3909J63821J014544J234045p62438p16931R97041O77795J384034
1941B8492175L45802J361090J419458K92426j072219O37272J972206Q58773K109570
1932C6416553M25728J972541J652564K284344K641394K415752K207476L818169
1924E3834521L184515M634623L229130M167144M026321L559178L743747L275093
1916H3654272K005680J970982J669490m84354j820902j000972j923133k276325
1908H1794738j038918j171835j573330j998295k069086j537233r61200j738285
1900F9706556j928269n44433n7426M05264K244297J603784J360123K587700L504065
$$ plain form
1959 28715698 29190715 28967296 28039926 26484569 26038039 24819087 23975949 24323679 24406355
1950 24406355 24500264 24664085 25678629 26912674 26150236 25433305 26430346 27108141 28492175
1941 28492175 28837977 30199067 31618525 31910951 30838732 31476004 33448210 34306983 36416553
1932 36416553 36842281 38814822 40467386 42751730 45393124 47808876 50016352 53834521
1924 53834521 57019036 61653659 64882789 69049933 73076254 76635432 80379179 83654272
1916 83654272 85659952 87630934 89300424 88816070 86995168 85994196 84071063 81794738
1908 81794738 80755820 79583985 78010655 76012360 73943274 72406041 71444841 69706556
1900 69706556 67778287 67233854 67176428 67581692 69825989 71429773 72789896 75377596 78881661
1891G8881661K493285M769069N490808L294491N718207P397507P523554Q238989
1883A23807571Q042879R868341P797034Q785312Q967284N982007K764959K422368
1875A78437755p47357m792681r443935q920919n755003o343294p514675n753907
1867A29165984n000077q507578p582704p558369p297541m894772k959126j158095
1859H4207722j790501j80747l65013L03102O61293J531787J458728K612762J841969
1850I0281102J950692M391026L307896L038545J771728L952933L889767L754670
1842A16338359M058985M554608K071306Q19009o33678l589605k582748l997027
1834A17039209m496356m070231m710597m791943l205962m368879o099417m690877
$$ plain form
1891 78881661 81374946 86144015 91634823 94929314 100647521 108045028 115568582 123807571
1883 123807571 131850450 141718791 149515825 158301137 167268421 173250428 176015387 178437755
1875 178437755 177690398 172897717 163453782 154532863 148777860 142434566 134919891 129165984
1867 129165984 124165907 115658329 108075625 100517256 93219715 88324943 85365817 84207722
1859 84207722 82417221 82236474 81871461 82174563 82835856 84367643 85826371 88439133 90281102
1850 90281102 92231794 96622820 99930716 102969261 104740989 108693922 112583689 116338359
1842 116338359 120397344 124951952 127023258 127842267 127208589 123618984 121036236 117039209
1834 117039209 112542853 108472622 103762025 98970082 95764120 91395241 85295824 80604947
1826H0604947l058329l682825k663560j089742k185747j664035k34280q74221
1818F5152208p52502Q32789J201144L9607j048064l07941l87900k529006k039019
1809F0161316k487212l592347k082888k459295j962729j327464M38562k178274
1801D4509669j233985R6679j836389R91477M88145O06756N17326L01893o31671
1792D3809900J167378J059170N27116K309260J289806K98594r1630J008771j097827
1783E0280538n45435r52137j378263j094969k471476j864636j402241k273746
1775C8297635m4368j503023k378720n76745m4751m31353n17520l43633j14501
1766C2343021N68787M38641j9969j372638N2869J004145L45335J55668q28857
$$ plain form
1826 80604947 77546618 73863793 71200233 70110491 67924744 66260709 66026429 65152208
1818 65152208 64399706 65232495 66433639 66473246 65425182 65117241 64729341 62200335 60161316
1809 60161316 57674104 54081757 51998869 49539574 47576845 46249381 46687943 44509669
1801 44509669 43275684 43372363 41535974 42527451 43015596 43622352 44139678 44441571 43809900
1792 43809900 44977278 46036448 46563564 48872824 50162630 50461224 50369594 51378365 50280538
1783 50280538 49735103 48782966 47404703 46309734 43838258 41973622 40571381 38297635
1775 38297635 38253267 36750244 34371524 33794779 33750028 33318675 32801155 32457522 32343021
1766 32343021 32911808 33350449 33330480 31957842 32010711 33014856 33360191 33515859 32687002
1757C2687002r44336k68636j180765p13527j203876l37747k318442q34106L01706
1748B5187273j113204k822349p04940L44482r23959p19735q37718j611548q71921
1739A5926381n39458n10242M2696p25591O65667r52203r12359K17370l07695K77110
1729A3181676p10557p47355J275780m6166j247158r62819R94421j249633j14707
1720A0373482k37670k30541k11755r25210r8556L77254L9100q68958q29140M46045
1710G834051r4076n26743L23634k54793j148422K34211M66683K07679j270451
1701E771773l8405J309367k88231P1909J58858J78695j88968L0926k519884j08424
1691D377616R88009P28158m59531m32625J002787l59362j220758O5217m38352
$$ plain form
1757 32687002 31742666 31474030 30293265 29579738 28375862 28038115 25719673 24885567 25187273
1748 25187273 24074069 21251720 20546780 20891262 19967303 19247568 18409850 16798302 15926381
1739 15926381 15386923 14876681 14919377 14193786 14859453 13907250 12994891 13212261 12904566 13181676
1729 13181676 12471119 11723764 12999544 12953378 11706220 10743401 11737822 10488189 10373482
1720 10373482 10135812 9905271 9693516 8768306 8669750 9047004 9086104 8217146 7388006 7834051
1710 7834051 7739975 7213232 7536866 7282073 6133651 6367862 6834545 7042224 5771773
1701 5771773 5733368 7042735 6754504 6826413 6985271 7163966 6974998 7005924 4486040 4377616
1691 4377616 5365625 6093783 5634252 5201627 6204414 5845052 4624294 4689511 4251159
1682D251159L5403K74745O9389M80019L57123m6012n15474j96532M95495Q6081
1672E291396j434303n9524l29795k16310p20732O38187K33490j51890L68462K47622
1662C866603L91927j372883R1383O64754j88027j65667J70122L77051p93705n53509
1652B488049J27474k3211M97014J51487L04389l13638M61173k99812o04025m44763
1642B344137Q92262M08648j492639N47873p38469J0180P85601j30969q77136q15573
1632I33915j61695K95313K42629L19445k36412Q36941Q70075k60411P58300o28685
1622B969415L01697K49517r8288M88910j224014n88357l63772m21880P36616J535464
1612C585308k19058j01901Q83766K40213p94519n97447j02125r74689R17651q5353
$$ plain form
1682 4251159 4286562 4561307 4630696 5110715 5467838 5421826 4906352 4709820 5205315 5291396
1672 5291396 3857093 3797569 3467774 3251464 2530732 3168919 3402409 3250519 3618981 3866603
1662 3866603 4258530 2885647 2977030 3641784 3453757 3288090 3458212 3835263 3041558 2488049
1652 2488049 2615523 2592312 3089326 3240813 3545202 3231564 3692737 3392925 2788900 2344137
1642 2344137 3236399 3645047 2152408 2700281 1961812 1971992 2757593 2626624 1749488 933915
1632 933915 772220 1067533 1310162 1629607 1393195 2230136 3100211 2839800 3598100 2969415
1622 2969415 3271112 3520629 3422341 3911251 2687237 2098880 1735108 1313228 2049844 3585308
1612 3585308 3366250 3264349 4148115 4388328 3593809 2996362 2894237 1919548 2837199 2751846
1602B751846N11282J594439l08588p78264p37639J16799O89807L09458k50674
1593C898466j80252J377287J342295N58235K74761n93428o38299L06771n32963
1584E812873j97279L27833M71863R33140r60096l81617O36775Q27148r2228N68015
1574G946427K77964K46091n65669j56149N64138P65241P14703q57169O95174m33369
1564I197382M24531j64283L59903J573625J979235L61531r70046O47359l25122
1555A3084115j66787J7688R03925P18080l86921J328707L52781O57573J046933
1546A7556094J105640J432381J808691n40183M11179J194884J026073J62478M85940
1537B4643177J025171n91912J584686q7900j938598N49002Q41157J1614K62324
$$ plain form
1602 2751846 3263128 4857567 4548979 3770715 3033076 3149875 3839682 4149140 3898466
1593 3898466 3718214 5095501 6437796 6996031 7270792 6677364 6039065 6345836 5812873
1584 5812873 5615594 5943427 6415290 7348430 6388334 6006717 6643492 7470640 7378412 7946427
1574 7946427 8224391 8470482 7904813 7748664 8312802 9078043 9792746 8935577 9630751 9197382
1564 9197382 9621913 9457630 9817533 11391158 13370393 13731924 12761878 13409237 13084115
1555 13084115 12917328 12935016 13838941 14557021 14170100 15498807 15851588 16509161 17556094
1546 17556094 18661734 20094115 21902806 21362623 21773802 22968686 23994759 24157237 24643177
1537 24643177 25668348 25076436 26661122 26573222 24634624 25183626 26024783 26036397 26298721
1528B6298721N16644J403231L39713N77009R90738L34914o74616K18213Q77140
1519C0881707L024886J710835J664590K148570J626005M79898J063468n86791
1511D2013168J082661J775834N58767K65572P27055R78787Q25086J289966L31075
1502D9847971Q31760j422627j581891q25653j93930K23841l65507r52452K83185
1493D5844697K91579m4403n30712R51461J055427J265638r54L47883j45882J438208
1483E0472942K214404Q06273R03732J511267K821475K422470L187803J962811
1475F6303177L95591R62540n96627j746045j958787k790584j985535j39652p73138
1466E7670940k010224j124189k143389l99902j781665k057702j251697j158795
$$ plain form
1528 26298721 26815365 28218596 28558309 29135318 30126056 30460970 29786354 30004567 30881707
1519 30881707 33906593 35617428 37282018 39430588 41056593 41536491 42599959 42013168
1511 42013168 43095829 44871663 45430430 45696002 46423057 47401844 48226930 49516896 49847971
1502 49847971 50679731 49257104 47675213 46849560 46655630 46879471 46513964 45561512 45844697
1493 45844697 46136276 46091873 45561161 46512622 47568049 48833687 48832733 49180616 49034734 50472942
1483 50472942 52687346 53493619 54397351 55908618 58730093 61152563 64340366 66303177
1475 66303177 66698768 67661308 67064681 65318636 63359849 60569265 58583730 58444078 57670940
1466 57670940 55660716 54536527 52393138 51993236 50211571 48153869 46902172 45743377
1458D5743377L0452J092964M89686M48740j589656q93213q34466o20549k87757
1449D3579578l21239q121J62513J529463o10062r72142N33710O22294J383644
1440D5899638K135144J131956K587863O70265p41320j995983l441650k037569
1432D4208344k802282j442337j647464k990817j931318k879840k488799j519350
1424B6506137k95390O71962J360802m97836j452304l55415q75269p93923j8553
1415B4250211j416901p96454l76759n12586m03832q19481j335082k73374J95634
1406A8511376j053639j023933M58733l32538L57541M30275l59365l70741q62073
1397A5755636K13099P10442q15n61205k217419j954670r26531j218345p892M88350
$$ plain form
1458 45743377 45773829 46866793 47356479 47805219 46215563 45322350 44487884 43867335 43579578
1449 43579578 43258339 43250218 43412731 44942194 44332132 43359990 43893700 44515994 45899638
1440 45899638 48034782 49166738 51754601 52424866 51683546 49687563 46245913 44208344
1432 44208344 41406062 39963725 38316261 35325444 33394126 30514286 28025487 26506137
1424 26506137 26210747 26882709 28243511 27745675 26293371 25937956 25062687 24268764 24250211
1415 24250211 22833310 22036856 21660097 21147511 20743679 19924198 18589116 18315742 18511376
1406 18511376 17457737 16433804 16892537 16559999 16917540 17347815 16988450 16617709 15755636
1397 15755636 15968735 16679177 16678362 16117157 13899738 11945068 11018537 9800192 9792300 10280650
1387A0280650l79481r45782k220405r41656O54429K380209q3269j762900o11758
1378F370037j142786O18333j79935p0855m82351n40435m74484p6921L66892P09887
1368E097382p59552j206881o81853J267275N06196j421106n87546j16609j32305
1359A965001L63079j55327K35130L56753j7355n55198M06789o15617M48466k08040
1349B223681n59373l73887K75199j42685N75660j05438n49049O21711K44518j60077
1339B050260r73159L21259k28775Q9472J081187k56829q01050K30096M54105Q83488
1329B850054K53266j038564j589204J211793Q45857J82387k18265p86860q44585
1320H65879K040488o525j64735L06153m50620m17616o80462j017507K03023J671743
$$ plain form
1387 10280650 9901169 8955387 6734982 5793326 6447755 8827964 8744695 6981795 6370037
1378 6370037 5227251 5845584 5665649 5594794 5112443 4572008 4097524 4020603 4387495 5097382
1368 5097382 4337830 3130949 2449096 3716371 4222567 2801461 2213915 2097306 1965001
1359 1965001 2328080 2172753 2407883 2764636 2747281 2192083 2598872 1983255 2431721 2223681
1349 2223681 1664308 1290421 1565620 1422935 1998595 1893157 1344108 1965819 2210337 2050260
1339 2050260 1077101 1398360 1169585 1259057 2340244 2083415 1282365 1512461 1966566 2850054
1329 2850054 3103320 2064756 475552 1687345 2533202 2715589 2497324 1710464 865879
1320 865879 2906367 2899842 2735107 3041260 2590640 2173024 1492562 475055 678078 2349821
1310B349821p00555M91711k94852J64151O43531r89745N22170O11085l33945k01073
1300B262299J6495J81576R82898J88896k69136j378229j382688O84745j05854
1291A181002o90308J044319O67365j057210O04304J81102p32756L54366r52747
1282E99437q16857j06057Q4449Q26434n826r42539j33973O89392K031528j263027
1272I62961j065079m3711L07115N73529L47396P1162j036543k83410J129963J35139
1262A098522j350436P27390J057261m28984N3734l61979o27125Q55796J063436
1253B087615R4507o64342N43956M46980J7532M88256K24857J7515j165233n00779
1243A590864j12512p07144l08221l60763J851024J46812j536129l23349L46452
$$ plain form
1310 2349821 1649266 2140977 1846125 2010276 2653807 1664062 2186232 2797317 2463372 2262299
1300 2262299 2278794 2460370 3443268 3632164 3363028 1984799 602111 1286856 1181002
1291 1181002 490694 1535013 2202378 1145168 1749472 1930574 1197818 1552184 599437
1282 599437 -217420 -323477 -239028 587406 581580 -360959 -494932 194460 2225988 962961
1272 962961 -102118 -145829 161286 734815 1082211 1153373 116830 -166580 963383 1098522
1262 1098522 -251914 475476 1532737 1103753 1157487 795508 168383 1024179 2087615
1253 2087615 2182122 1517780 2061736 2508716 2526248 3014504 3239361 3256876 2091643 1590864
1243 1590864 1478352 771208 462987 102224 1953248 2100060 563931 240582 587034
1234E87034L18425J62148m8119L242L1419K89143P78140k69955j393718K39611
1224F97370J005365j15427N6462q4613N5281o97553q91578m45844o67907l31698
1214a420142R84290J494190K7071j642639p19522j16205J21517P83078K86742
1205b01620k40032j44706J051128n4797m64379K98813J21550m17404M70263K39173
1195F57989n61389m49051P62684k15752J84525o26702P26030K78209l56671j033285
1185f33413p13866P24393Q28518R50146k28636k15635j266448j1185P92851j110432
1175h83707m69688O88790Q20611k58256J359897r77035p69143l49187n26928Q93099
1165d71547J127202p59501o8262m52261K80659R26916l51497L65474n77610j30145
$$ plain form
1234 587034 905459 1067607 1019488 1022730 1054149 1343292 2121432 1851477 457759 697370
1224 697370 1702735 1587308 1643770 1559157 1614438 916885 25307 -420537 -1088444 -1420142
1214 -1420142 -435852 1058338 1085409 -557230 -1276752 -1392957 -1271440 -488362 -201620
1205 -201620 -441652 -586358 464770 409973 -54406 244407 365957 -51447 418816 657989
1195 657989 96600 -352451 410233 194481 379006 -247696 478334 756543 399872 -633413
1185 -633413 -1347279 -622886 205632 1155778 927142 711507 -554941 -566126 226725 -883707
1175 -883707 -1353395 -664605 156006 -102250 1257647 280612 -488531 -837718 -1364646 -471547
1165 -471547 655655 -103846 -172108 -624369 -343710 583206 231709 597183 19573 -110572
1155a10572k97450J300919L49457k30967N99757j137558j8225P90316n56801j53660
1145E35216k24098M99367n12242l0607K61294M83646j371120n35703N30275m42816
1135h06788L36568J062228J84065o97857m474O49747J282972m08774o52177k65339
1125F80171K70912K1867m15554K22193J40690P11767R7711p3124O89226M81230
1115B827089l2468M178L14591m82933j162014J76200J96944o01092j736971J106962
1105F10486M30124l45656L76641K33737j49875J212920j357868p7086P545L56822
1095A297790k91492q0929n02988J283698N49402o84917O12798k47088L95345J343400
1085C675019j05444r62931J44321o02859o37083J74894J34173O50373K81707j435049
$$ plain form
1155 -110572 -408022 892897 1242354 1011387 1611144 473586 455361 1245677 688876 535216
1145 535216 311118 810485 298243 267636 528930 1012576 -358544 -894247 -363972 -806788
1135 -806788 -470220 592008 776073 78216 73742 723489 2006461 1597687 945510 680171
1125 680171 951083 972950 557396 779589 920279 1632046 1729757 1656633 2345859 2827089
1115 2827089 2794621 2798799 3113390 2630457 1468443 1644643 1841587 1240495 -496476 610486
1105 610486 1040610 694954 1071595 1305332 1155457 2368377 1010509 933423 940968 1297790
1095 1297790 1006298 925369 422381 1706079 2255481 1570564 2183362 1936274 2331619 3675019
1085 3675019 3569575 2606644 2750965 2148106 1511023 1685917 1820090 2470463 2752170 1317121
1075A317121j1946N67148J100108q44272J16157J4446j54853L77317m03121J155973
1065C234078J399640r83064j942811P8789J327365p53485J47318J42484K77342
1056B927656J10314K70599J48301J35208O35379L08491r5011j290833o62702R78637
1046C466039K29906o86834J64856J274799R05937j16064j415051q74285J180691
1037D129994L85991k7203J189435J48535m82919P747p54020P65341O23402O40380
1027F626683M68786P70742J65710k315004q92092J456610K77008Q77868Q62552
1018H298863k67309k48302n97027k30520J555937R30514L70209K81431L73210
1009A0467006O29420L60795J060906j572019J236578O59707J286890R573j049863
$$ plain form
1075 1317121 1305175 1872323 2972431 2128159 2244316 2258762 2103909 2481226 2078105 3234078
1065 3234078 4633718 3650654 1707843 1786632 3113997 2360512 2507830 2650314 2927656
1056 2927656 3037970 3308569 3456870 3592078 4227457 4535948 4440937 3150104 2487402 3466039
1046 3466039 3695945 3009111 3173967 4448766 5354703 5238639 3823588 2949303 4129994
1037 4129994 4515985 4488782 5678217 5826752 5343833 5351580 4597560 5362901 5986303 6626683
1027 6626683 7095469 7866211 8031921 5716917 4824825 6281435 6558443 7436311 8298863
1018 8298863 8031554 7783252 7186225 6955705 8511642 9442156 9812365 10093796 10467006
1009 10467006 11096426 11457221 12518127 10946108 12182686 12842393 14129283 14138856 13088993
1000A3088993N11448N8022O18568O93208Q64146K62975P38797J140372J029396
991A9005925J513191N29209J016150J048456K269938J916728K070607K025776
983C1395980K789665K916290M676766K998167M483630L528682L469182N924560
975F2182922O195946O455009Q147135R182854J1918996J8475369K3385825K9974744
967A75918800L4384883L5190026M4737742N2478085M4766792o055803o6747652
960C14672873p8310379n6849716l4882266k3703595j7208305j3027878j0434941
953H0255793q629968o389487n982145m698690l991061j291862j482403k509992
945D5280185l741522m909724l130383k393443j200597j777855j370012j118375
$$ plain form
1000 13088993 13600441 13658463 14277031 14970239 15834385 16097360 16836157 17976529 19005925
991 19005925 20519116 21048325 22064475 23112931 25382869 27299597 29370204 31395980
983 31395980 34185645 37101935 41778701 44776868 49260498 52789180 56258362 62182922
975 62182922 68378868 74833877 82981012 92163866 104082862 122558231 145944056 175918800
967 175918800 210303683 245493709 290231451 342709536 387476328 381420525 314672873
960 314672873 236362494 179512778 144630512 120926917 103718612 90690734 80255793
953 80255793 71625825 65236338 59254193 54555503 50564442 49272580 47790177 45280185
945 45280185 41538663 36628939 33498556 31105113 29904516 28126661 26756649 25638274
937B5638274j478718j973995k460763Q73731r33266j780282j190753J008928j737912
928A5965244j164476k8936r39362j328698n28456n56071N31782o10403j296559
919A0044065n39445L68996j325441m32883l94321j073023N03875J429310o85611
910G895522K40881k57581j221391r80107N56805q44778J0879n64295J547938J005998
900G389871j238881j636746r05537R1475M83928O80659Q83826J2343o75150m76384
890D609404K59605o7044j003602n47331m79566J027256o26980q1299L09402L35695
880C735540m49072J81004p87299r99219Q15979Q89101q75042j34621m63835o4170
870A848366m63678K21429j47568j204477L82463N30969o71819K93527N06988Q09642
$$ plain form
937 25638274 24159556 22185561 19724798 20598529 19665263 17884981 16694228 17703156 15965244
928 15965244 14800768 14771832 13832470 12503772 11975316 11419245 11951027 11340624 10044065
919 10044065 9504620 9873616 8548175 8115292 7720971 6647948 7151823 8581133 7895522
910 7895522 8136403 7878822 6657431 5677324 6234129 5389351 5400230 4835935 6383873 7389871
900 7389871 6150990 4514244 3608707 3700182 4184110 4864769 5748595 5760938 5085788 4609404
890 4609404 4869009 4801965 3798363 3251032 2771466 3798722 3171742 3090443 3399845 3735540
880 3735540 3286468 3467472 2680173 1680954 2496933 3386034 2510992 2376371 1912536 1848366
870 1848366 1384688 1606117 1458549 254072 636535 1167504 495685 789212 1296200 2105842
860B105842n53497j53161r55319P30720k97072n40287P07947L11231j66166L08633
850A498871M19483k32849j050102j4883l30252Q2084R50929k085981J15340J974293
840A326933L65870N5452J38763j901972k91493R22662l79132O49845r20276L24005
830B90657k20879J04046M31668L93209K666n81084m05328K21616q77535L29536
820c11428J523303j496690K99742j9168j140447o14365Q11750J464581j041129
811e23851r40138p84003p8304J514002l13926J88511O0462N7202K89464L59815
801a70766J068782J38499r15768r24196O98488o35062n72952O5836K20195J30707
791h96237Q70863p57038j302813R5813J26454J803232M07509o67361p04015K78503
$$ plain form
860 2105842 1552345 1399184 443865 1174585 877513 337226 1045173 1356404 1190238 1498871
850 1498871 1918354 1685505 635403 620520 290268 372352 1323281 -762700 -647360 1326933
840 1326933 1692803 1748255 1887018 -14954 -306447 616215 237083 886928 -33348 290657
830 290657 69778 173824 605492 998701 1001367 420283 14955 236571 -640964 -311428
820 -311428 1211875 -284815 14927 -4241 -1144688 -1759053 -947303 517278 -523851
811 -523851 -1463989 -2247992 -2326296 -812294 -1126220 -937709 -877247 -820045 -530581 -170766
801 -170766 898016 1036515 120747 -803449 -104961 -740023 -1312975 -1247139 -1026944 -896237
791 -896237 -25374 -782412 -2085225 -1989412 -1862958 -59726 347783 -319578 -1023593 -745090
781g45090o25292O32419J64746o00933o5319K39024J286049j085027o27418p47140
771b173981l55855J012403Q02308R30777j055867n93282J347180j03440n50902
762g40659R22417k28614j390685J99069k60725J80088j37372l09841L02939N05432
752i57951Q88546M03711l1608k36763p81770K55765j03959n95963M87898n16950
742a189044J121036K96601N29347k26942j010744N71867p4484m86524n18916L84751
732f03052K44244j44566P07743j005059K6667r5531O41283J27550q6080O02634
722D15833P29921l19128j237355Q80482q2305o40509M29207o11624J25651k67542
712e77369M66813O75951J62658J48126o62400k51376p21927L35751J422046r60387
$$ plain form
781 -745090 -1370382 -737963 -573217 -1174150 -1239469 -1000445 285604 -799423 -1426841 -2173981
771 -2173981 -2529836 -1517433 -715125 215652 -840215 -1433497 -86317 -189757 -740659
762 -740659 181758 -46856 -1437541 -1238472 -1499197 -1319109 -1456481 -1766322 -1463383 -957951
752 -957951 -69405 334306 302698 65935 -715835 -460070 -564029 -1159992 -672094 -1189044
742 -1189044 -68008 228593 757940 530998 -479746 92121 17637 -468887 -987803 -603052
732 -603052 -358808 -503374 204369 -800690 -774023 -869554 -228271 -100721 -186801 415833
722 415833 1145754 826626 -410729 469753 387448 -253061 176146 -435478 -309827 -577369
712 -577369 -110556 565395 728053 876179 213779 -37597 -759524 -423773 998273 37886
702C7886n62085J616290j022536K9415P5757l91195Q01945o24602p81927R88521
692A67469M23675N07677L87429j006812l62284Q31019q88141o84819l78041Q20903
682a81925M56859l78452J096795k13437J090280l98770j437088O51388O99413
673A385063l69392p68473m22121L89036j023212k45660P01106k17673j2788n80007
663a164121O2305R57838J36420O10113m52393l28424q01121M24469R85539J05666
653E36291j196534k03950j35600j88682j129035m53284J798976O9287P47458q3392
643b38465j277133j30848R50869m08546L56572L96027p4568K32071M76881k03449
633G9411J053382j23001j515480m71684L89091L05189j89915J482508m19585o55167
$$ plain form
702 37886 -524199 1092091 69555 98970 174727 -216468 585477 -39125 -821052 167469
692 167469 591144 1098821 1486250 479438 117154 948173 60032 -624787 -1002828 -181925
682 -181925 274934 -103518 993277 779840 1870120 1471350 34262 685650 1385063
673 1385063 1015671 247198 -174923 214113 -809099 -1054759 -353653 -571326 -584114 -1164121
663 -1164121 -1101816 -143978 -7558 602555 150162 -178262 -979383 -554914 430625 536291
653 536291 -660243 -864193 -999793 -1188475 -2317510 -2770794 -971818 -902531 -155073 -238465
643 -238465 -1515598 -1646446 -695577 -1104123 -747551 -351524 -426092 -194021 282860 79411
633 79411 1132793 1009792 -505688 -977372 -588281 -283092 -473007 1009501 589916 -65251
623f5251L28434o4039j131405j77808k75266p85867J695896o0939M9465j825538
613b312318M53878J382684M24049n00651l30238K88314j7261k48596J449219M82809
603A071889j303256j058732m71799j25336K01255P78938m5196K69623R56331j62234
593A11483k60246p41500k77074K98972L20015k08186j15958K2001J021883n48787
583c77397p40994J027245p25117O49811m82957p03059q33530O29891M86160j50541
573a220488m47028Q44349L85083N18308j031455o29178M71055M76912Q71831n40284
563c00895L83788j055543m55828J36777J607436O91477j132837o06162p8218R59007
553A49002L99492j296139J02381P94228j038313N7467k36444j47974q81878Q01761
$$ plain form
623 -65251 263183 199144 -932261 -1110069 -1385335 -2171202 -475306 -536245 -486780 -2312318
613 -2312318 -1858440 -475756 -51707 -552358 -882596 -594282 -611543 -860139 589080 1071889
603 1071889 -231367 -1290099 -1761898 -1887234 -1685979 -907041 -952237 -682614 273717 111483
593 111483 -148763 -890263 -1167337 -868365 -548350 -756536 -872494 -850493 171390 -377397
583 -377397 -1118391 -91146 -816263 -166452 -649409 -1352468 -2185998 -1556107 -1069947 -1220488
573 -1220488 -1667516 -823167 -438084 80224 -951231 -1580409 -1109354 -632442 239389 -300895
563 -300895 82893 -972650 -1428478 -1291701 315735 1007212 -125625 -731787 -810005 149002
553 149002 548494 -747645 -645264 148964 -889349 -831882 -1068326 -1216300 -2098178 -1296417
543a296417Q6959O16401R43013p74138j07016j311080J057172J058436l71435
534i8105r5852r82386J4813R36852m37473p63741P75981j11213R2041M90509N47806
523C69232M27397q74618m62658R3038j08115k3155j09995n00838N13191J30286
513e46235o3067Q64139p03258K57227L67644L6713p63738m72145o16716L69224
503a270212R62159m0869j84867K42078L64142K95888m05624q30181K15450k49232
493i01268R44379j42127k17435m04347j09756O81136J34709M53088R05562l08245
483A035696m57636j08175r18721J02408o02524m22266J88472l23698J014582k65312
473g57174l04189p81832K28213Q08732l09898j34814K02597L22605K63246m43070
$$ plain form
543 -1296417 -1209458 -593057 349956 -424182 -531198 -1842278 -785106 273330 -98105
534 -98105 -193957 -1176343 -1161530 -224678 -662151 -1425892 -649911 -761124 -669083 -178574 369232
523 369232 796629 -77989 -540647 -447609 -555724 -578879 -688874 -1189712 -676521 -546235
513 -546235 -609302 254837 -448421 -191194 176450 213163 -550575 -1022720 -1639436 -1270212
503 -1270212 -308053 -348922 -533789 -291711 72431 368319 -37305 -867486 -652036 -901268
493 -901268 43111 -99016 -316451 -720798 -830554 -149418 -14709 438379 1343941 1035696
483 1035696 578060 469885 -448836 -346428 -948952 -1371218 -1182746 -1506444 -491862 -757174
473 -757174 -1061363 -1843195 -1614982 -806250 -1116148 -1250962 -1048365 -725760 -462514 -905584
463i05584j00517K0535Q21095J58939m21910q4555Q5461k62358J480114j87880
453F03340r73945m23721j85605Q6789j26919O19792j088579j096718J257191K15055
443a113320O36135o84037r8707J01717R8980J283300o71939J34810M11854N35225
433F34018r05864P0766Q85935j68483q69372R9477p48971O12124K73044J96935
423G9609j544079N83263O47027P28438Q31698L9919j499558n76506Q6660r00324
413a523853O41784K71672j045925N23755J260224M73189j379717k68922M77566
404e70227J114262R3369j749095R6420m58794J054734m02466K03037r0248M25867
394b83141M16318r52569J063574l17474q95405l52202Q388Q17500Q12076j26001
$$ plain form
463 -905584 -1006101 -985566 -164471 -5532 -427442 -511997 -426536 -688894 791220 603340
453 603340 -370605 -794326 -979931 -893142 -1020061 -400269 -1488848 -2585566 -1328375 -1113320
443 -1113320 -477185 -1161222 -1259929 -1158212 -1059232 224068 -447871 -313061 98793 634018
433 634018 -271846 -201080 684855 516372 -353000 -253523 -1002494 -390370 -117326 79609
423 79609 -1464470 -881207 -234180 494258 1325956 1365875 -133683 -710189 -623529 -1523853
413 -1523853 -882069 -610397 -1656322 -1132567 127657 600846 -778871 -1047793 -570227
404 -570227 544035 637404 -1111691 -1015271 -1474065 -419331 -821797 -618760 -709008 -283141
394 -283141 133177 -819392 244182 -73292 -968697 -1320899 -1312511 -495011 317065 191064
384A91064M6379J297059m82327j85541q7783r27615l08800K0698J94960j239248
374a481154P36343J660547l06912j186907n30741Q4617l8040M41601k97096L7642
364h80100M32627m64583o57281J017840K49962O15873l03189J76834j36094n178
354D6711k23885j213679K80118J249959n31651L97496P7916m08071n46261O48759
344b22588J35323n78435O21967j38016n98701O72304m31076K14595N66990o62599
334d20236R93073l09072N15518o41522j848356n59992J009997Q49794O27373j029918
324h13341q33062J141392o67301M38463N62094J55874L92196m11290M01814j162807
314g95968o24271O03627L07377N5759J174799j26144q62123Q55307p46591m28158
$$ plain form
384 191064 237443 1534502 1052175 866634 778851 -148764 -457564 -436866 -241906 -1481154
374 -1481154 -744811 915736 608824 -578083 -1108824 -1024207 -1062247 -620646 -917742 -880100
364 -880100 -447473 -912056 -1569337 -551497 -301535 314338 11149 187983 51889 46711
354 46711 -177174 -1390853 -1110735 139224 -392427 5069 82985 -325086 -871347 -222588
344 -222588 -87265 -665700 -43733 -181749 -780450 -108146 -539222 -324627 242363 -420236
334 -420236 572837 263765 779283 137761 -1710595 -2270587 -1260590 -410796 216577 -813341
324 -813341 -1646403 -505011 -1172312 -733849 -171755 -15881 376315 -34975 366839 -795968
314 -795968 -1420239 -816612 -509235 -453476 721323 595179 -266944 588363 -158228 -586386
304e86386j04815O87742j18445m94114j010636j057633J815076R63157n93942
295d99996l22363P756L61984J241832q45444m16286k04873l02660J106719J13601
285B40270j396005K73265P62585K8640q04888k88735m4294M29059J188691j35654
275B52934L77851j29948r98505P92758j43046m79658L16098P41187r3009p01018
265f4356J29234o63666q1858L43212M27591n42222k70054o67181J169967M44187
255B24854J69132q93921l45457M71562K33543K37757O51415K4086j097473P72534
245D48032q14659O60602j54179j86282l90209J72328Q78178m73058K39741l68163
235A2331m34234l29280j6977N80060r28099R31668P17514m38649n62195J147627
$$ plain form
304 -586386 -691201 -3459 -121904 -616018 -1626654 -2684287 -869211 93946 -499996
295 -499996 -822359 -814603 -452619 789213 -56231 -472517 -677390 -980050 126669 240270
285 240270 -1155735 -882470 -119885 -91245 -896133 -1184868 -1229162 -800103 388588 252934
275 252934 630785 500837 -497668 295090 152044 -327614 -11516 729671 636662 -64356
265 -64356 64878 -598788 -680646 -337434 90157 -452065 -722119 -1389300 -219333 224854
255 224854 393986 -499935 -845392 -373830 -140287 97470 748885 772971 -324502 448032
245 448032 -366627 293975 139796 -46486 -436695 -264367 613811 140753 380494 12331
235 12331 -421903 -751183 -768160 -188100 -1116199 -184531 532983 94334 -467861 679766
225F79766n96741j496840R11428M10077l95475r03138R54008j112684k33451M59677
215a323373k12643J333876L4446q42133N52113q8644l10897q49680j56898o7204
205a931037r77691J229672P65780O08652n24221j044925K1673Q75345J55650M14632
195d06470O8871P56623P12193r80249J15739m37939M53046L79515n97071n32373
185d68115o02789L19900p9776l44870k79176P27875J382715m61276n29320k29207
175e64039k04355n29784P68133k69003J58190P7117J90163k62462J60023O48370
165A72353p811L40994k0763l91687L14277J69864j184657J158991p14534j686849
155a849822N17333J613595L08631n85279L42818N22605m61227q90632o00881Q35171
$$ plain form
225 679766 83025 -1413815 -502387 -92310 -487785 -1390923 -436915 -1549599 -1783050 -1323373
215 -1323373 -1536016 -202140 -167694 -1009827 -457714 -546358 -857255 -1706935 -1863833 -1931037
205 -1931037 -2908728 -1679056 -913276 -304624 -828845 -1873770 -1852097 -976752 -821102 -406470
195 -406470 -337599 419024 1131217 150968 266707 -171232 281814 661329 64258 -468115
185 -468115 -1070904 -751004 -830780 -1175650 -1454826 -726951 655764 194488 -334832 -564039
175 -564039 -768394 -1298178 -530045 -799048 -640858 -563741 -373578 -636040 -476017 172353
165 172353 164542 505536 484773 93086 407363 577227 -607430 551561 -162973 -1849822
155 -1849822 -1332489 281106 589737 4458 347276 869881 408654 -481978 -1082859 -247688
145b47688L45155K46943j47879o46183n20982N81401n45264k50876O30455q98374
135a453292M54659O02796J171628j137530n29176k50169M87049J73437L74713
126a05885L62650J4062K18316r25506M8460M13178O86490n75527l93661J020940
116G63517K48356j633791o7975J95649P52748j80728q78208J70502j04550N1925
106f82555L05581n0461m13602Q43860K02506r33199q86770N64707O54113l91310
96g87130l47126k43330O32925O18472O28592k31066N04305p02544o12096K78902
86b60096M75999L82663n21191j83783p82245K29100k64060J12005O90396l6086
76a57298n98567N98481n34748q3590P44092r26383N53205P48734J1089m03500
$$ plain form
145 -247688 97467 344410 196531 -449652 -970634 -389233 -934497 -1185373 -554918 -1453292
135 -1453292 -998633 -395837 775791 -361739 -890915 -1141084 -654035 -480598 -105885
126 -105885 256765 270827 489143 -436363 -387903 25275 711765 136238 -257423 763517
116 763517 1011873 -621918 -689893 -494244 258504 77776 -800432 -629930 -734480 -682555
106 -682555 -376974 -427435 -841037 2823 205329 -727870 -1614640 -1049933 -395820 -787130
96 -787130 -1134256 -1377586 -744661 -126189 502403 271337 775642 73098 -538998 -260096
86 -260096 215903 598566 77375 -106408 -888653 -659553 -923613 -811608 -121212 -157298
76 -157298 -755865 -157384 -692132 -775722 -31630 -958013 -404808 343926 355015 -48485
66d8485j348635K94315J72303M28287J052036O0252o09003k08681N02996j76908
56A18477L748q79507m5799k9222k91090j45015J064740m01599p20402n1415K63975
45a113109K06701r41455J046969R9212M53566j79726j33141Q85631j22962n14096
35c12410J95083p15682j15813M43082r6592J04011J48491J57062L0896n338j10304
24b77514N54419l652k61480m24365l27257n93811P29132l00449o8506P31558m33727
13f75652J206201n64821J71092m29747M10841K1991o59738J96064l91746k12419
3i27934L44636O69576Q8837
0A75115
$$ plain form
66 -48485 -1397120 -1102805 -930502 -502215 549821 610073 1070 -207611 295385 118477
56 118477 122225 -757282 -803081 -832303 -1123393 -1268408 -203668 -605267 -1325669 -1377084 -1113109
45 -1113109 -906408 -1847863 -800894 -701682 -248116 -427842 -560983 324648 201686 -312410
35 -312410 -117327 -833009 -948822 -505740 -602332 -498321 -349830 -192768 -161872 -167210 -277514
24 -277514 276905 273253 11773 -412592 -739849 -1333660 -604528 -904977 -973483 -241925 -675652
13 -675652 530549 -34272 136820 -292927 117914 139905 -519833 -323769 -715515 -927934
3 -927934 -583298 86278 175115
0 175115
$$ Imaginary data points
##PAGE= N=2
##DATA TABLE= (X++(I..I)), XYDATA
16383f274116M31140J98412p17608M30195L50950l72990N31172P45621n31728
16374e208952k61468L13307m38132j85995m01968N89511K87843M09558r83397
16365e879693l38419j8999Q51337R88085j0652k06983j68901P119M60485k77192
16355d593813M39972O71289n01790K11361l2407l59237R5412k0944L10451N06738
16345c272968p76505P35427k67528R2680N73667N93177J67998J60033o72357K13846
16335b452530O99083o34610K52627P4205R2637r15423k09913M06689O25570k0507
16325b082172k10763K43532k47255k46300N62267M34933m39985j98542n43369
16316b727654J024109N30729O11715K13560k38418k24982M64413l36502q09602
$$ plain form
16383 -6274116 -5842976 -5644564 -6362172 -5931977 -5581027 -5954017 -5422845 -4677224 -5208952
16374 -5208952 -5470420 -5157113 -5595245 -5781240 -6183208 -5593697 -5305854 -4896296 -5879693
16365 -5879693 -6218112 -6237111 -5385774 -4397689 -4408341 -4615324 -4784225 -4777106 -4316621 -4593813
16355 -4593813 -4153841 -3482552 -3984342 -3772981 -3805388 -4164625 -4069213 -4090157 -3779706 -3272968
16345 -3272968 -4049473 -3314046 -3581574 -3488894 -2915227 -2322050 -2154052 -1994019 -2666376 -2452530
16335 -2452530 -1753447 -2388057 -2135430 -2061225 -1968588 -2884011 -3093924 -2687235 -2061665 -2082172
16325 -2082172 -2292935 -2049403 -2296658 -2542958 -1980691 -1545758 -1985743 -2184285 -2727654
16316 -2727654 -1703545 -1172816 -561101 -347541 -585959 -810941 -346528 -683030 -1492632
16307a492632K34568k46679Q19712o51548q1194L68447r1225l22992r13023M3587
16297b332979O66583n48305J204088L74888m44285R06210k54579o29275M95068
16288e62586M37016p22673O77025L38462m20177k70755M87253K40468o05611m85877
16278h87455k94287P90862M6786M1127o21665J200630R41083m1577l50462j334336
16268e09294q9591O59897n75721o0616P41042m55654J169112N79401n92241j021168
16258a54833O64351n01546N30676L72073M00043j33548n67595k60518K52661j11048
16248D90716J09066N60380J48560j127260j21690N15091L38352O73554o64310
16239I22459o31817K48449l23148r72721Q67948J076954j1745k58188J02092j56319
$$ plain form
16307 -1492632 -1258064 -1504743 -685031 -1336579 -1417773 -1049326 -1140551 -1463543 -2376566 -2332979
16297 -2332979 -1666396 -2214701 -1010613 -635725 -1080010 -173800 -428379 -1057654 -562586
16288 -562586 -125570 -848243 -171218 167244 -252933 -523688 -36435 204033 -401578 -887455
16278 -887455 -1181742 -390880 -344094 -302967 -924632 275998 1217081 1175504 825042 -509294
16268 -509294 -598885 61012 -514709 -575325 165717 -289937 879175 1458576 866335 -154833
16258 -154833 509518 7972 538648 910721 1310764 1177216 609621 349103 601764 490716
16248 490716 599782 1160162 1308722 181462 59772 574863 913215 1586769 922459
16239 922459 290642 539091 215943 -756778 111170 1188124 1176379 918191 1020283 863964
16229H63964N10106K80516l06304o53639m83704M74987Q79526Q03250m88860j02252
16219A777590j6070L25408n31938m95645J98445J83966L11882r86637r4337K20436
16209H93100N26217R16701p47150Q05695l80172p69900O43766m74333P81570L19118
16199B514612L38193j098263m52154M05578R32590p9085L9498o57171l97864L90031
16189A935965k00732k96637j78022K56756Q7566N90454k95627l29521P84635O69085
16179C023922k11006L33855l06619n03439k46001j30671L11091o5893J567999
16170C773238j17169q87239l08597j55553r85682K2651J177037j65767n18733
16161A834186l00089J55645J058456K06205j66879L74598r0928m10445o96059
$$ plain form
16229 863964 1374070 1654586 1348282 694643 210939 685926 1565452 2368702 1879842 1777590
16219 1777590 1761520 2086928 1554990 1059345 1257790 1441756 1753638 767001 672664 893100
16209 893100 1419317 2336018 1588868 2394563 2014391 1244491 1888257 1413924 2195494 2514612
16199 2514612 2852805 1754542 1302388 1707966 2640556 2561471 2600969 1943798 1545934 1935965
16189 1935965 1735233 1438596 1260574 1517330 1604896 2195350 1899723 1570202 2354837 3023922
16179 3023922 2812916 3146771 2840152 2336713 2090712 1960041 2271132 2205239 3773238
16170 3773238 3656069 2768830 2460233 2304680 1318998 1341649 2518686 2352919 1834186
16161 1834186 1534097 1689742 2748198 2954403 2787524 3162122 3071194 2660749 1964690
16152A964690m0815j13829J200607R4309j361198K09250L46610J201687n24394
16143B976917j196668K84082J233350k68580o7368n97r6411L24362L23926J08216
16133C621229n53814L28008m95943l60630j8406j121775j27829J59440P41207
16124B171487M03890P39550R03912j064312P145K85209L66655j46196j163109
16115B504231K3886M03477k28011j94483o85292O96180j90188N47467q99045J138427
16105C116649O7587M64723O18038J90463p83382j130448j14612J638850m7454
16096D020414j002734O97004j261833K13347m60379l62676q89257Q62823l35074
16087A481635K88048m960J692020J254146n95100q75213l38856o41452l97638
$$ plain form
16152 1964690 1923875 1810046 3010653 3104962 1743764 1953014 2299624 3501311 2976917
16143 2976917 1780249 2064331 3297681 3029101 2961733 2961136 2864725 3189087 3513013 3621229
16133 3621229 3067415 3395423 2899480 2538850 2520444 1398669 1270840 1430280 2171487
16124 2171487 2575377 3314927 4218839 3154527 3161672 3446881 3813536 3667340 2504231
16115 2504231 2528117 2931594 2703583 2509100 1823808 2519988 2329800 2877267 1978222 3116649
16105 3116649 3184236 3648959 4266997 4457460 3674078 2543630 2429018 4067868 4020414
16096 4020414 3017680 3714684 2452851 2666198 2205819 1843143 953886 1816709 1481635
16087 1481635 1769683 1764723 3456743 4710889 4115789 3240576 2901720 2260268 1862630
16078A862630L82140O89176K7880m01443j001196L39842J085212J007168J3388
16069D004797m47246O527o3544K3380j778190l69254O96050M0748N38041m26830
16059B224479R75952O67636j169158R25122L4859N39426L2355j558981o91202
16050A980488P35575m48992L42058K81863j7897R3432K92152n8682M60475k00479
16040C459993Q8293L91708p68613j171273j03063O46258J164390O54383J346145
16031E708221j467292j415586m42848J733057Q17682j272879q83785m46590k68637
16022B061343j08474Q47689J162544m44933k65672l8112Q9646J87970m39584Q25634
16012C878051m19480m01238M49719J11610j285603P50213J578109n95779j079747
$$ plain form
16078 1862630 2244770 2933946 2961826 2560383 1559187 1899029 2984241 3991409 4004797
16069 4004797 3557551 3564078 3500534 3523914 1745724 1376470 2072520 2113268 2651309 2224479
16059 2224479 3200431 3868067 2698909 3624031 3658890 4198316 4230671 2671690 1980488
16050 1980488 2716063 2267071 2609129 2890992 2873095 2966527 3258679 3199997 3660472 3459993
16040 3459993 3548286 3939994 3171381 2000108 1897045 2543303 3707693 4362076 5708221
16031 5708221 4240929 2825343 2382495 4115552 4933234 3660355 2776570 2329980 2061343
16022 2061343 1952869 2800558 3963102 3518169 3252497 3214385 3304031 3492001 3052417 3878051
16012 3878051 3458571 3057333 3507052 3618662 2333059 3083272 4661381 4065602 2985855
16003B985855R89898k48823j234334L8236N47851o18923M99368M86651n21467
15994B924312R82112q99956O37369O61994j361379n63441N70292P82944j61897
15985C572350r34346n15629N95302O82750J43852j839735J005680K79354L11948
15976C301526K14138j77952p56577k0581O16117o599K13703m26734j168810O36556
15966B424787R95115q79024n00392J126012J469323p87457q59850j11237R71702
15957C848979J467509K48931j188290j33040J477004j344848j133857L41970n88917
15948B995441M70804o06194M59548O16031q70281n9540K01732m53780j78833K70996
15938B845924l09203l42432R2608K66294K37623K55636L73249J83295m04878j269539
$$ plain form
16003 2985855 3975753 3726930 2492596 2530832 3078683 2459760 2959128 3445779 2924312
15994 2924312 3906424 3006468 3643837 4305831 2944452 2381011 2951303 3734247 3572350
15985 3572350 2638004 2122375 2717677 3400427 3544279 1704544 2710224 2989578 3301526
15976 3301526 3515664 3337712 2581135 2560554 3176671 3170072 3383775 2957041 1788231 2424787
15966 2424787 3419902 2540878 2040486 3166498 4635821 3848364 2988514 2877277 3848979
15957 3848979 5316488 5565419 4377129 4244089 5721093 4376245 3242388 3584358 2995441
15948 2995441 3466245 2860051 3319599 3935630 3065349 3005809 3207541 2753761 2574928 2845924
15938 2845924 2536721 2194289 2286897 2553191 2790814 3046450 3419699 3602994 3198116 1928577
15928A928577P11435k32859J79674o6119q93053O27683m61383Q67163j28093L68743
15918B901768J426044k22378p11696p88795r00512J36312N17913M43676j30716
15909B671616M29986n8550K41170n22224P18642j01703p69925J703963M3871j119639
15899C237207o17690L35832m5498M50014L74817J74073M9252n14587k59712m70748
15889B712960l85225m0325P52319R57181k94054p26584J531614M997K62038p05591
15879D069330J68571m580k48884L18838n59791K3844O51877J9189r58542K66471
15869C746323r3504j16217k45477j4092L59664M48085J048257O2866o7938j422433
15859C705534j163536J56505N14196L85337M6827J117544j281513l02421o6585
$$ plain form
15928 1928577 2640012 2407153 2586827 2520708 1627655 2255338 1793955 2661118 2533025 2901768
15918 2901768 4327812 4105434 3393738 2604943 1704431 1840743 2358656 2802332 2671616
15909 2671616 3101602 3043052 3284222 2761998 3480640 3378937 2609012 4312975 4356846 3237207
15899 3237207 2619517 2955349 2909851 3359865 3734682 3908755 3958007 3443420 3183708 2712960
15889 2712960 2327735 2287410 3039729 3996910 3702856 2976272 4507886 4512883 4774921 4069330
15879 4069330 4237901 4233321 3984437 4303275 3743484 3767328 4419205 4438394 3479852 3746323
15869 3746323 3652819 3536602 3291125 3277033 3636697 4084782 5133039 5195905 5127967 3705534
15859 3705534 2541998 2698503 3212699 3598036 3644863 4762407 3480894 3178473 3111888
15850C111888o15952K8736k65519N19728J31352k9991m16183L62702M59651n66604
15840B719808P71205K29415r2693O34276M79293k33805l19907j073838R10448
15831D024202N15622j388983n09683Q67638O7588J333812j236997j077106j33477
15822B462616J302931O00364J63641q44597N26988l51440M50307p86577j357553
15813B166680J617543J480938j25069p94283j35106o21735J062949l65436j540617
15804B745864o4753j63257M36625O30927m33883l79585l0650J618250J56634l37566
15794D178606J54979m03137m79102Q9344p3179j138286J440337p2488r28516K43830
15784C012388j97973l50263k52110m62886m06370J016359J059750Q02516j552439
$$ plain form
15850 3111888 2495936 2524672 2259153 2778881 2910233 2880242 2464059 2826761 3286412 2719808
15840 2719808 3491013 3720428 3627735 4262011 4741304 4507499 4187592 3113754 4024202
15831 4024202 4539824 3150841 2641158 3508796 3576384 4910196 3673199 2596093 2462616
15822 2462616 3765547 4365911 4529552 3684955 4211943 3860503 4310810 3524233 2166680
15813 2166680 3784223 5265161 5140092 4345809 4210703 3588968 4651917 4286481 2745864
15804 2745864 2681111 2517854 2954479 3585406 3151523 2771938 2741288 4359538 4516172 4178606
15794 4178606 4333585 3930448 3451346 3540690 3467511 2329225 3769562 3697074 2768558 3012388
15784 3012388 2814415 2464152 2212042 1749156 1342786 2359145 3418895 4221411 2668972
15775B668972q00948p81655J243571J294769l60112j059309Q31607o65713k85563
15766B085619P78199P74774j19209n09510o82866O07742q24611K7270J19260o96647
15756A560021J063164O55872O22092j488159J044831J262503j573545j87449K35015
15747C194345j92384L86851n68530M8580K97278O92542J131996Q11049j70736
15738E630991k079030r57398n68274M84340L93670k01618O20579J20208l31141
15729C112327M92629j8586n99984Q949M28396j59758q75157q24583J173985R31030
15719C669248r26162m22826Q40542P37858k1897j09352J88438J760290j030242
15710D685897r59352J66301L32235j29688j202399q49074O50643M42768p25602
$$ plain form
15775 2668972 1868024 1086369 2329940 3624709 3264597 2205288 3036895 2371182 2085619
15766 2085619 2863818 3638592 3519383 3009873 2327007 2934749 2110138 2137408 2256668 1560021
15756 1560021 2623185 3279057 3901149 2412990 3457821 4720324 3146779 2959330 3194345
15747 3194345 3001961 3388812 2820282 2868862 3166140 3858682 4990678 5801727 5630991
15738 5630991 3551961 2594563 2026289 2510629 2904299 2702681 3323260 3443468 3112327
15729 3112327 3604956 3586370 2986386 2995335 3423731 3263973 2388816 1564233 2738218 3669248
15719 3669248 2743086 2320260 3160802 3898660 3876763 3767411 3955849 5716139 4685897
15710 4685897 3726545 3892846 4225081 4095393 2892994 2043920 2694563 3137331 2411729
15701B411729L23017j66533n782J346117L47817l80410K55313r25854P40804k33005
15691C713213j044943m8295J45039P86979l23073j13406l50748K1369J75530q00008
15681B161657P78715J664225p66550p96501M96060l26883N81312k51957l0544
15672C509534K99241J85089j392024J46673J78070N04039J62739n61750M9298
15663C080909L17404J009453n60574J50050L57310N66286m63985q50620p12990
15654B893243j31940M17302j18219q92117L61904J72723j85630R74312Q54664
15645D346242J83602j034670r20986O05511r59158j24035L93389m32603J412552
15636C469844P00107l68582q46159M007L80234K43690m21251N35594k64595j303472
$$ plain form
15701 2411729 2734746 2568213 2562431 3908548 4256365 3875955 4131268 3205414 3946218 3713213
15691 3713213 2668270 2619975 2765014 3551993 3228920 3115514 2764766 2786135 2961665 2161657
15681 2161657 2940372 4604597 3838047 3041546 3537606 3210723 3792035 3540078 3509534
15672 3509534 3808775 3993864 2601840 2748513 2926583 3430622 3593361 3031611 3080909
15663 3080909 3398313 4407766 3847192 3997242 4354552 4920838 4456853 3606233 2893243
15654 2893243 2761303 3178605 3060386 2168269 2530173 2702896 2517266 3491578 4346242
15645 4346242 4529844 3495174 2574188 3179699 2220541 2096506 2489895 2057292 3469844
15636 3469844 4169951 3801369 2955210 2959217 3339451 3583141 3161890 3697484 3432889 2129417
15626B129417J497129J221097j080791r21964N49949L71k954j54069R8167j59731
15616C176621L5360j22634p0269J09266J610299N46662j233451L02923M95814
15607D850591N89248k10960j074093L4210k62705j125602l57528Q08516j20217
15598C131460n406m48444M67541l00176N42855n89788N66799K2346l05988m73244
15588B607955J234322k87334j181401M84268J40661L39475p00981r10801J16711
15579A842875P7564R78966J375601j011228p89200J507267l09736j226748O7989
15570B513350m26359L08628l19647J24265J403088k78402k51626q0290J23517
15561C116524O99825j467253P7748p5868P47926P88037R2122n52011K5674q05135
$$ plain form
15626 2129417 3626546 4847643 3766852 2844888 3394837 3395208 3392254 3238185 3336352 3176621
15616 3176621 3211981 3089347 3019078 3128344 4738643 5285305 4051854 4354777 4850591
15607 4850591 5439839 5228879 4154786 4188996 3926291 2800689 2443161 3251677 3131460
15598 3131460 3126054 2677610 3145151 2844975 3387830 2798042 3364841 3387187 3081199 2607955
15588 2607955 3842277 3554943 2373542 2857810 2998471 3337946 2636965 1726164 1842875
15579 1842875 1920439 2899405 4275006 3263778 2474578 3981845 3672109 2445361 2513350
15570 2513350 2086991 2395619 2075972 2200237 3603325 3324923 3073297 2993007 3116524
15561 3116524 3816349 2349096 2426844 2350976 3098902 3886939 3979061 3427050 3452724 2647589
15551B647589N10600L81546L90179p43661j009197J362504M24611j01321N44581
15542D407431m97444j268693l70901J261891L52434o82859j206571P11394O60711
15533C367393l01962m33851l10736M8833M73260M54753Q15829j517950j32167
15524B463402O72828L51594q37428p74250J153233J6083l55667j84675J012272
15515C517392J119759j767386n58484M83600Q2869j27104j00797J19827j170557
15506A599119R25995P75573p33334l44057R53730O70593L35470j322350j287038
15497A573701P28191K33189L60057R56351k85247j119691O21206l32445N6127
15488B791439j41034k68067J189190J72596p70756j139935K51694J140891M78218
$$ plain form
15551 2647589 3158189 3539735 3929914 3186253 2177056 3539560 3964171 3862850 4407431
15542 4407431 3909987 2641294 2270393 3532284 3884718 3201859 1995288 2706682 3367393
15533 3367393 3065431 2631580 2320844 2369677 2842937 3297690 4113519 2595569 2463402
15524 2463402 3136230 3487824 2650396 1876146 3029379 3045462 2689795 2505120 3517392
15515 3517392 4637151 2869765 2311281 2794881 2877750 2750646 2649849 2769676 1599119
15506 1599119 2525114 3300687 2567353 2223296 3177026 3847619 4183089 2860739 1573701
15497 1573701 2301892 2535081 2895138 3851489 3566242 2446551 3067757 2735312 2791439
15488 2791439 2650405 2382338 3571528 3744124 2973368 1833433 2085127 3226018 3704236
15479C704236l45005L55823p93747O68129p13141k14675N85517J83256k0205Q001
15469C418189L18222l00271J018963K09501r2372k01950j254715N04682O4665
15460C684914N96776j116430j521P22906r21983k87876Q49708j97731k1517K99738
15450C606984m40849R59367m43290j008907P50696j7431o53963O4233j355037
15441A461803J119058L03595K92382j40844q08261n08112J115655O28906J29400
15432C593582o24278N50722K42444n23913J57339Q89081M23735o6010j853105
15423B789597o49775J613004m38471r57080J184404L80879O01966l13616m97265
15414C713643O35727j065024M97319j062589O2977K57087R39052K54301m19773
$$ plain form
15479 3704236 3359231 3715054 2921307 3589436 2876295 2661620 3247137 3430393 3410188 3418189
15469 3418189 3736411 3436140 4455103 4664604 4572232 4370282 3115567 3620249 3684914
15460 3684914 4281690 3165260 3163739 3886645 2964662 2676786 3526494 3328763 3307246 3606984
15450 3606984 3166135 4125502 3682212 2673305 3424001 3406570 2752607 2816840 1461803
15441 1461803 2580861 2884456 3176838 3035994 2227733 1719621 2835276 3464182 3593582
15432 3593582 2969304 3520026 3762470 3238557 3395896 4284977 4708712 4642702 2789597
15423 2789597 2139822 3752826 3314355 2357275 3541679 3922558 4524524 4210908 3713643
15414 3713643 4349370 3284346 3781665 2719076 2782053 3039140 3978192 4232493 3812720
15405C812720p63697l84086q80204O51262J256925k28582l44665J502986l56085
15396D266574q17843K70285l05161j399635J582754J213412q6664j172190o53556
15387B897976Q6295K01368P19284J52036O83470j946607o46275M00307q2807M43620
15377B908667j89918J319897n3839k89434K40971L63318P3550l18510p87289M03332
15367C670745P67396n99245M00898q30395o62442J64499N13672M76453K13244
15358D114825j165580m18054J133262j99020k78020J52643r5359j45177k08689
15349B890831J003665j06887l67451j94324J384277j08707j544740k80057J405862
15340D082469J1740r4457M955j89769j306893N67354L20355O69494J98185j159756
$$ plain form
15405 3812720 3049023 2664937 1784733 2435995 3692920 3464338 3119673 4622659 4266574
15396 4266574 3448731 3719016 3413855 2014220 3596974 4810386 4723722 3551532 2897976
15387 2897976 2984271 3185639 3904923 4056959 4740429 2793822 2147547 2547854 2465047 2908667
15377 2908667 2718749 4038646 3984807 3695373 3936344 4299662 4373212 4054702 3267413 3670745
15367 3670745 4438141 3838896 4239794 3409399 2746957 2911456 3425128 3901581 4114825
15358 4114825 2949245 2531191 3664453 3465433 3187413 3340056 3244697 3099520 2890831
15349 2890831 3894496 3787609 3420158 3225834 4610111 4501404 2956664 2676607 4082469
15340 4082469 4094209 3999752 4004707 3814938 2508045 3075399 3395754 4065248 4263433 3103677
15330C103677j2061J47727r7507n48351m64690j42286K78034J551308o86777k16304
15320B912770M18990J213560l22884j177172m17276J36283J94613P33690N82232
15311D274806m06742M68563k2153k0584j333168R32106o30338L88193L59344N59499
15301D569526l39330k25187J76471j409841j94245J105030n76659l60401l62829
15292B382535N52981k61746q24389J58694o10225K15736J414635o61392N57957
15283B924786j039414J71269Q80045J06420m22098N27451O21882m82398R47312
15274D235255p28339p71043L9252N12752O2687k78182o90547N80517O94071j144677
15264B511746m34492J456451P60943j028387r56264l27568M45199K012696N53008
$$ plain form
15330 3103677 3091616 3239343 3141836 2593485 2128795 1986509 2264543 3815851 3129074 2912770
15320 2912770 3331760 4545320 4222436 3045264 2627988 2764271 2958884 3692574 4274806
15311 4274806 3868064 4336627 4314474 4293890 2960722 3892828 3262490 3650683 4010027 4569526
15301 4569526 4230196 4005009 4181480 2771639 2577394 3682424 3105765 2745364 2382535
15292 2382535 2935516 2673770 1849381 2008075 1397850 1613586 3028221 2366829 2924786
15283 2924786 1885372 2056641 2936686 3043106 2621008 3148459 3770341 3287943 4235255
15274 4235255 3506916 2735873 2775125 3287877 3350564 3072382 2381835 2962352 3656423 2511746
15264 2511746 2077254 3533705 4294648 3266261 2309997 1982429 2427628 4440324 4993332
15255D993332J15033m21825j13153j668149K07726N57086p75176n03Q58642j002513
15245B750500J102971k39989r14463J495898r3963l7467n5501L60747n4491n65280
15235C748962O76855k78950Q2845M10246m72837r7569n95430O59460m97571l70110
15225C265901L8260K88115O8413Q513J655292J80083N29580j105463p12707l07007
15215C908980j254484M14149K35549K69738n776p66656P852l02282J16037R7896
15205B721003n51155L80482J338545p48420l93616J368854R7650q85545K49722
15196C577520j4738n17180Q1441o32242J50226j38998Q79581n59546o3485J367854
15186D130433p00285p34002P69509L1974l00943P1807j38946N41944p48286k00290
$$ plain form
15255 4993332 5108365 4686540 4573387 2905238 3112964 3670050 2894874 2894371 3753013 2750500
15245 2750500 3853471 3613482 2699019 4194917 4100954 4063487 4007986 4368733 4314242 3748962
15235 3748962 4425817 4146867 4229712 4639958 4167121 4069552 3474122 4133582 3636011 3265901
15225 3265901 3304161 3592276 3660689 3669202 5324494 5504577 6034157 4928694 4215987 3908980
15215 3908980 2654496 3068645 3304194 3573932 3568156 2801500 2809352 2507070 2623107 2721003
15205 2721003 2169848 2550330 3888875 3140455 2746839 4115693 4213343 3327798 3577520
15196 3577520 3562782 3045602 3127043 2494801 2645027 2506029 3385610 2826064 2762579 4130433
15186 4130433 3430148 2696146 3465655 3497629 3196686 3268493 3129547 3671491 2923205 2722915
15176B722915J067606l57920o61950N17006l11355Q80475L63457k01638Q4234
15167D102830J114812k46078j942487m89644P26288N32372j1371J184192m46015
15158D524899j24683n65521k30510K60628M45362j353648P3738m53275R59868
15149C536858O25378M94149J60170j544520J06662k95533j7418N88124m68900
15140C184970l89690J4479R61575m17325o4351J37030M03711n1559k11536K17412
15130C784716j234868J041214O53915K41272k09161N54397K45767j403528J97730
15121C871454l36915j26042J067246q35955L23927P74008p55637p30703o01706
15112B649677Q61442p07135J12925j026261p1952J125846J086340n03816p57974
$$ plain form
15176 2722915 3790521 3432601 2770651 3287657 2976302 3856777 4220234 4018596 4102830
15167 4102830 5217642 4971564 3029077 2539433 3265721 3798093 3786722 4970914 4524899
15158 4524899 4400216 3834695 3604185 3864813 4310175 2956527 3030265 2576990 3536858
15149 3536858 4162236 4656385 4816555 3272035 3378697 3083164 3065746 3653870 3184970
15140 3184970 2795280 2809759 3771334 3354009 3289658 3426688 3830399 3778840 3567304 3784716
15130 3784716 2549848 3591062 4244977 4486249 4277088 4831485 5077252 3673724 3871454
15121 3871454 3534539 3408497 4475743 3639788 3963715 4737723 3982086 3251383 2649677
15112 2649677 3511119 2803984 2916909 1890648 1818696 2944542 4030882 3527066 2769092
15103B769092p51279J34081J528592K22062J62844k41498N83457K99001j37593
15094D568759j014434r46485o73772N0636J008228R77583o11004L37099N18879
15085D215489K98684j07698j19677m05487q68528L25022K16486l82206j42328
15076C029757R3596J063489o77181j46957k06210P52155q86557o29733J163969
15067C556328J4912K63625P15523q2485r75433o3306q10683L61645P45574n19436
15057C206264J845205P2980m45501o02533n89814r62976J26870n24028R19211
15048C045678J302961n68849n15962J96982p52937P2417Q77707j346932J486587
15039C797652R08837k02276P46907k12813j52455q45212o5518K24221p79816J74808
$$ plain form
15103 2769092 2017813 2151894 3680486 3902548 4065392 3823894 4407351 4706352 4568759
15094 4568759 3554325 2607840 1934068 1984704 2992932 3970515 3359511 3696610 4215489
15085 4215489 4514173 4406475 4286798 3881311 3012783 3337805 3554291 3172085 3029757
15076 3029757 3123353 4186842 3509661 3362704 3156494 3908649 3022092 2392359 3556328
15067 3556328 3571240 3834865 4550388 4467903 3492470 3429164 2618481 2980126 3725700 3206264
15057 3206264 5051469 5124449 4678948 4076415 3486601 2523625 2650495 2126467 3045678
15048 3045678 4348639 3779790 3263828 3460810 2707873 2780290 3657997 2311065 3797652
15039 3797652 4706489 4504213 5251120 5038307 4885852 4040640 3975122 4199343 3419527 3594335
15029C594335q7311M97446l51636j20476M04855o92149j460914J26124N57566
15020B467840O46575j01786J25160J447719m01516m90379l7040q3731R97471m12342
15010D157971q47981m965P67698r901p49800p15847M61770K73845m92905N00113
15000C339998o87868L82587k04403Q16699J232588p25560m43764p9138r59195
14991B671944K42569j03673O09683O78717p31859p5035O16598R3820L15494J085554
14981E403812j448388o80479J4803N55390j57681j16898M46926o34151p6510L71758
14971C678582o61335l10567J54092R64854J203970m40305j180440j67625J08435
14962C349661k55071M65785k06752O71083P29822J96573p18160J5905p8430r15281
$$ plain form
15029 3594335 3507024 4004470 3652834 3532358 3937213 3245064 1784150 1910274 2467840
15020 2467840 3114415 3012629 3137789 4585508 4183992 3693613 3656573 3572842 4570313 4157971
15010 4157971 3309990 3305025 4072723 4062822 3313022 2597175 3058945 3332790 2839885 3339998
15000 3339998 2652130 3034717 2830314 3647013 4879601 4154041 3710277 3631139 2671944
14991 2671944 2914513 2810840 3420523 4099240 3367381 3292346 3908944 4002764 4318258 5403812
14981 5403812 3955424 3274945 3289748 3845138 3687457 3570559 4017485 3383334 3306824 3678582
14971 3678582 3017247 2706680 2860772 3825626 5029596 4589291 3408851 3241226 3349661
14962 3349661 3094590 3560375 3353623 4024706 4754528 4951101 4232941 4248846 4170416 3255135
14952C255135P43268q66453N99431j21497J069196j76933j272330N28361P97150
14943D555328q26460n92508l2716L74347l34903l19322k38910P31301P15129M63635
14933D494921n12066o45477o3640k1394P62051K5118l02867n05566K7939r34842
14923B324177J161509l86410p21890J280471L56003O4631J40353L99209j064060
14914C553993k33851N85196n06534m39966K28815N58515m99994p11615Q0255R66290
14904C581104R77011j59680j357887o7740O34321l03772m72602m0782l26184L88982
14894B852771l9585M9277O00603N99697N76333P1800L94758j834138k53782k29108
14884B788626q70550K5045R78458M75262j94242j75655l61131M19846p33294J341994
$$ plain form
14952 3255135 3998403 3131950 3731381 3609884 4679080 4502147 3229817 3758178 4555328
14943 4555328 3728868 3136360 3103644 3477991 3143088 2823766 2584856 3316157 4031286 4494921
14933 4494921 3982855 3337378 3273738 3252344 4014395 4039513 3736646 3231080 3259019 2324177
14923 2324177 3485686 3099276 2377386 3657857 4013860 4078491 4218844 4618053 3553993
14914 3553993 3320142 3905338 3398804 2958838 3187653 3746168 3246174 2534559 2614814 3581104
14904 3581104 4558115 4398435 3040548 2972808 3607129 3303357 2830755 2789973 2463789 2852771
14894 2852771 2813186 2862463 3463066 4062763 4639096 4710896 5105654 3271516 3017734 2788626
14884 2788626 1918076 1943121 2921579 3396841 3202599 3026944 2665813 3085659 2352365 3694359
14874C694359J08352L13360J09126l42286o70399J104851j64610n45060o46161
14865B961532l70534J723685R52670j092385r37714J282266P60856k36414n29116
14856D514846K9341l28314j031205r31358m05880N48810n0346m49085O02021P306
14846B506136P61572J43259Q1288O14162l34998k4241N33489M19174o27325p38401
14836C334115m9731J119626J073880j637412l34586l99949K44374R54373o14800
14827C689890k07601O2772N33704L64595j943475J128712R92335p69779l04082
14818C547071J62921j056215o10142N01554L82765M51705J69418J476737n52172
14809D473642q28321m28224J256284O47426J57622n87537l72008J01475N00516
$$ plain form
14874 3694359 3802711 4116071 4225197 3882911 3212512 4317363 4152753 3607693 2961532
14865 2961532 2590998 4314683 5267353 4174968 3237254 4519520 5280376 5043962 4514846
14856 4514846 4544187 4215873 3184668 2253310 1847430 2396240 2345894 1896809 2498830 2506136
14846 2506136 3267708 3410967 3492255 4106417 3771419 3747178 4280667 4699841 4072516 3334115
14836 3334115 3284384 4404010 5477890 3840478 3505892 3105943 3350317 4304690 3689890
14827 3689890 3482289 3545061 4078765 4443360 2499885 3628597 4620932 3851153 3547071
14818 3547071 3709992 2653777 2043635 2545189 2927954 3379659 3549077 5025814 4473642
14809 4473642 3645321 3217097 4473381 5120807 5278429 4690892 4318884 4420359 4920875
14800D920875m7338M8960j445763n33483m24694L76334P28903k8389P9134l35463
14790C339076j32400p22006J321721K63422q23777N50040l07694l55120n7627
14781C075635k05868N80267N6078l08903J138739M36189r91062K9499r305n49144
14771C252125K75525l09915o35373Q70824J228756Q38562r92152p5303m41829
14762D011220P94554O16507q01808O64827j028318j54248n13562j170703M23840
14753B842309J80679l89246r9573J82322p398P4112R69270M3072l38571M70323
14743C927299j337169K60243k40532j9093J483349L96587p09266P71935O4263
14734D597616j526993l91889J526844N37219m66921K89025j51586j06120N87321
$$ plain form
14800 4920875 4873537 4922497 3476734 2943251 2518557 2894891 3623794 3595405 3674539 3339076
14790 3339076 3206676 2484670 3806391 4069813 3246036 3796076 3488382 3133262 3075635
14781 3075635 2869767 3450034 3506112 3197209 4335948 4772137 3781075 3810574 3801269 3252125
14771 3252125 3527650 3217735 2582362 3453186 4681942 5520504 4528352 4453049 4011220
14762 4011220 4805774 5422281 4620473 5285300 4256982 4102734 3589172 2418469 2842309
14753 2842309 3022988 2633742 2534169 2716491 2709093 2783205 3752475 3795547 3456976 3927299
14743 3927299 2590130 2850373 2609841 2590748 4074097 4470684 3761418 4533353 4597616
14734 4597616 3070623 2678734 4205578 4742797 4275876 4564901 4413315 4307195 4894516
14725D894516n27371N48925j6152j959824O76414L49518l38304k78073J602249
14716D951898M14999j202416k54812n14977n29796M67814n42106M68561R36396
14707D195561J14490k41089J68706q32866j087695P15990k9481j2901N74966o97832
14697B867849n79968J679857M28670P25282K35463j089944j217437M74819P00393
14688D224984j8325N567j11859m47632k97272J053631K72631p79676J436605n29084
14678D809570r78518Q70149r86219J27506J70613j256669M73989L81808M11680
14669D023909k7848M29463L90504M52021R5920k62783r99887k59664m97711j51396
14659C192528k9071M1732Q27748Q29407p76870q60272m69988R0074J82911L7175
$$ plain form
14725 4894516 4367145 4916070 4899918 2940094 3616508 3966026 3627722 3349649 4951898
14716 4951898 5366897 4164481 3909669 3394692 2864896 3332710 2790604 3259165 4195561
14707 4195561 4310051 4068962 4237668 3404802 2317107 3033097 3003616 2990715 3565681 2867849
14697 2867849 2287881 3967738 4396408 5121690 5357153 4267209 3049772 3524591 4224984
14688 4224984 4206659 4212226 4100367 3652735 3355463 4409094 4681725 3902049 5338654 4809570
14678 4809570 3831052 4701201 3714982 3842488 4013101 2756432 3230421 3612229 4023909
14669 4023909 3996061 4425524 4816028 5268049 5363969 5101186 4101299 3841635 3343924 3192528
14659 3192528 3163457 3205189 4032937 4862344 4085474 3225202 2755214 2845288 3028199 3065374
14649C065374J79072k49095k95099R47952Q08701j236709L34281M36789J13147
14640D104413j304340N31045M5009r32096L09390J315317J90109j413239q01438
14631B044170J101675L1143p13575N52245J122082l71994l90181N00415q75924
14622C000056l60797r151M16731K72497q02746R22667k31309k20658K23324J13883
14612C324497J064485K36660q02919K32483N39720o00785p2855l86825j700775
14603A833686m61374R63198J432488M62401m40893j286074N00089R77059k73367
14594C707213N45303n96481j467457J010735Q21911L56750J02419l88765p26087
14585C365541r79123K85194M37885J000980Q6952q99692P76429L55721P5123p4754
$$ plain form
14649 3065374 3244446 2995351 2700252 3648204 4456905 3220196 3554477 3991266 4104413
14640 4104413 2800073 3331118 3376127 2444031 2753421 4068738 4258847 2845608 2044170
14631 2044170 3145845 3176988 2463413 3015658 4137740 3765746 3375565 3875980 3000056
14622 3000056 2639259 2630108 3046839 3319336 2516590 3439257 3207948 2987290 3210614 3324497
14612 3324497 4388982 4625642 3822723 4055206 4594926 3994141 3921286 3534461 1833686
14603 1833686 1372312 2335510 3767998 4230399 3789506 2503432 3003521 3980580 3707213
14594 3707213 4252516 3656035 2188578 3199313 4021224 4377974 4480393 4091628 3365541
14585 3365541 2386418 2671612 3109497 4110477 4197429 3297737 4074166 4429887 4505010 4430256
$$ [...]
##END NTUPLES=NMR SPECTRUM
##END=
