##TITLE=1H_EC-3252(II-21)
 CDCl3,8 sc, 
 31.03.2021
##JCAMPDX= 6.0         $$ Bruker NMR JCAMP-DX V2.0
##DATA TYPE= NMR SPECTRUM
##DATA CLASS= NTUPLES
##ORIGIN= UXNMR, Bruker Analytische Messtechnik GmbH
##OWNER= root
$$ XWIN-NMR		Version 3.5
$$ Wed Mar 31 10:29:33 2021 Russian Standard Time (UT+4h)  she@DPX200
##.OBSERVE FREQUENCY= 200.131506
##.OBSERVE NUCLEUS= ^1H
##.ACQUISITION MODE= SIMULTANEOUS
##.ACQUISITION SCHEME= undefined
##.AVERAGES= 8
##.DIGITISER RES= 18
##SPECTROMETER/DATA SYSTEM= spect
##.PULSE SEQUENCE= zg30
##.SOLVENT NAME= CDCl3
##.SHIFT REFERENCE= (INTERNAL, CDCl3, 0, 15.9678)
##AUDIT TRAIL= $$ (NUMBER, WHEN, WHO, WHERE, WHAT)
$$ ##TITLE= Audit trail, XWIN-NMR		Version 3.5
$$ ##JCAMPDX= 5.01
$$ ##ORIGIN= Bruker BioSpin GmbH
$$ ##OWNER= she
$$ F:/spectra/data/she/nmr/H-F/1/pdata/1/auditp.txt
$$ ##AUDIT TRAIL=  $$ (NUMBER, WHEN, WHO, WHERE, WHAT)
(   1,<2021-03-31 10:28:15.03 +0400>,<she>,<DPX200>,
      <created by zg, POWCHK disabled, PULCHK disabled
       configuration hash MD5:
       00 E9 B6 7A A2 85 ED C7 34 08 36 98 17 FE 4E 26
       data hash MD5: 16K
       5A 21 72 6C 69 2C 7F F2 15 76 84 A8 1E FB 1B 36>)
(   2,<2021-03-31 10:28:17.25 +0400>,<she>,<DPX200>,
      <Start of raw data processing
       efp BC_mod = 2 LB = 0.24 FT_mod = 6 PKNL = 1 PHC0 = -11117.23 PHC1 = 8.200929 SI = 16K 
       data hash MD5: 16K
       CF CC 78 22 99 69 0E 5C 9C 2B 70 B5 44 47 E0 75>)
(   3,<2021-03-31 10:28:34.70 +0400>,<she>,<DPX200>,
      <pk PHC0 = -4.848597 PHC1 = 7.000001 
       data hash MD5: 16K
       C7 06 38 68 F7 04 09 22 2A 55 5C 02 80 4E 75 22>)
(   4,<2021-03-31 10:28:37.84 +0400>,<she>,<DPX200>,
      <abs ABSG = 5 
       data hash MD5: 16K
       5B 80 9C C0 48 C5 23 D5 B2 ED 6A DB 14 03 00 16>)
$$ ##END=
$$ 
$$ hash MD5
$$ 20 63 53 1D C4 5B EC 56 F6 82 24 00 02 4F 44 44
##$RELAX= 
##$RELAX= 
##$RELAX= 
##$RELAX= 
##$RELAX= 
##$RELAX= 
$$ Bruker specific parameters
$$ --------------------------
##$DU= <F:/spectra>
##$EXPNO= 1
##$NAME= <H-F>
##$PROCNO= 1
##$TYPE= <nmr>
##$USER= <she>
##$AMP= (0..31)
100 100 100 100 100 100 100 100 100 100 100 100 100 100 100 100 100 100 
100 100 100 100 100 100 100 100 100 100 100 100 100 100 
##$AQSEQ= 0
##$AQ_mod= 1
##$AUNM= <au_zg>
##$AUTOPOS= <>
##$BF1= 200.13
##$BF2= 200.13
##$BF3= 200.13
##$BF4= 200.13
##$BF5= 200.13
##$BF6= 200.13
##$BF7= 200.13
##$BF8= 200.13
##$BYTORDA= 1
##$CFDGTYP= 0
##$CFRGTYP= 5
##$CHEMSTR= <none>
##$CNST= (0..31)
1 1 145 1 1 1 1 1 1 1 1 1 1 1 1 1 1 1 1 1 1 1 1 1 1 1 1 1 1 1 1 1 
##$CPDPRG= <>
##$CPDPRG1= <>
##$CPDPRG2= <>
##$CPDPRG3= <>
##$CPDPRG4= <mlev>
##$CPDPRG5= <mlev>
##$CPDPRG6= <mlev>
##$CPDPRG7= <mlev>
##$CPDPRG8= <mlev>
##$CPDPRGB= <>
##$CPDPRGT= <>
##$D= (0..31)
0 1.2 0 0 0 0 0 0 0 0.06 0 0.03 0 0 0 0 0.0002 0 0 0 0 0 0 0 0 0 0 0 0 
0 0 0 
##$DATE= 1617172094
##$DBL= (0..7)
120 120 120 120 120 120 120 120 
##$DBP= (0..7)
150 150 150 150 150 150 150 150 
##$DBP07= 0
##$DBPNAM0= <>
##$DBPNAM1= <>
##$DBPNAM2= <>
##$DBPNAM3= <>
##$DBPNAM4= <>
$$ [...]
##$SUBNAM3= <"">
##$SUBNAM4= <"">
##$SUBNAM5= <"">
##$SUBNAM6= <"">
##$SUBNAM7= <"">
##$SUBNAM8= <"">
##$SUBNAM9= <"">
##$SW= 16.9725357007746
##$SWIBOX= (0..15)
0 0 2 0 0 0 0 0 0 0 0 0 0 0 0 0 
##$SW_h= 3396.73913043478
##$TD= 16384
##$TD0= 1
##$TE= 0
##$TE2= 300
##$TE3= 300
##$TEG= 300
##$TL= (0..7)
0 120 120 120 120 120 120 120 
##$TP= (0..7)
150 150 150 150 150 150 150 150 
##$TP07= 0
##$TPNAME0= <>
##$TPNAME1= <>
##$TPNAME2= <>
##$TPNAME3= <>
##$TPNAME4= <>
##$TPNAME5= <>
##$TPNAME6= <>
##$TPNAME7= <>
##$TPOAL= (0..7)
0.5 0.5 0.5 0.5 0.5 0.5 0.5 0.5 
##$TPOFFS= (0..7)
0 0 0 0 0 0 0 0 
##$TUNHIN= 0
##$TUNHOUT= 0
##$TUNXOUT= 0
##$USERA1= <user>
##$USERA2= <user>
##$USERA3= <user>
##$USERA4= <user>
##$USERA5= <user>
##$V9= 5
##$VALIST= <valist>
##$VCLIST= <CCCCCCCCCCCCCCC>
##$VD= 0
##$VDLIST= <DDDDDDDDDDDDDDD>
##$VPLIST= <PPPPPPPPPPPPPPP>
##$VTLIST= <TTTTTTTTTTTTTTT>
##$WBST= 1024
##$WBSW= 4
##$XGAIN= (0..3)
0 0 0 0 
##$XL= 0
##$YL= 0
##$YMAX_a= 418956
##$YMIN_a= -403608
##$ZGOPTNS= <>
##$ZL1= 120
##$ZL2= 120
##$ZL3= 120
##$ZL4= 120
##$ABSF1= 15.99371
##$ABSF2= -0.9789543
##$ABSG= 5
##$ABSL= 3
##$ALPHA= 0
##$AQORDER= 0
##$ASSFAC= 0
##$ASSFACI= 0
##$ASSFACX= 0
##$ASSWID= 0
##$AUNMP= <proc_1d>
##$AZFE= 0.1
##$AZFW= 0.1
##$BCFW= 0
##$BC_mod= 2
##$BYTORDP= 0
##$COROFFS= 0
##$CY= -3
##$DATMOD= 1
##$DC= 0
##$DFILT= <>
##$DTYPP= 0
##$F1P= 0
##$F2P= 0
##$FCOR= 1
##$FTSIZE= 16384
##$FT_mod= 6
##$GAMMA= 0
##$GB= 0
##$INTBC= 1
##$INTSCL= 2.992141e-10
##$ISEN= 128
##$LB= 0.24
##$LEV0= 0
##$LPBIN= 0
##$MAXI= 10000
##$MC2= 0
##$MEAN= 0
##$ME_mod= 0
##$MI= 1.114404
##$NCOEF= 0
##$NC_proc= -7
##$NLEV= 6
##$NOISF1= 3.799351
##$NOISF2= 2.8
##$NSP= 0
##$NTH_PI= 0
##$NZP= 0
##$OFFSET= 15.96781
##$PC= 1
##$PHC0= -11122.08
##$PHC1= 15.20093
##$PH_mod= 1
##$PKNL= yes
##$PPARMOD= 0
##$PSCAL= 0
##$PSIGN= 0
##$REVERSE= no
##$SF= 200.130008731051
##$SI= 16384
##$SIGF1= 3
##$SIGF2= 2
##$SINO= 5.538805
##$SIOLD= 16384
##$SREGLST= <1H.CDCl3>
##$SSB= 0
##$STSI= 16384
##$STSR= 0
##$SW_p= 3396.73913043479
##$SYMM= 0
##$S_DEV= 0
##$TDeff= 16384
##$TDoff= 0
##$TI= <>
##$TILT= no
##$TM1= 0
##$TM2= 0
##$TOPLEV= 0
##$USERP1= <user>
##$USERP2= <user>
##$USERP3= <user>
##$USERP4= <user>
##$USERP5= <user>
##$WDW= 1
##$XDIM= 16384
##$YMAX_p= 430373557
##$YMIN_p= -560521
$$ End of Bruker specific parameters
$$ ---------------------------------
##NTUPLES= NMR SPECTRUM
##VAR_NAME=  FREQUENCY,     SPECTRUM/REAL,   SPECTRUM/IMAG
##SYMBOL=    X,             R,               I
##VAR_TYPE=  INDEPENDENT,   DEPENDENT,       DEPENDENT
##VAR_FORM=  AFFN,          ASDF,            ASDF
##VAR_DIM=   16384,         16384,           16384
##UNITS=     HZ,            ARBITRARY UNITS, ARBITRARY UNITS
##FACTOR=    0.207333158178282, 1,           1
##FIRST=     3195.63789009859, 0,            0
##LAST=      -201.101240336198, 0,           0
##MIN=       -201.101240336198, -560521,     0
##MAX=       3195.63789009859, 430373557,    0
$$ Real data points
##PAGE= N=1
##DATA TABLE= (X++(R..R)), XYDATA
$$ [...]
5463A869475m9961R3900j92741k0214o672J59358J77871m0670L3850k20551j2419
5452A791226J70772J09215j19835K6851J13949o9456n660k08811q267j10073J32065
5441A821976j7907r6362k37806L7882O7058l2028R0686J9493l0321K114K64156
5430A888941o759l9324M7730M4399j16687L6699j9369Q7417m4855Q5504j84707
5419A778989m6132J56811J5614o5871N9549l4712p2947Q328j47454O7957K05690
5408A925822q6596j83949J00906k4191J20527L5186j77649J83137r4303j05170
5398A693720J11444M1058N3994l4012k26569J4629j11632N4958J41340j0856k7177
5387A700897k3877j26170J79974J32216j09247K3692j59840o0662J53433l3605
$$ y = [1869475, 1819514, 1913414, 1720673, 1700459, 1693787, 1853145, 2031016, 1990346, 2024196, 1803645, 1791226, 1961998, 2071213, 1951378, 1978229, 2092178, 2022722, 2017062, 1808251, 1799984, 1689911, 1821976, 1804069, 1707707, 1469901, 1507783, 1574841, 1542813, 1633499, 1652992, 1622671, 1624785, 1888941, 1882182, 1842858, 1890588, 1934987, 1818300, 1854999, 1835630, 1923047, 1878192, 1963696, 1778989, 1732857, 1889668, 1905282, 1839411, 1898960, 1864248, 1791301, 1799629, 1652175, 1720132, 1925822, 1839226, 1655277, 1756183, 1731992, 1852519, 1887705, 1710056, 1893193, 1798890, 1693720, 1805164, 1846222, 1900216, 1866204, 1639635, 1654264, 1542632, 1597590, 1738930, 1728074, 1700897, 1677020, 1550850, 1730824, 1863040, 1753793, 1777485, 1617645, 1556983, 1710416, 1676811]
5377A676811J54542m7804j07764J01117k2326j09307q9795k9498R8376P8712p9391
5366A623673J2162N3814J25057j08108K2562l8247j4062m6804K8577m7215k9959
5355A581450M1969k7235N1542m0698P9600J92703J28570p3163K0993q5559k9671
5344A840501N7124J71619r1573r3677L857j89543r0281K47742K43772j83348K9420
5333A945613j9097j64112O6137J63658O5888K84004M2963j46034j15548p665O4018
5322B179825l0289J08077O59j01196o0746n4791m7197O1143K15691J27803m2194
5311B356785n4817K41250j28413L9444J59956K66592r0356j44540J73791J08870
5301B928562n7697j27398K280J54943p9502J23478R0661o31J76541j87446J49257
$$ y = [1676811, 1831353, 1783549, 1675785, 1776902, 1754576, 1645269, 1555474, 1525976, 1624352, 1703064, 1623673, 1635835, 1689649, 1814706, 1706598, 1729160, 1690913, 1676851, 1630047, 1658624, 1611409, 1581450, 1623419, 1596184, 1647726, 1607028, 1686628, 1879331, 2007901, 1934738, 1955731, 1870172, 1840501, 1897625, 2069244, 1977671, 1883994, 1887851, 1698308, 1608027, 1855769, 2099541, 1916193, 1945613, 1926516, 1762404, 1828541, 1992199, 2058087, 2342091, 2385054, 2239020, 2123472, 2115807, 2179825, 2149536, 2257613, 2258272, 2157076, 2096330, 2041539, 1994342, 2055485, 2271176, 2398979, 2356785, 2301968, 2543218, 2414805, 2454249, 2614205, 2880797, 2790441, 2645901, 2819692, 2928562, 2870865, 2743467, 2745747, 2900690, 2821188, 2944666, 3035327, 3034696, 3211237, 3023791, 3173048]
5290C173048j39346M7703P7938p2756J65656J78006o4773j14695K92173R0756
5280C633710j48304l1260O1049Q8792K14432M8846J12156J64231L3351K2226J8264
5269D217493L4155K03759j08062j987J85565J64179K28827O4082j14435K386K17957
5258E093919J64900P0933j20125j63552p278J80014J40915K02524Q2260J08693
5248E753203K64730J42376o4845L5165K42929J44566K21920K42310J78246L9577
5238G200177k2136K37120N1709K15232K17541j19745J29105M10679J85338K57289
5228H762309K95353J51742L38144K56330M07385L25697J17070K55297K99178N55853
5218A1764358M76079M14137P33423O86133Q07216Q58754O84943Q67067R24523
$$ y = [3173048, 3033702, 3081405, 3159343, 3086587, 3252243, 3430249, 3365476, 3250781, 3542954, 3633710, 3485406, 3454146, 3515195, 3603987, 3818419, 3867265, 3979421, 4143652, 4177003, 4199229, 4217493, 4251648, 4455407, 4347345, 4345358, 4530923, 4695102, 4923929, 4988011, 4873576, 4875962, 5093919, 5258819, 5329752, 5209627, 5046075, 5038797, 5218811, 5359726, 5562250, 5644510, 5753203, 6017933, 6160309, 6095464, 6130629, 6373558, 6518124, 6740044, 6982354, 7160600, 7200177, 7178041, 7415161, 7466870, 7682102, 7899643, 7779898, 7909003, 8319682, 8505020, 8762309, 9057662, 9209404, 9547548, 9803878, 10211263, 10536960, 10654030, 10909327, 11208505, 11764358, 12240437, 12654574, 13387997, 14074130, 14881346, 15740100, 16425043, 17292110, 18216633]
5209A8216633R70633N49424L73698k09336k62367l59883o82385o55953l68198
5200A7572266l24789l42861j73903N8638R7636J59511j8523J00228M33796L87699
5190A7949698L46918O63648N25567O95663J004956Q54481J060426J334699J171454
5181B5607510J367124J713232J814720J738240J724225J525505R65669N88992
5173C7045217M5789k18726p41797j126330j007230j057334j072065p58495m38069
5164C0670960j65834K16954N96162N48794P90532Q93621J411444J546343K031040
5155C8540016K231556K562717K988239L301428L744639L784365L705183L160120
5147F4018263J885074P61782q43528k042225k562354k504058k375323k243807
$$ y = [18216633, 19187266, 19736690, 20110388, 19901052, 19638685, 19278802, 18596417, 17940464, 17572266, 17247477, 16904616, 16730713, 16789351, 16886987, 17046498, 17027975, 17128203, 17561999, 17949698, 18296616, 18960264, 19485831, 20181494, 21186450, 22040931, 23101357, 24436056, 25607510, 26974634, 28687866, 30502586, 32240826, 33965051, 35490556, 36456225, 37045217, 37091006, 36872280, 36130483, 35004153, 33996923, 32939589, 31867524, 31109029, 30670960, 30505126, 30722080, 31318242, 31867036, 32657568, 33551189, 34962633, 36508976, 38540016, 40771572, 43334289, 46322528, 49623956, 53368595, 57152960, 60858143, 64018263, 65903337, 66665119, 65821591, 63779366, 61217012, 58712954, 56337631, 54093824]
5139E4093824k109820k067897j843851j696100j244065j029768o94500m53464
5131D2954359j23406N41360Q59441J107529J463658J888040K481266K799058L150255
5122E7121560L888720M653356N455245O245843O500949O528126N681242L771909
5114I9846950J486577k243731n727103p945546q411317p870330o652774n628890
5106E6853836m595417l716417l285195k686338k104482j872210j574225q66733
5098C6152819p75663m98462k09619m3036J52534M06960O51640J066929J339860
5089C8243962J610388J871606K352689K581418K527062K101979J414702L73899
5081E3077705p06167k184260l337569m015528l940885l436559l209923k794789
$$ y = [54093824, 51984004, 49916107, 48072256, 46376156, 45132091, 44102323, 43407823, 42954359, 42830953, 43372313, 44231754, 45339283, 46802941, 48690981, 51172247, 53971305, 57121560, 61010280, 65663636, 71118881, 77364724, 83865673, 90393799, 96075041, 99846950, 101333527, 99089796, 93362693, 85417147, 77005830, 69135500, 62482726, 56853836, 52258419, 48542002, 45256807, 42570469, 40465987, 38593777, 37019552, 36152819, 35377156, 34878694, 34669075, 34626039, 34778573, 35185533, 35837173, 36904102, 38243962, 39854350, 41725956, 44078645, 46660063, 49187125, 51289104, 52703806, 53077705, 52371538, 50187278, 46849709, 42834181, 38893296, 35456737, 32246814, 29452025]
5073B9452025k237532j930250j797544j740258j415582j139783r69838j143778
5065A7077460j011876p90354o01975o38140n17194m99963n67164l78618l18968
5056A1753208l04586n23332j93174j71700k15838j40145l12118k84940j45570
5047I461805k28943l5207j57186k16241k96803j73767o3055j5631j96091q7394
5037G991487o9737j08993J45481l24022l23507n1211j78154k13172j23142J01682
5027F846712p3984l1242Q5846k2279Q0383J55056K41602L7368O583J80912L22059
5016G829016L26409K46717K28786K56209N13434K01218m44446k25650n53767m50093
5006G927833m98446l38817k03623j53864l81464j67015m6426j88407j70696k54803
$$ y = [29452025, 27214493, 25284243, 23486699, 21746441, 20330859, 19191076, 18221238, 17077460, 16065584, 15275230, 14673255, 14035115, 13517921, 13017958, 12450794, 12072176, 11753208, 11448622, 10925290, 10732116, 10560416, 10344578, 10204433, 9892315, 9607375, 9461805, 9232862, 9197655, 9040469, 8824228, 8527425, 8353658, 8290603, 8274972, 8078881, 7991487, 7921750, 7812757, 7958238, 7634216, 7310709, 7259498, 7081344, 6868172, 6745030, 6846712, 6772728, 6741486, 6827332, 6805053, 6885436, 7040492, 7282094, 7319462, 7326045, 7506957, 7829016, 8155425, 8402142, 8630928, 8887137, 9400571, 9601789, 9157343, 8931693, 8377926, 7927833, 7429387, 7090570, 6886947, 6733083, 6351619, 6184604, 6138178, 5949771, 5779075, 5524272]
4996E524272q353j5560J58622j75782j44143K24314J02429q74J21557J1384j06514
4985E691352N8180J54717J22498M33734J89992K14769O8294J51424L04618k0250
4975G369328p8092k34396j40603l91613l05595M6672j01034l32651k21789k93340
4965E316887j71764J63461r2361k60326k02042n4264k8144J17588M6392m1038
4955D794389Q4800J01612J05843O417k2923n3744l4717J56135K86707M7873J8595
4944E490987K42533J08120q2646j50892k99203j81527N7091r5016J02288l73083
4934D818652l11679q520o0234M3250q5880j31154n7039J36452L4434j05599J57167
4923D429850L28117K3892j84944M4240o7594j54823m154j20418j25460m2291J32413
$$ y = [5524272, 5515919, 5500359, 5658981, 5483199, 5339056, 5563370, 5665799, 5664925, 5786482, 5797866, 5691352, 5749532, 5904249, 6026747, 6460481, 6650473, 6865242, 6933536, 7084960, 7389578, 7369328, 7291236, 7056840, 6916237, 6524624, 6219029, 6265701, 6164667, 5832016, 5610227, 5316887, 5145123, 5308584, 5216223, 4955897, 4753855, 4699591, 4671447, 4789035, 4835427, 4794389, 4879189, 4980801, 5086644, 5093061, 5070138, 5016394, 4981677, 5137812, 5424519, 5472392, 5490987, 5733520, 5841640, 5758994, 5608102, 5308899, 5127372, 5184463, 5089447, 5191735, 4818652, 4506973, 4498453, 4438219, 4481469, 4395589, 4264435, 4207396, 4343848, 4378282, 4272683, 4429850, 4757967, 4781859, 4596915, 4641155, 4573561, 4418738, 4414584, 4294166, 4168706, 4126415, 4258828]
4912D258828j11492k19941L9466L5139P712k72909j12793L5563L8157J55546j03915
4901C749361k44494M1737q8055J16923O7752J90548R5567j19896l9192K27020
4891C997271J65530k3657r8759j59916j7832J83249o0263l87046O454J68300N8631
4880C831962k24370j23914L3526P3004n8278l838k23196j25319J42962K97377
4870C619916k3886k01239K7921r600j93919K5784L4084l2027J09505O2055o8183
4859C350411J20929Q4640O2495j62102j29110k4068R15j18101j05877q0929N6178
4848C055381k1604n1809J24022m4917J25619K4944L7144l7065j11713O0066k0636
4837C139432j15981j38553R5469J31006q643N7051J95789j02030j61786J22479
$$ y = [4258828, 4147336, 3927395, 3966861, 4002000, 4009712, 3736803, 3624010, 3659573, 3697730, 3853276, 3749361, 3504867, 3546604, 3458549, 3575472, 3643224, 3833772, 3929339, 3809443, 3770251, 3997271, 4162801, 4139144, 4040385, 3880469, 3862637, 4045886, 3985623, 3598577, 3605031, 3773331, 3831962, 3607592, 3483678, 3517204, 3590208, 3531930, 3528092, 3304896, 3179577, 3322539, 3619916, 3596030, 3394791, 3422712, 3413112, 3219193, 3244977, 3279061, 3247034, 3356539, 3418594, 3350411, 3471340, 3555980, 3618475, 3456373, 3327263, 3303195, 3304110, 3186009, 3080132, 2999203, 3055381, 3033777, 2981968, 3105990, 3061073, 3186692, 3211636, 3248780, 3211715, 3100002, 3160068, 3139432, 3023451, 2884898, 2980367, 3111373, 3102730, 3159781, 3355570, 3253540, 3091754, 3214233]
4827C214233j52841l0599K25031J9576J08967Q6705J30552M0649j98245M6954
4817C490982p5437Q3290p9633R049J48850M9318j84272O2585O6105k22791K03482
4806C551528Q4091J35830J02486o172l0843N7071p3751o5796J08559N385J89005
4795D057393M5944J5891j9786J38084l4308J03406Q8590j3361P7148r81J42185
4784D600205K876L4712R4600n0100N3183j96824k01596J26993p1172r4035k19425
4773D079417k23687j51094M9721m7383k26524k83552J42357P45o558K9194r0321
4762C272315q1205r6990j33391J85692R0443j52997j29167J3315r4449L4816K46162
4751C154544m7832K42657P6201J02741Q4642K1556N1134K58421j4243O8757P017
$$ y = [3214233, 3061392, 3030793, 3255824, 3275400, 3384367, 3471072, 3601624, 3642273, 3444028, 3490982, 3415545, 3498835, 3419202, 3428251, 3577101, 3626419, 3442147, 3504732, 3570837, 3348046, 3551528, 3635619, 3771449, 3873935, 3867763, 3836920, 3893991, 3820240, 3754444, 3863003, 3868388, 4057393, 4103337, 4119228, 4099442, 4237526, 4203218, 4306624, 4395214, 4381853, 4459001, 4458020, 4600205, 4603081, 4637793, 4732393, 4682293, 4735476, 4538652, 4337056, 4464049, 4392877, 4298842, 4079417, 3855730, 3704636, 3754357, 3706974, 3480450, 3196898, 3339255, 3340000, 3333442, 3362636, 3272315, 3191110, 3094120, 2960729, 3146421, 3236864, 3083867, 2954700, 2968015, 2873566, 2908382, 3154544, 3106712, 3349369, 3425570, 3528311, 3612953, 3634509, 3685643, 3944064, 3929821, 3998578, 4005595]
4740D005595j68253j99724j81039J26339N0660K4043N0239k11350j50953p7839
4730C267718r8093O2925J27333r864k40376Q7918N6153n3728J5614m4535O6248
4719C237313m1667j2483m2186j38417J5011m9419k01648L0411J4043n7236K49765
4708C003487J52480Q6419l0488K086l6372L2632q902j63259O0687j69964N1068
4697B979874J84155j92344R073J9186n2567L0334Q943P5119p6886j40097M0538
4686B885328j3533m2983J17418N1597Q888j6177j87208j02716M06456O1258r6386
4675C071942J592P8932P2765Q3012P0405O8509N4608J43377O4666J55455j37369
4664C727894j12753J004J38406J19273j56876k7984M2838J3274q1516J66643J10873
$$ y = [4005595, 3837342, 3637618, 3456579, 3582918, 3633578, 3657621, 3707860, 3496510, 3345557, 3267718, 3169625, 3232550, 3359883, 3350019, 3109643, 3197561, 3253714, 3199986, 3215600, 3171065, 3237313, 3195646, 3183163, 3140977, 3002560, 3017571, 2968152, 2766504, 2796915, 2810958, 2753722, 3003487, 3155967, 3242386, 3211898, 3213984, 3177612, 3210244, 3201342, 3038083, 3098770, 2928806, 2979874, 3164029, 2971685, 2980758, 2999944, 2947377, 2977711, 2986654, 3061773, 2984887, 2844790, 2885328, 2871795, 2828812, 2946230, 2997827, 3006715, 2990538, 2803330, 2700614, 3107070, 3168328, 3071942, 3073534, 3152466, 3225231, 3308243, 3378648, 3447157, 3501765, 3645142, 3709808, 3865263, 3727894, 3615141, 3616145, 3754551, 3873824, 3716948, 3688964, 3731802, 3745076, 3663560, 3830203, 3941076]
4653C941076J11996k66325j00910J85163J42617J86632q9311K4650j73215k23593
4643C738780R390N4198m1001k7936P0259M6097J94176L545k32774P7337J36387
4632D028458J87320J23280K21939J65312j37198N0538j06760K25904J8286j60223
4622D616856j21718J173j17394j7072J39777K10702K1903p3182O4951J71761Q557
4611D906314o439K10587K6178J56971R1270L4437N4660k52699J470J44360N7193
4600E424302j22740O2661j24605o5316J47660N8420Q686J34514L42253J46631
4590F012466j05514L6673K67171L44932L4992j173j44333J14654P6850m9599J6194
4579F603313j98176J65217K27214j38387K7851J03353R1592j8003J4440K19926
$$ y = [3941076, 4053072, 3786747, 3685837, 3871000, 4013617, 4200249, 4110938, 4135588, 3962373, 3738780, 3748170, 3802368, 3761367, 3733431, 3803690, 3849787, 4043963, 4047508, 3814734, 3892071, 4028458, 4215778, 4339058, 4560997, 4726309, 4589111, 4639649, 4532889, 4758793, 4777079, 4616856, 4495138, 4496311, 4378917, 4361845, 4501622, 4712324, 4734227, 4661045, 4725996, 4897757, 4906314, 4899875, 5110462, 5136640, 5293611, 5384881, 5419318, 5473978, 5221279, 5222749, 5367109, 5424302, 5301562, 5364223, 5239618, 5174302, 5321962, 5380382, 5389068, 5523582, 5865835, 6012466, 5906952, 5943625, 6210796, 6555728, 6590720, 6589547, 6445214, 6559868, 6636718, 6587119, 6603313, 6405137, 6570354, 6797568, 6659181, 6687032, 6790385, 6881977, 6863974, 6878414, 7098340]
4569G098340J391J22370m6664J99253R7941J5556J25596q136K39448J04921P8141
4558H028157L64275L53146J55002J91000K36341O9136L74534J84086N8181q4221
4548I929637N8939L61991K70266m281P1986K30770L70509L73598j9111j41372
4538A1502932J82806M1995Q2911O1175J00685L00967K15912J65563L90856M26198
4528A3472000N19718L86554M75800N86902M78654O72099P50849P23588O47997
4519A8714161M63023N26503P55604M91304O15453N04647J30480N98550M80374
4510B3280099N01509P27351Q86065J001780P88646Q66804Q66742O73520P32819
4501C0325335J050517R75487R22045R47898J107023R33802R09152P80419Q14554
$$ y = [7098340, 7099731, 7222101, 7175437, 7374690, 7472631, 7488187, 7613783, 7605647, 7845095, 7950016, 8028157, 8392432, 8745578, 8900580, 9091580, 9327921, 9397057, 9771591, 9955677, 10013858, 9929637, 9988576, 10350567, 10620833, 10616552, 10688538, 10919308, 11289817, 11663415, 11644304, 11502932, 11685738, 11727733, 11810644, 11871819, 11972504, 12273471, 12489383, 12654946, 13045802, 13472000, 13991718, 14378272, 14854072, 15440974, 15919628, 16591727, 17342576, 18066164, 18714161, 19177184, 19703687, 20459291, 20950595, 21566048, 22070695, 22201175, 22799725, 23280099, 23781608, 24508959, 25395024, 26396804, 27185450, 28052254, 28918996, 29592516, 30325335, 31375852, 32351339, 33273384, 34221282, 35328305, 36262107, 37171259, 37951678, 38766232]
4492C8766232J063167J180079J192979J293260J635054J974030K098185K425478
4484E1628464K649484K711000L221122L618958L533739M183695N110757N842209
4476H2499428O316834O763144P112360O956585O921960O746092O258311N171645
4468A34746359M423610K833963R46583j720514m235723o094009p198817p359586
4460A16341866p207134p029509p157354p145705o840909o863258o666442n943068
4452F1488487n215131m780306l998220l475361l093156k877494k649717k084699
4444C3314403k124951j972256j557633j401218j179272j009112r89368p30483
4436B2350110q60402r96165p92275p63541o60937m75891n20926l39790o01349
$$ y = [38766232, 39829399, 41009478, 42202457, 43495717, 45130771, 47104801, 49202986, 51628464, 54277948, 56988948, 60210070, 63829028, 67362767, 71546462, 76657219, 82499428, 88816262, 95579406, 102691766, 109648351, 116570311, 123316403, 129574714, 134746359, 139169969, 142003932, 142950515, 141230001, 136994278, 130900269, 123701452, 116341866, 109134732, 102105223, 94947869, 87802164, 80961255, 74097997, 67431555, 61488487, 56273356, 51493050, 47494830, 44019469, 40926313, 38048819, 35399102, 33314403, 31189452, 29217196, 27659563, 26258345, 25079073, 24069961, 23080593, 22350110, 21489708, 20493543, 19701268, 18937727, 18276790, 17800899, 17279973, 16940183, 16338834]
4427A6338834k55707k59170m00318j81886n98739p07836l90515l44804m36446
4418A2763413m64452k44944k87853k77230l29756o1929m76630k41019j43722j57508
4408A0078370k09521l24912o9245j92358j43805j83009o1647K7533j18952j31794
4398H670660o2842r4103j00754j74862O8434r0882O5818n6664k05943J5753j20588
4387G914027j83191j20097J89196k34543m50411k01051l9245o8833j29787n7825
4377F618240k69826j89422k49476k2425J0363j96470J15270j34993J16715j67397
4367E630579k08960J32121R187j61957j0864m8580k46033L2425J20460J02882
4357E351260q9572o9325k0507j29363j86921j2215N5933o0495j91828m5675J80773
$$ y = [16338834, 16083127, 15823957, 15423639, 15241753, 14643014, 13935178, 13544663, 13199859, 12763413, 12298961, 12054017, 11766164, 11488934, 11159178, 11097249, 10620619, 10379600, 10235878, 10078370, 9868849, 9543937, 9474692, 9282334, 9138529, 8955520, 8893873, 8921406, 8802454, 8670660, 8607818, 8513715, 8412961, 8238099, 8306533, 8215651, 8281469, 8224805, 8018862, 8034615, 7914027, 7730836, 7610739, 7799935, 7565392, 7114981, 6913930, 6874685, 6805852, 6676065, 6618240, 6348414, 6158992, 5909516, 5887091, 5897454, 5700984, 5816254, 5681261, 5797976, 5630579, 5421619, 5553740, 5562927, 5400970, 5390106, 5341526, 5095493, 5127918, 5248378, 5351260, 5261688, 5192363, 5171856, 5042493, 4855572, 4843357, 4899290, 4838795, 4646967, 4601292, 4782065]
4346D782065M6576O089M7684q9974q1782J16868p2394J33470k0278j367k25276
4335D641681k06579j40635O4144n6583J84164j54198k95145J94896p0551k3512
4325D137682k2543R5544L2901O6262k07798K1584r644J34816k85865J6153Q8920
4314D068012j90800j22912J19484k68214O6751m7552j72028o4192m9604P4898
4304C413843J49942J10473J8455J70719n9143k47251j05116K4578J3858Q8870
4294C579228K34503j83979m0685L7979j23577q9598J75222J72299J53428P5639
4284C990459j46717J1135P814K23374J30209j41756K0291L5884j58670M9188J13689
4273D134900J37892j33592j93833L1976j02540J1151K7508J22144j16717j06904
$$ y = [4782065, 4828641, 4834730, 4882414, 4792440, 4710658, 4827526, 4755132, 4888602, 4868324, 4866957, 4641681, 4435102, 4294467, 4358611, 4302028, 4486192, 4331994, 4036849, 4231745, 4161194, 4137682, 4115139, 4210683, 4243584, 4309846, 4102048, 4123632, 4113988, 4248804, 3962939, 3979092, 4068012, 3877212, 3754300, 3873784, 3605570, 3672321, 3624769, 3452741, 3388549, 3338945, 3413843, 3563785, 3674258, 3692713, 3863432, 3804289, 3557038, 3451922, 3476500, 3490358, 3579228, 3813731, 3629752, 3589067, 3627046, 3503469, 3413871, 3589093, 3761392, 3914820, 3990459, 3843742, 3854877, 3862691, 4086065, 4216274, 4074518, 4094809, 4130693, 3972023, 4021211, 4134900, 4272792, 4139200, 3945367, 3977343, 3874803, 3885954, 3913462, 4035606, 3918889, 3811985]
4263C811985o8814m049P7270K35756J37880j03376J8839L8708j04814J02328K84930
4252D426643m5541K34231J78725L3843R0282K02597n683j24851k87659p0260j32108
4241D500219M5526J9333k0083j14245l48295K089K18016j10384j15290j14975
4231C961911k347K3065l2596r2418o9016j47200l8532J47448K45626o7542j5578
4220C912821J02148N2606l7372m5668J32120J20792J15043N1709k2072k4720L957
4209D361364r2545j97162p2496o0887N5693j98200k75104N5654Q2983J84633q5774
4198C758159p6026O5292p6625j00634j4704R3869R5130K70220Q3690q6077k25355
4187C786939M4720L0957M4943Q0312R0652K00594m1541J60825O5216J2998K87344
$$ y = [3811985, 3743171, 3739122, 3816392, 4052148, 4190028, 4086652, 4105491, 4144199, 4039385, 4141713, 4426643, 4381102, 4615333, 4794058, 4827901, 4918183, 5120780, 5115097, 4990246, 4702587, 4632327, 4500219, 4545745, 4565078, 4544995, 4430750, 4082455, 4084544, 4302560, 4192176, 4076886, 3961911, 3959564, 3982629, 3950033, 3857615, 3788599, 3641399, 3602867, 3750315, 3995941, 3928399, 3912821, 4014969, 4067575, 4030203, 3984535, 4116655, 4237447, 4352490, 4404199, 4382127, 4357407, 4361364, 4268819, 4071657, 3999161, 3938274, 3993967, 3795767, 3520663, 3576317, 3659300, 3843933, 3758159, 3682133, 3747425, 3670800, 3570166, 3555462, 3649331, 3744461, 4014681, 4098371, 4012294, 3786939, 3831659, 3862616, 3907559, 3987871, 4078523, 4279117, 4237576, 4398401, 4463617, 4476615, 4763959]
4176D763959K93804J89854J30613n4413j06141l99296m03146j89438j18035j40542
4166C967219J9264J09465k02498j05785j04078j65332P5142J1285k7112j37547
4156C440023m7463J16878P3545O3755M9926j63064L577R0946K23982l8928j85113
4145C628064p7743j8364J24137J79941J3307r8617r0983O0684j49992K2803N8055
4134C651292n4791k4788j42906N9805K13570n8066q6281J07668N8402j34944o5651
4123C523310l7751P34J51868j43737j63492p0001J87604j68886j58437M7655J09503
4112C278370j16336k3870j03174j49637K01091K8399l3659q5574K3378R1134K4025
4101C134147o3180j7450j14052J03316j083N6035J42593O0307J25526j06378k19694
$$ y = [4763959, 5057763, 5247617, 5378230, 5323817, 5217676, 4818380, 4415234, 4225796, 4107761, 3967219, 3986483, 4095948, 3893450, 3787665, 3683587, 3518255, 3593397, 3604682, 3577570, 3440023, 3392560, 3509438, 3582983, 3646738, 3696664, 3533600, 3537177, 3628123, 3852105, 3813177, 3628064, 3550321, 3531957, 3656094, 3836035, 3849342, 3750725, 3659742, 3720426, 3570434, 3593237, 3651292, 3596501, 3571713, 3428807, 3488612, 3702182, 3644116, 3557835, 3665503, 3723905, 3588961, 3523310, 3485559, 3486293, 3638161, 3494424, 3330932, 3260931, 3448535, 3279649, 3121212, 3168867, 3278370, 3162034, 3138164, 3034990, 2885353, 3086444, 3114843, 3081184, 2995610, 3018988, 3110122, 3134147, 3070967, 3053517, 2939465, 3042781, 3041698, 3097733, 3240326, 3300633, 3426159, 3319781, 3100087]
4090C100087k91147J63452J85558j37089j38274K24842J69617j25683J92296p5354
4080C268305j2127j08128K1748K01819r245j33723N3468P5209Q9254o9110k7007
4069C350463K50434l481j3518J6786j29365o1237J49493J43961J83182q4827j49250
4058C652641q798k8351K12806k335q5553L9962o1839j00910P8031J31214p7752
4047C749116j38200l8839m2228o1640l6537J57577J43546j06789j66581m2432
4037C416993K77744J24078J93193k40023J54983J68192j02835j67266q0077P4908
4027C819890K73373O0812k55915n3419P1030p4165p1332k5384K18390J46604j37813
4016C972071O5194p0250J02049K59959J02408n8857N1072J65708P0291k1005M1113
$$ y = [3100087, 2808940, 2972392, 3157950, 3020861, 2882587, 3107429, 3277046, 3151363, 3343659, 3268305, 3256178, 3148050, 3169798, 3371617, 3362372, 3228649, 3282117, 3357326, 3446580, 3377470, 3350463, 3600897, 3597416, 3583898, 3600684, 3471319, 3410082, 3559575, 3703536, 3886718, 3801891, 3652641, 3643843, 3615492, 3828298, 3825963, 3740410, 3780372, 3718533, 3617623, 3695654, 3826868, 3749116, 3610916, 3572077, 3529849, 3468209, 3431672, 3589249, 3732795, 3626006, 3459425, 3416993, 3694737, 3818815, 4012008, 3771985, 3926968, 4095160, 3992325, 3825059, 3744982, 3819890, 4093263, 4154075, 3898160, 3844741, 3915771, 3841606, 3770274, 3744890, 3963280, 4109884, 3972071, 4037265, 3967015, 4069064, 4329023, 4431431, 4372574, 4423646, 4589354, 4659645, 4638640, 4679753]
4005D679753J31574j7960O3862J26247l7215J00659o5113j39440j67749m3742
3995D630876O5585r4906k1559q3820j3708j33485r1201J64490k2880r1481k23985
3984D083926K0329J93744L3347k3458N8839j37515j00683O94K73466J885P3935
3973D478509J07756j22372p7267o9819J25671j86901j39536L32263j32987m1677
3963D273640Q7123L8451K2517J873n896Q4116l28J32747J02799j34506l5532O8948
3951D635952J18837j53309P3546J57704n7041j84161J0308p6978L1288Q0038R2770
3940D728954j9681J05543O0741J27201n5538r7747J69023k5032l8894k776k212
3929D949582R508m5199J66677J10793O7789r0924L1422J98476J17157j92433J94129
$$ y = [4679753, 4811327, 4793367, 4857229, 4983476, 4946261, 5046920, 4981807, 4842367, 4674618, 4630876, 4696461, 4601555, 4579996, 4496176, 4482468, 4348983, 4257782, 4422272, 4399392, 4307911, 4083926, 4104255, 4297999, 4331346, 4307888, 4366727, 4229212, 4128529, 4129223, 4402689, 4404574, 4478509, 4586265, 4463893, 4386626, 4316807, 4442478, 4255577, 4116041, 4448304, 4315317, 4273640, 4360763, 4399214, 4421731, 4423604, 4417708, 4501824, 4501496, 4634243, 4737042, 4602536, 4567004, 4635952, 4754789, 4601480, 4675026, 4832730, 4775689, 4591528, 4601836, 4524858, 4556146, 4636184, 4728954, 4709273, 4814816, 4875557, 5002758, 4947220, 4849473, 5018496, 4993464, 4954570, 4951794, 4949582, 4959090, 4913891, 5080568, 5191361, 5259150, 5168226, 5199648, 5398124, 5515281, 5322848, 5516977]
3918E516977J06328J74773Q1347j28925n3903J01293J97761j00816M3356Q2987
3908F021178P7505j8612n8122O8742J74453J15900J66160l18m3462M5471l0992
3897F517903p58J01827j25583Q7602K05892J75355K643j60648j2936k3905O804
3886F774196m9886p0056K970Q7956J51441J55062r6409k0629J20153j16619J41050
3875G079229J42716Q7233K03999m9149k321P2621j694l4259J18970J62005J68342
3864G947692J63187j4761K23613J33701j36226L4408M66991Q9287J2522L22684
3854I243098J36624J66049J47246o6415J29334J56722L69490K60175K73906O9048
3844A0885277J03208N27559M04210K53726K76387K91383N44043M01007L82011
$$ y = [5516977, 5623305, 5798078, 5879425, 5750500, 5696597, 5797890, 5995651, 5894835, 5938191, 6021178, 6098683, 6080071, 6021949, 6090691, 6265144, 6381044, 6547204, 6546886, 6503424, 6548895, 6517903, 6517145, 6618972, 6493389, 6580991, 6786883, 6962238, 6964881, 6804233, 6791297, 6767392, 6774196, 6724310, 6654254, 6657224, 6745180, 6896621, 7051683, 6955274, 6934645, 7054798, 6938179, 7079229, 7221945, 7309178, 7513177, 7464028, 7461707, 7534328, 7532634, 7498375, 7617345, 7779350, 7947692, 8110879, 8096118, 8319731, 8453432, 8317206, 8351614, 8818605, 8907892, 8920414, 9243098, 9379722, 9545771, 9693017, 9626602, 9755936, 9912658, 10282148, 10542323, 10816229, 10885277, 10988485, 11516044, 11920254, 12173980, 12450367, 12741750, 13285793, 13686800, 14068811]
3835A4068811N18836M84628P31519O16285M81212O55561P71953M96215M24562
3826A9249582M48920K72754j26042m38149j98835j92990m01088m98997j67276
3817A7947879O7811J2478n2968j2994R8734M75998N41455M83864J37599L82531
3807B0082387M85523N06106M15399O18880O54524N61577P23741P86260J010078
3798B5844475Q76040R49699R91595P73540N11932L57633Q9395M02604M51962M79657
3788C1728532R442J99303P0634P2339o7416k56486r1573J13144L49026J12145
3778C2239090M33887O53612N84434P59086O45395M55301N01277L20381L35261
3769C6927724P66608O10163O65574P02805P28067P02169P76259Q11645Q26862
$$ y = [14068811, 14587647, 15072275, 15803794, 16420079, 16901291, 17556852, 18328805, 18825020, 19249582, 19698502, 19971256, 19845214, 19407065, 19208230, 19015240, 18614152, 18115155, 17947879, 18015690, 18028168, 17975200, 17962206, 18060940, 18536938, 19078393, 19562257, 19699856, 20082387, 20567910, 21074016, 21489415, 22108295, 22762819, 23324396, 24048137, 24834397, 25844475, 26720515, 27670214, 28661809, 29435349, 29947281, 30304914, 30394309, 30796913, 31248875, 31728532, 31737974, 31937277, 32007911, 32080250, 32012834, 31756348, 31664775, 31777919, 32126945, 32239090, 32672977, 33326589, 33911023, 34670109, 35315504, 35770805, 36272082, 36592463, 36927724, 37694332, 38304495, 38970069, 39672874, 40400941, 41103110, 41879369, 42691014, 43517876]
3760D3517876J003173J113544J087436J033471J423290J719086J530747J511276
3752E3939899J874164J776659J308790J377455J092786R78026Q60324Q49699O34697
3743F4692499Q64257R08726Q80782J482438J742071K202208K479555K571058K549625
3734H0373219K755880K981693K880809K860973K610546K384752K570535K441652
3726A01860059K193962J565236J531849J449524J442028J735814K242093K477370
3718A16497935K568608L082540L057634L147929L062911L244551K881824K963680
3710A40507612K534378J979294J732301J592921J393439J112028J235894J550458
3702A53638325J681892J244210N92302k63559j065320k318034l578199n086201
$$ y = [43517876, 44521049, 45634593, 46722029, 47755500, 49178790, 50897876, 52428623, 53939899, 55814063, 57590722, 58899512, 60276967, 61369753, 62347779, 63208103, 64057802, 64692499, 65556756, 66465482, 67346264, 68828702, 70570773, 72772981, 75252536, 77823594, 80373219, 83129099, 86110792, 88991601, 91852574, 94463120, 96847872, 99418407, 101860059, 104054021, 105619257, 107151106, 108600630, 110042658, 111778472, 114020565, 116497935, 119066543, 122149083, 125206717, 128354646, 131417557, 134662108, 137543932, 140507612, 143041990, 145021284, 146753585, 148346506, 149739945, 150851973, 152087867, 153638325, 155320217, 156564427, 157156729, 156893170, 155827850, 153509816, 149931617, 144845416]
3694A44845416o235114p049869p027011o469988n304571m736173l390695k025173
3686A02606822r36114j8557R43212J516430J320185N57582j052364l175778m807633
3677I6953785o189871o595618o311053n456206m588573m078329l310101l147169
3669E7276865k368797k340587j750871j512438j256978j162138j066798m78833
3661D5339425o02194n88073l95103k30936m73983l06242p37072j042871j087897
3652C9875054j449480j384162j055502j040344j166839j154800r31036o12185
3644C1080706m94541o37485l24308k35028m20485n71750n19994n50234n06156
3635B6820725n59979n68561m79142m90353n64638o43703m47967n08895m04264
$$ y = [144845416, 138610302, 131560433, 124533422, 118063434, 112758863, 108022690, 104631995, 102606822, 101670708, 101652151, 102595363, 104111793, 105431978, 105989560, 104937196, 101761418, 96953785, 90763914, 84168296, 77857243, 72401037, 67812464, 63734135, 60424034, 57276865, 54908068, 52567481, 50816610, 49304172, 48047194, 46885056, 45818258, 45339425, 44737231, 44149158, 43754055, 43523119, 43049136, 42742894, 42005822, 40962951, 39875054, 38425574, 37041412, 35985910, 34945566, 33778727, 32623927, 31692891, 31080706, 30586165, 29948680, 29624372, 29389344, 28968859, 28397109, 27877115, 27326881, 26820725, 26260746, 25692185, 25213043, 24722690, 24158052, 23514349, 23066382, 22557487, 22153223]
3626B2153223l56635k80427m07130k63416j73508j69414j40891j03824j63519
3617B0094459k42476m2270j54876m8540l46183m03964r5189l30918l96057l09272
3607A7724714j89829P5976l02991k14103R6293k20597m5208P6249j38552j52415
3597A6709537j15591k88379k10643j99670o1542k7613k11232K3918M1763m8035
3587A5612513k00543j73406r2800o9721J35780p3643k21334l20466J1314K12335
3577A4820029J36460o1787j03094r2171k3304k6739P7594l4403p4670J74904L3831
3566A4826650j84780l1503j7854Q359j49963J14739r9639k02583J60690J48616
3556A4572732J8725N3345j50286P7214n6504r3133J99548J88665J2258P2366J73723
$$ y = [22153223, 21796588, 21516161, 21109031, 20845615, 20672107, 20502693, 20361802, 20257978, 20094459, 19851983, 19809713, 19654837, 19606297, 19260114, 18856150, 18760961, 18430043, 18033986, 17724714, 17534885, 17610861, 17307870, 17093767, 17190060, 16969463, 16924255, 17000504, 16861952, 16709537, 16593946, 16305567, 16094924, 15895254, 15833712, 15806099, 15594867, 15618785, 15660548, 15612513, 15411970, 15238564, 15145764, 15076043, 15211823, 15138180, 14916846, 14596380, 14607694, 14820029, 14956489, 14894702, 14791608, 14699437, 14676133, 14649394, 14726988, 14692585, 14617915, 14792819, 14826650, 14641870, 14610367, 14592513, 14600872, 14450909, 14565648, 14466009, 14263426, 14424116, 14572732, 14591457, 14644802, 14494516, 14571730, 14515226, 14422093, 14621641, 14810306, 14822564, 14894930, 15068653]
3545A5068653J1247J46256Q1850K16888K64290M5576O8440L61061J30195J6460
3535A6410916k01912O3650o1230l4077j985m9815j1878J0312Q8123O1905L7226
3524A6311235K25099J12446P7206K07628R6339L40586P1427N4251K47496K14556
3514A7958269L34550K88883J9506K26162M01124K59621K79188K72068M52992L20929
3504B0813292J21909L75161L68083J75138J79444M5551j47922J17994K1042K11423
3494B2281115Q4331K54901J12999J21256J84738L27356L85767J90634K27371L66182
3484B4536650O20299K07856J59889K88497N31204M88035O05989L92242M49168
3475B8279829L84230O62749P70259P86384Q51011R72935P31493M81767N36106
$$ y = [15068653, 15079900, 15226156, 15308006, 15524894, 15789184, 15834760, 15903200, 16264261, 16394456, 16410916, 16209004, 16272654, 16211424, 16177347, 16175362, 16125547, 16113669, 16123981, 16212104, 16274009, 16311235, 16536334, 16648780, 16725986, 16933614, 17029953, 17370539, 17441966, 17496217, 17743713, 17958269, 18292819, 18581702, 18601208, 18827370, 19228494, 19488115, 19767303, 20039371, 20492363, 20813292, 20935201, 21310362, 21678445, 21853583, 22033027, 22078578, 21930656, 22048650, 22069692, 22281115, 22365446, 22620347, 22733346, 22854602, 23039340, 23366696, 23752463, 23943097, 24170468, 24536650, 25156949, 25364805, 25524694, 25813191, 26344395, 26832430, 27438419, 27830661, 28279829, 28664059, 29326808, 30097067, 30883451, 31734462, 32707397, 33438890, 33920657, 34456763]
3466C4456763N15748L42120O61355O02763O09499O52248Q51756J177757J043190
3457D0913199Q24790R57446J076631J161640J066074J225871J097470J016860
3449D9339981J185951J255714J505982J649497J743340K086982K061387K144290
3441F2973124K527771K669192L068267K979935K738197K753424K820944L023433
3433H5554287L793681M465648N100143N515003O263919O956783P511966Q323765
3425A33485195R679150J0642221J2423421J4376544J6913245J9920204K2297563
3418B39737543K3678168K3432769K0073666J2490810o19492j6824223k9069428
3411B72899813l2879123l0048357k5183327k0278724j6201824j3138582j0826856
$$ y = [34456763, 34972511, 35314631, 35975986, 36578749, 37188248, 37840496, 38692252, 39870009, 40913199, 41737989, 42695435, 43772066, 44933706, 45999780, 47225651, 48323121, 49339981, 50525932, 51781646, 53287628, 54937125, 56680465, 58767447, 60828834, 62973124, 65500895, 68170087, 71238354, 74218289, 76956486, 79709910, 82530854, 85554287, 89347968, 93813616, 98913759, 104428762, 110692681, 117649464, 125161430, 133485195, 143164345, 153806566, 166229987, 180606531, 197519776, 217439980, 239737543, 263415711, 286848480, 306922146, 319412956, 318793464, 301969241, 272899813, 240020690, 209972333, 184789006, 164510282, 148308458, 135169876, 124343020]
3404A24343020q747140p507057o323141n206263m747880m040323l718226l098114
3396H0954876k520736k341021k242456j894488j452848j304948q39846p38484
3388F7620049o65088n23654l70454J42571L0782J07421N113l4283L31488O33131
3378F7277076M70742O97290R96214J142531J205215J519100J825009J801124K181004
3369G9115305K652241K645806L096761L488350L918754M408414M550052N058851
3361A08934534M770036M459051M114369L202261K204323R68943n5226q62170j062986
3352A26673135p17180j26484L32659Q91024J114355J538935K127163K476666L128009
3343A37438282L855597M632652N616254O773496P668054Q994035J0183203J1776623
$$ y = [124343020, 115595880, 108088823, 101765682, 96559419, 91811539, 87771216, 84052990, 80954876, 78434140, 76093119, 73850663, 71956175, 70503327, 69198379, 68358533, 67620049, 66954961, 66431307, 66060853, 66203424, 66234206, 66341627, 66346740, 66312457, 66643945, 67277076, 67747818, 68445108, 69441322, 70583853, 71789068, 73308168, 75133177, 76934301, 79115305, 81767546, 84413352, 87510113, 90998463, 94917217, 99325631, 103875683, 108934534, 113704570, 118163621, 122277990, 125480251, 127684574, 128653517, 128598291, 127736121, 126673135, 125955955, 125829471, 126162130, 127053154, 128167509, 129706444, 131833607, 134310273, 137438282, 141293879, 145926531, 151542785, 158316281, 165984335, 174978370, 185161573, 196938196]
3335A96938196J2881937J4292156J5331312J5579643J4650179J3646701J1682745
3328B95002869R238680O956010M669042K255872M32284p06431L0068K963652P524214
3319C28366260J2428134J6110251J7236216J4731940R039377J271045p453120
3312C91730103j6856977k4835482k9397632l1424549l0061246k6466093k1436787
3305B11251337j6855040j3149342j0521252q702806o782837n435186m445856l449435
3297A41909583k408099k160380j378225j678766k714610l492642m810698o171233
3289A17094930o650534o683179o390707n471386m747488m147027l743615l175463
3281G6085531k301230j990550j859203j710324j278503j148434q21221p87763
$$ y = [196938196, 209820133, 224112289, 239443601, 255023244, 269673423, 283320124, 295002869, 304241549, 311197559, 315866601, 318122473, 318554757, 317848326, 317878394, 320842046, 328366260, 340794394, 356904645, 374140861, 388872801, 397912178, 399183223, 391730103, 374873126, 350037644, 320640012, 289215463, 259154217, 232688124, 211251337, 194396297, 181246955, 170725703, 162022897, 155240060, 149804874, 145359018, 141909583, 139501484, 137341104, 135962879, 134284113, 131569503, 128076861, 123266163, 117094930, 110444396, 103761217, 97370510, 91899124, 87151636, 83004609, 79260994, 76085531, 73784301, 71793751, 69934548, 68224224, 66945721, 65797287, 64976066, 64188303]
3273F4188303r42108q56699p60127j016717j015919j221608j243219j374021j232709
3264E4525176j014876j022615o86156m55949n84813l09629j03875L60158N68053
3255E1275474P47945J033436J433856J117417Q20200L62721m59987q41346j356632
3246E4133084j592092j389289r54961l75061k54076j04271q5030L76998O66826
3237E0422128N40884P77769J019754J212668J566103J995723K112191K261368
3229F1908588K833254L301435M259837N164382O194260P527773R325283J0983378
3221A11498190J1394281J1427998J0144209O311495j58397p630608j3126771j4673170
3213A15187227j3249053j0798828q767397o546283n147780l961268l089771k652544
$$ y = [64188303, 63246195, 62389496, 61629369, 60612652, 59596733, 58375125, 57131906, 55757885, 54525176, 53510300, 52487685, 51801529, 51345580, 50760767, 50451138, 50347263, 50707421, 51275474, 52023419, 53056855, 54490711, 55608128, 56428328, 56791049, 56331062, 55489716, 54133084, 52540992, 51151703, 50196742, 49821681, 49567605, 49463334, 49378304, 49755302, 50422128, 50963012, 51740781, 52760535, 53973203, 55539306, 57535029, 59647220, 61908588, 64741842, 68043277, 72303114, 77467496, 83661756, 91189529, 100514812, 111498190, 122892471, 134320469, 144464678, 150776173, 150617776, 142987168, 129860397, 115187227, 101938174, 91139346, 82371949, 75825666, 70677886, 66716618, 63626847, 60974303]
3205F0974303j791442j336450j016778o74231o66574k41974j90972m34609j49756
3196E4471517m08718n56202o63897p20002p65153r67666r14712j106540j107126
3187D7261501j019463r58760j184077r18534j042249j050037r61655o42298p68600
3178C8715828o36798m99151m11392l61397q3002j69696q6635K69426L21720L27266
3168C7386169K14669L61607K2891m71669l71610k82111n63675m63207l64348m01463
3158C5067253l89712k31132l09015l40912k44224k89754k37947l4288k95688l16075
3148C2378506r0260j93522K1910j29958J342J35137J55361L1781J73909M31911
3138C2916117K87803K82015M97472M07979O38554J117128Q23609J038715J172961
$$ y = [60974303, 59182861, 57846411, 56829633, 56155402, 55488828, 55246854, 55055882, 54621273, 54471517, 54062799, 53506597, 52842700, 52122698, 51357545, 50389879, 49475167, 48368627, 47261501, 46242038, 45283278, 44099201, 43180667, 42138418, 41088381, 40126726, 39484428, 38715828, 38079030, 37579879, 37168487, 36807090, 36724088, 36554392, 36467757, 36737183, 37058903, 37386169, 37600838, 37962445, 37985336, 37513667, 37142057, 36859946, 36296271, 35833064, 35468716, 35067253, 34677541, 34446409, 34137394, 33796482, 33552258, 33262504, 33024557, 32990269, 32694581, 32378506, 32288246, 32094724, 32116634, 31986676, 31988018, 32123155, 32278516, 32310297, 32484206, 32916117, 33203920, 33485935, 33983407, 34391386, 35029940, 36147068, 36970677, 38009392, 39182353]
3129C9182353J438781J755437K273574K488627K761028L696875M773007O018752
3121F4388434P089744P846354Q043815P321542N355180J498513m716063r770325
3113H7057194j1329390r794289p849943o145696m637999l725869l216768k398551
3105C7958689k069623j805836j137139j175282r42636j046610q65084q00756p21903
3096B7393820q31245n76332n38425k23298l48868k50311l05587m07580j91665
3087B3720509k93923m16845j65178j74118J25249l4010k69736j30460k67709k50904
3077B1842875n55275m65639j89805k88836k58249k27470l00458l9180j76034r8255
3067A9243674O9922j56460j0723L18414J67938J64226R7816P5836J89749M00703
$$ y = [39182353, 40621134, 42376571, 44650145, 47138772, 49899800, 53596675, 58369682, 64388434, 71478178, 79324532, 87368347, 94689889, 100045069, 101543582, 96827519, 87057194, 75727804, 65933515, 58083572, 51937876, 47299877, 43574008, 40357240, 37958689, 35889066, 34083230, 32946091, 31770809, 30828173, 29781563, 28916479, 28115723, 27393820, 26562575, 25986243, 25447818, 25224520, 24875652, 24625341, 24319754, 23912174, 23720509, 23426586, 23009741, 22844563, 22670445, 22795694, 22761684, 22491948, 22361488, 22093779, 21842875, 21287600, 20821961, 20632156, 20343320, 20085071, 19857601, 19557143, 19517963, 19341929, 19243674, 19313596, 19157136, 19146413, 19464827, 19632765, 19796991, 19894807, 19970643, 20160392, 20561095]
3057B0561095N60676N80338M97685P84120R15422J028460N02328J01191o7556
3048B5463759l58545p18341q47101p34210q10095m70517l29210j33883k20096
3039B0841761J3327K8843P7423k3618K93490J19310J40835J21157M4645L68129
3029B2025302L00839K40720K59632L42090L52915M19078N23720N08145K80479
3020B5252920L05556K39320K07623j54264k35345k31022m14106k36113l88845
3011B4345724k51365j65597l93778k17891L5448k60347l6555o1081k59960J93222
3001B2927820m3305K59822K01001o1773Q1422K15720J29138L58679K96941L29507
2991B4694972L44530M46216M40242M44201M66198L99172N30835N15939K77115
$$ y = [20561095, 21121771, 21702109, 22199794, 22983914, 23899336, 24927796, 25430124, 25531315, 25463759, 25105214, 24386873, 23539772, 22805562, 21995467, 21524950, 21195740, 21061857, 20841761, 20855088, 20883931, 20961354, 20937736, 21231226, 21350536, 21491371, 21612528, 21657173, 22025302, 22326141, 22566861, 22826493, 23168583, 23521498, 23940576, 24464296, 24972441, 25252920, 25558476, 25797796, 26005419, 25851155, 25615810, 25384788, 24970682, 24734569, 24345724, 24094359, 23928762, 23534984, 23317093, 23352541, 23092194, 23055639, 22994558, 22734598, 22927820, 22884515, 23144337, 23345338, 23283565, 23364987, 23580707, 23709845, 24068524, 24365465, 24694972, 25039502, 25485718, 25925960, 26370161, 26836359, 27235531, 27766366, 28282305, 28559420]
2982B8559420K91447M91725M50365O50234O78193O22153P69452P45415N17172
2973C3775576M64183J017377O43481O34907P93025Q17198O04131R89545Q42795
2964D0582218J011698J137056J198577J358553J187598J445740J388100J398515
2956E0708055J557139J507188J570441J628355J682083J683225J852471J911682
2948F4100639J861560K203314K157751K469780K502896K653569K572338K761875
2940H3283722K643376K580473L030572L062770K740041L000991L025760L080638
2932A06448343L004733L234107L326881L377619L201661L443408L490802L105898
2924A32633452L087970L059103K823348K812394K207622J943987K070666K137741
$$ y = [28559420, 28850867, 29342592, 29792957, 30443191, 31121384, 31743537, 32512989, 33258404, 33775576, 34239759, 35257136, 35900617, 36535524, 37328549, 38145747, 38749878, 39739423, 40582218, 41593916, 42730972, 43929549, 45288102, 46475700, 47921440, 49309540, 50708055, 52265194, 53772382, 55342823, 56971178, 58653261, 60336486, 62188957, 64100639, 65962199, 68165513, 70323264, 72793044, 75295940, 77949509, 80521847, 83283722, 85927098, 88507571, 91538143, 94600913, 97340954, 100341945, 103367705, 106448343, 109453076, 112687183, 116014064, 119391683, 122593344, 126036752, 129527554, 132633452, 135721422, 138780525, 141603873, 144416267, 146623889, 148567876, 150638542, 152776283]
2916A52776283J835407J523896J749455J647749J331927J265710R77626N97241
2908A63705294M27126K19033j74673p12571j226808j342651j229714j469110j783839
2899A56412087j843084j769056j907137j960426k219628k588293k778389k900429
2891A38445645l098794l200662l429831l647078l766394l783144l667225l292763
2883A10559754l253789l082575l078267l112955l202317l256750k764754k869245
2875H5939102l058263k983117k914582k495128k412845k478901k356533k329944
2867F4909789k300442k098495j899993j935692j809303j660777j675440j468325
2859E0061322j336751j131640r41221r82417r29593o76417p92713o45985n81885
$$ y = [152776283, 154611690, 156135586, 157885041, 159532790, 160864717, 162130427, 163108053, 163705294, 164132420, 164351453, 164176780, 163464209, 162237401, 160894750, 159665036, 158195926, 156412087, 154569003, 152799947, 150892810, 148932384, 146712756, 144124463, 141346074, 138445645, 135346851, 132146189, 128716358, 125069280, 121302886, 117519742, 113852517, 110559754, 107305965, 104223390, 101145123, 98032168, 94829851, 91573101, 88808347, 85939102, 82880839, 79897722, 76983140, 74488012, 72075167, 69596266, 67239733, 64909789, 62609347, 60510852, 58610859, 56675167, 54865864, 53205087, 51529647, 50061322, 48724571, 47592931, 46651710, 45669293, 44739700, 44063283, 43270570, 42624585, 42042700]
2850D2042700l77681l99417l13859l45831k04464k71193j2417j29706j98319j61300
2840C9628513k30430k28297k35961p7974J1053j94731j97184p2373p3044n4659
2830C8274913m25421k03133o5508m2529j88335j53799j77985j17397j17566J58351
2820C6941591j76220J44780L07878N6393K44952L28293L38401N10566M63389K31624
2810C9391647M70478M07233M07152J88462M9822K71157M36021J54581Q459K46365
2800D2031377M28918K69536K32883L29300J12281R8952r467k2002l0509K13561
2790D3654830K58230K32244K1899k8282J59790L10039L20871L66043L06697L11822
2780D5914183O09088N85765O11333P04179O65958N35019Q16364Q13003J022384
$$ y = [42042700, 41665019, 41265602, 40951743, 40605912, 40401448, 40130255, 40117838, 39988132, 39789813, 39628513, 39398083, 39169786, 38933825, 38855851, 38866904, 38672173, 38474989, 38402616, 38329572, 38274913, 37849492, 37646359, 37580851, 37538322, 37349987, 37196188, 37018203, 36900806, 36783240, 36941591, 36765371, 36910151, 37218029, 37274422, 37519374, 37847667, 38186068, 38696634, 39160023, 39391647, 39862125, 40269358, 40676510, 40864972, 40914794, 41185951, 41621972, 41776553, 41785012, 42031377, 42460295, 42729831, 42962714, 43292014, 43404295, 43503247, 43493780, 43471778, 43441269, 43654830, 43913060, 44145304, 44167203, 44138921, 44298711, 44608750, 44929621, 45295664, 45602361, 45914183, 46523271, 47109036, 47720369, 48424548, 49090506, 49625525, 50441889, 51254892, 52277276]
2771E2277276J006320J091147J186738J263422J461886J259860J416615J538138
2763F2501402J565356J967967K009306K100119K359772K266097K685586K814678
2755H0270283K708964K911580L255577L458227L928985M154450M764756N098462
2747A10551284N701820O255580O643730P461709Q316897R458354J0215692J1530872
2739A76135938J2761474J4569405J6586928J8297314K0729814K2813907K4383494
2732C06278274K5542155K5421198K3536055K0184270J5343347R729880M338378
2725D30373557n57450l854174n463189o074625n658008m566050l341881k242138
2717C98616042j326699j379537k151093l996959o530479r805465j3949936j7794116
$$ y = [52277276, 53283596, 54374743, 55561481, 56824903, 58286789, 59546649, 60963264, 62501402, 64066758, 66034725, 68044031, 70144150, 72503922, 74770019, 77455605, 80270283, 82979247, 85890827, 89146404, 92604631, 96533616, 100688066, 105452822, 110551284, 116253104, 122508684, 129152414, 136614123, 144931020, 154389374, 164605066, 176135938, 188897412, 203466817, 220053745, 238351059, 259080873, 281894780, 306278274, 331820429, 357241627, 380777682, 400961952, 416305299, 426035179, 430373557, 429816107, 425961933, 420498744, 414424119, 408766111, 404200061, 400858180, 398616042, 397289343, 395909806, 393758713, 389761754, 383231275, 373425810, 359475874, 341681758]
2709C41681758k1319399k3614964k4498351k3775472k1785413j9722848j7352768
2702A89612543j5414598j3605936j1513297j0534771r014141p951072p484689
2695A14094039o333979n719344n159335m577144l878628l461221l358034l022560
2687G8583794k891005k594291k447972k254875j923724j925684j875365j641259
2679F1029619j506310j436064j230669j446384j506724r82443j138692j134559
2671E0647774j046523p06867p27802r27788o77618o99394p64885l95449n53746
2662D4147702o00873o17181k92225m03086n49473j94991k10400l81422l05881
2653D0592170m84340j93528j11988j62125O1390l58933j96125j50036k00534j03391
$$ y = [341681758, 320362359, 296747395, 272249044, 248473572, 226688159, 206965311, 189612543, 174197945, 160592009, 149078712, 138543941, 129529800, 121578728, 114094039, 107760060, 102040716, 96881381, 92304237, 88425609, 84964388, 81606354, 78583794, 75692789, 73098498, 70650526, 68395651, 66471927, 64546243, 62670878, 61029619, 59523309, 58087245, 56856576, 55410192, 53903468, 52921025, 51782333, 50647774, 49601251, 48894384, 48166582, 47238794, 46561176, 45861782, 45096897, 44701448, 44147702, 43546829, 42929648, 42637423, 42234337, 41684864, 41489873, 41279473, 40898051, 40592170, 40107830, 39914302, 39802314, 39640189, 39701579, 39342646, 39146521, 38996485, 38795951, 38692560]
2643C8692560j54145j15656q927q6527K9651K381j06207N7123J66130J97415M2954
2632C8716752J3828J67196P9496J19010R1745K65938M6235L05116M46264J26743
2622D0378323M03070M93617K89487M33936N50263M48239N11995M25806O49482
2613D4584218P66613N90229O46940L99697O66794J091654O57900P78987R21935
2604E1104967Q44254Q29635O92810P90479Q51727J092916Q00834J006705J068771
2595E9083098R28131J002181J214426J056040R33330R48998R71928J267651J203973
2586F8609756J255693J315104J201451J339142J620557J709341J888219J672703
2578H0611966J861109K159442J938599K302060K262578K645462K590116K609641
$$ y = [38692560, 38538415, 38422759, 38413832, 38327305, 38356956, 38359337, 38253130, 38310253, 38476383, 38673798, 38716752, 38730580, 38897776, 38977272, 39096282, 39188027, 39453965, 39500200, 39805316, 40251580, 40378323, 40781393, 41275010, 41564497, 41998433, 42548696, 42996935, 43508930, 43934736, 44584218, 45350831, 45941060, 46588000, 46987697, 47654491, 48746145, 49404045, 50183032, 51104967, 51949221, 52778856, 53471666, 54262145, 55113872, 56206788, 57007622, 58014327, 59083098, 60011229, 61013410, 62227836, 63283876, 64217206, 65166204, 66138132, 67405783, 68609756, 69865449, 71180553, 72382004, 73721146, 75341703, 77051044, 78939263, 80611966, 82473075, 84632517, 86571116, 88873176, 91135754, 93781216, 96371332, 98980973]
2570I8980973K726843K574530K991714L567088L473540L623909L958471M082989
2562A25980057M890156N302363N578024O219805O611277P403234Q060549Q753463
2554A78798928R441300J0457160J1559348J2638899J3536064J4157365J4594127
2547B65183191J4572155J4018077J3005046J1842448R868578P961221O514165
2540C42964881N744102N381115O257335P616171Q716597R701747J0112346R616235
2532D06110529Q710883O940702M206129R13210k661265o200973r200446j1264769
2524C97554000j2644823j3190003j2816951j2293134j0996791r761716q832717
2517C17017865q390633q188541q178494q747289j0007495j1193074j2002056j2824192
$$ y = [98980973, 101707816, 104282346, 107274060, 110841148, 114314688, 117938597, 121897068, 125980057, 130870213, 136172576, 141750600, 147970405, 154581682, 161984916, 170045465, 178798928, 188240228, 198697388, 210256736, 222895635, 236431699, 250589064, 265183191, 279755346, 293773423, 306778469, 318620917, 328489495, 336450716, 342964881, 348708983, 354090098, 360347433, 367963604, 376680201, 386381948, 396494294, 406110529, 414821412, 421762114, 425968243, 426881453, 424220188, 418019215, 408818769, 397554000, 384909177, 371719174, 358902223, 346609089, 335612298, 325850582, 317017865, 308627232, 300438691, 292260197, 283512908, 273505413, 262312339, 250310283, 237486091]
2509B37486091j3146494j3340519j3049885j1925118j1056599r805747r067752
2502A56093977p951318p180182o648773n831118n150905m838406m382788l872772
2494A10237715l750051l480019l336393l223457l293066l034796k870152k892656
2486H4357125l050663k826506k706632k379714k231526k031047j797542j750506
2478F5582989j689782j914961j665026j404085j254331j241121j359289j373167
2470E3681227j116722j093958j196616j098925j069440q39620r02542q60333j069471
2461D4433600p58976r01185r77090r28343p45905p52267q35855p74000q09666
2452C6950313o93216n37903n38024q63967o63723q10387p63879q83504n56929
$$ y = [237486091, 224339597, 210999078, 197949193, 186024075, 174967476, 165161729, 156093977, 148142659, 140962477, 134313704, 128482586, 123331681, 118493275, 114110487, 110237715, 106487664, 103007645, 99671252, 96447795, 93154729, 90119933, 87249781, 84357125, 81306462, 78479956, 75773324, 73393610, 71162084, 69131037, 67333495, 65582989, 63893207, 61978246, 60313220, 58909135, 57654804, 56413683, 55054394, 53681227, 52564505, 51470547, 50273931, 49175006, 48105566, 47265946, 46363404, 45503071, 44433600, 43674624, 42773439, 41796349, 40868006, 40122101, 39369834, 38533979, 37759979, 36950313, 36257097, 35719194, 35181170, 34317203, 33653480, 32843093, 32079214, 31195710, 30638781]
2443C0638781o44955p02190n82392m95628o00721n91791m56568m18517o11262
2434B5534757o25095k75061o30530m92292l02691n28667j46695l20444o24047
2425B1589235m82680k42497j57532j79597j39149l64250k69031m28221k93566
2416A9032712j29506l04161k61375j49427k50053k64709j80724p6754l20846j01767
2406A6993390k39248k14413k62539L6533l98140k92434P1633l56129l70082q2233
2396A4886338l10443k37000k01186j96226j56875k08444L2183o9719j20161k38490
2386A3179977j33596j23647k80235k13901j52717k02890j57059l20743k00608
2377A1394581J12851J36995k46757q2044Q6818p1124m1424k52570n2607Q0064
$$ y = [30638781, 29993826, 29291636, 28709244, 28213616, 27612895, 27021104, 26564536, 26146019, 25534757, 24909662, 24634601, 24004071, 23511779, 23209088, 22680421, 22533726, 22213282, 21589235, 21106555, 20864058, 20706526, 20526929, 20387780, 20023530, 19754499, 19326278, 19032712, 18903206, 18599045, 18337670, 18188243, 17938190, 17673481, 17492757, 17416003, 17095157, 16993390, 16754142, 16539729, 16277190, 16313723, 15915583, 15623149, 15694782, 15338653, 14968571, 14886338, 14575895, 14338895, 14137709, 13941483, 13784608, 13576164, 13608347, 13538628, 13418467, 13179977, 13046381, 12922734, 12642499, 12428598, 12275881, 12072991, 11915932, 11595189, 11394581, 11507432, 11644427, 11397670, 11315626, 11402444, 11331320, 11289896, 11037326, 10984719, 11064783]
2367A1064783q8569J07763j6137J34047Q4219r5401j025K49265L57839J09922
2357A1906706L43727L60380J98021L89638L98410N82699O88395P25415M53965
2348A6047356P89349R56368R46714R08256P46275O34250L66892K5073q9828m00917
2338B0929788o39127p72070q15315j109947j042654j059176j097305q73367o61374
2329A2859453p69297p66786m12678n02571n43337k31747k11764l54969k3553l39792
2319H702959k44117l26119j78778m7645p9647k04387l16505j7864M7707p2298
2309G263306j03599j77072J0842m2121k06049J42007n5570k66973k10571q4501
2299F269699j39269K5544J79698j08671j38330j98594r7399J06204k4322k9692
$$ y = [11064783, 10976214, 11083977, 11067840, 11201887, 11286106, 11190705, 11189680, 11438945, 11796784, 11906706, 12250433, 12610813, 12808834, 13198472, 13596882, 14179581, 14867976, 15593391, 16047356, 16836705, 17793073, 18739787, 19648043, 20394318, 21028568, 21395460, 21420533, 21330705, 20929788, 20290661, 19518591, 18703276, 17593329, 16550675, 15491499, 14394194, 13520827, 12859453, 12090156, 11323370, 10910692, 10408121, 9864784, 9633037, 9421273, 9066304, 9042751, 8702959, 8458842, 8132723, 7953945, 7906300, 7826653, 7622266, 7305761, 7287897, 7335604, 7263306, 7159707, 6982635, 6993477, 6951356, 6745307, 6887314, 6831744, 6564771, 6354200, 6269699, 6130430, 6155974, 6335672, 6227001, 6088671, 5890077, 5792678, 5898882, 5874560, 5844868]
2289E844868J7731M6568O0615k7639j26692K05447j16186l73716k4324n320q5918
2278E415434K7065J79520k52203o6252r4862j463P6801j84183J736P5677K878
2267E180148J56936n7879N5304J83783J06335q6824R5090j73911j91779K24872
2257E492075J73844j83765P9271J22972j53488m8262k10189l6071J02860M9824
2247E389071J58057L15458O780n5004k5356R2643O4514J21914P4570J71574P1551
2236F385772j20606j38128m4961r4411J33880j10598o3935l0677K72803K46682
2226F435821j27564m6371n115J93351K19613J31004J22813r1662r5682K37597
2216F973805R1783J36460m8451k4693J01416K23172J13068Q6225J47999J75626
$$ y = [5844868, 5862599, 5909167, 5969782, 5942143, 5815451, 6020898, 5904712, 5530996, 5506672, 5501352, 5415434, 5442499, 5622019, 5369816, 5303564, 5208702, 5207239, 5284040, 5099857, 5101593, 5177270, 5180148, 5337084, 5279205, 5334509, 5518292, 5624627, 5537803, 5632893, 5458982, 5267203, 5492075, 5665919, 5482154, 5561425, 5684397, 5530909, 5482647, 5272458, 5236387, 5339247, 5389071, 5547128, 5862586, 5869366, 5814362, 5789006, 5881649, 5946163, 6068077, 6142647, 6314221, 6385772, 6265166, 6127038, 6082077, 5987666, 6121546, 6010948, 5947013, 5916336, 6189139, 6435821, 6308257, 6261886, 6256771, 6450122, 6669735, 6800739, 6923552, 6831890, 6736208, 6973805, 7065588, 7202048, 7153597, 7128904, 7230320, 7453492, 7566560, 7652785, 7800784, 7976410]
2206G976410K22054o7931K50276K17028K46786R9186M0109J90987J01881K07801
2196I484587k8536J95430M8909p3560J22556J24036K24088J60099J34627K56360
2186A0648596L39746K19651J00178k9416Q8748J35569N5783j17280q2839k37411
2176A1121325k14501j38185j92190J3575k04673j21062j54491j28899R7600J53534
2166A0232033M0227Q5371K54284o7439J34583l19665o65465n96275m49651n60638
2156H087365m77376j49769m67801k78427r3834k12878j72087j49210j96516q2330
2146E807137j88960J3415l04961M2895Q6573J3089q9547J34391J57697J45912
2136E817641K08593L84146L33958N19918N24644M26585O12129N83578K95050o05705
$$ y = [7976410, 8198464, 8130533, 8380809, 8597837, 8844623, 8943809, 8983918, 9174905, 9276786, 9484587, 9456051, 9651481, 9700390, 9626830, 9749386, 9873422, 10097510, 10257609, 10392236, 10648596, 10988342, 11207993, 11308171, 11278755, 11367503, 11503072, 11558855, 11441575, 11358736, 11121325, 10906824, 10768639, 10576449, 10590024, 10385351, 10264289, 10109798, 9980899, 10078499, 10232033, 10272260, 10357631, 10611915, 10544476, 10679059, 10359394, 9693929, 9097654, 8648003, 8087365, 7609989, 7460220, 6992419, 6713992, 6620158, 6407280, 6235193, 6085983, 5889467, 5807137, 5618177, 5631592, 5326631, 5369526, 5456099, 5469188, 5379641, 5514032, 5671729, 5817641, 6026234, 6410380, 6744338, 7264256, 7788900, 8215485, 8827614, 9411192, 9706242, 9100537]
2126I100537j074791j165424o58164l72937j11630n2878j86169k96519o2036o779
2116E113210k15016l21485P0089j08691M3620j70606j21090j23700k2419M4756
2106D188668j16457R8008k1151J43423K19034K01103O9315M146K44771L62663
2096E393523L58281J22856j51645j86358o12847n15333l18086j53705k11522k06727
2086C518437j91343k5471Q1925K7406j98934j86954q6531k0355l3184K719j78987
2075B708728J17695q561P29k5096j80059k09853P5284J20391j02311O4955j11657
2064B450245j84751q4985M1524j2797p0007j71531J16631l7413Q5012K50316J32587
2053B514831M9958q9442j38355J263K5119o2499L6498n3173j25264J16910J48638
$$ y = [9100537, 8025746, 6860322, 6202158, 5829221, 5717591, 5664713, 5478544, 5182025, 5119989, 5113210, 4898194, 4576709, 4646798, 4538107, 4581727, 4411121, 4290031, 4166331, 4143912, 4188668, 4072211, 4170219, 4149068, 4292491, 4511525, 4712628, 4781943, 4786089, 5030860, 5393523, 5751804, 5874660, 5723015, 5536657, 4923810, 4408477, 4090391, 3936686, 3725164, 3518437, 3327094, 3301623, 3383548, 3410954, 3212020, 3025066, 2938535, 2918180, 2884996, 2887715, 2708728, 2826423, 2817862, 2818591, 2793495, 2613436, 2403583, 2478867, 2599258, 2496947, 2561902, 2450245, 2265494, 2180509, 2222033, 2209236, 2139229, 1967698, 2084329, 2046916, 2131928, 2382244, 2514831, 2564789, 2475347, 2336992, 2338255, 2363374, 2300875, 2337373, 2284200, 2158936, 2275846, 2424484]
2042B424484L7528n7953J1462J38062J0827J31482o99n2784P988L0729J18640
2031B799766Q0840O0015m978K89821O4637j6898M7429J01649L79428J46225P4181
2020D022115J68807K18362K99814L71574L74564J22522M60888Q4330M07623J29567
2010F660166K10479M2536J68924N7462k92597k81294l20927l29417k19677l26139
2000E369516o16179k50282j72704l07510k07852j79467k84446j66711k90538j01533
1990B792294j94320j55370j88690l0820J0843q4482j62283l599j0394P6060K4671
1979B073910k59902j03938K92485k6443k63819L786J0362j39609P8982L9998j2567
1968A693245m5774L3240K9108p3711R6078n5319P5659l9705k12128k3026m5175
$$ y = [2424484, 2462012, 2404059, 2415521, 2553583, 2564410, 2695892, 2695193, 2642409, 2650397, 2681126, 2799766, 2880606, 2940621, 2935643, 3225464, 3290101, 3273203, 3320632, 3422281, 3801709, 3947934, 4022115, 4190922, 4409284, 4709098, 5080672, 5455236, 5577758, 6038646, 6122976, 6530599, 6660166, 6870645, 6913181, 7082105, 7139567, 6846970, 6565676, 6244749, 5915332, 5695655, 5369516, 4753337, 4503055, 4330351, 4022841, 3814989, 3635522, 3351076, 3184365, 2893827, 2792294, 2597974, 2442604, 2253914, 2223094, 2233937, 2149455, 1987172, 1983573, 1973179, 2049239, 2073910, 1814008, 1710070, 2002555, 1976112, 1712293, 1716079, 1726441, 1586832, 1665814, 1705812, 1693245, 1647471, 1680711, 1709819, 1636108, 1732186, 1676867, 1752526, 1712821, 1500693, 1477667, 1432492]
1957A432492Q9366P2655k3759j91035k12204j19081K6647J63992R1m1486j30993
1946A066685m1181K28276M3764Q5659L1808j74233p9270Q0449J16312p0790K8376
1935A315855k30049m9992J57228j48166R448O3828R5136J058O5796N2537m0901
1924A291778k09002M6994k7944J1153l7113M8659J89116p2255p9982j41903P7696
1913A097197R3908R0562k15528k29231K03144l5803o0982R9487K9381q1438k5508
1902I65189J8548P2445j4159k35876J97333K8140r0354l0481r17K536o367J33446
1890A039483J17612j25976j34109L2276j79770K7637J02836k4958o163K80952
1880A129820j01985n5722J19278l7870j62640M284p3294j12428J56573R5696j72683
$$ y = [1432492, 1521858, 1594513, 1570754, 1379719, 1167515, 1048434, 1075081, 1239073, 1239164, 1197678, 1066685, 1025504, 1253780, 1297544, 1383203, 1415011, 1240778, 1161508, 1241957, 1358269, 1287479, 1315855, 1085806, 1035814, 1193042, 1044876, 1054324, 1118152, 1213288, 1214346, 1280142, 1332679, 1291778, 1082776, 1129770, 1101826, 1112979, 1075866, 1124525, 1313641, 1241386, 1161404, 1019501, 1097197, 1191105, 1281667, 1066139, 836908, 1040052, 1004249, 943267, 1042754, 1072135, 990697, 965189, 983737, 1056182, 1042023, 806147, 1003480, 1031620, 941266, 910785, 909868, 912404, 906037, 1039483, 1157095, 1031119, 897010, 929286, 749516, 777153, 879989, 855031, 848868, 1129820, 1027835, 972113, 1091391, 1053521, 890881, 895165, 821871, 709443, 866016, 961712, 789029]
1869G89029P8084k4929O5847R3438j33770N927M7594L8928O3078q5657M1817m4927
1857I34459q4268K35678j06812K17622J55505j07245l7388m3815K9084J01549
1847A294369J9050m6255n2613l9096J9506N2937j22072M3538M4020j16771J61932
1836A258545J81898j88099j01325p3538j9362J64648N3280p3239J39765K14530
1826A557103m2342j67976q374j5209q3703J66741K63795J4454l8244k07335K3855
1815A462765k76000Q6809J16915j06908r5346Q6220K76860J3520j46654P5408
1805A493589P8047N3974p264r8667J02586J3666l2478J79630k4897j67777o4571
1794A525838K85052j03357j43498L02981J44696r2565n2546j3574K09484O5781
$$ y = [789029, 867113, 842184, 908031, 1001469, 867699, 873626, 921220, 960148, 1023226, 937569, 979386, 934459, 850191, 1085869, 979057, 1196679, 1352184, 1244939, 1207551, 1163736, 1192820, 1294369, 1313419, 1267164, 1214551, 1175455, 1194961, 1247898, 1125826, 1169364, 1213384, 1096613, 1258545, 1440443, 1252344, 1151019, 1077481, 1058119, 1222767, 1276047, 1202808, 1342573, 1557103, 1514761, 1346785, 1338411, 1323202, 1239499, 1406240, 1670035, 1684489, 1646245, 1438910, 1462765, 1186765, 1273574, 1390489, 1283581, 1188235, 1274455, 1551315, 1564835, 1418181, 1493589, 1571636, 1625610, 1618346, 1519679, 1622265, 1635931, 1603453, 1783083, 1758186, 1590409, 1525838, 1810890, 1707533, 1564035, 1867016, 2011712, 1919147, 1866601, 1853027, 2062511, 2128292]
1784B128292k13692Q2665K06560j63375j03229L72122p3883R6216q7637p3844
1774B170195K50841J48100L12937J42588k03054j0145L03698Q3452q5398J34017
1764C247231P0540L23978J52938n1264Q0539J94621L30072Q7940K92665K85376
1754E014636L88370N34866L58917P16790P18013N79030O12838M89672J044088
1745A0457220J413644J194940J833289J718754K051360K146023J740275J425695
1737B3981200M50353r41454k146876k697503k551542k259265j776117j550043
1729A0508753j385461n47426o93414p88423m80753q17080l26302j78695n28777
1720D762422l62054j95288m09953l66927r9589j01481l37765p0427j38552j55157
$$ y = [2128292, 1914600, 1997265, 2203825, 2040450, 1937221, 2309343, 2235460, 2331676, 2244039, 2170195, 2421036, 2569136, 2882073, 3024661, 2821607, 2811462, 3115160, 3198612, 3113214, 3247231, 3317771, 3641749, 3794687, 3743423, 3823962, 4018583, 4348655, 4436595, 4729260, 5014636, 5403006, 5937872, 6296789, 7013579, 7731592, 8310622, 8923460, 9413132, 10457220, 11870864, 13065804, 14899093, 16617847, 18669207, 20815230, 22555505, 23981200, 24431553, 23490099, 21343223, 18645720, 16094178, 13834913, 12058796, 10508753, 9123292, 8575866, 7882452, 7094029, 6613276, 5796196, 5469894, 5291199, 4762422, 4400368, 4205080, 3795127, 3428200, 3328611, 3227130, 2889365, 2818938, 2680386, 2525229]
1710B525229Q0906r7773r7482K5664k67517j01243n4783n0254p1138j62958n6762
1699A671889M9345L90k1249j25146j21408p5340R7143M4503j21367m0539j73371
1688A184850J27965Q8137K7128o5645k4501P336l7029K1153J0838j89525r9510
1677A051197K3081P0795j01971l1243L3305r8855k41222J40731J56425r1120J65947
1666A077070L547k83343K2456Q7281k47425p3830P3846R8843q9074J17293m181
1655G82483O3299j31092P2077N7481L3847M2995j98809j8431N2647n4096j27373
1644E75028R2513p7075J98473j28753q8001K4899n1140k47429R2725N5296k6889
1633D19647J42355p3146l8765Q9459L5173j20406j74419o3131P6723N3877P5255
$$ y = [2525229, 2606135, 2508362, 2410880, 2436544, 2169027, 2067784, 2013001, 1962747, 1891609, 1728651, 1671889, 1721234, 1721624, 1700375, 1575229, 1453821, 1378481, 1475624, 1520127, 1398760, 1358221, 1184850, 1312815, 1400952, 1428080, 1362435, 1337934, 1345270, 1308241, 1329394, 1340232, 1150707, 1051197, 1074278, 1145073, 1043102, 1011859, 1045164, 946309, 705087, 845818, 1002243, 911123, 1077070, 1080617, 797274, 819730, 907011, 659586, 585756, 659602, 758445, 669371, 786664, 782483, 845782, 714690, 786767, 844248, 878095, 921090, 722281, 703850, 756497, 702401, 575028, 667541, 590466, 788939, 660186, 572185, 597084, 545944, 298515, 391240, 446536, 419647, 562002, 488856, 450091, 539550, 574723, 454317, 279898, 216767, 293490, 347367, 422622]
1622D22622J60885j45971p159o2068P0723p1586j66101l5881J7019K4250k57J14272
1610C20748j6045P4006o9596N4993l4264L4236P5675J3386j22332J10379J27054
1599E68240j62074J7037j66015q3854j3952J32731p7679N1077J3201M293k1320
1588B61685K1937J22512L4289j09587j64115J00680R9438M3703j45881j6346J87979
1577D36294J51977J83259o0601j61271k20700o2533J4015m8262Q7235m9501J1119
1566B81031J34036n7385O0083l6421o3045m6751r8280Q2185j99683J0661J60052
1555B26483k0434o6382N330l1847l7951J03045J2583q5438J75423m9306R6157
1544C27663J8644r9392p1446j49208K30200O0078j44869j37669q8262J72015l222
$$ y = [422622, 583507, 437536, 430377, 368309, 439032, 367446, 201345, 165464, 182483, 206733, 206476, 320748, 304703, 378709, 309113, 364106, 329842, 364078, 439753, 453139, 330807, 441186, 568240, 406166, 423203, 257188, 173334, 159382, 292113, 214434, 265511, 278712, 283005, 261685, 283622, 406134, 440423, 330836, 166721, 267401, 366839, 410542, 264661, 248315, 436294, 588271, 771530, 710929, 549658, 328958, 266425, 280440, 232178, 319413, 269912, 281031, 415067, 357682, 417765, 381344, 318299, 271548, 173268, 255453, 55770, 66431, 226483, 206049, 139667, 144997, 113150, 75199, 178244, 190827, 105389, 280812, 231506, 327663, 346307, 246915, 175469, 26261, 256461, 316539, 171670, 34001, -54261, 117754, 114532]
1533A14532l7657k3465J40519j0431J55042J0651l3353j11114n8881O2427n5609
1522A52661k3924L0248N863Q3377p1315J36236j08132n6178o2795j18719j03572
1511a36250J3621Q4827P1529J97337j24312k1135R8779l1592K2231J24188j02685
1500A96538m9713j03047R9943L0P87j24486J13627M9465j53226M1961N3428R4653
1488B19960m5729n3220n3002p7693P0100J47084O9333j9004n3865m7498J36140
1477B92606J12548k93178q3677J16693j31907N8529Q9930K3317j24531q813L9674
1466I1191L5110J10566K2957k6206j3024M9809j32311L321J19694r655j41052
1455A10400J4351J67173M496p7518l4712k7177O6607L0775K76K1456n4603q3435
$$ y = [114532, 76875, 53410, 193929, 183498, 338540, 349191, 315838, 204724, 145843, 208270, 152661, 128737, 158985, 164848, 248225, 176910, 313146, 205014, 148836, 86041, -32678, -136250, -122629, -37802, 33727, 231064, 106752, 85617, 184396, 152804, 175035, 299223, 196538, 146825, 43778, 143721, 143751, 144538, 20052, 133679, 183144, 29918, 71879, 125307, 219960, 174231, 121011, 68009, -9684, 60416, 207500, 276833, 257829, 203964, 156466, 292606, 405154, 111976, 28299, 144992, 13085, 71614, 161544, 184861, 60330, 51517, 91191, 126301, 236867, 259824, 233618, 220594, 270403, 138092, 141413, 261107, 251452, 110400, 124751, 291924, 296420, 218902, 184190, 157013, 223620, 254395, 254671, 276127, 221524, 138089]
1443A38089J76090j12888j04874J32707q1971j18250M7652O7551k20299J70551
1433I4358J02708q3677p6179K0057O0166M248j19112N9817j29801k7666L14007
1422B18926m4457j11019R8454J1875j85392k90122J3129K08722J60349J4398O0670
1411A55533M2097P6043k09369k10552K1752O4295k0875K11409K6048q1846J2007
1400H6542j56241o8724J51189K60643p3042k030k30488R3976J36507M9895J35674
1389C83901k34096p483Q5975k4315k0678k3122K44306j02117k51234P8716k5290
1378A04563k53866L9074N6261J65740P5895K6495k2610j69964p9951K2625J08942
1367G3204J29257o1407j10145m3046J68641J61480j2983j5236j53904r600L4670
$$ y = [138089, 314179, 201291, 96417, 229124, 147153, 28903, 76555, 144106, -76193, 94358, 197066, 113389, 37210, 57267, 117433, 121681, 2569, 62386, -67415, -95081, 218926, 174469, 63450, 161904, 173779, -11613, -301735, -288606, -79884, 80465, 94863, 155533, 197630, 273673, 64304, -146248, -124496, -60201, -81076, 130333, 156381, 74535, 86542, -69699, -138423, 12766, 273409, 200367, 198337, -32151, 61825, 198332, 248227, 383901, 149805, 142322, 228297, 203982, 183304, 160182, 404488, 302371, 51137, 129853, 104563, -149303, -110229, -53968, 111772, 187667, 214162, 191552, 21588, -58363, -35738, 73204, 202461, 141054, 30909, -12137, 156504, 317984, 305001, 289765, 135861, 126261, 160931]
1356A60931j44606K5905r149o588L7426j81028M023J17934J34869p2078J010p7203
1344h554L8211M4234Q4605j23037j39431n9316K86048K1564q5059q8875j89701
1333b19311K05669O3978j04937l2347j8400P6758L7130k77435M3382K16345J91669
1322A82501P7250Q4009j12293l4091j8320o3550J8526k00869K68J27965L735k8561
1310C6570k8675J22696J7015n6862m5833j04512j8292K3751J4411N3882O2445
1299G6596j66432o6927M6262J8152J42349j24683O8298J2656J83877O2465p6536
1288A76077j79163M6031J31039q7592q3603R2428j79198J0868M2293j29543J2566
1277a47797J27595J17472Q5480M2294j14185m6346Q2344K8263n0765L6258r0386
$$ y = [160931, 16325, 42230, 33081, 26493, 63919, -117109, -113086, 4848, 139717, 67639, 68649, -8554, 29657, 73891, 158496, 35459, -103972, -163288, 122760, 144324, 59265, -29610, -219311, -13642, 50336, -54601, -86948, -105348, -28590, 8540, -268895, -225513, -9168, 182501, 259751, 343760, 231467, 197376, 179056, 115506, 134032, -66837, -66569, 61396, 65131, 36570, 7895, 130591, 147606, 90744, 44911, -59601, -77893, -54142, -39731, 14151, 76596, -89836, -156763, -110501, -92349, 50000, -74683, -6385, 6271, 190148, 252613, 176077, -3086, 42945, 173984, 86392, 2789, 95217, -83981, -73113, -30820, -160363, -147797, -20202, 97270, 182750, 225044, 110859, 64513, 146857, 175120, 124355, 160613, 70227]
1266G0227J35L0175j2638j1823N9798l9340Q1675k2303J33704k8205M7305J14717
1254D23427J18952j9854j77083j30560J77252r0019M7774R2823j53709j22947
1244A66056j87046J36453r6203k8863J71462n2112o3861J0700q9921O8483R7171
1233A32319N8527j89231j49899J4063J55879R127j22526K08925K99732m6100j24981
1222B45835k4318j45810j18561K5328o3495Q2667J94295J38421n5369j20196j9400
1211A39397j28367L26365J03576k18587N1883j01330O0085J5753r745l8607j16770
1200H3653j04662j93018L776K70563J65444o497p2904O642k2588k44608J01110
1189a3089J7966j19601j09315J01140K21231K8175L3977j41837k2182k9805J16241
$$ y = [70227, 70362, 100537, 87899, 76076, 135874, 96534, 178209, 155906, 289610, 261405, 308710, 423427, 542379, 522525, 345442, 214882, 392134, 302115, 349889, 442712, 289003, 166056, -20990, 115463, 19260, -9603, 161859, 109747, 45886, 56586, -33335, 35148, 132319, 190846, 1615, -148284, -134221, 21658, 30785, -91741, 117184, 416916, 370816, 245835, 221517, 75707, -42854, -17526, -81021, 1646, 195941, 334362, 278993, 158797, 139397, 11030, 337395, 440971, 222384, 274267, 172937, 233022, 248775, 239030, 200423, 83653, -21009, -214027, -210251, 60312, 225756, 219259, 146355, 152997, 130409, -114199, -13089, 4877, -114724, -224039, -122899, 98332, 126507, 160484, 18647, -3535, -33340, 82901]
1178H2901M8153o0974m4729r5297N0600R575K03932M1528k47529P9246k5389n618
1166C6399J46707q5183j41817J21158R9775k69749J25910R7346O2694j04405J07122
1155A95957o1147m598R9999Q5074k47104J4502J63400j35454j73746K1678J21415
1144G9976P3991j9262j87752J19120l9568J04028O0467k5569J88901o554K2467
1133C70245k98830j25579J1873J27536Q280n7489L1471R3236M8437L7783k0326
1122B26637m5852O0858J79614n033o9928M651m6951K26683p8407O4676r6114j01023
1110C19811M8879o0713o6356J85075Q283l025J12415k06021k2354J6448r3462
1099B38980J34874J91331O8457j79711K9836N7725r961k225J57470r2526j1615
$$ y = [82901, 131054, 70080, 25351, -69946, -19346, -9771, 194161, 235689, -11840, 67406, 42017, 36399, 183106, 97923, -43894, 77264, 177039, -92710, 33200, 130546, 193240, 88835, 195957, 134810, 130212, 230211, 315285, 68181, 82683, 246083, 110629, -63117, -41439, 79976, 153967, 134705, -53047, 66073, 26505, 130533, 191000, 165431, 354332, 347778, 370245, 71415, -54164, -42291, 85245, 93525, 36036, 67507, 160743, 209180, 246963, 226637, 180785, 241643, 421257, 416224, 346296, 350947, 303996, 530679, 452272, 516948, 420834, 319811, 368690, 307977, 241621, 426696, 434979, 431954, 544369, 338348, 315994, 332442, 238980, 373854, 565185, 633642, 453931, 483767, 541492, 531531, 529306, 686776, 594250, 582635]
1088E82635P1937J09264m6380M4548j70434J6770P037J00491K0269P178l2517
1077G10798N3932j01053j114j22419K738K65122k6963n304K4160L1382m8166M2382
1065H25495j16800N4237M8885K16283K8661K85689J23343l07080J74336J94646
1055A527695P8538k34308P4486J9682k97062N4500J95551j04911q6756O1254L3300
1044A321969N0947N9191L8575j17916j00912J47504J17955J57682J6789o9116
1034A622668J2452J87982j5247j3290R4892R257M8874M7729N4967k8247O3336
1023B085373p9086P967J58157K70410k6288Q9020J17339J65639N7666K9662O5801
1012B941660L37409J98257R4909l7174K41880J77473K19441J17281K99760M30757
$$ y = [582635, 654572, 763836, 717456, 762004, 591570, 608340, 615377, 715868, 736137, 743315, 710798, 764730, 663677, 662563, 540144, 542882, 808004, 781041, 775737, 799897, 831279, 783113, 825495, 708695, 762932, 811817, 1028100, 1056761, 1342450, 1465793, 1158713, 1333049, 1527695, 1606233, 1371925, 1446411, 1466093, 1169031, 1223531, 1419082, 1314171, 1227415, 1288669, 1321969, 1372916, 1432107, 1470682, 1352766, 1251854, 1399358, 1517313, 1674995, 1691784, 1622668, 1635120, 1823102, 1807855, 1794565, 1889457, 1898714, 1947588, 1995317, 2050284, 2022037, 2085373, 2006287, 2014254, 2172411, 2442821, 2416533, 2505553, 2622892, 2788531, 2846197, 2875859, 2941660, 3279069, 3477326, 3572235, 3535061, 3776941, 3954414, 4173855, 4291136, 4590896, 5021653]
1002E021653L71425K07574K91718J56188L37316L65683K71877Q5910L15210N60294
992G984848M05102N77229P47059P47235P84868Q04719Q82080Q01015O19984R06206
982A5260345J143508J299575J700431K369306L036234M011952N421633O991119
974D1234103P527073P899691Q015697P615618L817818p397530j4956476j2552058
966D1203936q308224n293771m021014k937478k461788k010899j670758j117676
958A3382328j084175r31378p04881l27262n77577q70194p22611n09017m40695
949G214538l90022l86026n77896j86081l40049l00995j80993j41514k82994k55791
939D172177l26499j91187P0593j58084j05561r2823j5127n3837k21430k07165
$$ y = [5021653, 5393078, 5600652, 5892370, 6048558, 6385874, 6751557, 7023434, 7109344, 7424554, 7984848, 8389950, 8967179, 9714238, 10461473, 11246341, 12051060, 12933140, 13734155, 14354139, 15260345, 16403853, 17703428, 19403859, 21773165, 24809399, 28821351, 34242984, 41234103, 48761176, 56660867, 64676564, 72292182, 76110000, 68712470, 53755994, 41203936, 32895712, 27601941, 23580927, 20643449, 18181661, 16170762, 14500004, 13382328, 12298153, 11366775, 10661894, 10334632, 9757055, 8886861, 8164250, 7655233, 7214538, 6824516, 6438490, 5860594, 5674513, 5334464, 5033469, 4852476, 4710962, 4427968, 4172177, 3845678, 3654491, 3725084, 3567000, 3461439, 3368616, 3353489, 3299652, 3078222, 2871057]
929B871057j71899O7321J8950k15590j27155j26698k0674R8755l43327j59132
919A891608k4831J06944K9527j43449j59773p1726j24847l5531q492q9582N1918
908A421766M7707P2665K737k7479L0316n3840l6732k5772R145j47325j26802l0759
896A135627j66446J3689J28718J8987N7717K9870q7688j56272r7672J0534O9322
885I56386k5835N4160J7253j12813L1289q7636q2072j10229j1765k13165J14600
874E30173J36503O2918o8074r9108r2398L9177O9870j4298l4659M1548q257r5086
862D68309p4978r8227M5346J77600p4199O3264l6422k18128m1450N1121J07675
851C69911l5325J11901j17621N2658J40445j88641M1864o8127l7595o2588J473
$$ y = [2871057, 2699158, 2766479, 2785429, 2569839, 2442684, 2315986, 2295312, 2394067, 2050740, 1891608, 1866777, 1973721, 2003248, 1859799, 1700026, 1628300, 1503453, 1467922, 1459430, 1369848, 1421766, 1469473, 1542138, 1544875, 1517396, 1547712, 1493872, 1457140, 1431368, 1440513, 1293188, 1166386, 1135627, 969181, 982870, 1111588, 1130575, 1188292, 1218162, 1130474, 974202, 876530, 887064, 956386, 930551, 984711, 1001964, 889151, 920440, 832804, 750732, 640503, 628738, 415573, 530173, 666676, 729594, 661520, 562412, 470014, 509191, 579061, 564763, 530104, 571652, 563395, 468309, 393331, 295104, 340450, 518050, 443851, 507115, 470693, 252565, 211115, 262236, 369911, 334586, 446487, 328866, 381524, 521969, 333328, 375192, 307065, 269470, 206882, 208355]
840B08355J10384p6434l1531N2396j4985M3220M1987Q5660j17360j13995j9510
829A68187k8393O0442m3890k7101J22983P3509m9370Q7218k1074p0386J9672l06252
817a4455q4001P5359K77046J13534j95528K23064o6501m0383M6444L8244p5530
806B97293r209k99030K4661J55061o2259P770j27822l4738J12777K33718J80808
795D79030j58078j23197j73608m9401P0289J461M8460N6304j2165K2300Q9725
784B51120N3870m4106k1102o7983M6786L757k1050j13238j45171k6135K03152
773A19900j54896M4147J42480m0302r4443j15919K04758J27534l3220k15878j15118
762a30957n2473K11205k2136p9402P6054k2572P954j62619J56612k8189L1063
$$ y = [208355, 318739, 242305, 210774, 263170, 248185, 291405, 333392, 419052, 301692, 187697, 168187, 139794, 200236, 156346, 129245, 252228, 325737, 276367, 363585, 342511, 272125, 291797, -14455, -98456, -23097, 253949, 367483, 171955, 395019, 328518, 288135, 334579, 372823, 297293, 288084, -10946, 13715, 168776, 106517, 114287, -13535, -48273, 64504, 298222, 479030, 320952, 197755, 24147, -25254, 45035, 46496, 94956, 151260, 139095, 161395, 251120, 304990, 260884, 239782, 171799, 218585, 222342, 201292, 88054, -57117, -83252, 119900, -34996, 9151, 151631, 111329, 16886, -99033, 105725, 233259, 200039, -15839, -130957, -183430, 27775, 5639, -73763, 2291, -20281, -12327, -174946, -18334, -46523, -15460]
751a5460J9200J14779J43541k16554J0984j3964q2044k21582J55866J34451j02479
740g3262n5459J08206P079j53981K9245K10422K5600j47055j80077K16330J21631
729A08679q2812J01202k9919q2479j41261N9849J51256R0961M3126j75304q0199
718c6901K5714l35831r0146L6470O1797J30778J15419o2474q7839J24814n8563
707a76762O8277M3533j54661j7329J72780M8349j21587j75220N7312J69951o3827
696a49184m0095P6102J05800P7475p3714q8117J62500o8448k570K05985j01581
685A04153r5353J56431J24854N2981J29407j14129n4482j77303r9384o2089N573
674b9341n9441J44675j5898M1984j90829m3711J02454j4572l9697P0042Q9130
$$ y = [-15460, 3740, 118519, 262060, 45506, 56490, 42526, -39518, -261100, -105234, 29217, -73262, -128721, -20515, -13436, -167417, -138172, 72250, 97850, -49205, -229282, -12952, 108679, 25867, 127069, 97150, 14671, -126590, -66741, 84515, 175476, 218602, 43298, -36901, -11187, -347018, -437164, -400694, -338897, -208119, -92700, -155174, -243013, -118199, -176762, -108485, -64952, -219613, -236942, -64162, -15813, -137400, -312620, -255308, -85357, -149184, -189279, -113177, -7377, 70098, -3616, -91733, 70767, 2319, -251, 205734, 104153, 8800, 165231, 290085, 343066, 472473, 358344, 303862, 126559, 27175, -34914, -29341, -88782, 55893, 39995, 81979, -108850, -152561, -50107, -64679, -104376, -34334, 54796]
663E4796l4606N067j21663j4297J42244k1507k53482J8347n0273O1257M5544J20263
651d8310J9349j52677k18570j5334K52250j14249j4009R119J35641r963R0344
640f6409J65334l59637q6192Q8715o7324P2956m6499J24335J96575K2668Q639
629E3161r242n456j23044M0808M306j01812j13170J11811Q7139N2812m109o5368
617g2164J39672n8987o9663K9504k21532q4852Q1254K00505J2228N2741n3723
606d5017k54540j20511K16410J4523j05138J29218J71150l6418k03925k8155N6357
595b06046j05057L9295J73426p321O2123o0389p7177n3319J67011K95884j43831
584H4599j59513m7968j6380J76549N7843k00838j24161R1592j879L1927P323Q502
$$ y = [54796, 20190, 25257, -96406, -110703, 31541, 10034, -243448, -225101, -275374, -214117, -168573, -48310, -28961, -181638, -400208, -415542, -163292, -277541, -291550, -282431, -146790, -156753, -66409, 98925, -260712, -346904, -258189, -325513, -252557, -299056, -174721, 21854, 44522, 53161, 43919, 38463, -84581, -43773, -39467, -141279, -254449, -142638, -55499, -2687, -6796, -72164, 67508, 8521, -61142, -31638, -253170, -338022, -256768, -56263, -44035, 8706, -45017, -299557, -420068, -203658, -189135, -294273, -165055, 6095, -30323, -234248, -262403, -206046, -311103, -271808, -98382, -105703, -43580, -103969, -181146, -234465, -67454, 228430, 84599, -74914, -122882, -139262, 37287, 95130, -105708, -229869, -138277, -140156, -108229, -100906, -92404]
572i2404k926j39102o1641J46814O7455m4884p2365P4649r238j85023J65543J24837
560b8285q2714Q2672J15570j97954k24417j29557J37681J98713L7366j8921J37942
549B8096q2950j38466j21193J2526L5740K62723J211k4047M4540k82559j94129
538d58508K41704k6318Q5623J45094j42014l7151J27772o3558j8090J7225k11714
527c39935M1512K28175L1903o1020m7214j30187J15819J35877m9066l010k0189
516i7335r3694L216M1028J85546j45201R460p1602K7061j40981L8651P1249q1469
504b54071j8957M7114O6268J3562j98740O4867Q7991P9154n527o1390k6152O5187
492a40694J010m2417O1530j03888J2065O7852R01L5283l4307j81640J1565r032
$$ y = [-92404, -95330, -234432, -296073, -149259, -81804, -126688, -199053, -124404, -133642, -318665, -153122, -28285, -110999, -28327, 87243, -110711, -335128, -464685, -327004, -128291, -90925, -109846, 28096, -54854, -193320, -314513, -301987, -266247, -3524, -2313, -26360, 18180, -264379, -458508, -216804, -243122, -157499, -12405, -154419, -191570, -63798, -127356, -145446, -128221, -339935, -298423, -70248, -38345, -99365, -146579, -276766, -160947, -25070, -74136, -77146, -97335, -191029, -187813, -146785, 38761, -106440, -96980, -168582, -141521, -282502, -243851, -172602, -254071, -273028, -225914, -159646, -146084, -344824, -279957, -191966, -112812, -118339, -179729, -205881, -140694, -139684, -182101, -120571, -224459, -212394, -144542, -143641, -108358, -142665, -324305, -312740, -321772]
480c21772k02696J17383J99328j52705N8356J57570p8812O7201j1110j59276J48739
469a77794p5990k2238K25622m4478j59955M9079J8870P2345O3631o9316j07485
458b27709J41162J22603o8758k54280J3425K3493n2858R0166n6745R0144j7968
447a97325J04620j31149m5000J45044m3096j18104K78395j01154l09194r471J84491
436b41943J60756p2841M9831R232m7369L48241n0343l08771O6300M4187j88650
425b31370l11496J04862L34450O3621j23593K0228j21193r5077P1968O1149j02581
414c29032j02984O0493K74047j47699j27809J19966J3992M9011p9127o8850l1790
403c69782j01942P1106O1226O7030K47338j37808l08343K04889N7522J11108K1818
$$ y = [-321772, -524468, -407085, -207757, -360462, -302106, -144536, -223348, -156147, -167257, -326533, -177794, -253784, -276022, -50400, -94878, -254833, -205754, -186884, -114539, -50908, -120224, -227709, -86547, 36056, -32702, -286982, -273557, -250064, -302922, -212756, -269501, -179357, -197325, -92705, -223854, -268854, -123810, -166906, -285010, -6615, -107769, -416963, -426434, -241943, -81187, -154028, -104197, -94965, -142334, 205907, 155564, -153207, -86907, -42720, -231370, -542866, -438004, -103554, -39933, -163526, -143298, -264491, -359568, -287600, -226451, -329032, -432016, -371523, -97476, -245175, -372984, -253018, -239026, -190015, -269142, -337992, -369782, -471724, -400618, -339392, -272362, -25024, -162832, -471175, -266286, -208764, -97656, -75838]
392g5838r3783n182j14421o4432K36382J28213j08828k14347k153J73685q5785
381b26489n5077P6205J00589j3880o1162j68K6291J751n2295q6827K6733n3908
369c18237m4523O0361l0235Q0093o4242L2180R7669R3055L4697k60812J06365
358b13629L0166j10997k7921J48413J2001j17341O8251L8539r8705N5295J3043
347b02885r4833q0539p0309L981J36420N6374M9901o5208n1329J82274J6095j22340
335b42398p7821j57712J561J12907j42058N5919M1438m6215Q333K26408O2923
324a56715p0315K2279M6575k72686R825L4853J19711L3476j26039l5844N6859
313c38021l0848P9954J35911N108k10272k14626m0105J17821M9165K02779M2173
$$ y = [-75838, -169621, -174803, -289224, -353656, -117274, 10939, -97889, -312236, -314389, -140704, -226489, -281566, -205361, -104772, -118652, -179814, -179982, -153691, -151940, -204235, -291062, -264329, -318237, -362760, -302399, -332634, -252541, -316783, -284603, -186934, -93879, -59182, -319994, -213629, -183463, -294460, -322381, -173968, -161967, -279308, -211057, -172518, -271223, -215928, -202885, -297718, -378257, -448566, -444585, -308165, -251791, -201890, -267098, -318427, -136153, -120058, -242398, -320219, -477931, -476370, -363463, -505521, -449602, -408164, -454379, -446046, -219638, -156715, -227030, -204751, -158176, -430862, -421037, -386184, -266473, -232997, -359036, -394880, -338021, -368869, -288915, -153004, -147896, -358168, -572794, -612899, -495078, -445913, -243134, -200961]
302b00961j43190Q8273N1442M1439J05839O2333k10055Q0624l3872M410l6951
291a90669k5447j50334L8283q936j35240M6531O1956j2154K2668R6249j04096
280c61189q7142J10737o8125Q8580Q730j91388K7524J4952J14977O101l4996p1281
268d42520N688J25567J0364N5627J1502k8091q8873r4457N2135K15260l6545j63716
256c78059j13513J57304m3866J20713k2083j4163J06988N6884R3708j18878o4740
245b19705j09028j19461L504O8039K10774j899j73278p3406J2042J88772R0194
234a23452j25365k1132m3212k2899m1993j77075M1247M7566J41895o3757J7418
223c70759l7249Q076J12909M656j1256j7344R6030J41294P859j36684k17696r3991
$$ y = [-200961, -344151, -255878, -204436, -162997, -57158, 5175, -204880, -124256, -158128, -153718, -190669, -216116, -366450, -328167, -337103, -472343, -425812, -363856, -376010, -353342, -257093, -361189, -448331, -337594, -405719, -317139, -308409, -499797, -472273, -457321, -342344, -336243, -371239, -442520, -436832, -311265, -300901, -245274, -233772, -261863, -350736, -445193, -393058, -177798, -214343, -378059, -491572, -334268, -378134, -257421, -279504, -293667, -186679, -129795, -36087, -154965, -219705, -328733, -448194, -444690, -376651, -165877, -167776, -341054, -414460, -402418, -213646, -123452, -248817, -269949, -313161, -336060, -378053, -555128, -513881, -466315, -324420, -388177, -370759, -408008, -399932, -287023, -282367, -293623, -310967, -214937, -73643, -65784, -202468, -420164, -514155]
211e14155o5694R3296J87008q9644k9516n3910J00946l0908J8711q7100j9838
200d90804J5011o5450R4115J37552o2617l6621j3749k5962J44714O6657L9242
189a97912j22707j65539m8924K0865o9393l419J27212Q4584J14224L7325M6264
178a77420r9656m5932o8541q532N7757J980p007Q3280j3899m4986l8379j21381
166d82716R2247P272J6516j67271J90826n0938l0312J1966l3904n4752l0754n1115
154e82935J16399O5851J57767Q2270j00852j01488L8656K0578k80103n241K49728
143c39370j14643J03562k0781k6696J4275n2100l7958K5583O4546J7366n344O4370
131c07190k3441j29195n8373k7123J37347K16649O0226j81905M3122j15572P2125
$$ y = [-514155, -579849, -486553, -299545, -389189, -418705, -472615, -371669, -402577, -383866, -470966, -490804, -475793, -541243, -447128, -309576, -372193, -408814, -422563, -448525, -303811, -237154, -197912, -320619, -486158, -535082, -514217, -583610, -587029, -459817, -375233, -261009, -223684, -177420, -277076, -323008, -391549, -400081, -342324, -340344, -347351, -264071, -277970, -322956, -361335, -482716, -390469, -383197, -366681, -533952, -343126, -394064, -424376, -412410, -446314, -501066, -531820, -582935, -466536, -400685, -242918, -160648, -261500, -362988, -324332, -303754, -583857, -589098, -339370, -454013, -350451, -371232, -397928, -383653, -435753, -473711, -448128, -383582, -366216, -371560, -307190, -330631, -459826, -518199, -545322, -407975, -191326, -131100, -313005, -269883, -385455, -313330]
120c13330m9098P6489l3681k1243m0643l6860j14884m417P3021m8931q7831J10118
108d91290l0907k22377M0198J38096O5341N15Q401q499j03873p5192J67876P8234
96d33477Q7652k36537j69240j793J54780M6977L1960L2729k4804O643N1203j9315
84d73222L7411N1494q8032q7053P9360Q6517O1415J1737J1431l9118n264J01377
72b51947m4371o2201l5692M6370R5976q6891j39616P21L2922M5326M2786j7741
60c74358j98441m7772n6049R3084Q3759O1327o8366J7987j663L7008L6888q3939
48e00535l523q091K3600j4303J11537k0769j6380R6891j54665m326m6281o97q2527
35f20069j5122o671R5097M5376J02604k3800k217N5064O1555n2540j13700N7261
$$ y = [-313330, -362428, -285939, -319620, -340863, -381506, -418366, -533250, -537667, -464646, -513577, -601408, -491290, -522197, -744574, -704376, -566280, -500939, -500424, -492023, -500522, -604395, -679587, -511711, -433477, -345825, -582362, -751602, -753395, -598615, -551638, -519678, -486949, -511753, -505110, -453907, -473222, -435811, -384317, -472349, -559402, -480042, -393525, -332110, -320373, -308942, -348060, -353324, -251947, -296318, -358519, -394211, -347841, -251865, -338756, -478372, -477651, -444729, -399403, -356617, -374358, -572799, -620571, -676620, -583536, -499777, -438450, -506816, -488829, -490492, -453484, -416596, -500535, -504058, -512149, -488549, -502852, -391315, -412084, -428464, -331573, -486238, -490564, -536845, -537542, -620069, -635191, -641862, -546765, -501389, -398785, -422585, -424802, -369738, -308183, -360723, -474423, -417162]
23d17162K9186J2106m834q1565J1571l3922M6639p6520n7329j9647R8061m8661
11e42077o9149J08362p1136m6320L9535J71554N591r8942p0446r497l1813
0f14338
$$ y = [-417162, -387976, -375870, -380704, -462269, -450698, -484620, -437981, -514501, -571830, -591477, -493416, -542077, -611226, -502864, -574000, -620320, -580785, -409231, -403640, -502582, -573028, -582525, -614338]
$$ Imaginary data points
##PAGE= N=2
##DATA TABLE= (X++(I..I)), XYDATA
16383e256238k500J24803Q5597k9395J34997j2366M867L689L3597J10591K41532
16372d560826N3687p9112M2456J22578J36160O0248J07369J02845J8695p0754
16362d066654R3428J10755N8758Q6039q9317K7737p6006J50320J41836M8274Q6416
16351c428414R0348J1898J9171J83181J94648Q5929Q5622L5200j43963o2761l2622
16340b961763J07114J32489J19149K07658J60553r929k02893N4844K02608J0737
16330b179433J01771J74802k796m9946o1707R3504K62647P9296K1534L8600k5948
16319a547676n5200K19027K047J0996J50062L020j165K35171l6794L1786q2515
16308a071241Q6282P5417o9434M622J92394K05136J25398o4803j32207J83177
$$ y = [-5256238, -5258738, -5133935, -5048338, -5077733, -4942736, -4955102, -4950235, -4946546, -4912949, -4802358, -4560826, -4507139, -4586251, -4543795, -4421217, -4285057, -4224809, -4117440, -4014595, -3995900, -4066654, -3973226, -3862471, -3803713, -3717674, -3806991, -3779254, -3855260, -3704940, -3563104, -3514830, -3428414, -3338066, -3326168, -3306997, -3123816, -2929168, -2843239, -2757617, -2722417, -2866380, -2929141, -2961763, -2854649, -2722160, -2603011, -2395353, -2234800, -2244729, -2447622, -2392778, -2190170, -2179433, -2077662, -1902860, -1905656, -1955602, -2017309, -1923805, -1661158, -1581862, -1560328, -1521728, -1547676, -1602876, -1383849, -1381802, -1370806, -1220744, -1217724, -1218889, -983718, -1020512, -988726, -1071241, -984959, -909542, -978976, -974354, -781960, -576824, -451426, -516229, -648436, -465259]
16298d65259J03613J3152N0545J04371Q6719l5980M4590J05125L8957N7568J2110
16287A15511o0521J8529J65824O3137M1574N4361J5490q584l7476J01679J51678
16276F21202J43545o5192N469o478L8048P5094o120J71293l2688o0363r4024P3931
16264H63717J74734O5079R8811O5671l7435P7386k3115J9917P8112O0254N5553
16253A498684O5049M2342k6152l4800p8973L4049J86432Q9136n3540Q8109O6665
16242A877001R9254J82083o9409n1434J28153N4192j1922j29401r9631R1996J75837
16231B246719j9841M6699m2545J4404K5493J25363j1736j187P9213J03471m6452
16220B519601L7349M4775R1764J49192p3042P3062n4517q8116J4484L047K2609
$$ y = [-465259, -361646, -348494, -297949, -193578, -106859, -142839, -98249, 6876, 45833, 103401, 115511, 54990, 73519, 239343, 302480, 344054, 398415, 413905, 405321, 367845, 469524, 621202, 764747, 699555, 705024, 698546, 736594, 811688, 805568, 976861, 944173, 883810, 789786, 863717, 1038451, 1103530, 1202341, 1268012, 1230577, 1307963, 1284848, 1304765, 1382877, 1443131, 1498684, 1563733, 1606075, 1579923, 1545123, 1466150, 1500199, 1686631, 1775767, 1722227, 1810336, 1877001, 1976255, 2158338, 2088929, 2037495, 2165648, 2219840, 2207918, 2078517, 1978886, 2070882, 2246719, 2226878, 2273577, 2231032, 2245436, 2270929, 2396292, 2384556, 2383369, 2462582, 2566053, 2519601, 2556950, 2601725, 2693489, 2842681, 2769639, 2842701, 2788184, 2700068, 2714552, 2717599, 2740208]
16209B740208L6466P0257j14536J44571J38883N1731O1858l1949m3999L4827j1804
16198C076513q3874L4417N0231P9289n1928O2728j39386l2238R4020M4962K03824
16187C338558J12271j07261k41778R3755Q0993J16592J88701j79186P6121m4544
16177C434222Q0538m703k198K00530l2486j63484K4977j0642J08043Q3312j44616
16166C573493N8262K00686j24222q6451L4283j33761R7417Q1739j59385n1010
16156C491051J60188K29968j83058R3059M6040J05732Q0036M3022p0126Q0210
16146D076122p3895j23547k21225o1742K3081q0632J28995J94100L9924j06840
16136C794341K65938M1147p8240j18847r2217O6667P9413l0993L7065J52201J7318
$$ y = [2740208, 2776674, 2846931, 2732395, 2876966, 3015849, 3067580, 3129438, 3097489, 3053490, 3088317, 3076513, 2992639, 3027056, 3077287, 3156576, 3104648, 3167376, 3027990, 2995752, 3089772, 3134734, 3338558, 3450829, 3343568, 3101790, 3195545, 3276538, 3393130, 3581831, 3402645, 3478766, 3434222, 3514760, 3510057, 3507859, 3708389, 3675903, 3512419, 3537396, 3526754, 3634797, 3718109, 3573493, 3631755, 3832441, 3708219, 3621768, 3656051, 3522290, 3619707, 3701446, 3542061, 3491051, 3651239, 3881207, 3698149, 3791208, 3837248, 3942980, 4023016, 4066038, 3995912, 4076122, 4002227, 3878680, 3657455, 3595713, 3618794, 3538162, 3667157, 3861257, 3901181, 3794341, 4060279, 4101426, 4023186, 3904339, 3812122, 3878789, 3958202, 3927209, 3964274, 4116475, 4133793]
$$ [...]
##END NTUPLES=NMR SPECTRUM
##END=
