##TITLE=1H_EC-3252(II-2)
 CDCl3,8 sc, 
 30.03.2021
##JCAMPDX= 6.0         $$ Bruker NMR JCAMP-DX V2.0
##DATA TYPE= NMR SPECTRUM
##DATA CLASS= NTUPLES
##ORIGIN= UXNMR, Bruker Analytische Messtechnik GmbH
##OWNER= root
$$ XWIN-NMR		Version 3.5
$$ Tue Mar 30 10:07:47 2021 Russian Standard Time (UT+4h)  she@DPX200
##.OBSERVE FREQUENCY= 200.131506
##.OBSERVE NUCLEUS= ^1H
##.ACQUISITION MODE= SIMULTANEOUS
##.ACQUISITION SCHEME= undefined
##.AVERAGES= 8
##.DIGITISER RES= 18
##SPECTROMETER/DATA SYSTEM= spect
##.PULSE SEQUENCE= zg30
##.SOLVENT NAME= D2O
##.SHIFT REFERENCE= (INTERNAL, D2O, 0, 15.9678)
##AUDIT TRAIL= $$ (NUMBER, WHEN, WHO, WHERE, WHAT)
$$ ##TITLE= Audit trail, XWIN-NMR		Version 3.5
$$ ##JCAMPDX= 5.01
$$ ##ORIGIN= Bruker BioSpin GmbH
$$ ##OWNER= she
$$ F:/spectra/data/she/nmr/H-F/1/pdata/1/auditp.txt
$$ ##AUDIT TRAIL=  $$ (NUMBER, WHEN, WHO, WHERE, WHAT)
(   1,<2021-03-30 10:06:31.06 +0400>,<she>,<DPX200>,
      <created by zg, POWCHK disabled, PULCHK disabled
       configuration hash MD5:
       00 E9 B6 7A A2 85 ED C7 34 08 36 98 17 FE 4E 26
       data hash MD5: 16K
       08 DB 6D AC 57 93 CD B6 8D B0 B0 30 DA 28 5E C0>)
(   2,<2021-03-30 10:06:33.59 +0400>,<she>,<DPX200>,
      <Start of raw data processing
       efp BC_mod = 2 LB = 0.24 FT_mod = 6 PKNL = 1 PHC0 = -11126.78 PHC1 = 21.20094 SI = 16K 
       data hash MD5: 16K
       92 8B 64 53 C9 14 69 F7 C7 EB F9 C6 DC E4 B4 64>)
(   3,<2021-03-30 10:06:51.29 +0400>,<she>,<DPX200>,
      <pk PHC0 = 2.25447 PHC1 = -3 
       data hash MD5: 16K
       C4 F4 1A F0 CC 0C 6B E1 25 67 DA BF F9 FD 7D 62>)
(   4,<2021-03-30 10:06:54.90 +0400>,<she>,<DPX200>,
      <abs ABSG = 5 
       data hash MD5: 16K
       09 7D 3C D6 5D B5 E9 E9 1D 5F 95 B1 A1 18 82 8F>)
$$ ##END=
$$ 
$$ hash MD5
$$ 2D 5F 8F 2A C7 E1 0D C8 3B F8 8B C9 AA FD DB 56
##$RELAX= 
##$RELAX= 
##$RELAX= 
##$RELAX= 
##$RELAX= 
##$RELAX= 
$$ Bruker specific parameters
$$ --------------------------
##$DU= <F:/spectra>
##$EXPNO= 1
##$NAME= <H-F>
##$PROCNO= 1
##$TYPE= <nmr>
##$USER= <she>
##$AMP= (0..31)
100 100 100 100 100 100 100 100 100 100 100 100 100 100 100 100 100 100 
100 100 100 100 100 100 100 100 100 100 100 100 100 100 
##$AQSEQ= 0
##$AQ_mod= 1
##$AUNM= <au_zg>
##$AUTOPOS= <>
##$BF1= 200.13
##$BF2= 200.13
##$BF3= 200.13
##$BF4= 200.13
##$BF5= 200.13
##$BF6= 200.13
##$BF7= 200.13
##$BF8= 200.13
##$BYTORDA= 1
##$CFDGTYP= 0
##$CFRGTYP= 5
##$CHEMSTR= <none>
##$CNST= (0..31)
1 1 145 1 1 1 1 1 1 1 1 1 1 1 1 1 1 1 1 1 1 1 1 1 1 1 1 1 1 1 1 1 
##$CPDPRG= <>
##$CPDPRG1= <>
##$CPDPRG2= <>
##$CPDPRG3= <>
##$CPDPRG4= <mlev>
##$CPDPRG5= <mlev>
##$CPDPRG6= <mlev>
##$CPDPRG7= <mlev>
##$CPDPRG8= <mlev>
##$CPDPRGB= <>
##$CPDPRGT= <>
##$D= (0..31)
0 1.2 0 0 0 0 0 0 0 0.06 0 0.03 0 0 0 0 0.0002 0 0 0 0 0 0 0 0 0 0 0 0 
0 0 0 
##$DATE= 1617084390
##$DBL= (0..7)
120 120 120 120 120 120 120 120 
##$DBP= (0..7)
150 150 150 150 150 150 150 150 
##$DBP07= 0
##$DBPNAM0= <>
##$DBPNAM1= <>
##$DBPNAM2= <>
##$DBPNAM3= <>
##$DBPNAM4= <>
$$ [...]
##$SUBNAM3= <"">
##$SUBNAM4= <"">
##$SUBNAM5= <"">
##$SUBNAM6= <"">
##$SUBNAM7= <"">
##$SUBNAM8= <"">
##$SUBNAM9= <"">
##$SW= 16.9725357007746
##$SWIBOX= (0..15)
0 0 2 0 0 0 0 0 0 0 0 0 0 0 0 0 
##$SW_h= 3396.73913043478
##$TD= 16384
##$TD0= 1
##$TE= 0
##$TE2= 300
##$TE3= 300
##$TEG= 300
##$TL= (0..7)
0 120 120 120 120 120 120 120 
##$TP= (0..7)
150 150 150 150 150 150 150 150 
##$TP07= 0
##$TPNAME0= <>
##$TPNAME1= <>
##$TPNAME2= <>
##$TPNAME3= <>
##$TPNAME4= <>
##$TPNAME5= <>
##$TPNAME6= <>
##$TPNAME7= <>
##$TPOAL= (0..7)
0.5 0.5 0.5 0.5 0.5 0.5 0.5 0.5 
##$TPOFFS= (0..7)
0 0 0 0 0 0 0 0 
##$TUNHIN= 0
##$TUNHOUT= 0
##$TUNXOUT= 0
##$USERA1= <user>
##$USERA2= <user>
##$USERA3= <user>
##$USERA4= <user>
##$USERA5= <user>
##$V9= 5
##$VALIST= <valist>
##$VCLIST= <CCCCCCCCCCCCCCC>
##$VD= 0
##$VDLIST= <DDDDDDDDDDDDDDD>
##$VPLIST= <PPPPPPPPPPPPPPP>
##$VTLIST= <TTTTTTTTTTTTTTT>
##$WBST= 1024
##$WBSW= 4
##$XGAIN= (0..3)
0 0 0 0 
##$XL= 0
##$YL= 0
##$YMAX_a= 519576
##$YMIN_a= -508092
##$ZGOPTNS= <>
##$ZL1= 120
##$ZL2= 120
##$ZL3= 120
##$ZL4= 120
##$ABSF1= 15.97403
##$ABSF2= -0.9986324
##$ABSG= 5
##$ABSL= 3
##$ALPHA= 0
##$AQORDER= 0
##$ASSFAC= 0
##$ASSFACI= 0
##$ASSFACX= 0
##$ASSWID= 0
##$AUNMP= <proc_1d>
##$AZFE= 0.1
##$AZFW= 0.1
##$BCFW= 0
##$BC_mod= 2
##$BYTORDP= 0
##$COROFFS= 0
##$CY= -3
##$DATMOD= 1
##$DC= 0
##$DFILT= <>
##$DTYPP= 0
##$F1P= 0
##$F2P= 0
##$FCOR= 1
##$FTSIZE= 16384
##$FT_mod= 6
##$GAMMA= 0
##$GB= 0
##$INTBC= 1
##$INTSCL= 2.992141e-10
##$ISEN= 128
##$LB= 0.24
##$LEV0= 0
##$LPBIN= 0
##$MAXI= 10000
##$MC2= 0
##$MEAN= 0
##$ME_mod= 0
##$MI= 1.114404
##$NCOEF= 0
##$NC_proc= -7
##$NLEV= 6
##$NOISF1= 3.799351
##$NOISF2= 2.8
##$NSP= 0
##$NTH_PI= 0
##$NZP= 0
##$OFFSET= 15.96781
##$PC= 1
##$PHC0= -11124.53
##$PHC1= 18.20094
##$PH_mod= 1
##$PKNL= yes
##$PPARMOD= 0
##$PSCAL= 0
##$PSIGN= 0
##$REVERSE= no
##$SF= 200.130008731019
##$SI= 16384
##$SIGF1= 3
##$SIGF2= 2
##$SINO= 5.538805
##$SIOLD= 16384
##$SREGLST= <1H.CDCl3>
##$SSB= 0
##$STSI= 16384
##$STSR= 0
##$SW_p= 3396.73913043479
##$SYMM= 0
##$S_DEV= 0
##$TDeff= 16384
##$TDoff= 0
##$TI= <>
##$TILT= no
##$TM1= 0
##$TM2= 0
##$TOPLEV= 0
##$USERP1= <user>
##$USERP2= <user>
##$USERP3= <user>
##$USERP4= <user>
##$USERP5= <user>
##$WDW= 1
##$XDIM= 16384
##$YMAX_p= 446005614
##$YMIN_p= -836598
$$ End of Bruker specific parameters
$$ ---------------------------------
##NTUPLES= NMR SPECTRUM
##VAR_NAME=  FREQUENCY,     SPECTRUM/REAL,   SPECTRUM/IMAG
##SYMBOL=    X,             R,               I
##VAR_TYPE=  INDEPENDENT,   DEPENDENT,       DEPENDENT
##VAR_FORM=  AFFN,          ASDF,            ASDF
##VAR_DIM=   16384,         16384,           16384
##UNITS=     HZ,            ARBITRARY UNITS, ARBITRARY UNITS
##FACTOR=    0.207333158178282, 1,           1
##FIRST=     3195.63789009808, 0,            0
##LAST=      -201.101240336709, 0,           0
##MIN=       -201.101240336709, -836598,     0
##MAX=       3195.63789009808, 446005614,    0
$$ Real data points
##PAGE= N=1
##DATA TABLE= (X++(R..R)), XYDATA
$$ [...]
$$ plain form
5183 19978983 20265734 21193317 21448220 21597931 21861519 22024847 21579847 21002292 20196129
5174 20196129 19812235 19926342 19894604 20131453 20496108 20696167 21431972 22324768 23003576 24014762
5164 24014762 25076664 26633776 28538240 30478101 32357631 34362002 36197600 37229779
5156 37229779 37641421 37523215 36568781 34949586 33588873 32258271 30809675 30108054 29566586
5147 29566586 29077002 28517131 27971341 27352236 26764930 26706838 26717406 26800027 26948159 27299632
5137 27299632 27936793 29071703 30614108 31819684 33269722 35111311 37579033 40424713
5129 40424713 43612761 47011204 50735243 53990731 56306667 57464442 57217282 54944193
5121 54944193 51034868 46503426 41876645 38002671 34655914 31446954 29434465 28030550
$$ packed form
5183A9978983K86751R27583K54903J49711K63588J63328m45000n77555q06163
5174B0196129l83894J14107l1738K36849L64655K00059P35805Q92796O78808J011186
5164B4014762J061902J557112J904464J939861J879530K004371J835598J032179
5156C7229779M11642j18206r54434j619195j360713j330602j448596p01621n41468
5147B9566586m89584n59871n45790o19105n87306n8092J0568Q2621J48132L51473
5137B7299632O37161J134910J542405J205576J450038J841589K467722K845680
5129D0424713L188048L398443L724039L255488K315936J157775k47160k273089
5121E4944193l909325m531442m626781l873974l346757l208960k012489j403915
$$ plain form
5113 28030550 26360839 25030958 24266885 23442593 23038612 22540716 22245997 22187684 22089795
5104 22089795 22208576 22450596 22765165 23201533 23768108 24665427 25335368 26250503 27880786
5095 27880786 29034050 30538947 31277044 31999291 32155809 31444984 29703511 27479055 25214916
5086 25214916 22918733 20791007 19221788 17885281 16998488 16142661 15393545 14899855 14233519
5077 14233519 13762748 13462189 13028975 12556728 11959067 11687576 11301087 10921415 10877167 10842277
5067 10842277 10425606 10096539 9843723 9901760 9600755 9302580 9460866 9672360 9702586 9530226
5057 9530226 9409979 9253115 9353803 9238921 9275853 9100886 9117937 9015608 9294598 9287350
5047 9287350 8873960 8502681 8472092 8393804 8149568 8094381 8324087 8480875 8428343 8166854
$$ packed form
5113B8030550j669711j329881p64073q24292m03981m97896k94719n8313r7889
5104B2089795J18781K42020L14569M36368N66575Q97319O69941R15135J630283
5095B7880786J153264J504897P38097P22247J56518p10825j741473k224456k264139
5086B5214916k296183k127726j569219j336507q86793q55827p49116m93690o66336
5077A4233519m70771l00559m33214m72247n97661k71491l86489l79672m4248l4890
5067A0842277m16671l29067k52816N8037l01005k98175J58286K11494L0226j72360
5057I530226j20247j56864J00688j14882L6932j74967J7051j02329K78990p248
5047I287350m13390l71279l0589p8288k44236n5187K29706J56788n2532k61489
$$ plain form
5037 8166854 8168147 7958243 8011415 8063155 8102387 8258752 8087669 8243464 8470228 8918344
5027 8918344 9382683 9263969 9467732 9707146 10190096 10232786 10347931 10521151 10496286 10375785
5017 10375785 9874059 9466936 8881684 8738519 8680688 8561577 8366504 7941968 8063806 7834106
5007 7834106 7675427 7657015 7700886 7814166 7802445 7639580 7761660 7809864 7839957 7852397 7847830
4996 7847830 8016100 8048242 8001892 8078988 8407970 8556555 8777786 8644686 9056952 9267003
4986 9267003 9380125 9517384 9497651 9288403 8922711 8798738 8977821 8930504 8936748 9046508
4976 9046508 8973115 8927708 8931150 8289693 8216428 8407588 8484615 8292776 8391265 8364466 8365707
4965 8365707 8504704 8404266 8604698 8456006 8330332 8530618 8897714 8759608 8809386 8851102
$$ packed form
5037H166854J293k09904N3172N1740L9232J56365j71083J55795K26764M48116
5027H918344M64339j18714K03763K39414M82950M2690J15145J73220k4865j20501
5017A0375785n01726m07123n85252j43165n7831j19111j95073m24536J21838k29700
5007G834106j58679j8412M3871J13280j1721j62865J22080M8204L0093J2440m567
4996G847830J68270L2142m6350P7096L28982J48585K21231j33100M12266K10051
4986I267003J13122J37259j9733k09248l65692j23973J79083m7317O244J09760
4976I046508p3393m5407L442o41457p3265J91160P7027j91839R8489k6799J241
4965H365707J38997j00438K00432j48692j25674K00286L67096j38106M9778M1716
$$ plain form
4955 8851102 9219956 9501660 9283050 9286119 9724279 9922118 9860500 10199196 10146088 10092602
4945 10092602 10256987 10318285 10430671 10768289 10693704 10687002 10821934 11048609 11243527 11481389
4935 11481389 11597311 12116707 12203360 12180802 12462837 12733552 13084731 13124419 13100163 13157695
4925 13157695 13191520 13761902 14078545 14216128 14686899 14990999 15523409 16214722 16932064 17747482
4915 17747482 18516610 19868392 20825366 21707118 23029895 24492260 25513717 26149810 26922665
4906 26922665 26879483 26366471 25526706 24892155 24104013 23098741 22102450 21642806 21434598
4897 21434598 20946894 20760160 20726153 20510482 20801558 20847202 21300443 21995252 22150145 22464209
4887 22464209 23055292 23813511 24917161 26006469 27451832 29063718 30621658 32282502
$$ packed form
4955H851102L68854K81704k18610L069M38160J97839o1618L38696n3108n3486
4945A0092602J64385O1298J12386L37618p4585o702J34932K26675J94918K37862
4935A1481389J15922N19396Q6653k2558K82035K70715L51179L9688k4256N7532
4925A3157695L3825N70382L16643J37583M70771L04100N32410O91313P17342Q15418
4915A7747482P69128J351782R56974Q81752J322777J462365J021457O36093P72855
4906B6922665m3182n13012q39765o34551p88142j005272r96291m59644k08208
4897B1434598m87704j86734l4007k15671K91076M5644M53241O94809J54893L14064
4887B2464209N91083P58219J103650J089308J445363J611886J557940J660844
$$ plain form
4879 32282502 34452968 36423740 38701899 40570185 42568780 43587467 43603154 43357858 42325621
4870 42325621 40444576 37812628 35521027 33156298 30940772 28662762 26909562 25903630
4862 25903630 24318276 23429437 22896815 22097130 21481223 21505912 21288460 21050105 20791638
4853 20791638 20848085 21160787 21445948 22004327 22282151 22988008 23754170 24446736 25240496 26455148
4843 26455148 27649846 28479889 29491985 29894014 30278174 30061300 29169368 27913275 26126937
4834 26126937 24820605 23428452 21778367 20310468 19750638 18943443 17675631 16583318
4826 16583318 15647389 14909187 14435214 13560904 13023420 13035382 12563519 12164936 11927418 11586026
4816 11586026 11360280 11128287 11084661 11154023 11332415 11065003 10991204 10668762 10842547 11048544
$$ packed form
4879C2282502K170466J970772K278159J868286J998595J018687J5687k45296j032237
4870D2325621j881045k631948k291601k364729k215526k278010j753200j005932
4862B5903630j585354q88839n32622p99685o15907K4689k17452k38355k58467
4853B0791638N6447L12702K85161N58379K77824P05857P66162O92566P93760J214652
4843B6455148J194698Q30043J012096M02029L84160k16874q91932j256093j786338
4834B6126937j306332j392153j650085j467899n59830q07195j267812j092313
4826A6583318r35929p38202m73973q74310n37484J1962m71863l98583k37518l41392
4816A1586026k25746k31993m3626O9362J78392k67412p3799l22442J73785K05997
$$ plain form
4806 11048544 11010402 11309919 11367117 11489749 11775265 11658190 11531684 11440653 11167528 10856817
4796 10856817 10302761 9993316 9537995 9207237 8908881 8743506 8634936 8279293 8029485
4787 8029485 7799862 7639367 7293460 7201624 6845496 6843480 6880546 6651197 6495391 6300306
4777 6300306 6032591 5878622 5667691 5506341 5589892 5849326 5653333 5569667 5249414 5310994
4767 5310994 5472100 4905739 4792272 5150174 5328215 5432846 5441173 5431642 5716960 5726877 5505257
4756 5505257 5373587 5413582 5462673 5321166 5009772 4778651 4823628 5059925 4803965 4902801
4746 4902801 4857391 4503652 4644992 4826301 5136316 4804194 4475214 4255847 4038460 4370146
4736 4370146 4241237 4434243 4424922 4536238 4730827 4717399 4521532 4367793 4330288 4228410
$$ packed form
4806A1048544l8142K99517N7198J22632K85516j17075j26506r1031k73125l10711
4796A0856817n54056l09445m55321l30758k98356j65375j08570l55643k49808
4787H029485k29623j60495l45907r1836l56128k016L7066k29349j55806j95085
4777F300306k67715j53969k10931j61350Q3551K59434j95993q3666l20253O1580
4767E310994J61106n66361j13467L57902J78041J04631Q327r531K85318R917k21620
4756E505257j31670L9995M9091j41507l11394k31121M4977K36297k55960R8836
4746D902801m5410l53739J41340J81309L10015l32122l28980k19367k17387L31686
4736D370146j28909J93006r321J11316J94589j3428j95867j53739l7505j01878
$$ plain form
4726 4228410 4061028 4248793 4504785 4450804 4422285 4291742 4449445 4409230 4413380 4432076 4520382
4715 4520382 4636451 4707657 4755942 4614546 4627171 4544559 4332806 4302819 4049061 3935128
4705 3935128 4267252 4399036 4393242 4291874 4249008 4451868 4635619 4503287 4392994 4420828
4695 4420828 4616284 4697407 4480725 4492593 4749221 4418535 4312151 4269955 4389213 4445746
4685 4445746 4663843 4995345 5091151 4999738 4981799 5057088 5073290 5052709 4958426 4886600 4444820
4674 4444820 4655710 4982197 5217451 5172007 5311641 5556917 5385823 5380234 5327433 5684967
4664 5684967 5698845 5326542 5517533 5527930 5385024 5348958 5450917 5704802 5617043 5644971
4654 5644971 5589393 5503287 5575896 5608622 5600853 5540991 5691712 5711583 5757350 5755702 5706664 5751127
$$ packed form
4726D228410j67382J87765K55992n3981k8519j30543J57703m0215M150J8696Q8306
4715D520382J16069P1206M8285j41396J2625q2612k11753k9987k53758j13933
4705C935128L32124J31784n794j01368m2866K02860J83751j32332j10293K7834
4695D420828J95456Q1123k16682J1868K56628l30686j06384m2196J19258N6533
4685D445746K18097L31502R5806r1413j7939P5289J6202k0581r4283p1826m41780
4674D444820K10890L26487K35254m5444J39634K45276j71094n589n2801L57534
4664E684967J3878l72303J90991J0397j42906l6066J01959K53885q7759K7928
4654E644971n5578q6106P2609L2726p769n9862J50721J9871M5767j648m9038M4463
$$ plain form
4642 5751127 5778706 5966670 6200377 6438009 6464196 6202550 6116198 5903299 5885877 6079451
4632 6079451 5886734 6024011 5842312 5980097 6214464 6341462 6140384 6489717 6641491 6742012
4622 6742012 7064061 6980321 6965442 6956521 7292119 7194090 7095267 7165101 7250842 7297782 7137135
4611 7137135 7251914 7246395 7292603 7014920 7045532 7155696 7202761 7390416 7622804 7751858
4601 7751858 7761424 7867467 7781783 8000908 8017775 8070661 8355521 8360806 8200479 8745049 9027402
4590 9027402 9174366 9243626 9317886 9022731 9289114 9564659 9587104 9587610 9801563 10156321 10214503
4579 10214503 10054905 9850493 9700369 10182065 10558624 10536396 10414927 10472482 10878035 11236906
4569 11236906 11320213 11775993 11890395 11807970 12016811 12069326 12336300 12561020 12731858 12597985
$$ packed form
4642E751127K7579J87964K33707K37632K6187k61646q6352k12899j7422J93574
4632F079451j92717J37277j81699J37785K34367J26998k01078L49333J51774J00521
4622F742012L22049q3740j4879q921L35598r8029r8823O9834Q5741M6940j60647
4611G137135J14779n519M6208k77683L0612J10164M7065J87655K32388J29054
4601G751858R566J06043q5684K19125J6867N2886K84860N285j60327N44570K82353
4590I027402J46964O9260P4260k95155K66383K75545K2445N06K13953L54758N8182
4579A0214503j59598k04412j50124M81696L76559k2228j21469N7555M05553L58871
4569A1236906Q3307M55780J14402q2425K08841N2515K66974K24720J70838j33873
$$ plain form
4559 12597985 12387930 12318430 12654524 12814878 12916054 12865062 12951116 13409503 13903939 14002725
4549 14002725 14070407 14569598 14791205 14566853 14855572 15171034 15195698 15214427 15126086 15607671
4539 15607671 16067718 16564672 16943763 17311830 17540224 17920941 18516677 18913506 19137129
4530 19137129 19652131 20048957 20394792 20965384 21425497 21639206 21668792 22260520 22809524 23317267
4520 23317267 23999291 24984403 25872549 26465740 27262818 28406240 29264089 30634376 31866315
4511 31866315 32972269 34623816 36383232 38327159 40108169 42557351 44897522 47926725
4503 47926725 51162394 54425022 58016692 61909190 66071335 70425164 74863621 79099867
4495 79099867 83232091 87065897 90481238 93697756 96064853 97550760 98909486 99111146
$$ packed form
4559A2597985k10055o9500L36094J60354J01176n0992Q6054M58387M94436R8786
4549A4002725O7682M99191K21607k24352K88719L15462K4664J8729q8341M81585
4539A5607671M60047M96954L79091L68067K28394L80717N95736L96829K23623
4530A9137129N15002L96826L45835N70592M60113K13709K9586N91728N49004N07743
4520B3317267O82024R85112Q88146N93191P97078J143422Q57849J370287J231939
4511C1866315J105954J651547J759416J943927J781010K449182K340171L029203
4503D7926725L235669L262628L591670L892498M162145M353829M438457M236246
4495G9099867M132224L833806L415341L216518K367097J485907J358726K01660
$$ plain form
4487 99111146 98259731 96484459 94323360 91835328 89524436 87593752 86201167 85062723
4479 85062723 84463151 84238214 84381212 85163636 86395956 88076093 89971952 91995088 93755442
4470 93755442 95475846 96899114 97582495 97435256 96402989 94076048 90740972 86373376
4462 86373376 81837917 77368004 73211684 69142083 64478943 60055316 56058275 52269138
4454 52269138 48168290 44706928 41758373 39043112 36465183 34437231 32566233 31020606
4446 31020606 29591880 28485145 27447410 26250404 24995435 24145878 23321281 22619052 22129871
4437 22129871 21238041 20437994 19835128 19152129 18677975 18311576 17840003 17229297 16996955
4428 16996955 16429311 16139661 15853229 15890000 15509797 15025715 14614281 14216818 14060727 13894924
$$ packed form
4487I9111146q51415j775272k161099k488032k310892j930684j392585j138444
4479H5062723n99572k24937J42998P82424J232320J680137J895859K023136J760354
4470I3755442J720404J423268O83381j47239j032267k326941l335076m367596
4462H6373376m535459m469913m156320m069601m663140m423627l997041l789137
4454E2269138m100848l461362k948555k715261k577929k027952j870998j545627
4446C1020606j428726j106735j037735j197006j254969q49557q24597p02229m89181
4437B2129871q91830q00047o02866o82999m74154l66399m71573o10706k32342
4428A6996955n67644k89650k86432L6771l80203m84082m11434l97463j56091j65803
$$ plain form
4418 13894924 13851533 13509266 13331404 13334219 13474853 13163433 12981284 12772995 12761694 12671518
4408 12671518 12487868 12331696 11946400 11677714 11476433 11199360 11609759 11703746 11626603 11628307
4398 11628307 11397060 11581750 11498875 11589577 11740753 12058785 12132163 12023487 12268537 12606144
4388 12606144 13068364 13087093 13438465 13560738 13404417 13199809 12896526 12322617 11839014 11401375
4378 11401375 11090894 10849502 10517088 10304922 9981175 9444846 9405430 8939989 8705205 8674207
4368 8674207 8498233 8606373 8757095 8383082 8345354 8322446 8078035 7927913 7733415 7712376
4358 7712376 7913931 8023775 8046919 7806542 7663570 7804038 7780885 7821802 7763251 7706593
4348 7706593 7732900 7855606 7644551 7748392 7947116 7948340 8268881 8291231 8289383 8049983 7833258
$$ packed form
4418A3894924m3391l42267j77862K815J40634l11420j82149k08289j1301r0176
4408A2671518j83650j56172l85296k68686k01281k77073M10399R3987p7143J704
4398A1628307k31247J84690q2875R0702J51176L18032P3378j08676K45050L37607
4388A2606144M62220J8729L51372J22273j56321k04608l03283n73909m83603m37639
4378A1401375l10481k41392l32414k12166l23747n36329l9416m65441k34784l0998
4368H674207j75974J08140J50722l74013l7728k2908k44411j50122j94498k1039
4358G712376K01555J09844K3144k40377j42972J40468k3153M0917n8551n6658
4348G706593K6307J22706k11055J03841J98724J224L20541K2350j848k39400k16725
$$ plain form
4337 7833258 7542003 7456497 7265395 7137842 6930766 6929229 7094452 7159963 7349798 7147759
4327 7147759 6846809 6960231 6909265 6665818 6792875 6813013 6790733 6938581 6999751 6981028
4317 6981028 6808412 6949546 7086822 6823009 7169756 7338594 7665113 7834851 7770016 7613758
4307 7613758 7547942 7767381 7694481 7616392 7652279 7514081 7156881 7194762 6988039 6955309 6844126
4296 6844126 6782845 6845035 6686849 6885437 6735598 6710575 6862123 7061552 6855584 6804234
4286 6804234 6792626 7167310 7244781 7369543 7307987 7384142 7482427 7622215 7966459 8144492
4276 8144492 8368278 8765496 8892382 9070708 9477314 9587886 9867139 9947874 10188293 10587112
4266 10587112 11128039 11665684 11903187 12006485 11743516 11014070 10163606 9399057 8987313
$$ packed form
4337G833258k91255q5506j91102j27553k07076j537J65223O5511J89835k02039
4327G147759l00950J13422n0966k43447J27057K0138k2280J47848O1170j8723
4317F981028j72616J41134J37276k63813L46747J68838L26519J69738o4835j56258
4307G613758o5816K19439p2900p8089L5887j38198l57200L7881k06723l2730j11183
4296F844126o1281O2190j58186J98588j49839k5023J51548J99429k05968n1350
4286F804234j1608L74684P7471J24762o1556P6155R8285J39788L44244J78033
4276H144492K23786L97218J26886J78326M06606J10572K79253Q0735K40419L98819
4266A0587112N40927N37645K37503J03298k62969p29446q50464p64549m11744
$$ plain form
4257 8987313 8908957 8843878 8687717 8491289 8102998 7925206 8111570 7991378 8129918 8108743
4247 8108743 8155523 8072748 7785747 7760748 7824244 8036950 8144420 8189714 8305493 8291733 8249742
4236 8249742 8220832 8221326 8296691 8394333 8340030 8730647 8942017 8696484 8555767 8439320 8461929
4225 8461929 8428102 7996284 7762640 7750601 7546366 7557512 7869232 7811214 7527756 7672863
4215 7672863 7607167 7601429 7643814 7647770 7456758 7783461 7680648 7412652 7744306 7639452 7724583
4204 7724583 7976024 8218435 8133459 8405897 8545374 8412757 8586415 8938099 9102066 9032706
4194 9032706 9200750 9228712 9331752 9516657 9706681 9534864 9409656 9521254 9906458 10131790
4184 10131790 10458407 10831619 11234860 11467180 11573911 11814153 12027331 11898715 11424752
$$ packed form
4257H987313p8356o5079j56161j96428l88291j77792J86364j20192J38540k1175
4247H108743M6780q2775k87001k4999O3496K12706J07470M5294J15779j3760m1991
4236H249742k8910M94P5365R7642n4303L90617K11370k45533j40717j16447K2609
4225H461929l3827m31818k33644j2039k04235J1146L11720n8018k83458J45107
4215G672863o5696n738M2385L956j91012L26703j02813k67996L31654j04854Q5131
4204G724583K51441K42411q4976K72438J39477j32617J73658L51684J63967o9360
4194I032706J68044K7962J03040J84905J90024j71817j25208J11598L85204K25332
4184A0131790L26617L73212M03241K32320J06731K40242K13178j28616m73963
$$ plain form
4175 11424752 10806373 10419410 9897551 9522578 9529515 9287624 8811364 8821986 8735959 8783042
4165 8783042 9093854 8930443 9073533 9015850 9068398 8941182 8601108 8596813 8558378 8764706
4155 8764706 8586654 8493993 8853386 8887180 8925235 8942208 8397165 7853665 7813534 7810695 7756990
4144 7756990 7555171 7165747 7441676 7352663 7637810 7739296 7526699 7654954 7676868 7789152
4134 7789152 7944933 8031267 8176478 8511886 8583795 8697216 8944998 9102511 9137198 9614259
4124 9614259 9852179 9977099 10135696 10187136 10174486 10363814 10346834 10325175 10148796 9715980
4114 9715980 9225437 8967188 8360787 7952419 7742038 7469873 7340990 7116857 6994312 6613778
4104 6613778 6716386 6530972 6519269 6091473 6115795 6444549 6022759 5735326 5697412 5747127
$$ packed form
4175A1424752o18379l86963n21859l74973O937k41891m76260J0622q6027M7083
4165H783042L10812j63411J43090n7683N2548j27216l40074m295l8435K06328
4155H764706j78052r2661L59393L3794L8055J6973n45043n43500m0131k839n3705
4144G756990k01819l89424K75929q9013K85147J01486k12597J28255K1914J12284
4134G789152J55781Q6334J45211L35408P1909J13421K47782J57513L4687M77061
4124I614259K37920J24920J58597N1440j2650J89328j6980k1659j76379m32816
4114I715980m90543k58249o06401m08368k10381k72165j28883k24133j22545l80534
4104F613778J02608j85414j1703m27796K4322L28754m21790k87433l7914M9715
$$ plain form
4094 5747127 5729408 5776714 5649717 5537513 5789874 5792949 5823537 5990199 5843867 5478349
4084 5478349 5467532 5735765 5785158 5799546 5720679 5733943 5524250 5757654 5532285 5759339
4074 5759339 5708172 5542986 5534887 5410160 5518425 5673813 5504359 5337512 5416155 5434647
4064 5434647 5457240 5442575 5666771 5761384 5559717 5711464 5617047 5421709 5502969 5367693
4054 5367693 5568570 5562459 5394130 5368524 5585871 5653725 5506903 5664088 5827017 5842564
4044 5842564 5595185 5357312 5570330 5422282 5240138 5601849 5656554 5374352 5562185 5593214
4034 5593214 5665078 5535476 5714954 5688373 5564950 5538051 5685869 5451020 5655276 5824948
4024 5824948 5771513 5971629 5587796 5708904 5834532 5874555 5962228 5856921 5740946 5662361
$$ packed form
4094E747127j7719M7306j26997j12204K52361L075L0588J66662j46332l65518
4084E478349j0817K68233M9393J4388p8867J3264k09693K33404k25369K27054
4074E759339n1167j65186q099j24727J08265J55388j69454j66847P8643J8492
4064E434647K2593j4665K24196R4613k01667J51747r4417j95338Q1260j35276
4054E367693K00877o111j68329k5606K17347O7854j46822J57185J62929J5547
4044E842564k47379k37873K13018j48048j82144L61711N4705k82202J87833L1029
4034E593214P1864j29602J79478k6581j23423k6899J47818k34849K04256J69672
4024E824948n3435K00116l83833J21108J25628M0023Q7673j05307j15975p8585
$$ plain form
4014 5662361 5813095 6041746 6185538 6156713 6202427 6513315 6388306 6306482 6231568 6330926
4004 6330926 6650268 6784445 6771549 6813214 6964897 7192530 7054576 6752656 6707774 6550817
3994 6550817 6071158 6069112 6357881 6433915 6334976 6462672 6414330 6372866 6606723 6560223 6486546
3983 6486546 6512262 6593722 6716422 6651446 6688249 6829478 7020723 6945300 6972599 6796744 6930116
3972 6930116 7165624 7197627 6828086 6725430 7164580 7225653 7391394 7571339 7442753 7352003
3962 7352003 7370906 7203963 7158353 7563814 8061936 8015526 7946332 7655054 7613365 7700955 8093743
3951 8093743 8038180 8230855 8802075 9077643 8826354 8393202 8560225 8638785 8326715 8275689
3941 8275689 8498811 8907865 8883847 9155450 9376302 9360369 9237029 9367312 9502441 9447157
$$ packed form
4014E662361J50734K28651J43792k8825M5714L10888j25009q1824p4914R9358
4004F330926L19342J34177j2896M1665J51683K27633j37954l01920m4882j56957
3994F550817m79659k046K88769P6034r8939J27696m8342m1464K33857m6500p3677
3983F486546K5716Q1460J22700o4976L6803J41229J91245p5423K7299j75855J33372
3972F930116K35508L2003l69541j02656M39150O1073J65741J79945j28586r0750
3962G352003J8903j66943m5610M05461M98122m6410o9194k91278m1689Q7590L92788
3951H093743n5563J92675N71220K75568k51289m33152J67023P8560l12070n1026
3941H275689K23122M09054k4018K71603K20852j5933j23340J30283J35129n5284
$$ plain form
3931 9447157 9665023 9895520 10142622 10151215 10098679 9989413 10040371 10163552 10141198 10100535 10421708
3920 10421708 10783934 11041966 11085598 11461404 11542889 11671133 11714567 11702715 11557776 11677514
3910 11677514 11880696 12217028 12442232 12622861 12555059 12545373 12790514 13147714 13588830 13990993
3900 13990993 14276360 14307479 14108791 13829505 13594853 13145258 12250849 11727885 11378791 11042532
3890 11042532 10932599 10683890 10807318 10733801 10357353 10372541 10363717 10599394 10578221 10143697
3880 10143697 10156330 10148683 10168657 10024185 10141399 10701276 10710288 10779181 10706788 10541622 10683594
3869 10683594 10550265 10456271 10473151 10926452 10977178 11227441 11480357 11549413 11848073 12025373
3859 12025373 11996859 12292465 12378389 12716457 12669756 12514526 12569224 12908494 13109046 13207811
$$ packed form
3931I447157K17866K30497K47102Q593n2536j09266N0958J23181k2354m0663L21173
3920A0421708L62226K58032M3632L75806Q1485J28244M3434j1852j44939J19738
3910A1677514K03182L36332K25204J80629o7802r686K45141L57200M41116M02163
3900A3990993K85367L1119j98688k79286k34652m49595q94409n22964l49094l36259
3890A1042532j09933k48709J23428p3517l76448J5188q824K35677k1173m34524
3880A0143697J2633p647J9974j44472J17214N59877R012O8893p2393j65166J41972
3869A0683594j33329r3994J6880M53301N0726K50263K52916O9056K98660J77300
3859A2025373k8514K95606Q5924L38068m6701j55230N4698L39270K00552R8765
$$ plain form
3849 13207811 13345704 13599931 13719079 14253098 14683425 15280791 15674030 16360130 16794390
3840 16794390 17340802 17948072 18003478 17882640 17874197 18109040 18367436 18500588 18539883 18909263
3830 18909263 19202868 19536022 19840707 20252927 20032463 20324515 20332076 20144193 20065293 19955535
3820 19955535 20194845 20045155 19945738 20368452 20262785 20262371 20753907 21111922 21511576 21928307
3810 21928307 22540595 23584631 24135553 24553470 24934241 24985500 25154980 25565113 25369277
3801 25369277 25377857 25512474 25817741 26469847 26906945 27173376 27694297 28291453 28757241 29139286
3791 29139286 29780437 30262153 30397257 30987278 31605891 31802886 31795883 32149019 32550770 32769684
3781 32769684 33042676 33223891 33808020 34517011 35187690 35836157 36461763 36741118 37470378
$$ packed form
3849A3207811J37893K54227J19148N34019M30327N97366L93239O86100M34260
3840A6794390N46412O07270N5406j20838q443K34843K58396J33152L9295L69380
3830A8909263K93605L33154L04685M12220k20464K92052P561j87883p8900j09758
3820A9955535K39310j49690r9417M22714j05667m14M91536L58015L99654M16731
3810B1928307O12288J044036N50922M17917L80771N1259J69480M10133j95836
3801B5369277Q580J34617L05267O52106M37098K66431N20921N97156M65788L82045
3791B9139286O41151M81716J35104N90021O18613J96995p003L53136M01751K18914
3781C2769684K72992J81215N84129P08991O70679O48467O25606K79355P29260
$$ plain form
3772 37470378 37776321 38125729 38718851 39302135 39901510 40782863 41537609 42059687 42960805
3763 42960805 43605661 44775378 45833697 46765127 47996744 48763406 49736705 51000092 52414469
3754 52414469 53702842 54983578 56429165 57735994 59437843 61209286 62989309 64844607
3746 64844607 66665002 68622298 70397945 72175700 74130738 76149458 78191212 80015933
3738 80015933 82158910 84146037 86397953 88724300 91375259 94174030 97308960 100117457
3730 100117457 102827086 106089625 109171023 112004249 115395441 119264470 123271835 127997942
3722 127997942 132808451 137828021 142696400 148371265 154494978 160570524 166736990 172652998
3714 172652998 178610705 184130604 189154399 193263411 196610943 199301851 200443765 200249806
$$ packed form
3772C7470378L05943L49408N93122N83284N99375Q81353P54746N22078R01118
3763D2960805O44856J169717J058319R31430J231617P66662R73299J263387J414377
3754E2414469J288373J280736J445587J306829J701849J771443J780023J855298
3746F4844607J820395J957296J775647J777755J955038K018720K041754J824721
3738H0015933K142977J987127K251916K326347K650959K798771L134930K808497
3730A00117457K709629L262539L081398K833226L391192L869029M007365M726107
3722A27997942M810509N019570M868379N674865O123713O075546O166466N916008
3714A72652998N957707N519899N023795M109012L347532K690908J141914j93959
$$ plain form
3706 200249806 198960939 196300884 192998080 189066536 184039566 178398149 172472765 166300617
3698 166300617 159770646 153039691 145985480 138667105 131420698 124208423 117481616 111230249
3690 111230249 105912227 101563984 98498888 96093830 94212566 93043507 92097972 91101952
3682 91101952 89538014 87255281 84142902 79933587 74999744 70574495 66675306 63320945
3674 63320945 60323232 58067175 56081287 54034790 52269538 50766181 49526447 48444987
3666 48444987 47092765 45876364 44954937 44331806 44028526 43432824 42970580 42643582 42152044
3657 42152044 41113070 39850227 39100586 38423724 37223381 36223860 35220073 34714100 33731702
3648 33731702 33090184 32551219 31881574 31535341 31173175 30214985 29736780 29483104 29108614
$$ packed form
3706B00249806j288867k660055l302804l931544n026970n641417n925384o172148
3698A66300617o529971o730955p054211p318375p246407p212275o726807o251367
3690A11230249n318022m348243l065096k405058j881264j169059r45535r96020
3682I1101952j563938k282733l112379m209315m933843m425249l899189l354361
3674F3320945k997713k256057j985888k046497j765252j503357j239734j081460
3666D8444987j352222j216401r21427o23131l03280n95702m62244l26998m91538
3657D2152044j038974j262843p49641o76862j200343r99521j003787n05973r82398
3648C3731702o41518n38965o69645l46233l62166r58190m78205k53676l74490
$$ plain form
3639 29108614 29062866 28715697 28276784 27623263 27144387 27037764 26925321 26699337 26489251 26186382
3629 26186382 26066474 26029492 26018309 26242356 26278763 26178803 26252652 26364193 26518958 26567585
3619 26567585 26362954 25998921 26012493 25732957 25163936 24920355 24450280 24161791 24219259 24590876
3609 24590876 24603933 24317914 24487057 24550262 24291926 24105065 23944994 23787019 23668914 23609119
3599 23609119 23285881 22939805 23283284 23618353 23777564 23860794 24125613 24583993 24899843 25376152
3589 25376152 25621345 25649343 25947645 26261654 26525582 26045967 25834850 25430662 25003591 24433657
3579 24433657 23976059 23850605 23679310 23417926 23359292 23239081 23241246 23418697 23514359 23684294
3569 23684294 23348240 23047999 23091211 23199401 23514349 23643494 23569496 23791981 24243489 24153825
$$ packed form
3639B9108614m5748l47169m38913o53521m78876j06623j12443k25984k10086l02869
3629B6186382j19908l6982j1183K24047L6407r9960P3849J11541J54765M8627
3619B6567585k04631l64033J3572k79536n69021k43581m70075k88489N7468L71617
3609B4590876J3057k86019J69143O3205k58336j86861j60071j57975j18105n9795
3599B3609119l23238l46076L43479L35069J59211Q3230K64819M58380L15850M76309
3589B5376152K45193K7998K98302L14009K63928m79615k11117m04188m27071n69934
3579B4433657m57598j25454j71295k61384n8634j20211K165J77451R5662J69935
3569B3684294l36054l00241M3212J08190L14948J29145p3998K22485M51508q9664
$$ plain form
3559 24153825 24289791 24599431 24818684 24977638 25104542 25532490 25595902 25909862 26021142 26043231
3549 26043231 26405008 26526520 26337972 26138037 26551270 26565891 26515288 26991528 27145113 27277323
3539 27277323 27342833 27338503 27821005 28178769 28679277 28746248 29063729 29564742 29932345 30398690
3529 30398690 30899990 31592824 32725880 33663867 34573000 35357765 36601716 38129556 39286086
3520 39286086 40448091 41784576 42801570 43593866 44024028 43899618 43725608 43560092 43089992
3511 43089992 42690995 42538808 42155559 41994803 42145890 42624834 43003509 43341965 43367006 44031597
3501 44031597 44548365 44675057 45434843 46197838 47024998 47992781 48787895 49466015 50457636
3492 50457636 51602748 52806986 54868345 56856310 58926247 61302075 63544157 65458860
$$ packed form
3559B4153825J35966L09640K19253J58954J26904M27948O3412L13960J11280K2089
3549B6043231L61777J21512j88548j99935M13233J4621n0603M76240J53585J32210
3539B7277323O5510m330M82502L57764N00508O6971L17481N01013L67603M66345
3529C0398690N01300O92834J133056R37987R09133P84765J243951J527840J156530
3520C9286086J162005J336485J016994P92296M30162j24410j74010j65516m70100
3511D3089992l98997j52187l83249j60756J51087M78944L78675L38456K5041O64591
3501D4031597N16768J26692P59786P62995Q27160R67783P95114O78120R91621
3492E0457636J145112J204238K061359J987965K069937K375828K242082J914703
$$ plain form
3484 65458860 67546024 68494083 69154438 68866394 67612410 66062841 64566710 62975216 61577186
3475 61577186 60738692 59990506 59482430 59027387 59216242 59680047 60169176 60732076 61144332
3466 61144332 61880141 62687739 63754553 64912746 66552878 68101325 70008404 72187881
3458 72187881 74130948 76102655 77931455 79803592 81729879 83773214 86142338 88378600
3450 88378600 91026037 93780641 96271332 98437328 100665021 103037320 105634417 108401143
3442 108401143 112026292 116826246 121544508 127227201 134290561 142220409 151537163 162638989
3434 162638989 175580938 190149713 205265861 220494782 233749221 243775692 250236132
3427 250236132 251261874 247690219 241188576 234702555 230963348 230714950 233430931 237402628
$$ packed form
3484F5458860K087164R48059O60355k88044j253984j549569j496131j591494j398030
3475F1577186q38494p48186n08076m55043J88855M63805M89129N62900M12256
3466F1144332P35809Q07598J066814J158193J640132J548447J907079K179477
3458G2187881J943067J971707J828800J872137J926287K043335K369124K236262
3450H8378600K647437K754604K490691K165996K227693K372299K597097K766726
3442A08401143L625149M799954M718262N682693P063360P929848R316754J1101826
3434A62638989J2941949J4568775J5116148J5228921J3254439J0026471O460440
3427B50236132J025742l571655o501643o486021l739207k48398K715981L971697
$$ plain form
3419 237402628 241672976 243125004 239252220 227765807 210490297 190799588 171940649
3412 171940649 155741083 142512320 132151855 123981405 117186390 111294843 106746512 102880628
3404 102880628 99265987 96268029 93457233 90715823 88181772 85660324 83474991 81975086
3396 81975086 80099759 78332455 76988532 75966373 75053884 74073510 73252857 72539411 72376480
3387 72376480 72218574 71796800 72031177 72397582 72647599 73171206 74243950 75212427 76315260
3378 76315260 77240906 78397614 79799890 81444169 83140551 85284184 87923190 90872520
3370 90872520 94134130 96802975 99643577 102195523 104161685 105012045 104598509 103646889 102394096
3361 102394096 100909788 99476050 98684385 98008622 98275452 99327888 100660563 102523509
$$ packed form
3419B37402628M270348J452028l872784j1486413j7275510j9690709j8858939
3412A71940649j6199566j3228763j0360465q170450o795015n891547m548331l865884
3404A02880628l614641k997958k810796k741410k534051k521448k185333j499905
3396H1975086j875327j767304j343923j022159r12489r80374q20653p13446j62931
3387G2376480j57906m21774K34377L66405K50017N23607J072744R68477J102833
3378G6315260R25646J156708J402276J644279J696382K143633K639006K949330
3370I0872520L261610K668845K840602K551946J966162Q50360m13536r51620j252793
3361A02394096j484308j433738p91665o75763K66830J052436J332675J862946
$$ plain form
3353 102523509 104578045 107219798 110203511 113663698 117265950 120995981 125228223 129695493
3345 129695493 134150968 138798629 144186399 150017496 157185765 165855497 175142596 185535699
3337 185535699 197282825 209417589 221137067 232250624 241713991 248102050 250800301
3330 250800301 250916019 249490759 247545604 247436341 249044990 253074942 260890613 272303785
3322 272303785 287503390 306581964 327926483 349360689 368265026 382239657 389128714
3315 389128714 386754533 375328223 355533593 329905695 300901231 271651249 244579193
3308 244579193 221498990 202658431 187870786 176302098 167773712 160851881 154664428
3301 154664428 148760563 143109449 136895463 130156995 123238779 116317295 110086822 104362001
$$ packed form
3353A02523509K054536K641753K983713L460187L602252L730031M232242M467270
3345A29695493M455475M647661N387770N831097P168269Q669732R287099J0393103
3337A85535699J1747126J2134764J1719478J1113557R463367O388059K698251
3330B50800301J15718j425260j945155j09263J608649M029952P815671J1413172
3322B72303785J5199605J9078574K1344519K1434206J8904337J3974631O889057
3315C89128714k374181j1426310j9794630k5627898k9004464k9249982k7072056
3308B44579193k3080203j8840559j4787645j1568688q528386o921831o187453
3301A54664428n903865n651114o213986o738468o918216o921484o230473n724821
$$ plain form
3293 104362001 99392595 95085222 91117004 87364611 84227684 81314324 78845439 76299057
3285 76299057 74177856 72176822 70621020 69585059 67822442 66437008 65288764 64160810
3277 64160810 63477115 62694553 61733712 61236453 60721912 60024713 59624315 59420466 58829530
3268 58829530 58499544 58110105 57623936 57293675 56756850 56439900 56549779 56481945 55914477 55809715
3258 55809715 55479444 55514971 55505434 55199955 55023747 54638035 54127174 53271220 52584208 52287571
3248 52287571 51840261 51288825 51454734 51694751 51892510 52276915 53128267 53911367 55157379
3239 55157379 56699030 58220859 59957992 61930525 64265499 66924008 69645806 71760701
3231 71760701 73648475 75122603 76918484 78459664 79610734 81156014 83252056 86303175
$$ packed form
3293A04362001m969406m307373l968218l752393l136927k913360k468885k546382
3285G6299057k121201k001034j555802j035961j762617j385434j148244j127954
3277F4160810o83695p82562r60841m97259n14541o97199m00398k03849n90936
3268E8829530l29986l89439m86169l30261n36825l16950J09879o7834n67468j04762
3258E5809715l30271L5527r537l05479j76208l85712n10861q55954o87012k96637
3248E2287571m47310n51436J65909K40017J97759L84405Q51352P83100J246012
3239E5157379J541651J521829J737133J972533K334974K658509K721798K114895
3231G1760701J887774J474128J795881J541180J151070J545280K096042L051119
$$ plain form
3223 86303175 90272359 94898164 99898729 104929108 108895338 110653136 109486589 104590195
3215 104590195 97528936 90052814 83617495 78396839 74385544 71284699 68976786 67401637
3207 67401637 65995726 64893164 64059374 63244789 62709765 62467050 62268661 62048484 62140829
3198 62140829 62231292 62518222 62703728 62846342 63085989 63242260 63371460 63439445 63488621 63278491
3188 63278491 63141186 62902236 62712420 62083039 61157444 60739126 60299138 60074853 59585677
3179 59585677 59132527 58073581 57491514 57238022 57202062 57160390 57453066 58280300 59063376 60315568
3169 60315568 61828307 63481351 65034569 66694366 68519246 70412654 72066498 74006903
3161 74006903 76051697 78238690 80001793 81511051 82367723 83185044 83623076 83747935 83113813
$$ packed form
3223H6303175L969184M625805N000565N030379L966230J757798j166547m896394
3215A04590195p061259p476122o435319n220656m011295l100845k307913j575149
3207F7401637j405911j102562q33790q14585n35024k42715j98389k20177R2345
3198F2140829R0463K86930J85506J42614K39647J56271J29200O7985M9176k10130
3188F3278491j37305k38950j89816o29381r25595m18318m39988k24285m89176
3179E9585677m53150j058946n82067k53492l5960m1672K92676Q27234P83076J252192
3169F0315568J512739J653044J553218J659797J824880J893408J653844J940405
3161G4006903K044794K186993J763103J509258Q56672Q17321M38032J24859o34122
$$ plain form
3152 83113813 82412980 81223531 79351610 77171824 75126000 73705476 72200923 70830767
3144 70830767 69840302 68736683 67911951 67194930 66352630 65588511 65640716 65737441 65698625 66206706
3134 66206706 66981504 67953961 69328701 70957190 73018042 75314190 77538232 79655330
3126 79655330 82336054 85053108 88385348 92510636 96332155 100009411 103415967 106588302
3118 106588302 107776399 106687802 102696414 96634278 89876149 83384697 77625114 73013672
3110 73013672 69101798 66139813 64166506 62606159 61387379 60169818 59167889 58124076
3102 58124076 57294994 56448741 55819577 54984935 54539349 54576287 54479928 54882654 55556980 56647632
3092 56647632 57782757 59547017 61518188 63737660 66105193 68524096 70583403 71540992
$$ packed form
3152H3113813p00833j189449j871921k179786k045824j420524j504553j370156
3144G0830767r90465j103619q24732p17021q42300p64119N2205R6725l8816N08081
3134F6206706P74798R72457J374740J628489K060852K296148K224042K117098
3126G9655330K680724K717054L332240M125288L821519L677256L406556L172335
3118A06588302J188097j088597l991388o062136o758129o491452n759583m611442
3110G3013672l911874k961985j973307j560347j218780j217561j001929j043813
3102E8124076q29082q46253o29164q34642m45586L6938r6359M02726O74326J090652
3092E6647632J135125J764260J971171K219472K367533K418903K059307R57589
$$ plain form
3084 71540992 71217362 69562847 66808000 63834671 60342317 57442714 54603871 51934742
3076 51934742 50053380 48399124 47121714 46064389 45427387 44794175 44333793 44004854 44223287
3067 44223287 44537701 44650132 45200273 46402000 47719554 49315336 51109763 53021855 54825350
3058 54825350 56086094 54788939 51914010 48513680 45998578 44611637 43847644 43248616
3050 43248616 42734067 42860163 42655191 42268397 41841462 41413391 40393228 39631609 38810924
3041 38810924 38221277 37732650 37316722 37345512 37423532 37386663 37559864 37515549 37549852 37540666 37992134
3030 37992134 38088931 38360884 38821288 39585049 39975369 40114741 40862820 41614211 42343100 42952495
3020 42952495 43346677 43636960 43718827 43876763 44223482 44181938 44482820 44470916 44509058 44533691
$$ packed form
3084G1540992l23630j654515k754847k973329l492354k899603k838843k669129
3076E1934742j881362j654256j277410j057325o37002o33212m60382l28939K18433
3067D4223287L14414J12431N50141J201727J317554J595782J794427J912092J803495
3058E4825350J260744j297155k874929l400330k515102j386941p63993n99028
3050D3248616n14549J26096k04972l86794m26935m28071j020163p61619q20685
3041C8810924n89647m88627m15928K8790P8020l6869J73201m4315L4303r186M51468
3030C7992134R6797K71953M60404P63761L90320J39372P48079P51391P28889O09395
3020D2952495L94182K90283Q1867J57936L46719m1544L00882j1904L8142K4633
$$ plain form
3010 44533691 44624042 44727594 44803245 45281140 45776873 46059887 46612827 47158037 47953113 48846028
3000 48846028 49604742 50513024 51355678 52312825 53510769 54278532 55368405 56587176 57883110
2991 57883110 59201001 60631574 62089950 63882798 65491093 66989828 68181411 69658666
2983 69658666 71425462 73022784 74646796 76247519 78142380 80074858 81891457 83838886
2975 83838886 85970228 87972208 89538761 91428368 93759529 95644729 97361904 99314196
2967 99314196 100942324 102681735 104451198 106351378 108316434 110583195 112697501 114271891
2959 114271891 116154872 118027403 120050269 121770191 123960533 125494748 126877455 128689933
2951 128689933 130169267 131549508 132966484 134718625 136275642 137386298 138627028 139945919
$$ packed form
3010D4533691R0351J03552P5651M77895M95733K83014N52940N45210P95076Q92915
3000D8846028P58714R08282Q42654R57147J197944P67763J089873J218771J295934
2991E7883110J317891J430573J458376J792848J608295J498735J191583J477255
2983F9658666J766796J597322J624012J600723J894861J932478J816599J947429
2975H3838886K131342K001980J566553J889607K331161J885200J717175J952292
2967I9314196J628128J739411J769463J900180J965056K266761K114306J574390
2959A14271891J882981J872531K022866J719922K190342J534215J382707J812478
2951A28689933J479334J380241J416976J752141J557017J110656J240730J318891
$$ plain form
2943 139945919 141006868 142173708 143339518 144666732 145311471 146093140 146946730 147377631 148281707
2934 148281707 148798616 149220205 149526111 150039674 150441843 150654129 151057553 151440843 151964713
2925 151964713 152190837 151677907 151414224 151114601 150124096 149488833 148576510 147618809 147257577
2916 147257577 146585672 145629993 144715425 143912321 143061975 142092256 140917323 139716466 138303620
2907 138303620 136541977 134721952 133018225 131118719 129187480 127199757 125218217 123189152
2899 123189152 121487823 119672915 117792669 115893380 113960696 111838400 109591851 107007589
2891 107007589 104465078 102040088 99496532 97280881 94928822 92703210 90213024 87939561
2883 87939561 85829229 83769208 82146816 80234286 77816177 75929811 74326040 72568717
$$ packed form
2943A39945919J060949J166840J165810J327214O44739P81669Q53590M30901R04076
2934A48281707N16909M21589L05906N13563M02169K12286M03424L83290N23870
2925A51964713K26124n12930k63683k99623r90505o35263r12323r57701l61232
2916A47257577o71905r55679r14568q03104q50346r69719j174933j200857j412846
2907A38303620j761643j820025j703727j899506j931239j987723j981540k029065
2899A23189152j701329j814908j880246j899289j932684k122296k246549k584262
2891A07007589k542511k424990k543556k215651k352059k225612k490186k273463
2883H7939561k110332k060021j622392j912530k418109j886366j603771j757323
$$ plain form
2875 72568717 70733996 68911248 67124979 65251977 63265452 62036450 60747127 59082064
2867 59082064 58145413 56989929 55491810 54292092 53521597 52908643 52194533 51187535 51079524
2858 51079524 50873041 50220486 49606126 49557588 49487356 49512186 49459763 49721083 50022132 49761351
2848 49761351 49888402 50017549 50210706 50136199 50315109 50167954 50229835 50161851 50128604 49784787
2838 49784787 49574072 49642281 49678907 49563941 49637434 50014198 49827551 49876969 50454305 50697913
2828 50697913 50950871 51388254 52051973 52501992 52801567 53667677 54396818 55321201 56405034
2819 56405034 57815688 59049997 60128335 61099349 62542278 63646269 64856753 66070493
2811 66070493 66532732 66976136 66881087 66424604 66255943 65885599 65380849 64682873 64244419 64184614
$$ packed form
2875G2568717j834721j822748j786269j873002j986525j229002j289323j665063
2867E9082064r36651j155484j498119j199718p70495o12954p14110j006998j08011
2858E1079524k06483o52555o14360m8538p0232K4830n2423K61320L01049k60781
2848D9761351J27051J29147J93157p4507J78910j47155O1881o7984l3247l43817
2838D9784787k10715O8209L6626j14966P3493L76764j86647M9418N77336K43608
2828E0697913K52958M37383O63719M50019K99575Q66110P29141R24383J083833
2819E6405034J410654J234309J078338R71014J442929J103991J210484J213740
2811F6070493M62239M43404r5049m56483j68661l70344n04750o97976m38454n9805
$$ plain form
2801 64184614 63773762 63521590 63435480 63705059 63805271 63727918 63802461 64247622 64755215 65455552
2791 65455552 65649394 65755229 66295687 66984317 67956298 69037111 70192178 71339575 72607628
2782 72607628 74102499 75418951 76576397 77645344 78519803 79452893 80089086 80353860 80206935
2773 80206935 79703091 79277108 78775101 78277587 77825508 77634412 77632368 77685082 78063557 78343901
2763 78343901 79142034 79602976 80103844 81147524 82432591 83603652 85416471 87226809 89000352
2754 89000352 91308132 93538573 96577308 99292233 102306734 105816270 109973762 114424143
2746 114424143 119481076 125079259 131116759 137258720 144361034 152202517 160640777 170053251
2738 170053251 180251511 191440425 203290849 215239145 227043944 237943527 246925509
$$ packed form
2801F4184614m10852k52172q6110K69579J00212p7353P4543M45161N07593P00337
2791F5455552J93842J05835N40458O88630R71981J080813J155067J147397J268053
2782G2607628J494871J316452J157446J068947Q74459R33090O36193K64774j46925
2773H0206935n03844m25983n02007m97514m52079j91096k044N2714L78475K80344
2763G8343901P98133M60942N00868J043680J285067J171061J812819J810338J773543
2754H9000352K307780K230441L038735K714925L014501L509536M157492M450381
2746A14424143N056933N598183O037500O141961P102314P841483Q438260R412474
2738A70053251J0198260J1188914J1850424J1948296J1804799J0899583Q981982
$$ plain form
2731 246925509 253339735 257374952 259225232 259107187 257364589 254865977 252437802 249638295
2723 249638295 247466792 245671045 243975476 242601887 240978206 239299581 236615581 232404934
2715 232404934 226796920 219263620 209775231 198982557 187438627 175713825 164281314
2708 164281314 152993984 142785256 133528919 125284181 117923400 111459941 105778156 100911047
2700 100911047 96309836 92241232 88545860 85558661 82369776 79274635 77019736 74500904
2692 74500904 72423206 70672336 68860034 67359666 66136255 64551443 63121647 62317814
2684 62317814 61706103 60809427 59860106 59111433 58718292 58298976 57602898 57211372 56720750
2675 56720750 56403531 56328497 55883365 55751351 55804098 55455057 55175683 54884031 54714733 54922947
$$ packed form
2731B46925509O414226M035217J850280j18045j742598k498612k428175k799507
2723B49638295k171503j795747j695569j373589j623681j678625k684000m210647
2715B32404934n608014p533300r488389j0792674j1543930j1724802j1432511
2708A64281314j1287330j0208728r256337q244738p360781o463459n681785m867109
2700A00911047m601211m068604l695372k987199l188885l095141k254899k518832
2692G4500904k077698j750870j812302j500368j223411j584812j429796q03833
2684F2317814o11711q96676r49321p48673l93141m19316o96078l91526m90622
2675E6720750l17219p5034m45132j32014N2747l49041k79374k91652j69298K08214
$$ plain form
2665 54922947 55194917 55087082 55300625 55231719 55002504 55119699 55422079 55554969 55575631 55567343
2655 55567343 55772249 55745954 56110558 56370853 56483926 56879667 57134847 57430941 57775300 57990629
2645 57990629 58755780 59474279 59971532 60699774 61539386 62308974 63050394 63984808 64953199
2636 64953199 66203424 67377054 68454207 69779406 70999880 72048956 73397677 74675068
2628 74675068 76308183 77382182 78338461 79431486 80936003 82370271 83753440 85306691
2620 85306691 86523905 87776839 89402746 91283786 92509959 93808205 95573741 96655057
2612 96655057 98114648 99463328 100917868 102161932 103483635 104943448 106532350 108293937
2604 108293937 109685133 111295618 113085977 115035786 116888376 118795090 120897001 123079169
$$ packed form
2665E4922947K71970j07835K13543o8906k29215J17195L02380J32890K0662q288
2655E5567343K04906k6295L64604K60295J13073L95741K55180K96094L44359K15329
2645E7990629P65151P18499M97253P28242Q39612P69588P41420R34414R68391
2636F4953199J250225J173630J077153J325199J220474J049076J348721J277391
2628G4675068J633115J073999R56279J093025J504517J434268J383169J553251
2620H5306691J217214J252934J625907J881040J226173J298246J765536J081316
2612I6655057J459591J348680J454540J244064J321703J459813J588902J761587
2604A08293937J391196J610485J790359J949809J852590J906714K101911K182168
$$ plain form
2596 123079169 125070168 127610355 130042870 132528975 135436896 138628451 142189050 145840356
2588 145840356 149657339 153502939 157744520 162285131 167100761 172600199 178132788 183545337
2580 183545337 189611943 195839943 201920478 207935331 213805690 219018762 224190574 229368293
2572 229368293 234106745 238098236 242174868 246119750 250315614 254536748 258884528 263950073
2564 263950073 269060305 274182366 279405829 284783718 289996312 294839954 300210213 305633929
2556 305633929 310881860 316128311 321493696 327732265 334375005 341714571 349295395 357384627
2548 357384627 365377257 372739989 379478769 385477662 390240409 394369723 397835163 401219480
2540 401219480 405057111 409691314 414932905 420431138 426056406 431960518 437461533 442002221
$$ packed form
2596A23079169J990999K540187K432515K486105K907921L191555L560599L651306
2588A45840356L816983L845600M241581M540611M815630N499438N532589N412549
2580A83545337O066606O228000O080535O014853N870359N213072N171812N177719
2572B29368293M738452L991491M076632L944882M195864M221134M347780N065545
2564B63950073N110232N122061N223463N377889N212594M843642N370259N423716
2556C05633929N247931N246451N365385O238569O642740P339566P580824Q089232
2548C57384627P992630P362732O738780N998893M762747M129314L465440L384317
2540D01219480L837631M634203N241591N498233N625268N904112N501015M540688
$$ plain form
2532 442002221 445115500 446005614 444887355 442349452 437760785 431466882 424815274 418447871
2524 418447871 411827575 405842492 401065281 397105792 394279919 391988468 390108727 388359023
2516 388359023 386882565 385039931 382645339 379563801 376556623 373105179 369239950 365088145
2508 365088145 360786816 355960037 350822522 345536111 339822461 333511288 326972745 320325205
2500 320325205 313882407 307536905 301519734 295538217 289452676 283771361 277763234 271366331
2492 271366331 264230279 255898905 247189418 237961924 227837868 217389384 206724409 196082606
2484 196082606 185907215 176850372 168315356 160443756 153099445 146375543 140432624 134948603
2476 134948603 130088115 125897534 121606390 117652256 114373063 111071997 108116257 105568543
$$ packed form
2532D42002221L113279Q90114j118259k537903m588667o293903o651608o367403
2524D18447871o620296n985083m777211l959489k825873k291451j879741j749704
2516C88359023j476458j842634k394592l081538l007178l451444l865229m151805
2508C65088145m301329m826779n137515n286411n713650o311173o538543o647540
2500C20325205o442798o345502o017171n981517o085541n681315o008127o396903
2492B71366331p136052q331374q709487r227494j0124056j0448484j0664975j0641803
2484A96082606j0175391r056843q535016p871600p344311o723902n942919n484021
2476A34948603m860488m190581m291144l954134l279193l301066k955740k547714
$$ plain form
2468 105568543 102769627 100121469 97253210 94768384 92722136 90857433 88812495 86929789
2460 86929789 85517423 84142265 82249294 80745886 79286088 77824307 76343443 74906205
2452 74906205 73498837 71991260 70526830 68841068 67153598 65625362 64033779 62693106
2444 62693106 61282217 59787041 58609466 57281217 55896613 54645473 53485865 52196087
2436 52196087 51109385 50105445 49194693 48081129 47196042 46128156 44373846 43362193
2428 43362193 42839617 41525983 40467502 39779711 39040658 38339141 37942499 37069520 36242779
2419 36242779 35942103 35548570 34982273 34289059 33445819 33131010 32392257 31914259 31334333
2410 31334333 30698068 30202473 29688116 29441448 29027004 28302623 27694402 27507624 27225426
$$ packed form
2468A05568543k798916k648158k868259k484826k046248j864703k044938j882706
2460H6929789j412366j375158j892971j503408j459798j461781j480864j437238
2452G4906205j407368j507577j464430j685762j687470j528236j591583j340673
2444F2693106j410889j495176j177575j328249j384604j251140j159608j289778
2436E2196087j086702j003940r10752j113564q85087j067886j754310j011653
2428D3362193n22576j313634j058481o87791p39053p01517l96642q72979q26741
2419C6242779l00676l93533n66297o93214q43240l14809p38753m77998n79926
2410C1334333o36265m95595n14357k46668m14444p24381o08221j86778k82198
$$ plain form
2401 27225426 26796825 26245784 25789313 25372794 25214761 24990078 24782951 23972859 23414133
2392 23414133 23386403 23380629 23011023 22371498 22214382 21988164 21486505 21385363 21086357 20883385
2382 20883385 20733918 20356362 20091309 19733139 19637975 19473535 19450819 19215389 19113767 19028244
2372 19028244 18680045 18568580 18345245 18232210 18482430 18311751 18105001 17829237 17757591 18060992
2362 18060992 18074914 18063728 18079436 18373883 18545017 18525424 18686734 19139503 19646144 20019944
2352 20019944 20538308 20890638 21351579 21899718 22542573 23117590 23597979 23988532 24263624
2343 24263624 24645153 24598115 24401510 24143606 23760655 23001773 22651516 21981807 20666292
2334 20666292 19506587 18531219 17693114 16480250 15728224 15476134 15160472 14665197 14232235
$$ packed form
2401B7225426m28601n51041m56471m16519j58033k24683k07127q10092n58726
2392B3414133k7730n774l69606o39525j57116k26218n01659j01142k99006k02972
2382B0883385j49467l77556k65053l58170r5164j64440k2716k35430j01622q5523
2372A9028244l48199j11465k23335j13035K50220j70679k06750k75764p1646L03401
2362A8060992J3922j1186J5708K94447J71134j9593J61310M52769N06641L73800
2352B0019944N18364L52330M60941N48139O42855N75017M80389L90553K75092
2343B4263624L81529m7038j96605k57904l82951p58882l50257o69709j315515
2334B0666292j159705r75368q38105j212864p52026k52090l15662m95275m32962
$$ plain form
2325 14232235 13849512 13775316 13397185 12977712 13012924 12948782 12784456 12371907 11983613 11585516
2315 11585516 11848158 11859530 11564802 11423803 11398474 11313004 11221648 11159307 11127576 11160372 10991855
2304 10991855 10945588 11087902 11039747 10756731 10469738 10326850 10397892 10404406 10471220 10321952
2294 10321952 10358810 10201034 10248711 10493608 10317999 10058973 9939814 10075308 9745729 9733001
2284 9733001 9894928 9959873 9710643 9293396 8959546 9225786 9561041 9341535 8918496 8870545
2274 8870545 9267773 9335331 9447689 9356773 9557646 9411403 9244666 9246465 9036564 9100784
2264 9100784 9184787 9128678 9090812 8724146 8705431 9027755 9267966 9094613 8591998 8613871
2254 8613871 8579940 8672082 8851094 9113833 9441976 9374069 9185765 9100610 9068125 9062610 8974527
$$ packed form
2325A4232235l82723p4196l78131m19473L5212o4142j64326m12549l88294l98097
2315A1585516K62642J1372k94728j40999k5329q5470r1356o2341l1731L2796j68517
2304A0991855m6267J42314m8155k83016k86993j42888P1042O514O6814j49268
2294A0321952L6858j57776M7677K44897j75609k59026j19159J35494l29579j2728
2284I733001J61927O4945k49230m17247l33850K66240L35255k19506m23039m7951
2274H870545L97228O7558J12358r0916K00873j46243j66737J799k09901O4220
2264I100784Q4003n6109l7866l66666j8715L22324K40211j73353n02615K1873
2254H613871l3931R2142J79012K62739L28143o7907j88304q5155l2485n515q8083
$$ plain form
2243 8974527 9101754 9212838 9037056 8801020 8679224 8897798 8901889 8764643 8759142 8722957
2233 8722957 8752142 8869937 8955888 8876143 8833229 8544444 8709770 8742878 8591325 8922981
2223 8922981 9149006 9170647 9057143 8755204 8720121 8927492 8824365 8737947 8877538 8760689
2213 8760689 8749384 8843560 9195686 9516304 9469852 9589815 9963435 9793310 9635049 9809462
2203 9809462 9726151 9796464 9877890 9895000 10106144 10358816 10283098 10443886 10287846 10235139 10291627
2192 10291627 10141578 10371796 10708358 10513147 10583381 10888398 10935423 10675001 11012442 10913550
2182 10913550 10726035 10962340 10758738 10581107 10647108 10444949 10042336 10021292 10192169 10037257
2172 10037257 9809194 9622807 9524837 9374436 9065648 8638433 8261163 8503340 8252989 7903683
$$ packed form
2243H974527J27227J11084j75782k36036j21796K18574M091j37246n501l6185
2233H722957K9185J17795Q5951p9745m2914k88785J65326L3108j51553L31656
2223H922981K26025K1641j13504l01939l5083K07371j03127q6418J39591j16849
2213H760689j1305R4176L52126L20618m6452J19963L73620j70125j58261J74413
2203I809462q3311P0313Q1426J7110K11144K52672p5718J60788j56040n2707N6488
2192A0291627j50049K30218L36562j95211P0234L05017M7025k60422L37441r8892
2182A0913550j87515K36305k03602j77631O6001k02159m02613k1044J70877j54912
2172A0037257k28063j86387r7970j50401l08788m27215l77270K42177k50351l49306
$$ plain form
2162 7903683 7922255 7971390 7631828 7166322 7019620 7061149 6961606 6869865 6785924 6448380 6307366
2151 6307366 6160902 6171327 6382127 6383760 6160259 6102478 6177794 6157253 6400977 6611730 6558774
2140 6558774 6607502 6818431 6877520 6976735 6790303 6843719 6758396 6535907 5971337 5795364
2130 5795364 5473161 5250800 5264402 5171238 5306977 4992417 4896890 4843592 4995773 4938002
2120 4938002 4776659 4729749 4582714 4458603 4662869 5012969 4757477 4930823 4894271 4775149
2110 4775149 5029939 5114162 5085734 5258562 5184486 5326498 5547219 5419019 5578492 5330761
2100 5330761 5029784 4785879 4876414 4875704 4506819 4276198 4213149 4335310 4645893 4143812
2090 4143812 3949290 4089697 4043191 4057571 3972257 4221453 4280538 4071530 4196695 4105685
$$ packed form
2162G903683J8572M9135l39562m65506j46702M1529r9543r1741q3941l37544j41014
2151F307366j46464J0425K10800J633k23501n7781P5316k0541K43724K10753n2956
2140F558774M8728K10929N9089R9215j86432N3416q5323k22489n64570j75973
2130E795364l22203k22361J3602r3164J35739l14560r5527n3298J52181n7771
2120D938002j61343m6910j47035j24111K04266L50100k55492J73346l6552j19122
2110D775149K54790Q4223k8428J72828p4076J42012K20721j28200J59473k47731
2100E330761l00977k43905R0535p10l68885k30621o3049J22161L10583n02081
2090D143812j94522J40407m6506J4380q5314K49196N9085k09008J25165r1010
$$ plain form
2080 4105685 4097472 3971180 4062110 4173153 4279765 4148970 3959080 4030014 4253613 4273455
2070 4273455 3998678 4172741 4062282 3883146 3745319 3792003 3824181 3795487 4011718 3897695
2060 3897695 3763821 3915050 3837272 3700349 3673909 3812182 3829056 3682825 3656053 3979107
2050 3979107 3780573 3447694 3520509 3670921 3707903 3871318 3786417 3819174 3805030 4062620
2040 4062620 4110695 3851475 3809602 3842361 4263325 4160776 3943055 4042811 3894734 3975233
2030 3975233 4019274 3921883 4181847 4028552 3844857 4061417 4212443 4336469 4609361 4771030
2020 4771030 4842646 4850846 5024746 5169054 5393181 5287979 5669786 5713059 5667154 5623236 5518677
2009 5518677 5342208 5210245 5103526 4879824 5049500 5059029 4652660 4362889 4506580 4104078
$$ packed form
2080D105685q213j26292R0930J11043J06612j30795j89890P0934K23599J9842
2070D273455k74777J74063j10459j79136j37827M6684L2178k8694K16231j14023
2060C897695j33874J51229p7778j36923k6440J38273J6874j46231k6772L23054
2050C979107j98534l32879P2815J50412L6982J63415q4901L2757j4144K57590
2040D062620M8075k59220m1873L2759M20964j02549k17721R9756j48077Q0499
2030C975233M4041r7391K59964j53295j83695K16560J51026J24026K72892J61669
2020D771030P1616Q200J73900J44308K24127j05202L81807M3273m5905m3918j04559
2009E518677j76469j31963j06719k23702J69676R529m06369k89771J43691m02502
$$ plain form
1999 4104078 3759562 3532970 3340936 3325193 3258750 3060080 2650603 2489038 2764425 2798255
1989 2798255 2740206 2758493 2627710 2888547 3037937 3236400 3297939 2960933 2815734 2609608
1979 2609608 2799058 2798131 2623805 2488869 2491044 2556539 2427927 2463892 2572883 2366468 2636811
1968 2636811 2627994 2384194 2279463 2289699 2360253 2204523 2405328 2751641 2609449 2664529
1958 2664529 2904278 2630744 2472513 2572547 2597991 2585651 2283596 2405262 2501958 2248658
1948 2248658 2497871 2411060 2325873 2327667 2381418 2654245 2466761 2503936 2455883 2431541 2352049
1937 2352049 2588718 2678890 2261331 2288366 2291303 2248373 2212611 2283358 2262641 2144468 2565319
1926 2565319 2615259 2551484 2596267 2405036 2677327 2419413 2269357 2285188 2180478 2318401
$$ packed form
1999D104078l44516k26592j92034j5743o6443j98670m09477j61565K75387L3830
1989B798255n8049J8287j30783K60837J49390J98463O1539l37006j45199k06126
1979B609608J89450r27j74326j34936K175O5495j28612L5965J08991k06415K70343
1968B636811q817k43800j04731J0236P0554j55730K00805L46313j42192N5080
1958B664529K39749k73534j58231J00034K5444j2340l02055J21666R6696k53300
1948B248658K49213q6811q5187J794N3751K72827j87484L7175m8053k4342p9492
1937B352049K36669R0172m17559K7035K937m2930l5762P0747k0717j18173M20851
1926B565319M9940o3775M4783j91231K72291k57914j50056J5831j04710J37923
$$ plain form
1916 2318401 2394374 2472583 2728884 2538527 2711872 2746254 2192051 2286884 2389284 2346906
1906 2346906 2474498 2343269 2482011 2556173 2409452 2407326 2598824 2646577 2689586 2891513
1896 2891513 2942658 3057544 3148824 3024676 2822283 3024859 3169956 3282737 3153731 3218246
1886 3218246 3080951 3017048 3234953 3346178 3248305 3099447 3347023 3551248 3599889 3516635
1876 3516635 3708267 3541196 3916451 3976129 4105056 4366450 4381315 4762172 4777586 4505886
1866 4505886 4689533 4671108 4786499 4718022 4758057 4912004 4838274 4752411 4468424 4236328
1856 4236328 4340060 4316951 4011405 4019651 4095133 4299257 4276017 4292196 4690158 4576099 4511058
1845 4511058 4713762 4852435 5014846 5038517 5190038 5239572 5482637 5675209 5617077 5816779
$$ packed form
1916B318401P5973P8209K56301j90357J73345L4382n54203R4833J02400m2378
1906B346906J27592j31229J38742P4162j46721k126J91498M7753M3009K01927
1896B891513N1145J14886R1280j24148k02393K02576J45097J12781j29006O4515
1886C218246j37295o3903K17905J11225r7873j48858K47576K04225M8641q3254
1876C516635J91632j67071L75255N9678J28927K61394J4865L80857J5414k71700
1866D505886J83647j8425J15391o8477M0035J53947p3730q5863k83987k32096
1856D236328J03732k3109l05546Q246P5482K04124k3240J6179L97962j14059o5041
1845D511058K02704J38673J62411K3671J51521M9534K43065J92572n8132J99702
$$ plain form
1835 5816779 6129144 6542875 7012623 6665411 6698658 6359465 5956360 5661461 5282309 4943735
1825 4943735 4726637 4652194 4547439 4276655 4102407 3967107 3925121 3814293 3889832 3981485
1815 3981485 4285298 4286715 4012613 3894494 3534579 3536846 3748941 3591457 3671225 3800409
1805 3800409 4050299 4177745 3899077 3882157 3824383 4258510 4535271 4380883 4156351 3953956
1795 3953956 3616687 3521915 3330767 3345230 3170018 2985716 3020664 2776927 2780780 2848328 2995763
1784 2995763 2950155 2950342 3080501 3040476 2905132 2551968 2300045 2606287 2810368 3087695
1774 3087695 3291372 3040493 3185431 3269023 3273560 3263145 3008608 2989917 3270788 3303567 3306905
1763 3306905 3420751 3403707 3459000 3500982 3540903 3622125 3796541 4052320 4288558 4449921
$$ packed form
1835E816779L12365M13731M69748l47212L3247l39193m03105k94899l79152l38574
1825D943735k17098p4443j04755k70784j74248j35300m1986j10828P5539R1653
1815C981485L03813J417k74102j18119l59915K267K12095j57484P9768J29184
1805C800409K49890J27446k78668j6920n7774M34127K76761j54388k24532k02395
1795C953956l37269r4772j91148J4463j75212j84302L4948k43737L853O7548J47435
1784B995763m5608J87J30159m0025j35344l53164k51923L06242K04081K77327
1774C087695K03677k50879J44938Q3592M537j0415k54537j8691K80871L2779L338
1763C306905J13846j7044N5293M1982L9921Q1222J74416K55779K36238J61363
$$ plain form
1753 4449921 4539564 4974339 5316214 5685542 5888058 6067035 6866874 7644486 8432344 9155237
1743 9155237 10294405 11414901 12343347 13084179 13181478 12810141 11699419 10326772 9022607
1734 9022607 8020440 7013920 6272896 5876113 5521030 4891035 4435498 4394278 4291383
1725 4291383 3984166 3720646 3439045 3209518 2953623 3173694 3023085 2888841 2714287 2504268
1715 2504268 2753475 2418787 2301729 2386174 2568064 2521598 2513771 2075575 2163857 2198475 1667834
1704 1667834 1460938 1640787 1716261 1785940 1861521 1782892 1661700 1563732 1845931 1848155 1763542
1693 1763542 1719884 1687012 1945165 1902928 1847526 1859395 1722004 2030507 1735975 1651295 1880864
1682 1880864 1647765 1477210 1581751 1355147 1176454 1467363 1592806 1377795 1296820 1431501
$$ packed form
1753D449921Q9643M34775L41875L69328K02516J78977P99839P77612P87858P22893
1743I155237J139168J120496R28446P40832R7299l71337j110722j372647j304165
1734I022607j002167j006520p41024l96783l55083o29995m55537m1220j02895
1725D291383l07217k63520k81601k29527k55895K20071j50609j34244j74554k10019
1715B504268K49207l34688j17058Q4445J81890m6466p827m38196Q8282L4618n30641
1704A667834k06896J79849P5474O9679P5581p8629j21192r7968K82199K224q4613
1693A763542m3658l2872K58153m2237n5402J1869j37391L08503k94532q4680K29569
1682A880864k33099j70555J04541k26604j78693K90909J25443k15011q0975J34681
$$ plain form
1672 1431501 1560099 1436647 1187858 1263485 1564753 1530094 1401193 1230472 1210360 1474852
1662 1474852 1399535 1456174 1535465 1568332 1659885 1390354 1318259 1411983 1290339 1345548 1487484
1651 1487484 1363335 1465098 1289210 1006696 1273293 1442772 1288937 887789 802075 894169
1641 894169 1011187 1106282 1147109 1153055 1107803 1129395 1345442 1451092 1216687 1074470 909866
1630 909866 1082260 1258955 1310735 1349415 986196 751422 784005 990232 1155131 1125951
1620 1125951 1175377 1272343 1082516 1091828 1314099 1348655 1126276 1128388 1013250 955578 810302
1609 810302 890342 973631 993656 796999 767088 1079636 1267565 1037513 859448 699695
1599 699695 687870 1033248 1136869 1227281 820342 709130 644418 828286 1069009 968034
$$ packed form
1672A431501J28598j23452k48789P5627L01268l4659j28901j70721k0112K64492
1662A474852p5317N6639P9291L2867R1553k69531p2095R3724j21644N5209J41936
1651A487484j24149J01763j75888k82514K66597J69479j53835m01148q5714R2094
1641H94169J17018R5095M0827N946m5252K1592K16047J05650k34405j42217j64604
1630I09866J72394J76695N1780L8680l63219k34774L2583K06227J64899k9180
1620A125951M9426R6966j89827R312K22271L4556k22379K112j15138n7672j45276
1609H10302Q0040Q3289K0025j96657k9911L12548J87929k30052j78065j59753
1599F99695j1825L45378J03621R0412m06939j11212o4712J83868K40723j00975
$$ plain form
1589 968034 804314 1046356 743290 562509 529895 389081 754181 743913 788732 1041636
1579 1041636 931759 621613 538779 579840 612063 592001 778438 777840 867143 1030156 1082144
1568 1082144 1050794 900718 450635 556173 514347 565585 585951 628892 693957 450809 401629
1557 401629 415620 489826 427851 421429 513789 507079 548951 554595 524118 492272 575614 826776
1545 826776 867499 796176 482624 428187 882690 882090 806465 689712 551207 733515 742612
1534 742612 650680 581362 740663 765002 889824 754846 640698 635832 435964 529693 687262
1523 687262 567524 866902 668029 516557 833410 888230 554061 787641 603680 499054
1513 499054 737994 957126 1151655 863159 999629 903678 862591 938552 1133266 736412
$$ packed form
1589I68034j63720K42042l03066j80781l2614j40814L65100j0268M4819K52904
1579A041636j09877l10146q2834M1061L2223k0062J86437n98Q9303J63013N1988
1568A082144l1350j50076m50083J05538m1826N1238K0366M2941O5065k43148m9180
1557D01629J3991P4206o1975o422R2360o710M1872N644l0477l1846Q3342K51162
1545H26776M0723p1323l13552n4437M54503o00p5625j16753j38505J82308R097
1534G42612r1932o9318J59301K4339J24822j34978j14148m866j99868R3729J57569
1523F87262j19738K99378j98873j51472L16853N4820l34169K33580j83961j04626
1513D99054K38940K19132J94529k88496J36470r5951m1087P5961J94714l96854
$$ plain form
1503 736412 484902 892814 747154 644871 592165 307657 254968 309066 278246 470681
1493 470681 427633 420148 552327 724973 907210 748476 596035 545433 498278 312849 599104
1482 599104 838324 826888 734980 497806 422028 527791 624994 405127 348604 664011 889462
1471 889462 1059322 934016 778090 737926 908829 1116528 1093975 1084207 933552 771925
1461 771925 626775 475510 110186 147119 490428 464860 286967 593304 822733 950989
1451 950989 723621 761843 772882 766822 702190 679459 518535 352221 372847 610938 877608
1440 877608 874509 1056453 1060764 854245 710641 747996 745732 480757 403631 285865 250475
1429 250475 326831 309290 492998 625351 620729 340241 307884 480433 567093 176451 508432
$$ packed form
1503G36412k51510M07912j45660j02283n2706k84508n2689N4098l0820J92435
1493D70681m3048p485J32179J72646J82237j58734j52441n0602m7155j85429K86255
1482E99104K39220j1436r1908k37174p5778J05763R7203k19867n6523L15407K25451
1471H89462J69860j25306j55926m0164J70903K07699k2553r768j50655j61627
1461G71925j45150j51265l65324L6933L43309k5568j77893L06337K29429J28256
1451I50989k27368L8222J1039o060o4632k2731j60924j66314K0626K38091K66670
1440H77608l099J81944M311k06519j43604L7355k264k64975p7126j17766l5390
1429B50475P6356j7541J83708J32353m622k80488l2357J72549Q6660l90642L31981
$$ plain form
1418 508432 789435 659506 394321 531856 609220 755172 492489 697693 493380 575913
1408 575913 771125 341595 17574 179895 521127 469392 501887 478711 672386 779625
1398 779625 416969 230538 371016 669148 510525 501652 708131 563151 644042 639003 560824
1387 560824 364366 294658 278586 346947 225214 359919 458733 329021 179660 43855
1377 43855 497029 456475 164119 7676 -46455 248143 454996 244802 240943 650983 668791
1366 668791 593659 307994 193693 335630 473031 561106 740885 435556 271896 355580
1356 355580 355887 454632 869674 659419 463360 474487 584361 600925 249462 50964 62822
1345 62822 124732 322960 603576 615745 348853 345976 150540 154299 311001 271901 331748
$$ packed form
1418E08432K81003j29929k65185J37535P7364J45952k62683K05204k04313Q2533
1408E75913J95212m29530l24021J62321L41232n1735L2495k3176J93675J07239
1398G79625l62656j86431J40478K98132j58623q873K06479j44980Q0891n039p8179
1387E60824j96458o9708j6072O8361j21733J34705R8814j29712j49361j35805
1377D3855M53174m0554k92356j56443n4131K94598K06853k10194l859M10040J7808
1366F68791p5132k85665j14301J41937J37401Q8075J79779l05329j63660Q3684
1356C55580L07R8745M15042k10255j96059J1127J09874J6564l51463j98498J1858
1345F2822O1910J98228K80616J2169k66892k877j95436L759J56702l9100N9847
$$ plain form
1334 331748 479790 489508 430882 310447 290163 274405 440338 506351 280785 398938 292099
1323 292099 369127 358829 331743 164973 274019 432207 267339 250300 313876 411447 454162
1312 454162 315532 179966 545787 251168 -21558 384200 373542 570708 766343 358017
1302 358017 106177 52216 89309 146277 59482 -56894 -14863 88278 288450 349986 274399
1291 274399 421373 522405 454986 405252 530473 381376 534752 742720 685592 689425 646731
1280 646731 535385 374006 440719 246376 198303 237796 148939 457871 309750 174700
1270 174700 552900 587460 457332 440259 139312 360332 591271 419685 458146 567795
1260 567795 658059 585046 774952 804425 874803 685967 562327 725137 595683 877316
$$ packed form
1334C31748J48042R718n8626j20435k0284j5758J65933O6013k25566J18153j06839
1323B92099P7028j0298k7086j66770J09046J58188j64868j7039O3576R7571M2715
1312D54162j38630j35566L65821k94619k72726M05758j0658J97166J95635m08326
1302C58017k51840n3961L7093N6968q6795j16376M2031J03141K00172O1536p5587
1291B74399J46974J01032o7419m9734J25221j49097J53376K07968n7128L833m2694
1280F46731j11346j61379O6713j94343m8073L9493q8857L08932j48121j35050
1270A74700L78200L4560j30128j7073l00947K21020K30939j71586L8461J09649
1260E67795R0264p3013J89906K9473P0378j88836j23640J62810j29454K81633
$$ plain form
1250 877316 781068 962587 825756 568791 462696 405201 430241 255941 349840 215297
1240 215297 212471 170428 -17679 -91028 93610 79054 182487 297102 202277 353701 517896
1229 517896 419795 497971 -33386 -70938 162250 -127254 257604 394804 375759 216104
1219 216104 396833 388381 317396 362038 266660 279219 315911 423575 526706 756184 569934
1208 569934 132805 166052 302550 293800 260524 170317 233566 266981 221920 269280 262382 104362
1196 104362 304674 508970 419873 362439 386737 276083 100960 181409 404387 403043 203877
1185 203877 210184 494419 126246 166438 375951 391591 426071 283868 240865 179827 380548
1174 380548 163655 171515 60124 104898 264229 463148 192831 156549 42783 152258
$$ packed form
1250H77316r6248J81519j36831k56965j06095n7495K5040j74300R3899j34543
1240B15297k826m2043j88107p3349J84638j4556J03433J14615r4825J51424J64195
1229E17896r8101P8176n31357l7552K33188k89504L84858J37200j9045j59655
1219B16104J80729q452p0985M4642r5378J2559L6692J07664J03131K29478j86250
1208E69934m37129L3247J36498q750l3276r0207O3249L3415m5061M7360o898j58020
1196A04362K00312K04296q9097n7434K4298j10654j75123Q0449K22978j344j99166
1185B03877O307K84235l68173M0192K09513J5640L4480j42203m3003o1038K00721
1174C80548k16893P860j11391M4774J59331J98919k70317l6282j13766J09475
$$ plain form
1164 152258 273314 158513 162170 113542 357190 621371 657387 327090 338275 508765 61145
1153 61145 16988 355458 563200 572652 423034 420406 399308 220177 261323 183260 230922
1142 230922 448412 317850 468694 450295 365432 445320 429385 448692 596235 592471 847132
1131 847132 899878 677102 608364 712569 517107 690317 806726 801094 760315 797383 570411
1120 570411 507616 624003 827392 739096 532868 359050 398099 596761 566055 614032 793137
1109 793137 879986 799685 707316 865399 751203 780902 895428 785969 792318 913276 610843
1098 610843 518927 682374 904126 871347 902010 1079202 1109938 1287223 1228432 1341609 1439975
1087 1439975 1172185 1342897 1286354 1172689 1165686 901938 1188793 1330960 1413723 1428179
$$ packed form
1164A52258J21056j14801L657m8628K43648K64181L6016l30297J1185J70490m47620
1153F1145m4157L38470K07742R452j49618k628k1098j79131M1146p8063M7662
1142B30922K17490j30562J50844j8399q4863P9888j5935J9307J47543l764K54661
1131H47132N2746k22776o8738J04205j95462J73210J16409n632m0779L7068k26972
1120E70411o2795J16387K03389q8296k06228j73818L9049J98662l0706M7977J79105
1109G93137Q6849q0301r2369J58083j14196K9699J14526j09459O349J20958l02433
1098F10843r1916J63447K21752l2779L0663J77192L0736J77285n8791J13177R8366
1087A439975k67790J70712n6543j13665p003k63748K86855J42167Q2763J4456
$$ plain form
1077 1428179 1354615 1143805 1637088 1712525 1320223 1302634 1732161 1945172 1915772 2142382
1067 2142382 2547198 2360500 2552952 2627392 2675342 2668931 2747488 2628028 2270637 2031135
1057 2031135 2067840 2282550 2410703 2542009 2707518 2603454 2234907 2282634 2449237 2827307
1047 2827307 3116465 3004793 2789408 2821344 3127446 3286165 2950890 3105841 3136180 3380954
1037 3380954 3426098 3296893 3191624 3164908 3107132 3276451 3227119 3274826 3288953 3350269 3471566
1026 3471566 3498410 3640511 3535838 3704050 3613719 3702611 3839990 3865197 3974228 4204759
1016 4204759 4458450 4708678 4961490 5091875 5292135 5683287 5669488 5725285 6277752 6851843
1006 6851843 7341254 7684462 8329787 8611759 8773382 9342069 9800247 10258162 10610602 10586904
$$ packed form
1077A428179p3564k10810M93283P5437l92302j7589M29527K13011k9400K26610
1067B142382M04816j86698J92452P4440M7950o411P8557j19460l57391k39502
1057B031135L6705K14710J28153J31306J65509j04064l68547M7727J66603L78070
1047B827307K89158j11672k15385L1936L06102J58719l35275J54951L0339K44774
1037C380954M5144j29205j05269k6716n7776J69319m9332M7707J4127O1316J21297
1026C471566K6844J42101j04673J68212r0331Q8892J37379K5207J09031K30531
1016D204759K53691K50228K52812J30385K00260L91152j3799N5797N52467N74091
1006F851843M89411L43208O45325K81972J61623N68687M58178M57915L52440k3698
$$ plain form
996 10586904 10912570 11621369 11917857 12797670 13578249 14755704 15831549 16882839 18531787
987 18531787 20093602 21698943 23144594 24555886 26338742 28186037 30874388 34124439
979 34124439 37847039 42593024 48368245 56543634 67718446 80599083 92603397 104929067
971 104929067 117752755 125325380 118720670 99359967 77694523 60799791 49430520
964 49430520 41665322 36138387 31968831 28417116 25837551 24024329 22612688 21292254
956 21292254 19724854 18897800 18099099 17013276 15663283 14478413 13712082 12666242 11706810
947 11706810 10862502 10401556 9990189 9394673 8585429 8077883 7867075 7594829 7382213 7129669
937 7129669 7064198 6501751 6237187 5973995 5383164 5130813 5212670 4864472 4754096 4741557
$$ packed form
996A0586904L25666P08799K96488Q79813P80579J177455J075845J051290J648948
987A8531787J561815J605341J445651J411292J782856J847295K688351L250051
979C4124439L722600M745985N775221Q175389J1174812J2880637J2004314J2325670
971A04929067J2823688P572625o604710j9360703k1665444j6894732j1369271
964D9430520p765198n526935m169556l551715k579565j813222j411641j320434
956B1292254j567400q27054p98701j085823j349993j184870p66331j045840r59432
947A1706810q44308m60946m11367n95516q09244n07546k10808k72246k12616k52544
937G129669o5471n62447k64564k63192n90831k52351Q1857l48198j10376j2539
$$ plain form
927 4741557 4861267 4679910 4380766 4279205 4093763 3948888 3775424 3641434 3660528 3494452
917 3494452 3445027 3287261 3150859 3091790 3018778 2964185 2571903 2693803 2612177 2548143 2685658
906 2685658 2487960 2423973 2439270 2828853 2677552 2344950 2261760 2104130 2113429 2053897 2264079
895 2264079 2172232 2065208 1680105 1746259 1865122 1855140 1735109 1476951 1732682 1557243
885 1557243 1381527 1296821 1403764 1346422 1136581 1044515 1026624 1275270 1089269 1167817 1311356
874 1311356 1169468 1191874 1214664 1236114 1416836 1305555 1320904 1302557 1365234 1251615 1382666
863 1382666 1388197 977296 672443 743802 1249939 1178238 897463 674407 400129 639977
853 639977 1043543 1008199 451359 604960 951009 1134063 916474 830626 699675 645835
$$ packed form
927D741557J19710j81357k99144j01561j85442j44875j73464j33990J9094j66076
917C494452m9425j57766j36402n9069p3012n4593l92282J21900q1626o4034J37515
906B685658j97698o3987J5297L89583j51301l32602q3190j57630R299n9532K10182
895B264079r1847j07024l85103O6154J18863r982j20031k58158K55731j75439
885A557243j75716q4706J06943n7342k09841r2066j7891K48646j86001P8548J43539
874A311356j41888K2406K2790K1450J80722j11281J5349j8347O2677j13619J31051
863A382666N531m10901l04853P1359N06137p1701k80775k23056k74278K39848
853F39977M03566l5344n56840J53601L46049J83054k17589q5848j30951n3840
$$ plain form
843 645835 693700 611504 567515 729813 718953 723616 498050 591509 590195 451340 463704 545532
831 545532 374301 229296 135124 116453 229065 604571 732861 223030 269964 116383
821 116383 117681 472570 464359 283015 424256 390638 601157 194991 202194 138592 254177
810 254177 225976 308477 465740 528808 61204 55779 362330 457271 239697 120717 -40509
799 -40509 203420 259990 198974 249244 230935 280814 333269 66244 221003 388730 249351
788 249351 -54359 -86515 111424 181519 340581 33841 36294 248510 72054 -78165 157792
777 157792 226432 366513 291181 260816 162090 112672 285123 313144 415800 284864 -231913
766 -231913 -376588 13338 274178 417113 193507 -231486 -145606 89806 309711 241350
$$ packed form
843F45835M7865q2196m3989J62298j0860M663k25566R3459j314j38855J2364Q1828
831E45532j71231j45005r4172j8671J12612L75506J28290n09831M6934j53581
821A16383J298L54889q211j81344J41241l3618K10519m06166P203o3602J15585
810B54177k8201Q2501J57263O3068m67604n425L06551R4941k17574j18980j61226
799d0509K43929N6570o1016N0270j8309M9879N2455k67025J54759J67727j39379
788B49351l03710l2156J97939P0095J59062l06740K453K12216j76456j50219K35957
777A57792O8640J40081p5332l0365r8726m9418J72451K8021J02656j30936n16777
766b31913j44675L89926K60840J42935k23606m24993Q5880K35412K19905o8361
$$ plain form
756 241350 220417 26340 -126921 1428 59415 -81062 -283717 -94027 14061 -130570
746 -130570 -155940 -305532 -187001 -138139 -16739 -129847 143251 -142904 -208585 -21723
736 -21723 26878 -287360 -266827 -147288 -147453 -1556 30447 -318026 -309466 -213293 -236934 -112464
724 -112464 -116449 8370 428421 229678 -60620 26978 62578 223439 -107729 -141536 -31469
713 -31469 -9281 150981 145754 26173 100043 -33114 117831 185758 129665 153260 -369741
702 -369741 -504932 -287201 -212089 -55215 10934 -49053 -217007 146843 160636 31522 49498
691 49498 104000 -41953 116159 277228 261964 301896 185104 248191 531176 178826 193077
680 193077 269096 263343 121274 -155864 15947 67229 232607 226368 125096 -99114 -192250
$$ packed form
756B41350k0933j94077j53261J28349N7987j40477k02655J89690J08088j44631
746a30570k5370j49592J18531M8862J21400j13108K73098k86155o5681J86862
736b1723M8601l14238K0533J19539j65J45897L2003l48473Q560R6173k3641J24470
724a12464l985J24819M20051j98743k90298Q7598L5600J60861l31168l3807J10067
713c1469K2188J60262n227j19581P3870j33157J50945O7927n6093K3595n23001
702c69741j35191K17731P5112J56874O6149n9987j67954L63850J3793j29114J7976
691D9498N4502j45953J58112J61069j5264L9932j16792O3087K82985l52350J4251
680A93077P6019n753j42069k77138J71811N1282J65378o239j01272k24210r3136
$$ plain form
669 -192250 57304 -114804 54760 -10749 -9968 43565 -84902 -32042 34228 123065 152242
658 152242 -218104 -388346 62920 99999 -40066 -346091 -397202 -7307 27588 43189 -108182
647 -108182 -249564 -131280 -169204 78940 145970 109964 62224 170852 124266 173250 -252054
636 -252054 -397525 -242126 -181805 -275593 -121416 39553 50310 -65764 20327 14971 -183777
625 -183777 -278686 -386020 -407252 -317787 -458968 -455183 -451251 -401664 -80519 -230922 -261760
614 -261760 -254014 -366970 -519232 -455873 -281717 -95030 -56294 -263371 -367274 -291598 -571566
603 -571566 -356963 -267838 -409467 -304705 -264092 -342537 -284625 -453615 -347239 -372291 -481611
592 -481611 -143855 -161950 -226262 -76454 -80372 -82646 -140915 -117322 23686 -325193 -373045
$$ packed form
669a92250K49554j72108J69564o5509P81N3533j28467N2860O6270Q8837K9177
658A52242l70346j70242M51266L7079j40065l06025n1111L89895L4895J5601j51371
647a08182j41382J18284l7924K48144O7030l6006m7740J08628m6586M8984m25304
636b52054j45471J55399O0321r3788J54177J60969J0757j16074Q6091n356j98748
625a83777r4909j07334k1232Q9465j41181L785L932M9587L21145j50403l0838
614b61760P746j12956j52262O3359J74156J86687L8736k07077j03903P5676k79968
603e71566K14603Q9125j41629J04762M0613p8445N7912j68990J06376k5052j09320
592d81611L37756j8095o4312J49808l918k274n8269K3593J41008l48879m7852
$$ plain form
581 -373045 -464818 -392044 -262233 -333049 -177497 -36989 -374838 -303986 -208413 -348552 -435328
570 -435328 -374298 -381980 -406639 -224430 -420252 -215951 -251687 -339331 -52419 539844 350472
559 350472 -122256 -313731 -203744 -62564 36907 -3000 -126211 -72899 -281228 -141068
549 -141068 -232760 -310466 -99258 -142280 -166499 -434035 -670172 -575349 -370299 -285193 -348536
538 -348536 -609594 -776049 -398958 -469728 -654722 -806685 -606886 -720278 -577259 -355327
528 -355327 -640938 -679215 -426631 -634299 -688966 -656258 -587184 -430911 -586771 -349218 -366964
517 -366964 -223408 -440179 -535112 -440751 -260092 -270629 -253259 -264837 -371992 -182780 -247809
506 -247809 -533872 -613304 -586184 -367863 -208510 -522520 -490473 -232380 -541378 -655457
$$ packed form
581c73045r1773P2774J29811p0816J55552J40508l37849P0852R5573j40139q6776
570d35328O1030p682k4659J82209j95822K04301l5736q7644K86912N92263j89372
559C50472m72728j91475J09987J41180R9471l9907j23211N3312k08329J40160
549a41068r1692p7706K11208m3022k4219k67536k36137R4823K05050Q5106o3343
538c48536k61058j66455L77091p0770j84994j51963J99799j13392J43019K21932
528c55327k85611l8277K52584k07668n4667L2708O9074J56273j55860K37553j7746
517c66964J43556k16771r4933R4361J80659j0537J7370j1578j07155J89212o5029
506b47809k86063p9432K7120K18321J59353l14010L2047K58093l08998j14079
$$ plain form
496 -655457 -491939 -666863 -540711 -363573 -298688 -160777 -193258 -540889 -712976 -625487
486 -625487 -684238 -550280 -567014 -207233 -459362 -777586 -647090 -541061 -597508 -615186 -319731
475 -319731 -385235 -285199 -159576 -329347 -561221 -310832 -135541 -257688 -258062 -329583 -373543
464 -373543 -488471 -604778 -604726 -612577 -655271 -419031 -385252 -549886 -529565 -348998 -381230 -536086
452 -536086 -505177 -457180 -342938 -230379 -317103 -664104 -464705 -548141 -417228 -450202 -234962
441 -234962 -249408 -242861 -117708 -226579 -121234 -202112 -143009 -52964 -322582 -409953 -338032
430 -338032 -314215 -529359 -432118 -448659 -673774 -271913 -212600 -440512 -642772 -580502 -487536
419 -487536 -586647 -607974 -539861 -601019 -836598 -560957 -233310 -332607 -310162 -181824 -339948
$$ packed form
496f55457J63518j74924J26152J77138O4885J37911l2481l47631j72087Q7489
486f25487n8751J33958j6734L59781k52129l18224J30496J06029n6447j7678K95455
475c19731o5504J00036J25623j69771k31874K50389J75291j22147l74p1521m3960
464c73543j14928j16307N2p851m2694K36240L3779j64634K0321J80567l2232j54856
452e36086L0909M7997J14242J12559q6724l47001J99399q3436J30913l2974K15240
441b34962j4446O547J25153j08871J05345q0878N9103R0045k69618q7371P1921
430c38032K3817k15144R7241j6541k25115M01861N9313k27912k02260O2270R2966
419d87536r9111k1327O8113o1158k35579K75641L27647r9297K2445J28338j58124
$$ plain form
408 -339948 -558155 -803429 -553085 -530005 -374060 -64707 -5748 -407200 -630580 -498266
398 -498266 -341582 -366428 -537996 -685473 -527760 -458532 -771059 -663786 -555278 -717473
388 -717473 -770680 -546104 -352712 -525417 -521475 -339506 -394183 -210043 -405811 -312103 -587421
377 -587421 -466504 -445908 -442946 -458976 -517383 -806696 -740840 -530819 -575731 -694236 -695221 -559309
365 -559309 -388074 -602856 -745015 -504978 -672474 -715988 -439966 -319586 -352031 -408739
355 -408739 -244707 -229030 14059 -137119 -265826 -204447 -461275 -598049 -344444 -193927
345 -193927 -468486 -537259 -676684 -562562 -519103 -761999 -831714 -666268 -483147 -299401
335 -299401 -377479 -547117 -834281 -1048547 -570680 -463280 -912255 -1019179 -1153732 -668121
$$ packed form
408c39948k18207k45274K50344K3080J55945L09353N8959m01452k23380J32314
398d98266J56684k4846j71568j47477J57713O9228l12527J07273J08508j62195
388g17473n3207K24576J93392j72705L942J81969n4677J84140j95768R3708k75318
377e87421J20917K0596K962j6030n8407k89313O5856K10021m4912j18505r85J35912
365e59309J71235k14782j42159K40037j67496m3514K76022J20380l2445n6708
355d08739J64032J5677K43089j51178j28707O1379k56828j36774K53605J50517
345a93927k74559o8773j39425J14122M3459k42896o9715J65446J83121J83746
335b99401p8078j69638k87164k14266M77867J07400m48975j06924j34553M85611
$$ plain form
325 -668121 -787121 -1081449 -1133835 -937634 -841974 -844995 -962728 -632667 -409329 -380207 -549977
314 -549977 -837586 -822299 -894215 -537482 -883712 -868677 -774440 -917583 -756317 -529576 -446224
303 -446224 -811000 -1109960 -1011865 -1268161 -649163 -443773 -642513 -527644 -270247 -401091
293 -401091 -627925 -663546 -697361 -706399 -720070 -426486 -414361 -579867 -497600 -239542 -551773
282 -551773 -727217 -503682 -343678 -713248 -717982 -719207 -672751 -708100 -762851 -690665 -613807
271 -613807 -493342 -132070 -416796 -593780 -689248 -640128 -705186 -769307 -961912 -946623 -789388
260 -789388 -682754 -503973 -555032 -403372 -581889 -750842 -540484 -607116 -761937 -795370
250 -795370 -748686 -493112 -538666 -865019 -840230 -835549 -779606 -525350 -615982 -670660 -803175
$$ packed form
325f68121j19000k94328n2386J96201R5660l021j17733L30061K23338K9122j69770
314e49977k87609J5287p1916L56733l46230J5035R4237j43143J61266K26741Q3352
303d46224l64776k98960R8095k56296O18998K05390j98740J14869K57397j30844
293d01091k26834l5621l3815r038j3671K93584J2125j65506Q2267K58058l12231
282e51773j75444K23535J60004l69570m734j225M6456l5349n4751P2186P6858
271f13807J20465L61272k84726j76984r5468M9120o5058o4121j92605J5289J57235
260g89388J06634J78781n1059J51660j78517j68953K10358o6632j54821l3433
250g95370M6684K55574m5554l26353K4789M681N5943K54256r0632n4678j32515
$$ plain form
239 -803175 -915651 -1050016 -848908 -672196 -1003132 -762033 -395200 -443958 -666025 -728743
229 -728743 -858414 -1113346 -1178402 -1003529 -949469 -1075513 -832915 -950849 -1014186 -863990
219 -863990 -501696 -722054 -740815 -784447 -1082272 -1067840 -837550 -755476 -855694 -691474 -811970
208 -811970 -675491 -644286 -842492 -467602 -380170 -721594 -943513 -985292 -792496 -607554
198 -607554 -694360 -647762 -780684 -916825 -871350 -712870 -925623 -808669 -747411 -1032559 -933438
187 -933438 -1064821 -1060096 -953881 -980333 -1210328 -1019912 -1125263 -1200649 -1231386 -1138393 -589061
176 -589061 -685635 -916684 -783815 -764700 -579892 -712516 -931063 -978591 -799335 -461968
166 -461968 -768471 -803342 -811396 -978517 -1252152 -919972 -917655 -1235834 -1204833 -1049404 -888573
$$ packed form
239h03175j12476j34365K01108J76712l30936K41099L66833m8758k22067o2718
229g28743j29671k54932o5056J74873N4060j26044K42598j17934o3337J50196
219h63990L62294k20358j8761m3632k97825J4432K30290Q2074j00218J64220j20496
208h11970J36479L1205j98206L74890Q7432l41424k21919m1779J92796J84942
198f07554q6806M6598j32922j36141M5475J58480k12753J16954O1258k85148R9121
187i33438j31383M725J06215k6452k29995J90416j05351p5386l0737R2993N49332
176e89061r6574k31049J32869J9115J84808j32624k18547m7528J79256L37367
166d61968l06503l4871q054j67121k73635L32180K317l18179L1001J55429J60831
$$ plain form
155 -888573 -937900 -748854 -713456 -805619 -1032578 -945999 -917374 -794241 -702610 -980140 -826696
144 -826696 -569428 -687448 -780865 -795429 -943985 -1044229 -1114913 -941128 -937920 -859565 -793856
133 -793856 -920422 -1061679 -868396 -902288 -1377984 -1284581 -726835 -680401 -1052226 -1216142
123 -1216142 -1238712 -1010058 -903628 -1115851 -913209 -896107 -939913 -898666 -1090145 -1159196 -1065793
112 -1065793 -853456 -877359 -1080424 -1156357 -1352650 -1140193 -1011262 -929723 -1032309 -1066899
102 -1066899 -1036479 -967227 -821721 -895717 -896084 -1114203 -1329691 -1156865 -995145 -947386 -740552
91 -740552 -985432 -1039307 -1119670 -1202699 -952537 -856738 -1057059 -998028 -1012733 -1091281 -1159305
80 -1159305 -1039325 -1096330 -1014330 -1249928 -1310057 -1245951 -1088847 -891007 -584149 -589843 -831243
$$ packed form
155h88573m9327J89046L5398r2163k26959Q6579K8625J23133R1631k77530J53444
144h26696K57268j18020r3417j4564j48556j00244p0684J73785L208P8355O5709
133g93856j26566j41257J93283l3892m75696R3403N57746M6434l71825j63916
123a216142k2570K28654J06430k12223K02642J7102m3806M1247j91479o9051R3403
112a065793K12337k3903k03065p5933j96293K12457J28931Q1539j02586l4590
102a066899L0420O9252J45506p3996l67k18119k15488J72826J61720M7759K06834
91g40552k44880n3875q0363q3029K50162R5799k00321N9031j4705p8548o8024
80a159305J19980n7005Q2000k35598o0129O4106J57104J97840L06858n694k41400
$$ plain form
69 -831243 -965354 -1071127 -1310743 -1172611 -1103974 -866926 -799996 -989913 -943105 -973546 -1161898
58 -1161898 -1204455 -1138063 -1074222 -1150031 -1330699 -1042283 -1051471 -1091064 -1116185 -1186021 -1060626
47 -1060626 -918121 -934966 -921425 -1036818 -1023930 -982682 -1023272 -1099424 -1289132 -1393438 -1104898
36 -1104898 -1013431 -1109467 -1086041 -1007981 -1036292 -1073427 -1043554 -1006505 -1190006 -1257713 -1032193
25 -1032193 -1132528 -1195207 -1340516 -1375451 -1124597 -1301439 -1406296 -1597873 -1483234 -1286753
15 -1286753 -1183767 -1202036 -1060990 -1070572 -1006636 -914344 -1108932 -1292903 -1277095 -1121578 -1052253
4 -1052253 -1250154 -1013635 -1191385 -1168148
0 -1168148
$$ packed form
69h31243j34111j05773k39616J38132O8637K37048O6930j89917M6808l0441j88352
58a161898m2557O6392O3841p5809j80668K88416r188l9593k5121o9836J25395
47a060626J42505j6845J3541j15393J2888M1248m0590p6152j89708j04306K88540
36a104898R1467r6036K3426P8060k8311l7135K9873L7049j83501o7707K25520
25a032193j00335o2679j45309l4935K50854j76842j04857j91577J14639J96481
15a286753J02986j8269J41046r582O3936R2292j94588j83971J5808J55517O9325
4a052253j97901K36519j77750K3237
0a168148
$$ Imaginary data points
##PAGE= N=2
##DATA TABLE= (X++(I..I)), XYDATA
$$ plain form
16383 -6814381 -6827666 -6681296 -6512396 -6519117 -6550854 -6438716 -6405643 -6116199 -5920456 -5874611
16373 -5874611 -5847557 -5800015 -5524621 -5604306 -5507956 -5531721 -5431312 -5307727 -5108078 -5123968
16363 -5123968 -5140491 -5229574 -5057339 -4658118 -4535803 -4539356 -4537713 -4507288 -4334712 -4158972 -4205501
16352 -4205501 -4040259 -4083208 -4131471 -3964272 -3936233 -3943538 -3816913 -3916390 -3638391 -3369586
16342 -3369586 -3363864 -3494501 -3373077 -3126362 -3035632 -3110291 -2860233 -2912874 -3067968 -2941809
16332 -2941809 -2809227 -2646290 -2453630 -2443622 -2216583 -2143438 -2268037 -2121400 -2050475 -1982466
16322 -1982466 -1870011 -1632651 -1512256 -1798371 -1669672 -1752682 -1664028 -1475353 -1726051 -1626672
16312 -1626672 -1733723 -1570769 -1330132 -1286690 -1218055 -1097408 -796579 -875323 -1119484 -986954
$$ packed form
16383f814381j3285J46370J68900o721l1737J12138L3073K89444J95743M5845
16373e874611K7054M7542K75394p9685R6350k3765J00409J23585J99649j5890
16363e123968j6523q9083J72235L99221J22315l553J643L0425J72576J75740m6529
16352d205501J65242m2949m8263J67199K8039p305J26625r9477K77999K68805
16342c369586N722j30637J21424K46715R0730p4659K50058n2641j55094J26159
16332b941809J32582J62937J92660J0008K27039P3145j24599J46637P0925O8009
16322a982466J12455K37360J20395k86115J28699q3010Q8654J88675k50698R9379
16312a626672j07051J62954K40637M3442O8635J20647L00829p8744k44161J32530
$$ plain form
16302 -986954 -735643 -814013 -693197 -655479 -760075 -664888 -500800 -538568 -463944 -353367
16292 -353367 -355641 -338182 -422300 -335748 -169539 -71531 80691 215174 245353 471035 492452
16281 492452 624321 820956 694263 574622 627588 474660 573281 649880 804703 909163
16271 909163 997313 1199891 1175765 1142223 1440158 1167400 1279320 1376082 1578288 1552155
16261 1552155 1463244 1251649 1406534 1820433 2001729 1612807 1645066 1707974 1564672 1883738
16251 1883738 1998454 2017915 2311449 2465355 2116032 1983265 2023811 2215027 2187841 2248463
16241 2248463 2351666 2433528 2431650 2549492 2354179 2632581 2635965 2622960 2912954 2905918 3112766
16230 3112766 3194209 2903347 2820571 2763263 2919330 3119351 3086473 3073866 3085677 3147078 3090509
$$ packed form
16302i86954K51311p8370J20816L7718j04596R5187J64088l7768P4624J10577
16292c53367k274J7459q4118Q6552J66209R8008J52222J34483L0179K25682K1417
16281D92452J31869J96635j26693j19641N2966j52928R8621P6599J54823J04460
16271I09163Q8150K02578k4126l3542K97935k72758J11920R6762K02206k6133
16261A552155q8911k11595J54885M13899J81296l88922L2259O2908j43302L19066
16251A883738J14716J9461K93534J53906l49323j32767M0546J91216k7186O0622
16241B248463J03203Q1862j878J17842j95313K78402L384j3005K89994p036K06848
16230C112766Q1443k90862q2776n7308J56067K00021l2878j2607J1811O1401n6569
$$ plain form
16219 3090509 3157701 3291942 3144665 3139405 3288020 3591696 3382926 3303534 3401477 3462688
16209 3462688 3475510 3405130 3582691 3590502 3685473 3706495 3602494 3655665 3630713 3731795 3667010
16198 3667010 3706875 3791517 3791697 3908204 3856163 4017176 3882913 3990535 3760224 3783268 3973798
16187 3973798 3972507 4029460 4026359 3601601 3409884 3697357 4076492 4286030 4423000 4197618
16177 4197618 4123100 4325887 4448511 4787940 4705964 4625630 4421041 4308190 4279260 4616326
16167 4616326 4493209 4507866 4496365 4560352 4307111 4487774 4618917 4657763 4599354 4555031
16157 4555031 4378153 4518998 4503236 4543138 4700122 4653532 4649116 4773006 4656973 4428665
16147 4428665 4783296 4979448 4658848 4846852 4970124 5006582 4924371 4645269 4714180 4448720
$$ packed form
16219C090509O7192J34241j47277n260J48615L03676k08770p9392R7943O1211
16209C462688J2822p0380J77561P811R4971K1022j04001N3171k4952J01082o4785
16198C667010L9865Q4642J80J16507n2041J61013j34263J07622k30311K3044J90530
16187C973798j291N6953l101m24758j91717K87473L79135K09538J36970k25382
16177D197618p4518K02787J22624L39429q1976q0334k04589j12851k8930L37066
16167D616326j23117J4657j1501O3987k53241J80663J31143L8846n8409m4323
16157D555031j76878J40845j5762L9902J56984m6590m416J23890j16033k28308
16147D428665L54631J96152l20600J88004J23272L6458q2211k79102O8911k65460
$$ plain form
16137 4448720 4282011 4496880 4834219 4753835 4899310 5070608 5121733 4870811 4849065 4707326
16127 4707326 4755960 4656568 4822225 5175796 5023374 5011159 5044390 5268210 5294824 5282234
16117 5282234 5175440 4905101 5171469 5029791 4976376 4808057 5138376 5311217 5088788 4853131
16107 4853131 4738074 5016647 5035888 5194035 5074434 5062096 4933058 5087560 5104968 5227956
16097 5227956 5347467 4966487 4952977 4937916 5197449 5236930 5172111 4964770 5295110 5208872
16087 5208872 5236328 5167028 5122356 5334522 5302453 5491554 5221499 5197171 5319940 5397377
16077 5397377 5442557 5284006 5321946 5063030 4937912 5225574 5208182 5176131 5367998 5408869
16067 5408869 5351334 5400241 5642984 5590463 5761535 5296487 4970762 5250935 5246908 5306791
$$ packed form
16137D448720j66709K14869L37339q0384J45475J71298N1125k50922k1746j41739
16127D707326M8634r9392J65657L53571j52422j2215L3231K23820K6614j2590
16117E282234j06794k70339K66368j41678n3415j68319L30319J72841k22429k35657
16107D853131j15057K78573J9241J58147j19601j2338j29038J54502J7408J22988
16097E227956J19511l80980j3510j5061K59533L9481o4819k07341L30340q6238
16087E208872K7456o9300m4672K12166l2069J89101k70055k4328J22769P7437
16077E397377M5180j58551L7940k58916j25118K87662j7392l2051J91867M0871
16067E408869n7535M8907K42743n2521J71072m65048l25725K80173m027N9883
$$ plain form
16057 5306791 5258381 5478297 5369809 5551416 5451344 5150505 5398728 5394631 5314772 5418037
16047 5418037 5442880 5178063 5313096 5354863 5420884 5371655 5473947 5727906 6023453 6044519
16037 6044519 5577119 5301357 5476742 5564419 5669833 5597060 5514829 5305382 4841971 5043715
16027 5043715 5297875 5542109 5377919 5516566 5544287 5600210 5491451 5128462 5233926 5562349
16017 5562349 5562159 5420922 5549909 5560775 5560112 5609933 5868396 5860637 5842220 5796689 5649804
16006 5649804 5211428 5202999 5388707 5459478 5682167 5483413 5655120 5669401 5462153 5628144
$$ packed form
16057E306791m8410K19916j08488J81607j00072l00839K48223m097p9859J03265
16047E418037K4843k64817J35033M1767O6021m9229J02292K53959K95547K1066
16037F044519m67400k75762J75385Q7677J05414p2773q2231k09447m63411K01744
16027E043715K54160K44234j64190J38647K7721N5923j08759l62989J05464L28423
16017E562349j90j41237J28987J0866o63M9821K58463p759j8417m5531j46885
16006E649804m38376q429J85708P0771K22689j98754J71707J4281k07248J65991
$$ [...]
##END NTUPLES=NMR SPECTRUM
##END=
