##TITLE=1H_EC-3252(II-1)
 CDCl3,8 sc, 
 30.03.2021
##JCAMPDX= 6.0         $$ Bruker NMR JCAMP-DX V2.0
##DATA TYPE= NMR SPECTRUM
##DATA CLASS= NTUPLES
##ORIGIN= UXNMR, Bruker Analytische Messtechnik GmbH
##OWNER= root
$$ XWIN-NMR		Version 3.5
$$ Tue Mar 30 10:02:30 2021 Russian Standard Time (UT+4h)  she@DPX200
##.OBSERVE FREQUENCY= 200.131506
##.OBSERVE NUCLEUS= ^1H
##.ACQUISITION MODE= SIMULTANEOUS
##.ACQUISITION SCHEME= undefined
##.AVERAGES= 8
##.DIGITISER RES= 18
##SPECTROMETER/DATA SYSTEM= spect
##.PULSE SEQUENCE= zg30
##.SOLVENT NAME= D2O
##.SHIFT REFERENCE= (INTERNAL, D2O, 0, 15.974)
##AUDIT TRAIL= $$ (NUMBER, WHEN, WHO, WHERE, WHAT)
$$ ##TITLE= Audit trail, XWIN-NMR		Version 3.5
$$ ##JCAMPDX= 5.01
$$ ##ORIGIN= Bruker BioSpin GmbH
$$ ##OWNER= she
$$ F:/spectra/data/she/nmr/H-F/1/pdata/1/auditp.txt
$$ ##AUDIT TRAIL=  $$ (NUMBER, WHEN, WHO, WHERE, WHAT)
(   1,<2021-03-30 10:00:49.43 +0400>,<she>,<DPX200>,
      <created by zg, POWCHK disabled, PULCHK disabled
       configuration hash MD5:
       00 E9 B6 7A A2 85 ED C7 34 08 36 98 17 FE 4E 26
       data hash MD5: 16K
       2E 8E 74 11 BF 64 DC C5 EC D7 3D 00 99 08 50 47>)
(   2,<2021-03-30 10:00:51.71 +0400>,<she>,<DPX200>,
      <Start of raw data processing
       efp BC_mod = 2 LB = 0.24 FT_mod = 6 PKNL = 1 PHC0 = -11124.61 PHC1 = 14.40094 SI = 16K 
       data hash MD5: 16K
       67 D0 96 D3 A6 E7 4F 2B F2 20 BA 5C 45 AD 97 A8>)
(   3,<2021-03-30 10:01:14.10 +0400>,<she>,<DPX200>,
      <pk PHC0 = -2.167126 PHC1 = 6.799999 
       data hash MD5: 16K
       1D DA C7 9C 34 CE 76 AC 21 E8 41 79 04 94 0D 2C>)
(   4,<2021-03-30 10:01:20.82 +0400>,<she>,<DPX200>,
      <abs ABSG = 5 
       data hash MD5: 16K
       69 E0 0C 18 68 FD B3 FF C5 D1 02 7F 18 67 18 95>)
$$ ##END=
$$ 
$$ hash MD5
$$ 68 32 87 62 86 3B 79 6A 8F 99 20 4D 58 FF A3 09
##$RELAX= 
##$RELAX= 
##$RELAX= 
##$RELAX= 
##$RELAX= 
##$RELAX= 
$$ Bruker specific parameters
$$ --------------------------
##$DU= <F:/spectra>
##$EXPNO= 1
##$NAME= <H-F>
##$PROCNO= 1
##$TYPE= <nmr>
##$USER= <she>
##$AMP= (0..31)
100 100 100 100 100 100 100 100 100 100 100 100 100 100 100 100 100 100 
100 100 100 100 100 100 100 100 100 100 100 100 100 100 
##$AQSEQ= 0
##$AQ_mod= 1
##$AUNM= <au_zg>
##$AUTOPOS= <>
##$BF1= 200.13
##$BF2= 200.13
##$BF3= 200.13
##$BF4= 200.13
##$BF5= 200.13
##$BF6= 200.13
##$BF7= 200.13
##$BF8= 200.13
##$BYTORDA= 1
##$CFDGTYP= 0
##$CFRGTYP= 5
##$CHEMSTR= <none>
##$CNST= (0..31)
1 1 145 1 1 1 1 1 1 1 1 1 1 1 1 1 1 1 1 1 1 1 1 1 1 1 1 1 1 1 1 1 
##$CPDPRG= <>
##$CPDPRG1= <>
##$CPDPRG2= <>
##$CPDPRG3= <>
##$CPDPRG4= <mlev>
##$CPDPRG5= <mlev>
##$CPDPRG6= <mlev>
##$CPDPRG7= <mlev>
##$CPDPRG8= <mlev>
##$CPDPRGB= <>
##$CPDPRGT= <>
##$D= (0..31)
0 1.2 0 0 0 0 0 0 0 0.06 0 0.03 0 0 0 0 0.0002 0 0 0 0 0 0 0 0 0 0 0 0 
0 0 0 
##$DATE= 1617084048
##$DBL= (0..7)
120 120 120 120 120 120 120 120 
##$DBP= (0..7)
150 150 150 150 150 150 150 150 
##$DBP07= 0
##$DBPNAM0= <>
##$DBPNAM1= <>
##$DBPNAM2= <>
##$DBPNAM3= <>
##$DBPNAM4= <>
$$ [...]
##$SUBNAM3= <"">
##$SUBNAM4= <"">
##$SUBNAM5= <"">
##$SUBNAM6= <"">
##$SUBNAM7= <"">
##$SUBNAM8= <"">
##$SUBNAM9= <"">
##$SW= 16.9725357007746
##$SWIBOX= (0..15)
0 0 2 0 0 0 0 0 0 0 0 0 0 0 0 0 
##$SW_h= 3396.73913043478
##$TD= 16384
##$TD0= 1
##$TE= 0
##$TE2= 300
##$TE3= 300
##$TEG= 300
##$TL= (0..7)
0 120 120 120 120 120 120 120 
##$TP= (0..7)
150 150 150 150 150 150 150 150 
##$TP07= 0
##$TPNAME0= <>
##$TPNAME1= <>
##$TPNAME2= <>
##$TPNAME3= <>
##$TPNAME4= <>
##$TPNAME5= <>
##$TPNAME6= <>
##$TPNAME7= <>
##$TPOAL= (0..7)
0.5 0.5 0.5 0.5 0.5 0.5 0.5 0.5 
##$TPOFFS= (0..7)
0 0 0 0 0 0 0 0 
##$TUNHIN= 0
##$TUNHOUT= 0
##$TUNXOUT= 0
##$USERA1= <user>
##$USERA2= <user>
##$USERA3= <user>
##$USERA4= <user>
##$USERA5= <user>
##$V9= 5
##$VALIST= <valist>
##$VCLIST= <CCCCCCCCCCCCCCC>
##$VD= 0
##$VDLIST= <DDDDDDDDDDDDDDD>
##$VPLIST= <PPPPPPPPPPPPPPP>
##$VTLIST= <TTTTTTTTTTTTTTT>
##$WBST= 1024
##$WBSW= 4
##$XGAIN= (0..3)
0 0 0 0 
##$XL= 0
##$YL= 0
##$YMAX_a= 159338
##$YMIN_a= -166329
##$ZGOPTNS= <>
##$ZL1= 120
##$ZL2= 120
##$ZL3= 120
##$ZL4= 120
##$ABSF1= 15.98853
##$ABSF2= -0.9841337
##$ABSG= 5
##$ABSL= 3
##$ALPHA= 0
##$AQORDER= 0
##$ASSFAC= 0
##$ASSFACI= 0
##$ASSFACX= 0
##$ASSWID= 0
##$AUNMP= <proc_1d>
##$AZFE= 0.1
##$AZFW= 0.1
##$BCFW= 0
##$BC_mod= 2
##$BYTORDP= 0
##$COROFFS= 0
##$CY= -3
##$DATMOD= 1
##$DC= 0
##$DFILT= <>
##$DTYPP= 0
##$F1P= 0
##$F2P= 0
##$FCOR= 1
##$FTSIZE= 16384
##$FT_mod= 6
##$GAMMA= 0
##$GB= 0
##$INTBC= 1
##$INTSCL= 2.992141e-10
##$ISEN= 128
##$LB= 0.24
##$LEV0= 0
##$LPBIN= 0
##$MAXI= 10000
##$MC2= 0
##$MEAN= 0
##$ME_mod= 0
##$MI= 1.114404
##$NCOEF= 0
##$NC_proc= -9
##$NLEV= 6
##$NOISF1= 3.799351
##$NOISF2= 2.8
##$NSP= 0
##$NTH_PI= 0
##$NZP= 0
##$OFFSET= 15.97403
##$PC= 1
##$PHC0= -11126.78
##$PHC1= 21.20094
##$PH_mod= 1
##$PKNL= yes
##$PPARMOD= 0
##$PSCAL= 0
##$PSIGN= 0
##$REVERSE= no
##$SF= 200.130007486609
##$SI= 16384
##$SIGF1= 3
##$SIGF2= 2
##$SINO= 5.538805
##$SIOLD= 16384
##$SREGLST= <1H.CDCl3>
##$SSB= 0
##$STSI= 16384
##$STSR= 0
##$SW_p= 3396.73913043479
##$SYMM= 0
##$S_DEV= 0
##$TDeff= 16384
##$TDoff= 0
##$TI= <>
##$TILT= no
##$TM1= 0
##$TM2= 0
##$TOPLEV= 0
##$USERP1= <user>
##$USERP2= <user>
##$USERP3= <user>
##$USERP4= <user>
##$USERP5= <user>
##$WDW= 1
##$XDIM= 16384
##$YMAX_p= 507404845
##$YMIN_p= -3378548
$$ End of Bruker specific parameters
$$ ---------------------------------
##NTUPLES= NMR SPECTRUM
##VAR_NAME=  FREQUENCY,     SPECTRUM/REAL,   SPECTRUM/IMAG
##SYMBOL=    X,             R,               I
##VAR_TYPE=  INDEPENDENT,   DEPENDENT,       DEPENDENT
##VAR_FORM=  AFFN,          ASDF,            ASDF
##VAR_DIM=   16384,         16384,           16384
##UNITS=     HZ,            ARBITRARY UNITS, ARBITRARY UNITS
##FACTOR=    0.207333158178282, 1,           1
##FIRST=     3196.88265163477, 0,            0
##LAST=      -199.856478800019, 0,           0
##MIN=       -199.856478800019, -3378548,    0
##MAX=       3196.88265163477, 507404845,    0
$$ Real data points
##PAGE= N=1
##DATA TABLE= (X++(R..R)), XYDATA
$$ [...]
7261 1343215 1388835 1611059 3553373 4567231 4076783 2078478 1901054 1428674 976021
7252 976021 -94981 -447939 217390 307354 740926 744065 1377498 1457431 1312131 1448706
7242 1448706 804203 759574 442181 312065 1696672 588885 642156 636450 1110618 1709293
7232 1709293 2030113 1533477 1090816 2059084 2411871 3019744 2065549 1293273 600286 815232
7222 815232 1330816 2396185 2862346 2578195 2123032 1821017 1622008 1982597 1241539 1167829
7212 1167829 230903 981616 1568535 920935 2639634 1796526 709241 1142398 117778
7203 117778 -324781 469907 338376 214976 1087428 85448 -674418 459430 736269
7194 736269 1236299 381055 -446098 125031 534864 1356919 2357139 2404814 2716277 1944643
7184 1944643 1556884 47571 -718060 -444944 -1142568 346200 632121 1533565 2312291
7175 2312291 2450286 561654 1138614 1086289 832377 1039414 1015335 1247721 2102817 1724415
7165 1724415 708016 1056918 1115848 1520069 1003882 767971 866778 310305 937950 1903981
7155 1903981 1314809 1749506 1805278 1458353 1680123 926314 -214757 -561651 397832 1118039
7145 1118039 466492 621045 1229143 1915253 2309409 1147642 817717 373418 1467011
7136 1467011 1445820 482904 584115 1603571 2016394 924830 244570 1236344 1449910
7127 1449910 564371 764168 657773 248032 983169 836872 1796569 1449924 -635964
7118 -635964 441634 344727 -112992 775240 209369 682255 559657 -121713 759879 564850
7108 564850 1836012 2877788 3148848 3628476 5554399 5300520 5481602 5601838 5907646
7099 5907646 7035713 7069764 6129628 6856427 6836828 5644481 5688866 4335945 3688602 3074878
7089 3074878 1887675 1509925 925149 1584391 838176 330257 845341 1800711 565551
7080 565551 118082 1005552 1104119 1263919 2186388 1660734 1038752 1192783 2771312 3383009
7070 3383009 2809956 3220051 2503038 3948942 4634308 3610441 3716320 5055143 5568492
7061 5568492 6001936 7124915 6146650 5665970 5531891 3210891 2419342 3508353 2633560
7052 2633560 1884054 706575 2187270 2050069 -264419 119249 -102651 -64971 1273466
7043 1273466 608136 -781311 -6027 956302 -648882 -1210201 235245 -238288 -1040865
7034 -1040865 -250393 -132260 -645370 -111319 -706925 -1137462 -1248869 -395971 -709195 -240297
7024 -240297 -115063 -553394 83459 292579 -229838 -431690 -436221 -1353284 -1113891 -15790
7014 -15790 -362683 -787484 -1323541 -520707 119059 661973 637246 -323825 -999983 -1403923
7004 -1403923 -1703479 -1384471 -862077 -808618 -1728557 -2390207 -1591968 -463307 -292739 -848342
6994 -848342 -934416 -488217 -733192 -1247388 -828402 -867211 -86213 -1425618 -733207 412109
6984 412109 -1452948 -1683957 -1576223 -1355948 -1147905 -2185463 -1288310 -942905 -1535938
6975 -1535938 -521450 -463262 -1312215 -840625 -534936 -785382 -1504495 -2087013 -2090646 -2854285
6965 -2854285 -2917272 -2551806 -2150716 -1421411 589470 240439 725042 -57826 -888225 -1273264
6955 -1273264 -205353 -1039264 -912497 161392 479992 -361472 -1075057 -1505119 -2040879
6946 -2040879 -1048556 -329596 -451790 -980378 -1396630 -1701982 -1204076 -186861 108603
6937 108603 -1018295 -717442 -78665 -212425 -485032 161145 -726875 -1631465 -2590
6928 -2590 856683 -834766 -365016 641791 79599 -1453651 -1840773 -1752763 -2268428 -831273
6918 -831273 -24274 132956 -298158 -566307 -473189 -241257 696627 36486 -919191 -316667
6908 -316667 770154 990098 1062722 506564 -465647 -218942 -767772 -855561 -397160 -1277320
6898 -1277320 -1685387 -2047759 -1312518 -1815104 -2077895 -807057 -814835 -143911 -300524 -516010
6888 -516010 -1497330 -1364798 -1994073 -1271442 410788 -710896 -829183 -610 577975
6879 577975 -608324 -1366638 -1719048 -1458655 -1230594 -1683560 -358795 -1252269 -1991683
6870 -1991683 -1495099 -1562945 -579709 -569994 -1523148 -2228432 -709385 -2036594 -1217055 -1133777
6860 -1133777 -1698952 -1207342 -1342025 -57107 -547400 -1407888 -1226818 -1765289 -634154
6851 -634154 138375 -1624 -517407 -379820 -1642390 -1407695 -1068251 -946613 -538015 -840927
6841 -840927 -1376023 -1900941 -818555 -181695 -75395 195716 -308027 -115558 -1009708 -636378
6831 -636378 -555149 -1242458 -346718 -1322395 -1706625 910711 189205 224891 -887992 -608865
6821 -608865 -41566 -810496 -727428 185156 327515 100457 291095 -696793 372752 -294393
6811 -294393 -1627743 503485 1592143 2337830 2958355 2251200 3327062 540896 1153253
6802 1153253 1655919 417479 1179477 2174186 309219 577778 993736 -13669 -1394808
6793 -1394808 -105510 -159890 166528 1300109 1262144 2826102 2400513 1797403 1475554
6784 1475554 1926262 1913064 1181095 893306 2264295 3223473 4096924 3917510 2077329
6775 2077329 2451149 2648291 1532006 41013 -59928 55948 352772 1166348 1584553
6766 1584553 1191831 1390138 2521876 3338515 4086725 5836599 5135928 4983138 6480633
6757 6480633 6639709 6615194 7273885 5766017 5895522 9156192 10386294 9737688 11284702
6748 11284702 9823666 8982636 8868750 8096440 7785490 7615909 6495848 5772711 4231636
6739 4231636 3082560 3111672 2077475 2717395 1999080 1637925 1092568 291529 348946 1050715
6729 1050715 570571 4279 345672 905102 554047 126995 809548 1634407 1175647 801657
6719 801657 913405 -29444 562601 1291634 1487057 -17795 299514 774080 616377 1086420
6709 1086420 1062843 -832788 -1208197 -1502573 -1410684 119521 821207 -198092 -302515
6700 -302515 49202 -1449218 -1799829 -1769484 -1701574 -2155863 -949432 -534221 -853755 -1120808
6690 -1120808 -1174991 -1721856 -1156402 -1826666 -1139672 -2050222 -935812 -1740372 -2080386 -1308613
6680 -1308613 -1834437 -3234194 -3223873 -2822868 -1908851 -755478 -262653 773978 550206
6671 550206 -571431 -742970 -1016322 -974039 -580686 -460452 268588 245447 -823598 -690786
6661 -690786 -1534302 -1750486 -1481733 46402 -1215821 -1913530 -1239747 -2270323 -1644052
6652 -1644052 -1638504 -1300748 -777079 -556016 -924253 -1023517 -356840 -200680 -1258746 -700745
6642 -700745 -369634 -493957 -438537 -938753 -579322 -740294 -826667 -1189427 -1360831 -2230147
6632 -2230147 -2381112 -690272 -697965 -1020836 -898722 -1008959 -1679029 -1106152 -1179085 683
6622 683 -659115 -1537224 -1431100 -1876880 -1468484 -451239 -1488648 -1261037 -776377 -341089
6612 -341089 -202508 -919135 -1367479 -326122 -959346 -2323054 -1142016 -431361 -823471
6603 -823471 -486068 -696034 -308786 963518 861257 2750 603209 1398137 2102840 441984
6593 441984 55614 843058 73217 70816 407331 653370 472767 -222837 -1452846 -500800
6583 -500800 84342 -1003481 -1374211 -907510 -1106151 -1488060 -1178798 -1594441 -864710 215524
6573 215524 -1188177 -2438393 -3327342 -3079089 -2132758 -1485790 -205197 434090 41089
6564 41089 -707128 -1789419 -2098477 -2342327 -1582532 -8978 112666 -626321 568482
6555 568482 566243 760730 864641 618087 116383 -1219722 -1400005 -860136 -644542 -251437
6545 -251437 -198127 -1034345 -67266 964113 1187894 1065720 202726 -452873 469038 6308
6535 6308 -201022 -863945 -2140067 -2130015 -2177959 -826890 -1173159 -978931 168061 1005799
6525 1005799 -1043475 -1455558 348647 667917 640402 981677 286388 634193 547807 542915
6515 542915 2033522 1459190 2224086 624790 -86165 1080547 1678041 818513 584841
6506 584841 850123 1552793 2222009 1174513 1006841 1673086 2500038 3417082 4173071 5525499
6496 5525499 6931496 5725781 5734407 7347560 7461436 7874430 7953891 6880804 6104658
6487 6104658 4383010 3603420 4426440 4020890 4350627 3933472 3347431 3648863 4168509
6478 4168509 3874320 4333907 4494857 3237026 3034839 4064047 4388019 6871850 7535377
6469 7535377 8567871 7902929 5065875 4637967 3719354 3085134 2994500 2165772 2755680
6460 2755680 1298994 478670 768873 658991 259388 -8550 -514671 -1577264 -562873
6451 -562873 -1219643 -608970 -133476 253769 324236 335309 -539835 -1263931 -1353467 156470
6441 156470 157083 -210793 -604826 -1280683 -807675 928104 557592 455965 -165012 -947183
6431 -947183 -668578 -442308 -236078 -152179 702520 557583 536968 1041478 16772 -79887
6421 -79887 -521295 -83647 413525 -549606 -320925 1009420 161023 1540975 2007620 284848
6411 284848 405315 -268468 41715 98667 1126424 1572869 782871 885615 2227269 2021685
6401 2021685 1811461 2039938 2175563 840836 2263359 1836273 1438257 2834757 2275511
6392 2275511 2144602 1950234 1681872 1701357 1772016 1737215 2361866 2321030 2078391 2456424
6382 2456424 3052435 2819991 2523307 2561257 3396947 2595344 2740334 3407874 2621153 1554372
6372 1554372 1785140 2478372 3541824 2553265 2417918 2926144 2290948 3447068 2453722
6363 2453722 1948298 2792227 3441477 3330676 3880773 4492360 4921986 4917903 4355984 3632315
6353 3632315 4224309 4819582 4593371 3364568 3157506 4300501 3379673 4422723 5124824
6344 5124824 5156924 3918342 2898520 2616029 3254930 4853271 4388569 4213742 4339969
6335 4339969 3157204 2189446 3147887 3380747 3992355 4029382 3403188 3717900 3321629 4930044
6325 4930044 4953174 3555286 3436730 3256700 3830392 5117137 6378852 6936495 5472680
6316 5472680 6005936 7587349 6471963 6248502 6882830 6834705 7986036 8142738 7450641
6307 7450641 8219366 7670715 8963177 9288567 9646103 9295120 8395755 8126418 9695738
6298 9695738 9043513 9445281 10028364 8638641 10424571 9858594 10064056 9873622 9501962
6289 9501962 9737355 9810894 8626034 7989213 9991633 9448244 10749189 11189230 10607442
6280 10607442 10111158 10946564 10572639 10424717 10634648 9360782 10040827 10500386 11058541
6271 11058541 12992304 12329801 10954783 10808680 10182352 10943416 10780023 11171978 11776653
6262 11776653 11069341 11293837 10127420 9180157 9804730 10151572 8986217 8604610 8795723
6253 8795723 8946475 9179669 8670448 8357311 7809659 7552292 8575193 8477010 8184760 8271199
6243 8271199 7396074 8117363 8012813 6570465 6551261 6310954 5462825 6594181 6745250
6234 6745250 5637187 5797175 4988460 4655064 4272542 3378525 4569166 3242662 2708597
6225 2708597 2967985 3447941 3591360 2379244 305524 613501 1071423 2002447 2200880
6216 2200880 3435099 2742324 3293424 3649618 4636918 5780024 4932052 5130649 4740865
6207 4740865 4601586 6275533 5000745 4279836 4361035 3296837 5626124 5879954 6972382
6198 6972382 6701521 5741850 6030986 5159967 3652864 4267936 4112422 3948028 4517653
6189 4517653 4015573 4131391 4550675 3943835 4567427 4105630 3387070 2668961 3205387 2682015
6179 2682015 3386456 4737727 3753793 2481879 2162916 3126930 3557215 3237217 1670264
6170 1670264 2566161 2327022 3720202 3931710 2211206 3544214 3918725 4241633 3631974
6161 3631974 3228573 4277016 3849085 4458533 4439552 3964167 3504644 2994932 1975820
6152 1975820 2137033 3872071 3758896 3747969 3668953 3982994 4162780 4969669 4012642 3948514
6142 3948514 4427965 4677925 3772289 3136597 4612816 4158121 3802201 4054078 4263121
6133 4263121 4308327 4401039 4289645 3856931 4611518 4611620 5263096 4864508 4520170 6687940
6123 6687940 5486496 5437162 6349352 5328725 5831349 6114382 5023684 5703702 5727260
6114 5727260 4879495 4946826 3235228 2820956 3961035 4471197 5650436 5368929 5605010
6105 5605010 5091279 5653428 5398419 5553261 5240578 5421158 6752539 7157292 6533605
6096 6533605 6705226 6473863 7239407 7567557 7078236 7981012 7497973 9020213 8770965
6087 8770965 8339523 9259504 9863973 9301584 9902558 9258157 8648988 8249578 7434166 7149297
6077 7149297 8046678 8365984 8410837 7722756 6942703 5902044 5430705 4985424 4930576 4715510
6067 4715510 5632651 5470526 4719530 4491950 4356895 5248368 4883088 4150841 4102206 5246864
6057 5246864 4232083 4320536 5479309 5973156 6194789 4861282 4987103 5126235 3128028
6048 3128028 3624204 4593503 4517337 4621663 4815648 5070484 5633222 5920152 5959690 5903631
6038 5903631 5349594 5003712 5098154 4962731 5179649 5640309 5550039 4633378 5408956 4667917
6028 4667917 4515610 5149997 3926068 4414534 5281413 4932270 4144404 4414731 4624626
6019 4624626 4303744 4839860 5247267 4677031 4853854 4723309 4617152 5764825 6455770
6010 6455770 6351006 6069712 4813577 6125074 5330013 4646930 5786181 6130354 7036758
6001 7036758 7043022 6300872 5759523 5383508 6003254 7421977 8353925 6865326 7661164 7731380
5991 7731380 7139090 6277089 6224903 6307035 6149106 5728360 5660916 5393698 4732177 5077124
5981 5077124 5679810 3898825 4424445 5460668 4234465 3393144 1938637 1699438 2097407
5972 2097407 3356488 3739239 2370841 2267695 3051452 2545271 3262081 3184500 2803273
5963 2803273 2225697 2861691 2438548 2518184 2148262 3456688 3273228 4271199 3234863
5954 3234863 1809932 2725805 4225918 3268606 2866040 2606873 2556853 2867025 4539356
5945 4539356 3482088 2791744 3287499 3147077 2272919 1624629 2711146 2646604 2128682
5936 2128682 2303681 2221151 1967641 2523033 1244168 1776641 3290978 2647794 2880371
5927 2880371 3596173 2911925 583531 1710338 2459014 2982127 4754697 3235266 2725259
5918 2725259 2285497 2211753 2246433 1248722 2161061 2300360 1426026 1943683 2306638 1581485
5908 1581485 2080424 3108475 3125785 3670027 2519709 2351794 1977887 2006806 1147010 1124135
5898 1124135 2430496 3283111 3328996 2882251 2455276 2073177 1113065 2342088 2251116 2055597
5888 2055597 1671825 1888352 3841671 5180642 4317440 2969481 2705439 2895685 3289333
5879 3289333 3810941 4148912 2490424 4002104 4647020 3976206 3940174 4050082 2985414
5870 2985414 3334637 3333900 2870925 3725329 2719745 4287424 3727395 3642855 3905768 3192358
5860 3192358 3338010 3794832 3427053 3868693 3839782 2647061 2324965 2521199 2532913 2973410
5850 2973410 3005507 3327859 3441698 3946492 3880601 4224585 4895434 4547763 3750893 4934192
5840 4934192 3708375 3587720 3414690 4077711 4681086 2771254 3565294 4142660 4163096
5831 4163096 3909297 3288073 2827581 1671421 1965312 3190842 2852109 2590004 2361094
5822 2361094 2439489 2320776 2746439 2792162 2820239 1355965 898766 2255245 2407593 3112233
5812 3112233 3001096 2963105 2362094 2304842 2767780 3297674 3019720 3412563 3664926 2686402
5802 2686402 2094510 2162636 1954506 2947160 3576096 3194451 2397516 2564686 2940028 2789968
5792 2789968 2172472 2140041 3516712 4684539 5708439 4152891 4439752 4168317 3956731
5783 3956731 3537249 3988009 3577750 4111583 4537758 3931398 4178368 5376219 4719832
5774 4719832 5058112 4998382 5629196 5593282 4858665 4607434 4103471 4780455 4660486 2928748
5764 2928748 3289110 4937817 4553814 4141708 3979251 4905923 4549104 4601682 5269095 4147697
5754 4147697 4067923 5194677 6025704 3782250 3844915 4544598 4698915 3149712 3973465
5745 3973465 3543222 2710658 3934902 4506233 5890219 7290892 5844653 4784694 5264417
5736 5264417 5897451 5873387 4997856 5702384 6677537 7443808 9413149 9311096 9956674 11141159
5726 11141159 10012597 10474077 12576876 12483447 11692793 13071440 14088183 15217886 15506638
5717 15506638 17454659 17661097 17736564 19617224 19869983 20479155 20020201 19423616 19197347
5708 19197347 19079029 19813588 19130318 18614979 18996540 18679240 18712846 18324143 17946608 17765696
5698 17765696 17578920 17432044 16340722 16161307 15615213 15932836 15912122 15756958 14786412
5689 14786412 14206251 12513578 12189450 11259464 12485306 11070489 10766689 10553016 9219282
5680 9219282 9093421 9030062 8500580 7970981 8685806 8089053 7307375 8183376 8169414 6786718
5670 6786718 6224601 8617140 8269392 7026860 7125435 6553572 6568974 6263705 6457980 5419160
5660 5419160 5583775 6463077 6804089 7995111 7800685 6156132 5767698 6053529 6936020
5651 6936020 6864139 6611715 7521954 7226315 7827540 7065061 6957840 8358912 9620729
5642 9620729 9867030 12387263 12674720 11752787 12564058 13013727 13977254 12847762 13700832
5633 13700832 15831984 16048060 15515071 16107125 15750698 14559212 13547565 12412224 11638833
5624 11638833 12092913 11624120 11035671 11364645 10801303 8972702 7828972 7343300 7072201
5615 7072201 6700001 7355561 5378181 4512819 4351784 3963482 4008574 4799393 4623359 5760318
5605 5760318 5871605 4727951 4266301 3889488 4012137 4674269 5273749 4509241 3792649
5596 3792649 3028055 4184578 3513295 3861443 3774975 3986763 4460471 2870898 2837187 2146720
5586 2146720 3425089 5026818 3692118 2754302 2789477 1725523 2508258 2852718 3894823
5577 3894823 4039845 3036122 3313166 3309129 3140175 4258464 2609805 3006771 4235262
5568 4235262 3577836 5254333 6487142 5997954 4729364 4285608 4035993 2775143 3254853
5559 3254853 3311669 2401524 3347017 3906466 3350048 3855827 4686120 4455713 3068521 2622404
5549 2622404 2597737 2961552 4554656 2862001 4006640 5109659 4736513 3749192 3920169
5540 3920169 4406631 4796344 4279472 3423194 3461872 2872225 3366345 4716184 4892242 4604175
5530 4604175 5340860 6996457 6777376 5620470 7451428 6512859 8080656 7808736 6529806
5521 6529806 8529999 8929715 9732863 10016940 9290171 8459154 8417637 7826181 8081879 8376509
5511 8376509 7800330 6455811 6072124 6419800 6861748 6582910 5551199 7108395 7720085
5502 7720085 6544152 7017254 4973635 5519813 7168411 6671194 6388434 5594597 5481983
5493 5481983 6689199 4846530 4934213 6514723 5962680 4813722 4542740 5271560 4902000
5484 4902000 5250885 5136747 5441792 5169666 5264206 5590444 5490293 5599571 4968268 4181021
5474 4181021 3269724 3614001 3632674 3800566 4398023 3760684 5400179 5247910 6124763 6124797
5464 6124797 5741230 6287976 6630395 6967811 5999280 6090475 6723537 8332704 8864320 7742434
5454 7742434 6870946 7239498 7655388 6708201 7025468 6775204 6797395 7210960 6175580 5045155
5444 5045155 5099202 5560941 5336760 5667423 5337159 5159701 6324028 6489971 5758754 5808120
5434 5808120 5647989 5726356 5653640 5054910 4658454 4119423 4596607 5580726 5402015 5219522
5424 5219522 5131867 4271743 4706222 4819686 5044706 3710244 1939029 3047594 3407285
5415 3407285 3693115 2654201 2575943 4008484 3753457 3657610 3923158 3203374 3430681 3872650
5405 3872650 3165008 3949638 3662421 2841648 3915380 4197015 4252047 3264986 3686895 3128891
5395 3128891 3646593 3286340 3224678 2789181 3604024 3853360 3619781 3145193 2596693 4089865
5385 4089865 2732976 2915373 2541921 3077193 3388823 3002602 3956692 3800393 3018361
5376 3018361 3091954 1941078 2303269 3339280 3875853 3287731 2341254 2088288 1487770
5367 1487770 1625947 2676214 4298692 3602906 1936802 2394484 2854333 3204833 2826950
5358 2826950 2985940 2839018 3109138 3081769 2219766 3384549 2997916 3012342 2392890 2189490
5348 2189490 2987545 3611793 5829722 6354399 4791760 4712392 3882497 2368809 3359594
5339 3359594 3625742 2048702 2005766 2655235 3292974 3456060 3401268 3237898 3238846 3823456
5329 3823456 4379755 4370756 4304560 3929181 2923526 3434206 4660927 3606943 3462955 3658066
5319 3658066 2359247 3710116 4116923 4120052 5263513 5556945 5954162 5352550 4944435
5310 4944435 5888196 4744850 4252671 4732730 4790696 4056755 4290373 4043464 5079870
5301 5079870 4484248 3935811 5113211 5021301 4917918 5718808 4453529 4866945 5078996
5292 5078996 4808933 6057353 5659847 4919348 5543363 5646791 5320484 6652680 6446327
5283 6446327 7084189 7134823 6358725 6521447 8189090 7716530 7404619 7386314 7274806 6832001
5273 6832001 6808436 7989741 7792228 6534890 7103447 7456280 7227493 6910370 7953367
5264 7953367 8810168 8597843 7465144 7588138 8103322 7763454 7844451 6889032 7499382 9088578
5254 9088578 9598850 9101269 8037494 7818394 7854904 8357520 8853723 8816229 9433421 9772156
5244 9772156 10214717 10720109 12636720 12727546 12448173 13633386 12823232 11380206 11610085
5235 11610085 12136947 11577433 11788148 9835762 9012737 10033633 11181283 11159815 11895193
5226 11895193 13390498 12228282 11569952 12276209 13613324 13801218 13875689 13695592 14263264
5217 14263264 15396309 15027611 14455982 15928394 15904705 15664325 15112714 14516942 14235995
5208 14235995 13915675 13671958 15394379 14417978 14932885 16052967 16706780 16904916 17727997
5199 17727997 17604936 16200685 16126403 17236194 17022774 16058703 17375936 18620705 19804298
5190 19804298 19890103 21718316 21454735 21565182 22024776 20566007 19773372 19305427 17913100
5181 17913100 18489122 17569149 17218598 17738877 16689094 16705409 19396107 18102463 17472399
5172 17472399 17425937 17782992 19763564 19429288 20204485 20886791 19789318 20356581 20081733
5163 20081733 19984071 21313760 20031759 18835248 18769996 19535949 19725048 19071723 18901117
5154 18901117 19502142 19322815 19289529 18764963 18683135 18275540 18713099 18411175 18408353 18412394
5144 18412394 16736706 17471784 17287617 17020539 18278144 17502020 17665710 18767906 19447316
5135 19447316 21205379 20399221 19872168 19920185 19805309 19441458 20630399 20163552 19351655
5126 19351655 19692006 18982288 18234449 18297653 16768548 15016042 16115082 15631253 16098138
5117 16098138 16376156 14788962 14497320 14712147 15569011 15128775 14534345 15942917 15885003
5108 15885003 16339280 17194665 15842519 14400270 15387242 15986403 17214041 15633708 15289756
5099 15289756 15858068 15693309 16963186 15175473 13135461 14335298 13341131 11986949 12524970
5090 12524970 12103427 12248560 11409078 10907937 11294553 12102829 12711917 11443113 10795390
5081 10795390 11485572 11875584 12153111 12271023 12353656 11809308 11777789 10961736 10198678 9838902
5071 9838902 10515153 11079803 10919862 10706179 10902115 10263282 9824205 10579283 8376263
5062 8376263 8024773 8525517 8337543 8987619 9226413 8498582 9435476 10817755 10850051 9690125
5052 9690125 8153531 8832509 8988261 10734169 11310480 10669906 10492537 10532486 10019773
5043 10019773 10223592 11435011 11220112 10656624 11019717 11458534 10356816 12104753 12388255
5034 12388255 12324040 13836075 13459493 12395956 11446399 11017215 10972595 11057989 12002129 11482238
5024 11482238 11141946 11352880 10037337 9236988 10317948 10705625 11174162 12028454 10708421
5015 10708421 10142561 10669402 11788720 10796801 9248414 9808481 9834230 8849494 9377013
5006 9377013 10458599 9953926 9932155 9627875 8389329 9478115 9880134 9494287 9776295
4997 9776295 9099974 8363127 8401770 7707654 8448640 8414820 8035056 9923354 8230755 8203506
4987 8203506 8702949 8437769 8033538 8766848 9483516 9576923 8901290 9257497 8917412 9587572
4977 9587572 9971179 8321657 7765593 8811641 8500315 8726383 9344554 8304444 9015757
4968 9015757 10072554 9588482 9245855 9776556 9563483 9446697 9139274 8806621 8010093
4959 8010093 9003780 9992251 9462326 8026384 9909125 10614906 9796190 10502220 10118475
4950 10118475 8632814 10444629 10654382 10048142 10663242 10731702 11819415 11376934 11246203
4941 11246203 11976532 10940835 11293293 11428087 10972059 11394064 10497442 9298048 9170626
4932 9170626 9082165 9453888 10150599 10061706 9406666 9671699 10490737 10631612 11600292 10042616
4922 10042616 9477258 9386360 9708361 11225128 10904569 11091541 11515521 11531268 12018384 13164862
4912 13164862 13043822 14376441 13333196 13300492 13490564 12794134 14305357 13826137 13078765
4903 13078765 13031427 12384766 13157363 13263669 13422610 13314819 12868450 12473128 12080939 11575190
4893 11575190 10765125 12168337 13111099 12042873 12671938 12725390 11564121 12193021 11684903
4884 11684903 12344897 13378975 12949163 14151705 13516004 12926803 14777494 13430637 14370895
4875 14370895 15073422 15352416 15347538 13383254 14553484 13818751 13649301 14415622 14405357 13648524
4865 13648524 13991419 12921033 12758124 12836861 13239119 13103993 12743186 13473927 12795481
4856 12795481 12974484 13844965 13437448 13180403 13444386 13737812 14012132 14389863 15307555
4847 15307555 13988298 14986580 15089519 15264877 15206582 14864784 14671678 15354989 15449965 16395649
4837 16395649 17166476 17886795 18713309 18111313 16888968 16893923 16264907 17007963 16869193 15911080
4827 15911080 16328960 17168708 16406090 15928399 15630724 15970589 16098075 16117402 16075653 14790234
4817 14790234 15126715 15869017 15470585 15291555 16219530 16655795 16273206 16668410 17280832
4808 17280832 17190120 17683374 17354303 16731453 16451398 16124139 16854293 17174433 18607364
4799 18607364 18504933 18232150 18596671 18621069 18604447 17635679 18184641 19058175 19068747 19928936
4789 19928936 19240600 17939856 19159949 19096552 18188109 17934456 17121523 16956782 17132988
4780 17132988 17235484 17302800 17575598 16978041 17168789 19078099 18873479 17455957 18697007
4771 18697007 19870350 19873627 20880241 20715437 20690733 19082584 19181143 19895228 20535700 20604098
4761 20604098 19937510 19478730 19937187 19347250 19469876 18839878 17821951 18466787 18198580
4752 18198580 17767915 18705653 18000760 17793454 17417070 16722070 15939275 16188665 16443296
4743 16443296 15490346 14685096 14165369 15411354 14732361 14580679 15523225 15805424 15110879
4734 15110879 14378332 15355635 14676544 16246529 16972580 15940811 15968745 14878074 15149300
4725 15149300 15442102 15797721 17036223 16665416 17265864 17664120 17503677 19178908 20202115
4716 20202115 21145509 19103292 17054732 16463132 14444934 13911498 14834496 15021701 15374157
4707 15374157 15215948 15114934 14790426 14586788 14466924 14074125 14388366 12981072 13339116
4698 13339116 13338266 13139801 11891372 13179164 13707916 12798125 12249924 12507544 12592636 13029895
4688 13029895 13119039 12834042 14314700 14336265 13987597 14775816 14026306 12845924 13416503
4679 13416503 13475924 13014604 12279453 12586927 12637878 12495921 13037659 14074667 13562270 13100988
4669 13100988 12826211 13734508 12526600 12590393 13767100 12455226 12480319 12934348 13158103
4660 13158103 13246336 13658261 14047658 13712645 13223200 12652296 12379038 12331292 12367758 13244430
4650 13244430 13970473 13280419 14392796 15018245 14445391 13645553 13667024 13090400 13642915
4641 13642915 13954672 13334624 12648347 13063052 12594849 13248220 14745178 15245860 14146448
4632 14146448 14363124 13861665 13856489 15396130 15298676 15760741 14943620 14704284 14426879 14790223
4622 14790223 16158424 15163980 15652598 16024076 16145808 16843558 17290960 17027651 16989683
4613 16989683 16536000 15710337 16739872 17149159 19415164 20432429 19912527 19857266 20675673
4604 20675673 20774136 20929540 20783209 20161859 20612495 22389422 23353872 23235577 24448844
4595 24448844 24289128 24371193 25810577 25796958 26151714 26053737 27569962 27855899 29048731
4586 29048731 30525969 30593835 32131913 32947390 34298938 35350661 34670064 34184267 34659873
4577 34659873 36619012 39500810 40390509 40157928 39901423 38590668 39913408 41228104 41441356
4568 41441356 42436989 42367066 43406259 42907621 43290809 42087280 40817671 42321666 43520211
4559 43520211 42494349 42480814 43422136 44472805 44456720 46217780 46671104 47287935 48186445
4550 48186445 48662900 48609602 48555075 47408369 47789882 48253486 47987106 48465167 48697545 47250811
4540 47250811 47061635 47862654 47807520 47826975 47104623 47422108 46252811 46530775 46336016 46866470
4530 46866470 47114756 46722462 45384361 45196119 44207610 45217159 44743713 45069129 44240220
4521 44240220 43114450 41873964 41916938 42609774 41352640 40539966 40766592 39874502 39198960
4512 39198960 37567616 35441275 34818754 34381322 33251027 32762744 31342751 30065375 29171269
4503 29171269 28073381 27960317 27208658 27845767 28427171 27376502 27941967 28122938 27335499
4494 27335499 27776587 29236455 28361382 27321332 28806217 29705424 29549471 29625379 29459738
4485 29459738 28166286 27172250 26332736 26366226 25641112 24534782 23522097 22103558 21698892
4476 21698892 21860814 21548305 21736748 21272943 21317943 21335475 20348586 20722813 20736864 20170358
4466 20170358 18252135 17687486 18337122 18196462 17736342 17242692 18048177 18153972 17479290
4457 17479290 18294745 18969893 18018965 18241903 17512440 17580384 18410362 17317976 16331576
4448 16331576 15570323 15606559 15420208 15367711 16004499 15021920 14342185 14440239 14755969 14876246
4438 14876246 14343594 14790380 15617826 15327082 16306510 15479876 14840620 15213302 16214458
4429 16214458 16558468 15820648 15233267 15423621 14146959 15267068 15707023 15284092 16101376
4420 16101376 14482282 14990704 15667549 16149738 16650844 16528687 15952582 15640357 16254802
4411 16254802 15653295 15506814 14730888 15175060 14815906 14869922 15896752 15935180 16083534 16556513
4401 16556513 15522888 15811478 16679130 14869939 14672722 16896538 16831886 15827754 15478014
4392 15478014 15005997 15003060 14944054 14509880 15412313 15289164 15523174 14951192 14622430 15251311
4382 15251311 13498503 14352809 16194238 14706014 14002017 13704146 12983583 13928759 14299692
4373 14299692 13854280 13412333 13348861 13703482 12928154 13882374 13538437 12045240 13112958
4364 13112958 14131591 15480548 15163977 13514437 12309843 11528992 12818856 14454222
4356 14454222 12775478 12644573 12947617 12919495 13280710 12613645 13051996 12593973 13290745
4347 13290745 13550429 13221780 14535083 15135132 14438112 15251604 14730231 13675428 14057189
4338 14057189 13140814 14047304 14429610 15424652 15514014 15171512 13665779 14482791 14482902 13328237
4328 13328237 14363995 14856268 15097749 15813328 15816072 16856672 17727505 17906483 17764084
4319 17764084 18109910 16267934 15813960 14731666 14997551 15963874 15920888 17011430 17149899
4310 17149899 15960134 16045834 16113964 15917194 16244944 16285722 16297367 15974753 15663492 14325776
4300 14325776 14034373 15187981 15037331 14533285 15272510 14150171 14616393 15054334 14764428
4291 14764428 14321702 14877673 14162808 13949947 16278788 17289936 17239813 17232594 18676336
4282 18676336 17933362 17641915 17809196 17466282 17715773 19043157 18998408 19158809 19040916
4273 19040916 18930267 20887644 21039222 20405275 20698183 20518473 20519770 21528386 21411878
4264 21411878 21544023 21614802 22266996 22073705 22117749 21738508 21036882 22288413 21603167 22058376
4254 22058376 22234503 22777200 23654826 23251189 23443119 22400409 22478264 21740810 22179839
4245 22179839 22538818 23300409 23220536 23351955 24778843 24932123 24772188 26169672 26196491
4236 26196491 25817851 27534637 27891661 27569343 28890217 28257819 27640929 27341615 26163231
4227 26163231 24210067 24712598 24635738 24065143 24218543 24380365 24578450 22788581 22217438
4218 22217438 23681495 23909900 24445087 25629978 24914531 26550607 27575969 26029510 25744446
4209 25744446 26316865 26929121 27944235 29621472 30561815 32124478 33897341 34162653 34251111
4200 34251111 33320829 33662327 33189352 32369082 31126181 31061476 32652440 34110506 34704252
4191 34704252 36174528 39363408 41127835 43566969 46827238 49379563 53053270 54147959
4183 54147959 54759072 54480278 49498138 46315809 40679286 36956254 35305288 34072994
4175 34072994 33147954 31645791 29904162 29458703 29264216 29268088 28410724 28681500 29418085
4166 29418085 28992392 28868174 27641563 28212162 27267933 26061572 26338820 25513659 25414446
4157 25414446 25079890 25153969 25992309 23667445 21530251 23063008 22310553 22270059 22347304
4148 22347304 20662083 22196198 21958607 21391062 21571869 21627019 22101196 22275703 21315572
4139 21315572 20264727 20603103 21623299 21129997 21919462 21587631 20677521 20158394 20333575
4130 20333575 20383994 20428227 20646239 21976865 21470580 21118158 22110302 21477188 21828976 21815128
4120 21815128 19603033 20031150 20193509 20661339 20616207 18679318 18299789 18620523 18499578
4111 18499578 18683780 17705496 16118654 15128519 13833847 15146033 15937388 15281236 15879012
4102 15879012 14815411 15120109 15168715 14049569 14266134 14233697 15004180 14952585 14648785 13866496
4092 13866496 14562803 15673602 15269997 14979820 15377153 13836238 15159976 14818168 14148495
4083 14148495 15789713 14108706 15592665 15024845 15192821 15780323 14464711 14640898 14544228
4074 14544228 14796918 14702561 14406963 13944379 13017025 12481128 12762436 12167687 12879567 14436410
4064 14436410 14393294 14295324 14894649 13312355 12986374 12519830 12860655 13210124 14116928 14584153
4054 14584153 13811845 13660444 12581617 12605359 13746032 13991412 13173029 12178332 13710603
4045 13710603 14841794 14024567 14367294 15243845 14469555 13183708 12457460 12458097 13979420
4036 13979420 13851400 13690569 14077187 14570467 15443447 15105243 14785222 15433639 14831101
4027 14831101 15868693 15007238 13168181 12647457 13047760 14578644 15018937 15020981 15704821
4018 15704821 14329348 15067753 15919857 16124215 16175914 16138766 17038029 15483914 16476569
4009 16476569 15950285 15349627 16209492 16300896 16157297 16322242 15414075 16019970 15911081 15164523
3999 15164523 15494101 15031204 15837801 14888230 14727853 15490343 14563954 14405845 14597778
3990 14597778 14074361 14738555 14935472 14576423 14806619 14981875 15317134 15758935 16832419
3981 16832419 16626526 16019310 15978965 15862281 15024983 15917559 17062444 17346616 16345200
3972 16345200 16821233 17062946 16113931 16857675 16078102 16109990 17216993 17636001 17589537 16474652
3962 16474652 16913660 17828700 16447277 16459509 16404232 17068552 18247001 17815403 17881176 18972485
3952 18972485 18777598 18073221 18440282 18145060 19591484 19398219 18689637 18526821 18317045
3943 18317045 19439589 18849372 17939538 18223661 19477641 19630517 19881193 21165646 20655509
3934 20655509 20233682 21891247 23683760 24093509 22470643 21249127 23454621 23509186 22825139
3925 22825139 23288569 22686936 23588323 22963439 23961774 24395147 24316813 24268276 23025312 22158703
3915 22158703 23081955 23783320 23601556 22850139 23564774 24671869 24003627 25438417 23787238
3906 23787238 24366120 25000884 23937013 23951879 26000925 27248508 25581731 25558678 26950244
3897 26950244 27205662 27108206 27207118 28063317 29921156 31541734 30849649 29427876 30331526
3888 30331526 29801155 29279177 28735723 28575809 27255632 26449914 26842463 26468053 26179820
3879 26179820 27385627 27070555 26171769 26616307 27632136 27959724 28649740 29413829 28977302
3870 28977302 28801059 28068760 28167213 28088076 28723945 29129115 29088673 29552091 30060909 30014044
3860 30014044 30454946 29963192 29145631 30816867 31324000 31593696 31963142 31066401 30521747
3851 30521747 31106249 31192350 31701275 31178606 32117999 31551213 30533678 31956197 31760504
3842 31760504 30057149 29952958 30674063 30769452 31576633 32739286 33629935 33780955 34741043
3833 34741043 36089068 37140576 37681190 38950030 40242912 41292922 42550523 43388762
3825 43388762 43177018 43351894 43734035 44257937 43764491 43050830 43340810 41850409 41038484
3816 41038484 40206779 38465032 36704974 34527861 34178818 33932589 33552593 33345332 32819740
3807 32819740 31876654 32574727 32979032 32626794 32791501 33634547 33663292 32236469 33635028
3798 33635028 34125181 33871145 32794836 32239215 32604704 32919593 34554733 34641951 34628740
3789 34628740 35254093 35268705 35289424 36860594 37824615 39017632 39282282 39104344 38860957
3780 38860957 40302408 41514936 41214658 42847215 45535178 46936441 46194008 46090851 45935762
3771 45935762 45946020 45566269 45201536 48138964 49601857 49734836 49363128 48958451 50607446
3762 50607446 51094549 49903216 49789899 49708950 49108008 48980768 48999596 49721729 49223234 49472638
3752 49472638 48478014 49979484 51989350 51108454 50802099 49439660 49397632 49377444 48292096
3743 48292096 48403644 47815566 47329217 47327110 45729591 44643674 44499200 45056455 45803930
3734 45803930 44796356 45487938 45956003 45255093 44843045 46108562 47967095 48742619 49432719
3725 49432719 49462820 49326060 49843629 49032224 49287793 50482845 49913627 48735628 46956006
3716 46956006 46572221 47419179 46309376 44769146 43739522 42294531 43046578 42506233 42835345
3707 42835345 42984459 41932902 43724590 44103834 43866726 45277069 44491632 45648602 46027878
3698 46027878 46639166 46585097 46098636 45564489 44027531 44245023 43321495 42396786 42702796
3689 42702796 43079910 42494461 42178904 41853365 41419186 41102547 40956540 40593982 40232657
3680 40232657 40422005 39029411 39109770 39089499 39477670 39000724 38316933 37027045 35929463
3671 35929463 35503803 35408795 35610323 33619352 34623506 35159744 33591204 33619351 34190964
3662 34190964 34093741 34753332 34771834 34225747 34127191 35244959 34572308 34180854 34233041 34876298
3652 34876298 35264004 36679617 37605905 36168482 36650678 36824732 35895019 35015208 36577355
3643 36577355 35912239 34792382 35884667 34922205 34534623 33767358 35644907 35526058 34263250
3634 34263250 33734188 33663652 33509723 33647708 33175951 33336963 33359055 32162271 32318613 33208660
3624 33208660 32923713 33151473 33001062 34519131 35471200 35065911 34951965 33541873 32800305
3615 32800305 33043291 34100690 33170293 33007703 32389215 31470520 31169715 31949572 31397499
3606 31397499 31023859 30493826 30695312 30323614 29969814 30740627 30000988 30446267 30470630 29958090
3596 29958090 30352582 31981010 30645546 31007877 32421528 31475983 30544404 30526513 31331806
3587 31331806 30935596 30032080 30682369 31354095 31278168 32095920 31231471 31043541 30788889 30227418
3577 30227418 29823341 29840453 29551579 29548918 30241243 30648592 30080683 30371542 30631550 31055256
3567 31055256 31750872 31383210 32215545 32308020 31823899 31720770 29951499 31801155 31763954
3558 31763954 32136624 33484699 33523814 32509318 33531223 33459594 33255876 33322674 34557033
3549 34557033 36229372 36843464 37229601 37406259 37903445 38796466 40808308 40565080 39422187
3540 39422187 38479352 38735048 37595622 37568507 37354868 37798893 36856243 35954386 36311189
3531 36311189 35743335 36859392 37970238 37392463 38029847 36994976 36659840 36912158 37618515
3522 37618515 37597612 38548074 39155885 39855885 40429850 40427123 39181024 38963116 40182730 39914385
3512 39914385 40003278 39945175 39151018 38177993 38863639 39079035 39523304 39592474 39541312 39672452
3502 39672452 39788198 40609815 42210782 43027369 43319120 42435884 42166532 44362994 45329068
3493 45329068 45632039 46447631 47689198 47659098 47487723 48792942 49561625 49979576 50360263
3484 50360263 51106724 52609700 52952199 53436002 52764258 54873466 57805037 58109213 61075109
3475 61075109 62760420 63937871 67107246 70098891 71583142 74545208 78787318 83901788
3467 83901788 89565401 94523878 100737700 107360770 112925014 117487544 119159955 120173903
3459 120173903 120861131 122074769 121871163 121815823 122631624 120090194 115543728 108785562 104374002
3450 104374002 101331129 98951053 97191921 94021385 93359780 92568487 90610075 89981427
3442 89981427 90209268 89808896 89234786 88528693 87403971 85639681 83264487 81481714 80690310
3433 80690310 79447508 77781653 77561825 77088593 78026507 78174259 77939508 78062108 77111902
3424 77111902 76491270 75220660 73874645 72144143 72048674 71021675 69687737 70033275 69745751
3415 69745751 69594564 68768628 69191739 68973921 67760927 68822989 68711402 68783333 69433551
3406 69433551 69805455 69620674 70739101 70643754 70382857 70644158 71753358 72750022 72237945
3397 72237945 72676644 73109531 73737544 73374450 74890798 75630158 77512142 78968042 78740727
3388 78740727 78726606 80097882 80768965 79409804 79406594 79623395 79667201 80524272 81504595 81914190
3378 81914190 82203193 83384396 83955309 84761244 85077498 84860387 86129259 87742596 90179071
3369 90179071 91192876 91133520 92351030 93595917 93420835 95235359 96005838 98361669 101341253
3360 101341253 101173270 103475636 105844992 108540523 111058622 113348404 115360334 117136214
3352 117136214 120374129 122097952 125052070 126933636 130957841 136144295 139672290 143206036
3344 143206036 146703322 152579012 158876082 164959989 169175466 173792692 180784431 187627295
3336 187627295 194835048 203345186 212340677 222242195 229464257 235341301 238084693 240948748
3328 240948748 242682735 242538755 240819178 237777837 237309132 237699360 239044553 241172788
3320 241172788 243456659 246645875 250010928 251691080 250541850 248280869 246261340 242301673
3312 242301673 237711790 232501265 227905788 222941915 217663282 214596386 210280936 205854826
3304 205854826 200572680 194401531 187463283 183114817 177768671 172014972 167611610 162943877
3296 162943877 159971510 156290826 153749541 150564607 146441426 142352413 139856179 134663361
3288 134663361 131143583 128224604 123948336 120226582 116941575 115121149 113008665 110828407
3280 110828407 108918985 108746214 108675150 106548707 105238410 104065699 101817001 98903876
3272 98903876 99053147 98899257 98983848 98945115 98693480 98305145 98535737 99192918 98693592 99241525
3262 99241525 98573178 98466407 97592157 97160659 97143954 96751019 97853410 98472228 98463330 99229808
3252 99229808 100298135 102106128 103217580 104958266 106801607 104952130 103993031 103545011
3244 103545011 101800632 101599903 99898074 97791139 98287284 97635658 96987497 96759472 95925927
3235 95925927 95410620 96317473 96776427 96175306 96745826 96441683 95602935 94881222 95102372
3226 95102372 96369439 96966565 98931962 99418816 99379805 99852987 99767871 101627904 101987635
3217 101987635 104189267 107437810 108323699 111319306 113443363 116368519 118663701 122094119
3209 122094119 124888101 124297870 125732318 125968196 127416222 129722771 129926243 129333129 129419264
3200 129419264 128740851 128412950 126611843 126906515 125912087 124704332 124480324 125239410 125865234
3191 125865234 126725623 128672660 129425601 131240837 133760535 136331800 139725065 142187618
3183 142187618 144848760 145675786 143263239 139558292 136454326 134425041 133550687 133890098
3175 133890098 132806360 133779307 135438993 136549237 136977715 137610604 139745476 142980983
3167 142980983 145576168 148856035 151364373 155161702 159474933 163667983 168398181 174835044
3159 174835044 182560938 187652904 191433568 195655440 199314561 201340026 201310043 198534203
3151 198534203 195446123 189773315 184095374 177367707 168118856 162120806 156567380 152262852
3143 152262852 150194318 147130933 145024045 143429204 142679346 142581134 141624644 140274335 140125240
3134 140125240 140339441 139657710 140354489 139771054 138539346 138516980 138723855 138510874 138698073
3125 138698073 140985060 142105994 145070091 147637147 151543204 157379423 162153655 166362088
3117 166362088 167503361 167376894 165295596 161501964 158063108 152893583 147216313 142057193
3109 142057193 134772738 129311170 123633817 118712349 114773997 111716145 108450165 107172551
3101 107172551 105458184 103405578 102282645 100101375 99327775 97476945 96889639 96188267
3093 96188267 95579542 95816591 94667258 95077823 94682715 93880116 94088663 94179344 94324848
3084 94324848 93923050 93904828 95518719 96428971 96263784 97528223 97883308 98007325 98120194
3075 98120194 98796048 100215601 100840687 100121844 99348712 101474802 102693633 101233020 101398386
3066 101398386 102328508 103241824 105166017 106262723 106370677 106974937 106703288 106940877 107459404
3057 107459404 107020316 106946222 106457811 106048277 106810103 107145960 106561270 108073585 108545655
3048 108545655 107973979 109094631 108310318 108079225 108580167 108320787 108799378 109453211 107883021
3039 107883021 108273273 107883786 108373468 108522785 107640546 107350951 107874074 108939435 108620366
3030 108620366 109484111 108959637 109524164 110362946 110111740 110650129 111190844 111330020 111025666
3021 111025666 110221318 110536142 110903927 111567452 111612048 110493992 112200417 113708353 113734302
3012 113734302 113810900 115354812 115976023 115500763 117179341 117015036 118387665 119243109 120191707
3003 120191707 120611167 121690929 123018329 123940274 124151660 126722340 128295386 129881105
2995 129881105 131582299 133270727 135549758 137872002 140549672 141384663 143369087 144838600
2987 144838600 147558425 148919962 149620938 150613580 151604503 152517386 154388489 155779512 158283695
2978 158283695 160435811 160133964 161230772 163326070 164585509 165439101 167057986 170450902
2970 170450902 172587579 172947577 174690785 175376079 176538984 177161735 177667778 178628035 178448212
2961 178448212 179542435 180591660 182393231 183850008 184960490 185214917 186808847 188303960
2953 188303960 189333951 190798403 190968687 192307836 193013804 194187168 194653055 195238030 196675591
2944 196675591 198132863 199235290 199464332 201698942 202708836 203332682 203102362 203215378 203361276
2935 203361276 203365107 204949954 205098996 205266748 205804584 205970940 207389602 207524299 206560874
2926 206560874 207996416 208619273 208176026 208918925 210120700 211894782 213305129 213273036 214235948
2917 214235948 217066260 217266160 219110117 222377993 224198693 228698552 233704107 239538130
2909 239538130 245201392 249380574 254019341 257816358 261532738 262900250 263722353 263529860
2901 263529860 264169658 264649359 262576172 260357067 259336386 258309917 256984365 256131373
2893 256131373 255830905 255110019 251642203 248593507 246581093 242159850 238215511 233996329
2885 233996329 228680513 224845981 222271277 218034358 213573918 210460904 207070145 202384768
2877 202384768 198011002 195002361 191929316 187375056 183380111 179513795 176369730 173380468
2869 173380468 168800208 165299659 162013528 159813263 158427052 155509208 152823729 151436386
2861 151436386 148639978 146202830 144412837 142198959 140928458 140296405 138059032 136954470
2853 136954470 134780129 134862062 134053018 132691533 131347463 131268959 131414983 132181120 130689588
2844 130689588 130928165 131520895 131278358 131142544 129859579 128958944 128351264 128321171 127984826
2835 127984826 126568356 125598236 124546958 124051443 123180070 123530150 123747765 121987511 121707655
2826 121707655 119882741 119465482 118944609 117844755 116861238 116874010 115624071 114857759 114874831
2817 114874831 112906836 112635638 111825143 111009891 110096934 110402001 110286779 108887366 109888203
2808 109888203 109059958 108561658 108198034 108542855 108403786 107513758 106894539 107061110 106354460
2799 106354460 105915301 106066615 105766376 103569166 102636366 103524940 102928236 102180995 102315278
2790 102315278 101508409 101703253 101109177 99246969 100306141 100273653 99235821 99730725 99264253
2781 99264253 98893209 100058279 98797581 98930166 99790339 100542616 101237607 100020211 100277093
2772 100277093 101282157 101992228 103382575 104432726 105045764 106223765 107212946 109556098
2764 109556098 111562447 112387231 113526802 115477409 117628930 120156128 122643239 124851623
2756 124851623 127668492 129339542 130569312 131376864 131575793 131760582 131051050 132552076 133419486
2747 133419486 132859337 133502198 136324770 137272934 137001460 137810382 139029578 139098337 138584839
2738 138584839 137850934 138915673 138740364 138590436 137407529 136492361 136569599 136176438 136917909
2729 136917909 137343218 137588020 138236731 139384143 139831902 141741646 142710239 142669284 144127825
2720 144127825 144962668 144604042 145910289 147428715 148485916 148032572 146925129 146528567 147793580
2711 147793580 148957782 148025422 147759035 147474481 145786540 146118467 145159091 145251314 144286466
2702 144286466 143359692 142735796 141282028 141168890 140693982 138540465 137741161 135400526 133474764
2693 133474764 132306726 130605098 129556863 129411178 128586717 128777944 129301243 129620760 128789736
2684 128789736 128389944 129829940 132089984 133278068 132358394 133569701 135104568 136747792
2676 136747792 137808441 138911748 140126144 143151952 145671293 149542034 152589213 155771267
2668 155771267 157735536 159100975 160661806 161873661 164036525 166435673 167207660 168130326
2660 168130326 168892357 170841143 173051558 175191880 176275338 177338417 179025461 179151670
2652 179151670 179129844 178113270 178104268 176742723 175975931 174165766 174166487 172879694 172296545 174414291
2642 174414291 173446665 173701105 175324506 175664491 175447560 176301963 177278922 177753549 178601232
2633 178601232 179485220 180460498 182458865 183527486 183452143 184576786 186323404 187256529 189366591
2624 189366591 190817092 191855333 194231604 196773954 199963878 202249870 203410900 205193686
2616 205193686 206266940 209370479 212439477 214847850 217981446 219809149 221940167 223768381
2608 223768381 225627231 227314903 231612591 237430222 241603243 245292635 249929480 255272258
2600 255272258 260739985 267080903 274806569 280643715 284984879 290859189 295783534 299580286
2592 299580286 304234484 306951774 310623057 314847398 317599795 322823255 327363144 332649487
2584 332649487 337590391 341439096 346156661 348235294 349282411 349261506 350298230 349769002
2576 349769002 349089527 347939953 345510457 342408735 340102917 338465234 336556978 334786627
2568 334786627 333512637 331267142 329258606 328288134 326707256 324591521 322422741 318266980
2560 318266980 315866070 313967576 310389106 308531405 305799235 305403625 303658113 301451191
2552 301451191 298527091 297672350 298091254 298530315 296699240 296376787 295810861 294372943 294752909
2543 294752909 295590184 295242753 294493716 296679553 296894655 295476914 295361079 294727183 294639294
2534 294639294 293801686 291954523 289844477 286618046 284438172 282657868 280612894 279122375
2526 279122375 277309071 275235772 274364743 272845123 270146764 267041343 262985484 259789665
2518 259789665 256860175 251425777 246566142 240895807 235738656 231347497 225635089 220764856
2510 220764856 216581022 211778008 206482885 202709468 198301517 193594832 188704039 184500241
2502 184500241 179615594 175209342 170719993 165998892 163712646 159292633 155020793 151749612
2494 151749612 148482468 145014524 141447102 138012325 135026527 131948022 129730287 128117106
2486 128117106 125679801 122706392 120136643 117830254 114814070 112840773 111021098 109157393
2478 109157393 108504774 105673497 103692810 103146255 101012421 98992129 96553988 94660679
2470 94660679 93541123 93007084 91068660 88028822 86704813 85944505 86344055 83773592 82373481
2461 82373481 80572630 79269448 79352393 78454319 76799061 74902602 73439516 72146396 72626935
2452 72626935 72175323 70480813 69977274 69576284 69343660 68172553 65567902 65330342 64670365
2443 64670365 64636311 63703268 61021781 60083597 60352281 58404506 58051953 57465131 56701275
2434 56701275 54729532 55088336 55104651 53204640 52545850 50945396 49146465 49295087 48815252
2425 48815252 48496927 49089873 49235255 49262232 47360454 46771433 45986706 45192048 45967137
2416 45967137 45592340 44572839 42900360 42362279 42385217 42377086 43023272 42078274 41518950 42672174
2406 42672174 42087009 40999752 41430558 41313496 41561923 41146768 40923404 39689490 39869795
2397 39869795 40910697 39571648 39721034 41287095 40210976 39500136 40037634 40743823 40397102
2388 40397102 40320265 39929139 39610219 39280790 40574360 37841501 35389425 34714358 33828659
2379 33828659 32981460 33374334 33578590 32681395 32194736 32541596 32880305 32057882 30662204
2370 30662204 29599766 29778368 30562863 29780577 30137273 30948688 29937135 28389453 27608418
2361 27608418 29011659 28082721 26895439 27249557 27799297 27016939 27763449 26492238 26112617
2352 26112617 25991151 26410752 26509956 26212645 25216924 24294348 23939885 25443561 26057840
2343 26057840 26739630 26753820 27902597 27610259 26044722 25597975 25144691 26367206 27429105
2334 27429105 27113078 27173560 26582832 25902607 26631314 27803242 27297008 26120898 25108284
2325 25108284 24171933 24122302 24001627 23556368 22567675 22752746 22474685 23332928 23052733 22659453
2315 22659453 21162723 20234567 20458605 20608265 20519256 21545050 19932337 19585938 21149101
2306 21149101 20749448 21082795 20786439 20836933 20391249 19031533 19250687 18695239 18651831 18541941
2296 18541941 19252276 19165742 17905003 18196609 19366788 20012563 20794896 19702587 18814275
2287 18814275 19764089 18480218 18232026 18184293 17702400 18566480 17999297 18235243 18200167 18191540
2277 18191540 18551047 18930686 18113137 17632494 18092494 18493298 18458951 17935803 18921023 19544613
2267 19544613 17744959 17628642 18266990 17376605 18000024 17634688 17545883 19107297 18386610
2258 18386610 18717276 19612391 18600893 19375365 18991291 19327411 20223687 19611988 18713108
2249 18713108 19471705 19144388 19573063 18755961 19672718 20653155 20003967 20284413 21626645
2240 21626645 20429990 20424178 21439715 20782278 20715268 20840180 20953822 21442058 21105613 20743869
2230 20743869 21628000 21851462 20512054 20399595 21534857 22340044 21501543 20617237 21036969
2221 21036969 21908345 22640182 24004261 23756491 24629370 25127931 23147530 23018431 25568808
2212 25568808 26788920 26683866 26606725 26174828 26335547 26588212 27124670 27717459 28456994
2203 28456994 29140786 29340341 28815813 30366289 31776943 32804701 32491716 32551226 34637901
2194 34637901 36561358 35652621 36897807 37513839 38407009 41179348 43788341 43832071 45402328
2185 45402328 48067239 49363795 51596859 54249834 56277098 57834035 58691635 60640753
2177 60640753 60299984 60310361 59854079 56138743 53485049 50248800 46904881 44622803 42835229
2168 42835229 40185444 38062453 36398088 34931582 34315328 32162759 30495201 29991367
2160 29991367 30556364 30737359 28633253 27210790 26030597 26077123 25134021 24445993 24103318
2151 24103318 22234198 22110566 21759394 22484542 22277055 22787665 22863088 21674574 21390016
2142 21390016 21377031 21670310 21174940 20483708 19735929 19984938 19757831 19431268 18917140 18539250
2132 18539250 18892841 17945067 17781793 17572148 17664422 17415298 17441360 17965839 17062021 16286860
2122 16286860 16920977 16700155 15324563 16569373 16435202 15818133 16336726 15857922 14516109
2113 14516109 15799493 15594863 15871930 16121426 16026419 15478142 15210001 14652187 13466647
2104 13466647 14339335 14533940 14822848 14474520 13477607 12874790 12267275 12987127 12994749 12634153
2094 12634153 13087144 11745620 11213214 12229991 11637715 11733548 11493852 11373280 11283375
2085 11283375 11068814 12096912 11796945 13250393 13019719 12244579 12165522 12798451 12973546
2076 12973546 11614186 12812373 13618672 13562290 14834003 15421136 14292104 13232833 12791380
2067 12791380 11942774 12016924 12633266 12706273 14126175 13314300 13154907 13303387 12183981
2058 12183981 12946795 11979306 11593884 11356714 11388535 11287175 11272660 12385455 12009131 12591772
2048 12591772 12396457 12349588 12783852 13988608 14012109 14483383 16159786 16607053 16081079
2039 16081079 15420451 16773875 17875003 18956480 19389824 19159788 18052077 16391708 15291056
2030 15291056 14118884 12971051 11968060 12499630 12445060 11739370 11674934 11922182 10469573
2021 10469573 10516387 9669320 9189094 9196522 10564803 11612053 12338008 11993696 10769138
2012 10769138 11199783 12238825 12777370 12457586 12369336 12240148 12525975 13360534 14309793
2003 14309793 13958627 13883050 14363836 14392159 13866183 14511156 13989909 13674288 12685180 11363727
1993 11363727 9998263 8443688 7020704 7965446 7218228 7813001 7962853 7840351 7260784
1984 7260784 7206965 7482761 6590648 6114959 4693443 5459498 6211114 6477058 6672541 7147725
1974 7147725 7113043 6542984 6720667 7240883 5744303 4919757 5482364 4918154 4682697 5042610
1964 5042610 6050993 5097105 4956170 5464941 5319263 5012155 6062562 5940363 6404836
1955 6404836 7036663 7000642 6712482 6265131 6342630 6558980 5567154 5548865 5662342 5191189
1945 5191189 5850964 5698491 6010981 5658878 6314988 6983277 7707293 6019322 5957101 6602310
1935 6602310 6057769 6643581 7053093 6628944 5329308 6201338 6262064 5740509 6631443 5719814
1925 5719814 5047032 6033691 7045475 7414949 7180271 8010057 8276939 8959622 9784785
1916 9784785 8081628 7973323 8039903 8353764 8864690 8138038 8410209 8759089 8282544 8672735
1906 8672735 9378922 8165032 7883316 7989433 7397630 7677197 9139384 9257140 8786165
1897 8786165 8893042 8123229 9252119 10507196 10233066 8499630 7664517 8290652 9981019
1888 9981019 10536774 10995202 11050340 11413991 12039511 12023504 12145021 12757652 13727188 13543944
1878 13543944 14423340 15090132 14536897 14593652 13085912 12942416 13649668 13582633 11966520
1869 11966520 11384082 12055847 12080656 12512252 11863955 10255609 11154932 11519726 9611847
1860 9611847 10207452 10480460 11213158 10889404 11157027 11742223 11433544 11732506 11770274 12395319
1850 12395319 13660086 14489769 13028742 13059159 15056794 15333066 15643958 16230771 16020404
1841 16020404 17291906 18022954 17109381 15997329 15421284 15619458 15422524 15425986 15961716
1832 15961716 16534516 15755620 15975953 17145369 16899380 16220215 16045850 16886870 17280114
1823 17280114 16248461 16879291 17494386 17273397 17569331 17466293 17522155 16170122 15770630
1814 15770630 15548655 15974550 15821190 15510834 15184653 15261567 15182783 14354564 14588019 13718296
1804 13718296 11789523 11944330 12411624 11191495 11431372 11641749 13069878 12360000 12140584
1795 12140584 12913900 12663054 12811595 13386975 13099982 13145526 13439664 12409371 12222572
1786 12222572 13043766 11690152 11815654 12547838 12609881 12602254 12266028 11376663 10485621 10606977
1776 10606977 10669370 11318680 10841592 9982493 8793603 7834996 8026490 7782054 8736516
1767 8736516 9078265 7886732 7902164 9061288 9214514 8013121 8868214 8510367 8688254
1758 8688254 8063931 8105794 8964046 8727285 9488475 8281585 7692622 7417975 7131214 5839217
1748 5839217 6925533 7464926 6532948 7260417 8371013 8705194 7740489 8763291 8775894
1739 8775894 8540264 8078279 9574672 10265747 11429636 11156034 11572019 10780424 10295502
1730 10295502 10288097 8707914 7725179 7719773 7307085 6196360 5086008 5131804 5510378 5123176
1720 5123176 5040333 4310344 5711774 3601904 3538362 4223043 4646222 4038187 3332580 3509677
1710 3509677 3490964 3747027 4803846 4928336 3708023 2645635 2568935 1461364 2304354
1701 2304354 2772277 2070436 2305556 2502640 2414785 2076271 1607837 2349277 3091570 2801599
1691 2801599 2570810 2308655 2336137 1853872 1551111 2262145 3925733 4024917 3337227 3148492
1681 3148492 1771166 2783952 2733177 2394293 3207235 1982821 2483563 3152060 1701035
1672 1701035 1301271 1903194 282441 728651 503923 890838 1501170 1539390 1803608 2206122
1662 2206122 1174464 2239986 2044542 1063623 1386235 1026640 756855 679193 332876
1653 332876 691343 1720411 1573080 1709870 1598524 798270 525458 -28751 441647 1237988
1643 1237988 828816 1667059 3062440 3166071 1935764 1310523 1732437 2380125 1322318
1634 1322318 1039244 1386152 1172471 2320112 1990976 2190739 3060095 2924173 2665480
1625 2665480 2352132 1497814 1953055 3493531 4325902 4096248 3593331 4167160 3299237
1616 3299237 3251229 3241023 2082151 1938331 1902496 2863672 3716734 3323501 3739221 3945546
1606 3945546 3532212 4059652 4975663 5469238 3380384 3374410 4386340 4725685 5400838 3173805
1596 3173805 2278003 3383623 2906420 2924929 2590437 3341984 3937100 3534961 3701976 3462994
1586 3462994 3461935 5117549 5206181 4487781 3632743 2871019 3526380 1514419 1053622 2248743
1576 2248743 3413500 3084581 3199720 3279219 3007459 2771819 3629165 2620300 3075768
1567 3075768 2880538 2364083 3342894 2336332 2147589 2780361 2530251 2804087 2886213 914005
1557 914005 1557687 1291608 1237163 1586347 1460663 2061153 2000892 1899071 2401232 3405289
1547 3405289 2602850 2625411 2808915 2069189 1250224 830370 1087783 1141719 729940 624999
1537 624999 858358 1347494 3379924 2412045 1559146 2873737 950113 1063623 1960712
1528 1960712 1148710 866347 1146336 975628 1865259 1961280 2999605 2278960 2336664 4680877
1518 4680877 2994940 1685846 2074095 2431888 2872548 3232806 2806693 2738123 3209156
1509 3209156 3524380 3159110 3677601 3067957 2596147 3165059 4360338 3599477 1332064
1500 1332064 1106090 1488248 533340 698873 2551032 2786088 3161555 3350191 3018066
1491 3018066 3802803 3569945 4269976 3035735 2682037 4146157 3471533 2847990 2773479
1482 2773479 2393149 3287165 3897474 3024566 2960395 2658112 2434711 1708716 2459900 3594536
1472 3594536 2823090 2220731 1631338 754845 2083371 2725381 2417999 2298883 2483080
1463 2483080 995323 1867267 4244519 2849628 1096062 2926813 2504139 1322500 1843471
1454 1843471 1147661 1984058 1687858 2487421 2483655 1863094 2742297 2132872 775657 2431289
1444 2431289 2649165 811886 1165768 1824424 2072790 1423398 1285482 1916109 1979387 1681607
1434 1681607 1235665 146509 985569 2074107 1337426 754662 439316 744444 422586
1425 422586 385855 484207 994053 518337 -148983 100144 373082 229613 -375740 -567203
1415 -567203 1020418 237008 -671214 1957657 2628038 464758 693381 -217817 483572
1406 483572 1276923 -57705 889811 224140 -252894 -996257 -1157188 612009 -226922
1397 -226922 -694884 567034 57845 -836555 -755257 -572962 -695862 355645 29349 -597940
1387 -597940 -322092 -455536 -669325 -889781 -773783 62697 204764 -386229 -1309631 -1413000
1377 -1413000 7483 749435 -1408964 -1530088 -1374075 -2031028 -1775766 -1742490 -574901
1368 -574901 26635 750381 425908 -1998950 -1495555 -583687 -634484 728952 485493 -950721
1358 -950721 -1487215 -634566 -1419865 -743761 -363135 -381641 692492 733799 -936987 -1011917
1348 -1011917 -1948531 -1740054 -75394 37382 -281264 -385303 -1550 -3161 -1355562 -1100415
1338 -1100415 -624 -475806 -593615 -906083 215900 915124 -726963 -652670 397705
1329 397705 -137325 -1146355 -2057501 -1181686 -1674490 -966704 -455959 -701419 -1053135 -1828881
1319 -1828881 -2028567 -1118857 -1986278 -502751 329417 610444 882722 328162 -107159
1310 -107159 -858873 -1149253 -1350495 -1697705 -2202284 -1313630 -1493931 -1556382 -1455877 -1849565
1300 -1849565 -1646492 -1451105 -1080668 -1215020 -1712307 -1770130 -1552697 -799450 -161697 -1143330
1290 -1143330 -1434853 -1151747 -667638 97375 -61724 -499138 -812170 -808434 -803450 -259222
1280 -259222 -157798 222876 1097494 806867 -346079 -1520376 -969841 -466456 -1440822
1271 -1440822 -2225754 -1341983 -1986698 -1424084 -766695 -1248346 -2129428 -1908987 -2089551 -515728
1261 -515728 -641262 -985802 -41865 68623 1909702 1306945 267190 370960 1537420
1252 1537420 1039708 1857923 1610350 773883 2455435 3087325 1578370 469506 -3507
1243 -3507 399580 -167503 -9152 -100191 805902 -416484 -760468 -1262451 -1876761 -995843
1233 -995843 -416909 882876 612022 -240308 1141297 -699755 -1607514 -2053224 -2052215 -622291
1223 -622291 -1311013 -1072974 -832995 -1392666 -1766814 -939536 -1226916 -1382193 -1816409 -1392570
1213 -1392570 -864866 -1421383 -1658004 -2000500 -1743419 -872152 -531680 -366101 -927953 -2577266
1203 -2577266 -789499 -47987 -665004 -493426 201462 552416 725838 994112 -605622
1194 -605622 -6846 1478117 745373 436599 128021 305077 602087 692434 788474 -19732
1184 -19732 1307316 938093 377731 456203 515616 284521 -197776 -121632 -886876 -815155
1174 -815155 -272542 253373 -761476 -501538 -248052 -537257 -206978 588390 618888 102180
1164 102180 737237 1118207 780517 -514702 -415163 -510208 -353620 422352 677110 1637892
1154 1637892 1611216 -371243 90537 498395 235325 378815 -8518 -1096990 -1059802 -258278
1144 -258278 -351535 -562004 -95369 -341610 -1234467 -1058100 -348475 -272923 1273733 -21147
1134 -21147 -327956 84651 231218 35781 120933 486527 806441 697203 514950 1074756
1124 1074756 687443 590536 1314196 1990958 1307863 1074683 699498 980641 1023628 1124418
1114 1124418 932026 388698 2113113 2866746 2517064 3088386 3233029 2978349 3152415
1105 3152415 2972596 2905005 2367039 1383688 1767256 2337387 2606735 977699 1073220 1140396
1095 1140396 2090631 2146074 1756254 2990442 3873233 3813032 4491082 4481113 4171271 4003524
1085 4003524 2569400 2962868 3051139 3115757 2291192 1948388 1707084 2656335 2653613 1891562
1075 1891562 2409197 2601465 3237343 3615532 3586306 4369280 3609815 3375113 2769654 3650294
1065 3650294 3835213 4130717 4168005 4411681 5140414 5722606 5877389 5057323 5699543 5267775
1055 5267775 4626763 4014017 5069468 5969095 6252318 6047928 6509494 6863895 5778279
1046 5778279 5561458 6711122 6785681 7069573 7919183 7716829 7636717 9628693 9603484 10101671
1036 10101671 9377420 9285667 9705414 9552065 9806898 10236090 10113792 10047266 9653284 9548028
1026 9548028 10642634 10353156 10241731 11680662 11762515 11426378 10765757 9990640 11346418
1017 11346418 11908155 12319754 12919869 11824355 13624518 14745274 14814782 16199067 17138141
1008 17138141 16571706 17789074 18770160 18197671 18771754 19604692 20450352 23121793 24969304
999 24969304 26694436 27863420 29579862 31870175 33871944 35369734 36164169 37992767
991 37992767 40006093 42920674 45507350 48135258 52546827 55398065 58453499 63945282
983 63945282 69983925 76416868 83690322 89849666 95445398 102282503 109576240 116690254
975 116690254 128270913 142049298 157122501 179270924 208551019 248489152 296824365
968 296824365 350112920 411437215 466089522 507404845 506441717 429622396 334631547
961 334631547 261663545 214141769 180852918 157142346 136381921 119402715 107796604
954 107796604 98488777 89892188 84662869 81088671 78003526 74791180 70574118 66361492
946 66361492 60465970 56032500 51542896 47660706 45507664 42749951 40869333 38721500
938 38721500 37047118 35731523 33873273 33584010 32353777 30809239 31088674 29600919 28495689
929 28495689 28513701 26995438 24985786 23202277 22769601 22077969 20482359 19880165 18893839
920 18893839 18625117 19625809 17984050 17796101 18010917 16479349 14679294 13927666 13029646
911 13029646 12924775 13285242 13538950 12600439 12190778 11029331 10560100 10754268 11006521
902 11006521 10637385 9593088 10025913 10652480 9355777 8258670 8466634 8026723 8436385
893 8436385 8933519 7963682 7914121 8489316 8303273 7495897 7610842 7414870 6473468 6693779
883 6693779 8048766 8262993 7423068 7611594 7691503 6782324 7070264 6941341 6968156 5691733
873 5691733 5389219 4159455 4885525 6303784 5113939 5649322 5714776 4454352 3845779
864 3845779 3422369 3979735 3305456 3847668 4315731 3597322 4007638 3710659 2311400 2462500
854 2462500 2318361 2888930 3173647 4563245 4208587 2498863 2527481 3077722 2507301 2610535
844 2610535 3526549 2920597 2168576 2053030 2563141 1746470 2830493 2227417 2582453 3210728
834 3210728 2585571 2749269 3132733 2035247 1881184 3416480 2749409 3650466 3833156
825 3833156 2479040 2988219 2403826 1310026 1550954 2085667 1830806 1820856 2506257 3521943
815 3521943 3466109 2421928 2124580 2656440 339976 951868 2418831 1188351 644707
806 644707 991912 2851757 3121368 921750 1121304 864481 1405066 1149883 1950323 3144805
796 3144805 2034546 853368 1029563 401825 -309890 -76582 133184 199116 1543142
787 1543142 2122296 901715 542033 417056 1198787 2497307 983493 1546415 1436647
778 1436647 632450 944524 244512 1075585 2408132 991784 423445 430119 -581954 286082
768 286082 306824 767234 654384 470528 480051 662042 -720766 641183 364852 429702
758 429702 1387464 463156 1352075 754453 1316445 250008 -1507506 -576624 745557
749 745557 1440149 -307876 -671528 640912 705958 735350 608642 1103953 899641 -247362
739 -247362 55431 -53423 -1041942 -910212 -176367 -636522 -630586 1116265 1541925 435878
729 435878 -111537 -111156 692306 1365984 2082978 674856 656812 794654 -428430 324328
719 324328 567509 1241923 549801 -246954 -805786 -1539403 -742969 697562 1022087 -22358
709 -22358 -57236 1154541 667080 -788837 -1191020 -1258896 1138567 400134 253776 1100936
699 1100936 128191 113109 379396 758043 1221045 199807 166409 -474475 -1175033 -326547
689 -326547 402986 558070 949047 1234711 1196979 1778133 1114186 888518 1482385 947337
679 947337 2179957 1115714 882683 764126 903457 -527181 -1321771 -341376 294200
670 294200 1285111 -210052 616317 1468952 129411 -779367 216386 883144 744178 -406369
660 -406369 394544 162954 -546825 20938 -867733 -1582889 -229147 -297494 -779966 -810495
650 -810495 -952437 -73399 -896655 -1942172 -1027666 -777196 -318694 -420793 -492766 112691
640 112691 -489952 -878355 -43765 399023 -177229 -379793 -72287 -981440 64563 108734
630 108734 -198600 149462 -546046 -343725 519897 -659953 -1460002 -1057045 1027135 310427
620 310427 -305566 64860 -853037 -457131 450842 1176734 1316191 537596 -251807 5865
610 5865 -975801 -839721 -593784 -646747 -716910 -504219 -76336 -982963 -491681 -391595 325867
599 325867 -13671 -35431 -511507 -37173 -158831 -370070 -1627401 -2258747 -1102300 -683867
589 -683867 -482274 -711290 -153318 -121321 -1219366 -1837161 -1597157 -2676834 -1560792 -1174991
579 -1174991 -970755 -674416 -183308 -419610 445796 154267 -795032 -564847 354887 21924
569 21924 714979 1000433 329110 -396943 -420722 -447217 -208595 -988298 -297723 -482992
559 -482992 -1684029 -1093066 -1258675 -1160888 -737677 -1274576 -1411305 -1283170 -918092 -133236
549 -133236 -34448 -406864 -1546470 -1600883 -1713508 -1106903 -301132 639458 667538 243435
539 243435 -1201734 -202340 905802 -651326 -1108386 -1246196 -1070244 -1626378 -975023
530 -975023 -1055543 -987316 -687429 -1139570 -980703 -865068 -1591916 -1034169 -752597 -1634364
520 -1634364 -1278154 -931802 -2237325 -1674654 -772084 -303888 -72774 -1431434 -1363820 -2074631
510 -2074631 -2284295 -560090 -1173121 -986478 -536125 -1334425 -326788 228732 34017
501 34017 -1206770 -1318859 -1282388 -2773912 -2216167 -2051045 -978277 -666567 115255 389079
491 389079 -976207 158826 -86904 -451406 -184863 -859360 -1517971 857122 347027
482 347027 -1414245 -1578970 -606916 44971 -805160 -1144893 -910623 -689242 -419144 -928466
472 -928466 -208060 313655 -603885 -1262831 -1123350 -533921 -1281657 -1971334 -726235 -1205911
462 -1205911 -1615175 -546988 336149 1139678 171483 -1255634 -871156 -1158320 -557519
453 -557519 -1507122 -1189332 -1592223 -1230880 -272348 -766566 -1551374 -886024 -550423 -1164960
443 -1164960 -540426 -842056 -1258533 -1237862 -138068 -452702 -112367 -74473 -622581 -1024250
433 -1024250 -706231 -1048751 -866836 -1654439 -941604 -336158 -981251 -323231 -881244 -648077
423 -648077 -1284721 -399258 -1251079 -1541834 -1605183 -2499937 -1604146 -1162141 -766789 -793929
413 -793929 930594 184293 68194 -367357 -1329107 -1003133 -1191242 -357000 -781288 -1379631
403 -1379631 -444175 -1239530 -622710 497360 183044 -122102 776021 -1030906 -1183742
394 -1183742 -687401 -598921 -1603096 -1129867 -706613 -1303722 -892967 -609994 123341 398753
384 398753 -891253 -2463180 -1722943 -1284180 -825104 -962225 -653220 -242807 -1199668 -475228
374 -475228 -876803 -1127336 491745 634284 82233 581339 442397 -279011 -1453556 -1785290
364 -1785290 -1292428 -667148 -217840 -1536642 -970257 -1488444 -1285032 -1174313 -1664960 -1619119
354 -1619119 -1243484 -658287 29769 820167 285192 -164006 453739 89126 -1234547 -1627935
344 -1627935 -744194 -1149024 85320 -96538 -665396 -254655 -135547 142399 251645 -333202
334 -333202 -977884 -1624727 -1349527 -762172 -1760782 -503445 -1519642 -2102260 -1794382 -1527083
324 -1527083 -840523 -1497159 -854314 -584577 -428994 -650416 -854906 -1395855 -999265 164356
314 164356 354650 -811648 -2335666 -2868227 -2065679 -880522 226832 -423774 -2519345
305 -2519345 -3492656 -957209 -953388 -2575882 -1096794 -300497 -765131 -2463658 -2340313
296 -2340313 -1856493 -1534431 -1692440 -1877962 -2730507 -1663521 -178791 -55421 -145999 -1124649
286 -1124649 -1469021 -300822 270898 -1037495 -1470813 -755896 -693949 -1076678 -663132 -689511
276 -689511 -302025 -27226 -1548678 -2983621 -2299592 -1604602 -1805898 -2180735 -1156612
267 -1156612 -1722677 -2560192 -1710351 -1334486 -1124817 -1038981 -525114 365268 -575266 -1447971
257 -1447971 -1058847 -1295313 -1199177 -1226626 -635870 -991795 -1272358 -1287582 -838849 -1694317
247 -1694317 -1709143 -2406159 -2769183 -2538299 -2618484 -2136833 -941132 -1045457 -1558213 -1487495
237 -1487495 -2128071 -731969 -1038493 -2257883 -1523018 -117314 -2305256 -2697401 -2356993
228 -2356993 -2118824 -1006878 -948723 -954514 -791806 -586256 -1066307 -2561013 -1891555 -850591
218 -850591 -1986255 -1931166 -1532582 -1493502 -1230946 -955906 -1211889 -1076507 -824317 -1817933
208 -1817933 -1766983 -1088126 -2472429 -2107999 -890259 -1194492 -1586343 -1593861 -857406 -1178060
198 -1178060 -2143541 -556937 -822956 -528588 -484852 -861032 -6968 162684 -163661 -1739126
188 -1739126 -1776086 -285539 -726784 -1803385 -1438991 -1604136 -2200684 -2008740 -1848617 -1952704
178 -1952704 -1204850 -1898749 -2847409 -2387656 -1264414 -832177 -458110 -979483 -2617751
169 -2617751 -2435650 -2835213 -2824485 -2073833 -2123648 -1645376 -1753794 -1108709 1553 -194480
159 -194480 -420979 -1153695 -2847360 -2974616 -1417814 -1810031 -2031648 -2248517 -1860150 -1552134
149 -1552134 -1892297 -2097063 -891119 -620419 -1319672 -1171979 -859617 -1416161 -1021146 -1377235
139 -1377235 -2458568 -1507558 -2056736 -2719523 -2380273 -2255362 -3011020 -2290810 -2489385 -2709078
129 -2709078 -2483886 -2028026 -2989761 -1853086 -996552 -1470228 -2182729 -1269011 -1839105 -1907262
119 -1907262 -1266185 -1850671 -1674135 -1234765 -1231809 -991939 -1414242 -2625903 -2606109 -2155780
109 -2155780 -2609438 -1688804 -1645071 -2352973 -2001184 -2740945 -1978533 -1368241 -1860229 -2730217
99 -2730217 -1907846 -1188362 -1500249 -2412626 -2499304 -2217893 -1612990 -2234813 -2482016 -3438343
89 -3438343 -2678953 -2002376 -2722839 -2183037 -2384292 -2688898 -2207542 -1750214 -1907266 -2285095
79 -2285095 -2563356 -2233171 -2090347 -1688360 -427568 -2044663 -1490011 -1459521 -2168489 -2436052
69 -2436052 -2133835 -1528719 -1759649 -2578691 -3096986 -2491712 -3253783 -3267802 -2592736 -2191349
59 -2191349 -1885840 -1800709 -1351783 -875773 -886791 -1704427 -2615824 -1940962 -2192075 -2009061
49 -2009061 -2327309 -2769893 -3876567 -2949137 -2380988 -1940149 -1505712 -1788701 -2378951 -2407786
39 -2407786 -1969121 -2343668 -2227550 -1780685 -2707362 -2952703 -2870514 -3021437 -2133500 -2314011
29 -2314011 -1972499 -1722269 -2410797 -2768373 -1939532 -2380936 -1703161 -2229867 -2318173 -1149618
19 -1149618 -1336889 -2185168 -2734878 -2364181 -1817972 -2738746 -2606536 -1931321 -2553092 -2377092
9 -2377092 -1776906 -1365472 -1940006 -2298866 -3046577 -3211710 -2248727 -3129677 -3306533
0 -3306533
$$ Imaginary data points
##PAGE= N=2
##DATA TABLE= (X++(I..I)), XYDATA
16383 -10245294 -9102699 -9430152 -9879789 -9854556 -10219536 -9787168 -9247081 -9177407 -8289155
16374 -8289155 -8943393 -8664053 -8011588 -8275649 -8609729 -8787921 -9440384 -8793773 -7996338
16365 -7996338 -8031219 -7679129 -7563646 -7853179 -7777729 -7176752 -7061915 -7212977 -7788857 -7644715
16355 -7644715 -7209903 -7326774 -7291329 -7125766 -6943176 -6136197 -6091762 -6484463 -6124759 -5908482
16345 -5908482 -5886323 -5333396 -5214413 -5516850 -5449685 -4958256 -4762547 -3928381 -3723411 -4512229
16335 -4512229 -4653495 -4721991 -4235610 -4916770 -4784192 -4531532 -3311986 -2972231 -4549138
16326 -4549138 -4171886 -3387556 -3074822 -4271210 -3749331 -2501502 -2190370 -2958353 -3057531
16317 -3057531 -2829286 -3110018 -2723192 -1978509 -3092631 -3555285 -3434518 -3146306 -1813278
16308 -1813278 -594062 -814656 -964826 -1730773 -1700423 -1916646 -1956197 -642924 -1646851
16299 -1646851 -2216377 -1404068 -857124 -180943 -131784 -344693 362303 -569647 -12000 288925
16289 288925 -205213 -140083 374724 688305 630276 -52599 53613 1387780 2108004 1489046
16279 1489046 1873207 1899778 1413108 401804 -364943 1160641 1413971 1684549 1384036
16270 1384036 444468 554946 1139258 1117650 1800410 2284636 1492911 2230609 1717913 767311
16260 767311 1332489 1825023 1967205 2406629 2551434 1263996 1713926 2195702 2113699 2330946
16250 2330946 2460818 3283797 2601737 3438005 3492460 2860088 2170938 1732052 2927127
16241 2927127 3117246 3050777 3074725 3268028 3800782 3435380 3149673 3990432 3835634 2918151
16231 2918151 2632089 3781115 2995606 4430058 5726714 4748090 3426141 2822758 3069930
16222 3069930 4671076 5071761 5307864 5802141 6188771 5057071 4048502 3634930 4547601
16213 4547601 4345338 4016646 4711430 5183048 5247988 4289086 4662371 4365020 5260807 4898040
16203 4898040 5311644 6015977 5524400 5762873 4982185 4632631 6525065 5582913 6010625
16194 6010625 6161218 5221676 5607268 7143454 6474014 5840251 5458504 5331428 5674448
16185 5674448 6257068 6730523 7007451 6197662 6475005 6872928 5701808 5575664 5677923
16176 5677923 6716898 6742710 6041073 6195486 5294970 4613282 4872765 6396069 7268409
16167 7268409 7224176 7435153 7056989 7393443 6941011 7355186 7937712 7406888 7031845 7394291
16157 7394291 7100292 7476974 6294172 7566749 6755951 6101675 6317532 5467870 5221010
16148 5221010 5996879 5895221 6872028 7927413 6595535 7128445 7306454 6707265 6149247
16139 6149247 6793374 6769367 7254336 7613204 7066875 6805428 6681523 6681572 8447519 7396942
16129 7396942 7096153 6580246 6932662 7285359 6545110 6944135 7175034 7094318 7617476 8279143
16119 8279143 8017997 7808878 5681562 7051433 7905483 7872167 6649093 6997952 8313780
16110 8313780 7935562 7431852 7002455 7434855 6894959 6788366 6885692 7797884 7371771 6721747
16100 6721747 6527504 7513543 7977001 8009183 6610386 6708630 7059611 6822041 6694534 6696546
16090 6696546 7775039 7229067 7373929 8190384 7898082 7367674 7255886 7885522 7681557
16081 7681557 6758637 6327023 7093614 6124265 5249081 6701051 7768727 8082134 7044160
16072 7044160 8377701 8046332 8254637 8428921 8982737 9379263 8036481 8074704 7761683
16063 7761683 7253989 7672070 6825970 7278098 6936372 6560799 6313354 6746806 7062156
16054 7062156 6762708 6370943 6709931 7796220 7782965 7134400 6865664 7992066 7421378
16045 7421378 7733723 8037075 8051051 8855722 9057005 8334258 7906776 7149055 8170197
16036 8170197 8613699 6888883 7314703 7304780 7555295 7420335 6410566 6945422 7235615
16027 7235615 7614423 8618655 8156690 7268493 7646480 7532653 7203247 7016918 7516586
16018 7516586 6551017 6523714 6427137 6502601 7781668 7976465 7703010 7242975 6558632 7044180
16008 7044180 7683966 7118666 7599718 7863690 7561956 8403484 7411593 7127281 8237920
15999 8237920 7945368 7291556 6728191 7212896 7349680 7844528 9366697 8719251 6294629
15990 6294629 6384991 7616258 8615149 8405350 7162665 6762089 7328358 7476247 7702072
15981 7702072 6350776 6194813 7505836 7812165 6673511 5819944 6657412 6278567 7286474
15972 7286474 7199732 7948782 6759454 5707447 7308993 7613351 8607133 8563470 7270071
15963 7270071 6699961 7361941 7633023 7351255 7000515 7456675 7089229 6807338 7901782
15954 7901782 6722365 6894246 8022307 7100518 7939333 8338916 8096628 8095108 7768440
15945 7768440 7525778 6356057 6479593 7098493 7377332 8673485 8967369 7938539 8256003
15936 8256003 7852377 7584604 7476589 7958707 8857328 8086013 7940077 7511124 6593913
15927 6593913 6533425 7816881 7917247 8372173 6849544 6302824 7337064 6955780 7796115
15918 7796115 8918475 7801054 7664931 7748804 7106672 8055186 8128696 8532626 8024174
15909 8024174 8172330 8089403 7814444 7790115 7169721 6615504 7285697 7618800 6839488 8323468
15899 8323468 8064853 6818376 7774583 7134651 6293409 6920711 7543774 8608253 8393699
15890 8393699 7377681 8176768 7193952 8529130 9507488 8528574 7532272 7257080 6940458
15881 6940458 6976671 7572725 7220565 7023464 6957497 6415323 7090343 8234887 7645675 7262909
15871 7262909 6798193 7066672 8141263 8368300 6787156 6859739 6460347 8040393 6818062
15862 6818062 6744296 7706845 8897979 9361659 9037351 8257906 6942850 7817915 7579460
15853 7579460 7811629 6901629 8170817 8668650 8405314 9282868 9046752 6605091 7162872
15844 7162872 7242531 6911616 6844656 6773395 8850221 8962014 8506327 8090356 7551820 7460683
15834 7460683 8380987 8104110 8506784 8301173 7268305 7384862 7334922 7247989 8523392
15825 8523392 8910181 8221842 8267502 8571802 9117778 8257406 6836561 6866029 7848458 7519251
15815 7519251 7144147 7902443 8490278 9059487 7051159 7416539 7657671 7662585 9066138
15806 9066138 8297663 7527649 7313036 7565629 8278900 8735101 8327534 8194842 7941173
15797 7941173 8620583 8174348 7885694 7840369 5998641 6838100 7233341 7409416 7615220
15788 7615220 8783884 9423278 7923920 9013092 9172200 8732928 8765489 7296423 7320727
15779 7320727 7413639 7023908 8481386 9244142 8479979 8586062 8939337 9128616 9038568 7668686
15769 7668686 7256488 7029902 5960555 7089410 8340946 7964267 8443314 7987837 7792509
15760 7792509 8119893 8121587 9191234 8672884 7346497 8219197 8342433 7293839 7349002
15751 7349002 7123431 6682892 9087510 9534081 9294096 8639598 8583799 9258509 8308423
15742 8308423 8254889 8054713 6874223 7295605 8353658 8354729 8036360 8159500 8293439 8583308
15732 8583308 7728520 6580634 7049216 7011062 6564996 7838699 8768622 8557005 6853327
15723 6853327 6810523 7448366 7712409 8295962 7304903 6000098 7312008 7568252 7226187
15714 7226187 7380514 8076533 7969780 7667136 8069573 8858019 8160582 6775838 7042756
15705 7042756 7565952 7786448 7789453 7852425 8941045 9530201 8205038 8621067 8965121 8240167
15695 8240167 8057674 7864158 8529947 9400460 7762457 7010269 7931968 8783561 9199992
15686 9199992 8689979 7899630 8995146 8630294 8486963 8717909 6872145 6424693 7730538
15677 7730538 7129562 7354385 7347922 7056559 7374452 8501857 8700736 8567183 6736327
15668 6736327 6716643 8205526 8018092 8100604 7699747 7558004 8074806 7308153 7265056 8470839
15658 8470839 7517412 8599264 9806301 8915606 8165904 8687461 9330203 7751857 6782284
15649 6782284 6353045 7862244 7600279 9544594 9198016 8480819 8319225 7505920 7847675
15640 7847675 8457887 8421596 8295006 9190085 8337135 9097561 9397080 8832910 8510080 8966630
15630 8966630 8244795 8429711 7955984 6989254 7417930 7768036 7754652 7128898 6965537 7673636
15620 7673636 8683733 8004092 7850956 8132554 8173181 7635840 8175032 7700765 6197750
15611 6197750 7351779 8624143 8253677 6990747 7458718 8052953 8045055 8496811 7584899
15602 7584899 6638157 8507481 8569990 8604246 6922016 6881333 7468544 8014803 7697590 6982447
15592 6982447 6887682 7251501 7114329 5688684 7115376 7861978 8009626 7949292 6788211
15583 6788211 7664324 6762118 7225715 6242284 6515856 6753586 7683352 8520673 7515570
15574 7515570 7485011 7872662 8911938 8385379 8549221 9142749 9798026 8931400 8720819
15565 8720819 8683314 7657407 6586183 7222595 7468498 7103817 6192908 7217280 7805383
15556 7805383 6694305 6384222 7649919 7957972 7964980 6924373 6836421 8672631 8746882
15547 8746882 8282506 7151034 7517254 7436902 7743143 8133185 7426832 7798881 7996984
15538 7996984 7319674 7008587 6898632 7817429 9564057 9231267 8823762 8449322 8724142
15529 8724142 8182163 7172043 8243128 8006200 8668382 8043936 7759603 7891851 7149270
15520 7149270 7187122 9037038 10041694 9069623 8073903 7851678 9412373 8410840 8513619
15511 8513619 8242408 7919292 8809628 8012893 7812022 8061723 8191983 8565424 7617957
15502 7617957 7742163 8291769 8310502 8435565 8741857 8780392 8952776 8144358 8061135 8176116
15492 8176116 8021025 8914505 8228627 8463092 8289273 8518751 8539648 8481687 8666751 9185882
15482 9185882 9251051 8840217 8364215 8270258 8376789 7382432 7355115 7031912 7704453 8060533
15472 8060533 8177925 7843563 8719671 8500278 8223151 7744456 6806461 7113683 7445051
15463 7445051 9095244 9434391 7914256 8290082 9477179 8905555 9174170 8975092 7543458
15454 7543458 7998363 9315954 8610801 7859318 8664925 9965830 9626955 8670400 9228049
15445 9228049 8500673 6730853 6643413 7913275 7948122 7635016 7785131 8318952 8170491
15436 8170491 7812006 8039708 7503478 8057406 8183896 8022628 7873680 7647127 7991028
15427 7991028 7984538 8109651 8467227 8031954 9180044 8615607 8767371 8356749 8096487 8505500
15417 8505500 7782143 7095696 7494526 7607863 6973019 7728332 8480305 8489015 7736818 8704524
15407 8704524 7860312 7722004 8421546 8902071 8679438 8317840 6326786 7068544 8524773
15398 8524773 9408120 9503001 9775111 9616048 8342469 8714859 8093324 8225691 8506256
15389 8506256 8491168 8231863 9105035 8292043 7414848 7429742 8093968 8570932 7433450 7618344
15379 7618344 9422678 8953080 8704393 7677965 6303072 6682645 7424274 7484349 7390387
15370 7390387 7737962 8560070 9382985 8493474 7917660 7270741 7214508 8750069 8681250 8390586
15360 8390586 7965896 7413727 8030169 8578052 8971338 8356047 8315083 7497678 8574414
15351 8574414 8642037 7320555 7897620 8686941 8034133 7913442 7974423 8512896 9013040 7824648
15341 7824648 8349950 8988785 9044170 8161158 6581432 6623063 7470116 7190697 7646663 6880808
15331 6880808 7315049 8461724 8038453 7724315 7648664 8035412 8215012 8107918 8310050
15322 8310050 8373857 8203830 8486867 9006699 7781731 7559284 7775394 7232102 6958598
15313 6958598 8071020 7719434 6834096 6142935 7744560 8571505 7943994 8334989 7196777
15304 7196777 5918208 5866893 6837166 6859702 8101297 7226323 7244636 7859152 8318834 8663229
15294 8663229 8618648 9390925 7835283 7327372 8149946 8115833 7476700 7347982 8339171 8575637
15284 8575637 8058373 8182556 7403533 7716614 8552275 6739451 7549762 9379565 8636896
15275 8636896 7422878 7199997 7697324 8018790 9739832 8900941 7047890 7675511 7727187
15266 7727187 7348794 7710041 8775085 9172652 8861565 7434374 7697966 8269560 8605007
15257 8605007 8643911 7115489 7762245 9487081 9541035 8544675 8702192 8194754 8301000
15248 8301000 8272750 8990229 8412140 7421584 7371592 7942793 8439282 7812646 8600624 8998389
15238 8998389 8501898 7119091 9188694 8265546 7937029 8352469 8004153 6920353 7129362
15229 7129362 6213645 6903836 7564200 8039842 9343924 8671657 9595699 8974582 8991760
15220 8991760 9057368 8279237 7332505 7775697 8282485 9381015 9593014 8777932 8318901
15211 8318901 7289106 6839212 7063602 7010937 8449713 8050204 8841186 9028774 8449127
15202 8449127 9410835 9134725 8441410 7750686 7330665 6806537 8027361 7458324 6478148
15193 6478148 6380168 7305180 8011530 8542104 8596564 9320049 9583862 8806287 8923149 8678912
15183 8678912 8022645 7929800 8620832 9001166 9876556 8886552 8901849 8809883 7637052 7861990
15173 7861990 8464699 8203955 8633631 8222510 7843796 8087512 8816562 8165618 7892631
15164 7892631 8774498 8544863 8200734 8958758 8442744 8288135 8937008 8088238 7896822
15155 7896822 8702467 8410609 6974208 7246991 8230516 8934963 8483835 8821590 9081048
15146 9081048 10232811 10338256 9747662 8611067 7900299 8240918 7701406 8090801 8350085
15137 8350085 7846617 9148227 8298509 8051598 8770572 7895688 7629388 7889212 9100850
15128 9100850 8226712 8300277 8511161 9154472 9637800 8663365 8699367 8483459 8747607 8828819
15118 8828819 8185309 8606354 8970750 8596468 8217486 8545933 8538645 9036794 8716015 9479865
15108 9479865 9416600 9236414 7633959 7714605 7333081 7381060 7816119 7793578 8942923 8754621
15098 8754621 7781100 7423670 6072369 7602652 9967869 10455952 10252429 9143472 8077318
15089 8077318 8128495 8525668 9016262 8994806 8659570 8944685 7187717 7750917 7364096 7986922
15079 7986922 8024657 8372770 9147227 9678285 9242081 9436888 8661892 8743865 9259146 9031998
15069 9031998 9152780 8485825 8394007 8199916 8630982 9394801 8449020 7740715 8610677 8816073
15059 8816073 8491677 7756743 7201662 8341475 8378376 8050861 8037901 10412856 9188125
15050 9188125 7427799 7435450 7176937 7662494 7931637 8728434 9938776 8477014 7853488
15041 7853488 8912966 8021740 7525938 8182582 7892817 8349311 8269027 7601835 8363919
15032 8363919 8391774 8943934 8602505 8909414 7414832 7891465 9062101 8738434 8392455
15023 8392455 9129394 8610501 8484145 10401270 10244082 8456441 7882588 8874246 8074305
15014 8074305 7386075 8377508 8703640 8282109 8148132 8940064 9170396 8551809 8724775
15005 8724775 9355314 8628777 7792954 8995508 9794515 8907571 8874087 9208286 8687037
14996 8687037 8500555 9010342 7732111 8552996 9386800 8856701 7738065 8082139 9610619
14987 9610619 9662319 7805320 6773592 8351123 9001458 8325574 8466647 8622941 9011227
14978 9011227 8826439 9019010 8688324 9311952 8485178 8697040 9207806 8860087 9958307
14969 9958307 8975918 9630608 8587548 7738640 8566675 8480106 9253873 9582694 9451787
14960 9451787 9638972 8804317 7638737 7508321 8490085 8565725 8693837 8382018 9111195
14951 9111195 9326982 9601586 9656375 8301278 7155332 7568004 7463030 7659167 7337563
14942 7337563 7880163 7874462 8152556 7363308 7049173 7962393 8496998 8168856 6878433 6401904
14932 6401904 8021703 9178799 8205225 7579391 7641820 9062517 9009863 7784525 8614442
14923 8614442 8564031 6825859 7078854 8208257 8619705 8983633 8969603 9358840 9428659 7331761
14913 7331761 5668323 6873542 8247101 7683046 8351988 10199082 9726808 7755340 7048098
14904 7048098 7269187 7859808 6806508 8477422 8199985 7541702 7431460 7356120 8366859
14895 8366859 8030097 8031423 7721665 6758835 8018662 8880508 8338856 9397597 8845126
14886 8845126 8124252 8842576 9327125 9472419 9162162 8280752 8436980 8031363 8685877
14877 8685877 9123053 9116252 8756933 9372465 9141682 8516151 8866385 8783415 9887271 9268498
14867 9268498 8697563 8795034 8072355 6073144 7237239 8574866 8465949 8559894 8606922
14858 8606922 8071291 8642959 8479946 9138609 9532954 9935828 9851123 9387227 9500396 8974548
14848 8974548 8820725 10527409 9348623 8455085 9244909 8609459 9581917 9864553 9442140
14839 9442140 8590899 8891023 8746825 8315211 8322604 9042771 9496646 9185401 8595996 7853304
14829 7853304 8732646 8220565 8693151 8732785 8855021 9488668 8240849 7904531 8698224
14820 8698224 9096024 8129309 8950944 9364477 8621729 8843203 10072544 8711824 8606189
14811 8606189 9332193 9360863 9358499 8778872 8726232 7909543 8277674 8394757 7894704 9551993
14801 9551993 9822063 9079965 8985548 8641367 8963134 8825559 8316829 10392114 9791526
14792 9791526 8408238 8566625 8216664 9161407 10040645 8679379 9346032 9959990 10105572
14783 10105572 8876150 9265217 10269549 9540992 9853418 10460541 9283310 8930530 8530031
14774 8530031 8445296 9470831 8864126 8575506 8532127 8748493 9380650 9377097 9092146 8655021
14764 8655021 8483587 8385602 8118954 8606193 8672738 8490290 7647813 8210347 7970718 7582021
14754 7582021 8622166 9343475 9887702 9762106 9012114 8233419 8025536 8009785 8974589
14745 8974589 8413939 8526027 9206315 9291416 9427948 10084660 9025204 9611845 10112413
14736 10112413 9680237 9139272 7949979 9684347 8436216 7185629 8622818 8755646
14728 8755646 8630983 8954847 7439883 7091883 8017332 7496370 7505113 8961170 7707729
14719 7707729 7246460 8243846 8516930 8241812 8141096 8720813 8659744 8563854 9594030 8712740
14709 8712740 8884761 8326251 9535560 9614530 8579774 9054512 8746885 7913820 7705399
14700 7705399 8457986 8580107 8014626 8102758 9331414 10259137 9060139 8121221 8330900
14691 8330900 9281057 8639951 9235465 10256821 10255125 10825002 11951635 10948195 9336692
14682 9336692 8525710 7766513 7945376 8506638 8246164 8232680 8520966 10038356 9388674
14673 9388674 7851614 8439331 8221176 9502544 9750822 8168862 7579298 9052658 9086458
14664 9086458 9091958 8915876 7520234 8618305 9237247 9074784 8502523 8821411 8998352
14655 8998352 9224460 9823025 9986654 8804774 8376260 8520555 8519615 8615549 8597141 8806740
14645 8806740 7787083 8545790 8559466 8613122 7837436 8589931 9192970 8960462 8437098 7825678
14635 7825678 7244202 9607756 8876719 9936687 8668229 7711394 8574279 8853967 8470301
14626 8470301 8596064 7377651 6223899 7138927 7636032 7688945 8430936 7524325 9182479
14617 9182479 10810183 9982278 9152026 8789506 9235941 8710623 8872358 8042557 7382907
14608 7382907 7589543 8580046 7710908 8620519 8325438 8350848 9068529 9299164 9235987 8401463
14598 8401463 8784979 9690645 8620892 8670045 9597000 9681592 9413839 9207499 8075681
14589 8075681 8850855 8867590 7450586 7704328 7442996 7639774 7890959 7981267 6754260
14580 6754260 7518947 8555625 8294895 9488882 10324473 8739550 7473700 7501525 7368522
14571 7368522 8807191 8934756 8825170 8715243 9261220 9733177 9372832 9616572 9904200
14562 9904200 10096783 9906942 9777138 9379847 7625158 8370918 7683704 7975545 7879370
14553 7879370 8673891 9065688 9756688 9272727 9206511 10341470 10106203 9334963 8263385
14544 8263385 8576985 8597845 8519352 9635389 8628836 7787020 9290382 9176490 9109213
14535 9109213 8777215 8163665 8431851 8432289 9862093 10825322 10138452 10617186 9979887 9706748
14525 9706748 9019672 8745794 9025221 7997202 7888039 7559038 7134183 8424074 8756590
14516 8756590 9493564 9836077 9193198 8166433 8806281 9047525 8687952 8413503 9530267
14507 9530267 9892289 9216005 9367430 8863047 8015727 7835868 7658252 7963633 8008289 9010748
14497 9010748 9467171 9061882 8146351 8991156 8603435 8372425 9607260 7902989 8057366
14488 8057366 7812733 8786066 9236953 9338532 8824954 7387849 8664839 10246635 9350208
14479 9350208 8760914 8895293 8642324 9492628 10234370 9875365 9523264 8882793 8293345
14470 8293345 8690917 8388692 8809890 7896223 8166816 8585626 8787118 8884174 8718521 8498122
14460 8498122 8944997 9264957 8799855 8744723 9217373 10246869 10382435 9871782 10342422
14451 10342422 9079008 8370256 8620710 8223317 7810755 8020173 9998010 9802063 9330692
14442 9330692 8877918 8291300 8960513 7805407 7428436 8188573 7922044 9212164 8508837
14433 8508837 8538145 9976203 8634805 8331346 9465216 9985754 9406708 10355451 9938421
14424 9938421 10381988 11482286 10053607 8954256 9271881 9323477 8117408 9242614 9168221
14415 9168221 9624536 8911420 9283444 8044984 8429063 9036812 8594815 9016685 9902513
14406 9902513 9263492 8144622 8662385 10181220 9946095 7912830 8805358 8343998 8565033
14397 8565033 9960292 8601300 7363026 8844829 8923222 8340426 8965352 8613344 8490563
14388 8490563 8071662 8264662 8420514 8829521 8773255 9282374 9593885 8133083 8537271
14379 8537271 8833223 8863227 8605660 8652754 8534407 8291937 8142754 8752094 7514850 8105755
14369 8105755 8905567 9588205 9321965 9151609 9447489 8936915 8516714 8681458 8185371
14360 8185371 8472936 10388827 9752321 9467600 9216968 9422265 9252529 8976219 8783589
14351 8783589 9859975 9972006 9937748 9984467 9874173 8973798 9427256 8485140 8275103 9143582
14341 9143582 9135736 9537912 8490195 7810941 8215557 9143336 9033443 9525803 9398142 8951346
14331 8951346 9014057 9670127 9662873 9400622 8311847 8457558 8660495 8692706 9313348 8466223
14321 8466223 7443202 8236529 7859658 9021584 9911842 8761373 8839462 8911713 9629003
14312 9629003 10523201 10297513 10955155 9380187 9076909 9658740 10077338 9287671 8778907
14303 8778907 10218969 9722604 9378188 9119833 8368334 9343417 8994018 8176203 9066365
14294 9066365 8052262 7833966 7828187 9430195 9546303 10295399 9783190 8685838 8449519
14285 8449519 9185133 9999697 8575805 8321005 8588010 9392234 9485985 8505709 7662372
14276 7662372 8304530 9340992 9179086 8890032 7558116 7865681 9230833 9249672 9446130
14267 9446130 7483739 7421329 8976784 9844577 9725500 9468519 9342065 9822235 8868340
14258 8868340 8120082 8542450 8215788 7840507 8627362 8667007 8555838 7526288 8195244
14249 8195244 9477300 8690503 8105681 8877094 9385085 9627256 9790813 9098937 9577952
14240 9577952 8971773 9319477 8293380 8295696 7936764 8455919 8454822 8684144 8133787 7591940
14230 7591940 8198982 8253698 7918012 7497983 8626915 8219608 7603737 8013934 8495959
14221 8495959 9639235 9775663 9770038 9875372 9172549 8486426 9589589 9386289 9243791
14212 9243791 8691769 7812027 8360606 8616490 9369099 8803100 8938684 10074255 8549831
$$ [...]
##END NTUPLES=NMR SPECTRUM
##END=
