##TITLE=1H_EC-3250
 CDcl3,8 sc, 
 12.03.2021
##JCAMPDX= 6.0         $$ Bruker NMR JCAMP-DX V2.0
##DATA TYPE= NMR SPECTRUM
##DATA CLASS= NTUPLES
##ORIGIN= UXNMR, Bruker Analytische Messtechnik GmbH
##OWNER= root
$$ XWIN-NMR		Version 3.5
$$ Fri Mar 12 10:55:37 2021 Russian Standard Time (UT+4h)  she@DPX200
##.OBSERVE FREQUENCY= 200.131506
##.OBSERVE NUCLEUS= ^1H
##.ACQUISITION MODE= SIMULTANEOUS
##.ACQUISITION SCHEME= undefined
##.AVERAGES= 8
##.DIGITISER RES= 18
##SPECTROMETER/DATA SYSTEM= spect
##.PULSE SEQUENCE= zg30
##.SOLVENT NAME= D2O
##.SHIFT REFERENCE= (INTERNAL, D2O, 0, 15.9751)
##AUDIT TRAIL= $$ (NUMBER, WHEN, WHO, WHERE, WHAT)
$$ ##TITLE= Audit trail, XWIN-NMR		Version 3.5
$$ ##JCAMPDX= 5.01
$$ ##ORIGIN= Bruker BioSpin GmbH
$$ ##OWNER= she
$$ F:/spectra/data/she/nmr/H-F/1/pdata/1/auditp.txt
$$ ##AUDIT TRAIL=  $$ (NUMBER, WHEN, WHO, WHERE, WHAT)
(   1,<2021-03-12 10:54:23.46 +0400>,<she>,<DPX200>,
      <created by zg, POWCHK disabled, PULCHK disabled
       configuration hash MD5:
       00 E9 B6 7A A2 85 ED C7 34 08 36 98 17 FE 4E 26
       data hash MD5: 16K
       49 8E 52 F5 63 B2 CC 76 9F DB 7D 67 D2 CD 54 1F>)
(   2,<2021-03-12 10:54:27.21 +0400>,<she>,<DPX200>,
      <Start of raw data processing
       efp BC_mod = 2 LB = 0.24 FT_mod = 6 PKNL = 1 PHC0 = -11275.43 PHC1 = 10.80094 SI = 16K 
       data hash MD5: 16K
       A5 CE AA A5 23 FB 4B C8 AB 71 76 19 46 96 A2 02>)
(   3,<2021-03-12 10:54:47.26 +0400>,<she>,<DPX200>,
      <pk PHC0 = 0.1380492 PHC1 = -0.8 
       data hash MD5: 16K
       39 B5 27 6A 3B 7E 4D 73 4B 4F A9 D0 C8 C4 00 94>)
(   4,<2021-03-12 10:54:50.51 +0400>,<she>,<DPX200>,
      <abs ABSG = 5 
       data hash MD5: 16K
       B6 EB 60 6A CF 47 31 04 BB C0 98 1F FB DD 45 81>)
$$ ##END=
$$ 
$$ hash MD5
$$ 2F 69 F7 59 B2 D1 7B 02 B0 23 A1 33 A2 7B 92 9D
##$RELAX= 
##$RELAX= 
##$RELAX= 
##$RELAX= 
##$RELAX= 
##$RELAX= 
$$ Bruker specific parameters
$$ --------------------------
##$DU= <F:/spectra>
##$EXPNO= 1
##$NAME= <H-F>
##$PROCNO= 1
##$TYPE= <nmr>
##$USER= <she>
##$AMP= (0..31)
100 100 100 100 100 100 100 100 100 100 100 100 100 100 100 100 100 100 
100 100 100 100 100 100 100 100 100 100 100 100 100 100 
##$AQSEQ= 0
##$AQ_mod= 1
##$AUNM= <au_zg>
##$AUTOPOS= <>
##$BF1= 200.13
##$BF2= 200.13
##$BF3= 200.13
##$BF4= 200.13
##$BF5= 200.13
##$BF6= 200.13
##$BF7= 200.13
##$BF8= 200.13
##$BYTORDA= 1
##$CFDGTYP= 0
##$CFRGTYP= 5
##$CHEMSTR= <none>
##$CNST= (0..31)
1 1 145 1 1 1 1 1 1 1 1 1 1 1 1 1 1 1 1 1 1 1 1 1 1 1 1 1 1 1 1 1 
##$CPDPRG= <>
##$CPDPRG1= <>
##$CPDPRG2= <>
##$CPDPRG3= <>
##$CPDPRG4= <mlev>
##$CPDPRG5= <mlev>
##$CPDPRG6= <mlev>
##$CPDPRG7= <mlev>
##$CPDPRG8= <mlev>
##$CPDPRGB= <>
##$CPDPRGT= <>
##$D= (0..31)
0 1.2 0 0 0 0 0 0 0 0.06 0 0.03 0 0 0 0 0.0002 0 0 0 0 0 0 0 0 0 0 0 0 
0 0 0 
##$DATE= 1615532062
##$DBL= (0..7)
120 120 120 120 120 120 120 120 
##$DBP= (0..7)
150 150 150 150 150 150 150 150 
##$DBP07= 0
##$DBPNAM0= <>
##$DBPNAM1= <>
##$DBPNAM2= <>
##$DBPNAM3= <>
##$DBPNAM4= <>
##$DBPNAM5= <>
$$ [...]
##$SUBNAM3= <"">
##$SUBNAM4= <"">
##$SUBNAM5= <"">
##$SUBNAM6= <"">
##$SUBNAM7= <"">
##$SUBNAM8= <"">
##$SUBNAM9= <"">
##$SW= 16.9725357007746
##$SWIBOX= (0..15)
0 0 2 0 0 0 0 0 0 0 0 0 0 0 0 0 
##$SW_h= 3396.73913043478
##$TD= 16384
##$TD0= 1
##$TE= 0
##$TE2= 300
##$TE3= 300
##$TEG= 300
##$TL= (0..7)
0 120 120 120 120 120 120 120 
##$TP= (0..7)
150 150 150 150 150 150 150 150 
##$TP07= 0
##$TPNAME0= <>
##$TPNAME1= <>
##$TPNAME2= <>
##$TPNAME3= <>
##$TPNAME4= <>
##$TPNAME5= <>
##$TPNAME6= <>
##$TPNAME7= <>
##$TPOAL= (0..7)
0.5 0.5 0.5 0.5 0.5 0.5 0.5 0.5 
##$TPOFFS= (0..7)
0 0 0 0 0 0 0 0 
##$TUNHIN= 0
##$TUNHOUT= 0
##$TUNXOUT= 0
##$USERA1= <user>
##$USERA2= <user>
##$USERA3= <user>
##$USERA4= <user>
##$USERA5= <user>
##$V9= 5
##$VALIST= <valist>
##$VCLIST= <CCCCCCCCCCCCCCC>
##$VD= 0
##$VDLIST= <DDDDDDDDDDDDDDD>
##$VPLIST= <PPPPPPPPPPPPPPP>
##$VTLIST= <TTTTTTTTTTTTTTT>
##$WBST= 1024
##$WBSW= 4
##$XGAIN= (0..3)
0 0 0 0 
##$XL= 0
##$YL= 0
##$YMAX_a= 65100
##$YMIN_a= -79576
##$ZGOPTNS= <>
##$ZL1= 120
##$ZL2= 120
##$ZL3= 120
##$ZL4= 120
##$ABSF1= 16.06208
##$ABSF2= -0.9105835
##$ABSG= 5
##$ABSL= 3
##$ALPHA= 0
##$AQORDER= 0
##$ASSFAC= 0
##$ASSFACI= 0
##$ASSFACX= 0
##$ASSWID= 0
##$AUNMP= <proc_1d>
##$AZFE= 0.1
##$AZFW= 0.1
##$BCFW= 0
##$BC_mod= 2
##$BYTORDP= 0
##$COROFFS= 0
##$CY= -3
##$DATMOD= 1
##$DC= 0
##$DFILT= <>
##$DTYPP= 0
##$F1P= 0
##$F2P= 0
##$FCOR= 1
##$FTSIZE= 16384
##$FT_mod= 6
##$GAMMA= 0
##$GB= 0
##$INTBC= 1
##$INTSCL= 2.992141e-10
##$ISEN= 128
##$LB= 0.24
##$LEV0= 0
##$LPBIN= 0
##$MAXI= 10000
##$MC2= 0
##$MEAN= 0
##$ME_mod= 0
##$MI= 1.114404
##$NCOEF= 0
##$NC_proc= -9
##$NLEV= 6
##$NOISF1= 3.799351
##$NOISF2= 2.8
##$NSP= 0
##$NTH_PI= 0
##$NZP= 0
##$OFFSET= 15.97506
##$PC= 1
##$PHC0= -11275.29
##$PHC1= 10.00094
##$PH_mod= 1
##$PKNL= yes
##$PPARMOD= 0
##$PSCAL= 0
##$PSIGN= 0
##$REVERSE= no
##$SF= 200.13000728009
##$SI= 16384
##$SIGF1= 3
##$SIGF2= 2
##$SINO= 5.538805
##$SIOLD= 16384
##$SREGLST= <1H.CDCl3>
##$SSB= 0
##$STSI= 16384
##$STSR= 0
##$SW_p= 3396.73913043479
##$SYMM= 0
##$S_DEV= 0
##$TDeff= 16384
##$TDoff= 0
##$TI= <>
##$TILT= no
##$TM1= 0
##$TM2= 0
##$TOPLEV= 0
##$USERP1= <user>
##$USERP2= <user>
##$USERP3= <user>
##$USERP4= <user>
##$USERP5= <user>
##$WDW= 1
##$XDIM= 16384
##$YMAX_p= 495946350
##$YMIN_p= -640478
$$ End of Bruker specific parameters
$$ ---------------------------------
##NTUPLES= NMR SPECTRUM
##VAR_NAME=  FREQUENCY,     SPECTRUM/REAL,   SPECTRUM/IMAG
##SYMBOL=    X,             R,               I
##VAR_TYPE=  INDEPENDENT,   DEPENDENT,       DEPENDENT
##VAR_FORM=  AFFN,          ASDF,            ASDF
##VAR_DIM=   16384,         16384,           16384
##UNITS=     HZ,            ARBITRARY UNITS, ARBITRARY UNITS
##FACTOR=    0.207333158178282, 1,           1
##FIRST=     3197.08896675039, 0,            0
##LAST=      -199.650163684396, 0,           0
##MIN=       -199.650163684396, -640478,     0
##MAX=       3197.08896675039, 495946350,    0
$$ Real data points
##PAGE= N=1
##DATA TABLE= (X++(R..R)), XYDATA
$$ [...]
4439E857045J51596j58556k17062j07106j5306j59994j07975j54355J746j81698
$$ 5857045 6008641 5850085 5633023 5525917 5510611 5350617 5242642 5088287 5090033 4908335
4429D908335M5083k50276j23937j15542K4764j99982j09815j03130j67432J27331
$$ 4908335 4953418 4703142 4579205 4463663 4488427 4288445 4178630 4075500 3908068 4035399
4419D035399j05831N0424j14582K1336R5150k24302n04614p0502J21475j7577
$$ 4035399 3929568 3979992 3865410 3886746 3981896 3757594 3252980 3182478 3303953 3286376
4409C286376p0621K24812k6109j31999K7617J68578m0164j16016j77811J66460
$$ 3286376 3215755 3440567 3414458 3282459 3310076 3478654 3438490 3322474 3144663 3311123
4399C311123n1793l74419P6654R6513j22672J31822L3444j28461j17175j0991
$$ 3311123 3259330 2884911 2961565 3058078 2935406 3067228 3100672 2972211 2855036 2844045
4389B844045J71366j81926p4509P3019M1129j06201K6951J99515K08356J02318
$$ 2844045 3015411 2833485 2758976 2831995 2873124 2766923 2793874 2993389 3201745 3304063
4379C304063p5781p2705j80171Q710j14555k16940j56807L14811J18714P3512
$$ 3304063 3228282 3155577 2975406 2984116 2869561 2652621 2495814 2810625 2929339 3002851
4369C002851o5827j99314K4259r5540J19110n2851k00584l4942K76784N8731q1035
$$ 3002851 2937024 2737710 2761969 2666429 2785539 2732688 2532104 2497162 2773946 2832677 2751642
4358B751642p7685k68736j13550J67568j62028O9384J77213K49072L4099j75297
$$ 2751642 2673957 2405221 2291671 2459239 2297211 2366595 2543808 2792880 2826979 2651682
4348B651682k75856J54208J19613p1964q6895p9266j56450J89267j26378j14722
$$ 2651682 2375826 2530034 2649647 2577683 2490788 2411522 2255072 2444339 2317961 2203239
4338B203239k98844m0003K66275O9481j02871J10921k39050Q7620N9014q3657
$$ 2203239 1904395 1864392 2130667 2200148 2097277 2208198 1969148 2056768 2115782 2032125
4328B032125K16525j56366O5590r5469j05473N05215r2115j89434Q6326J84307
$$ 2032125 2248650 2092284 2157874 2062405 1956932 2462147 2370032 2180598 2266924 2451231
4318B451231J1466M022K50795k56079R3115p3435q9583O8092N0090m7486K7579
$$ 2451231 2462697 2466719 2717514 2461435 2554550 2481115 2391532 2459624 2509714 2462228 2489807
4307B489807r2251J72621n2303n0161P4900m3801J71083O6233j80303K06663K3981
$$ 2489807 2397556 2570177 2517874 2467713 2542613 2498812 2669895 2736128 2555825 2762488 2786469
4296B786469k21289o9431K83527R9856M0361l6384J79832N0303M34153k147J73621
$$ 2786469 2565180 2495749 2779276 2879132 2919493 2883109 3062941 3113244 3547397 3545250 3718871
4285C718871K59686M09885L19712K76671O33162N33506M95623O63880J022642
$$ 3718871 3978557 4388442 4708154 4984825 5617987 6151493 6647116 7310996 8333638
4276H333638J140902Q42569Q88342Q78302Q60009N33720j63906j471364k155630
$$ 8333638 9474540 10317109 11205451 12083753 12943762 13477482 13313576 11842212 9686582
4267I686582j657673j625167j087737o95313n09620m80339k97079L5033k52438
$$ 9686582 8028909 6403742 5316005 4620692 4111072 3630733 3333654 3368687 3116249
4258C116249j30956n8834k76556J97046N1946j09692j56303k45068k13164J8359
$$ 3116249 2985293 2926459 2649903 2846949 2898895 2789203 2632900 2387832 2174668 2193027
4248B193027L1077L6551j46633J16643j86959r4551m4980r0237J48167r2998r8692
$$ 2193027 2224104 2260655 2114022 2230665 2043706 1949155 1904175 1813938 1962105 1869107 1770415
4237A770415J16280o5980o8897O9996J49142l21061K18560M4610j89456P0114
$$ 1770415 1886695 1820715 1751818 1821814 1970956 1649895 1868455 1913065 1723609 1793723
4227A793723P9716k72006n1028K67884J31756l9025j85385J14514K3999j64102
$$ 1793723 1873439 1601433 1550405 1818289 1950045 1911020 1725635 1840149 1864148 1700046
4217A700046J07189J48983j04495k22663p0690J96041J13713O058j73712L8622
$$ 1700046 1807235 1956218 1851723 1629060 1558370 1754411 1868124 1874182 1700470 1739092
4207A739092P1010J03731j63592J9284l2135Q0701J39708j61161R8216K6943j13986
$$ 1739092 1810102 1913833 1750241 1769525 1737390 1818091 1957799 1796638 1894854 1921797 1807811
4196A807811J5445j36461m7016q7982J19919q1073k02815K99321J39445L06042
$$ 1807811 1823256 1686795 1639779 1551797 1671716 1590643 1387828 1687149 1826594 2132636
4186B132636j34701q1193L6306N4049N0353J71248l0768m04062l6823J05339J89209
$$ 2132636 1997935 1916742 1953048 2007097 2057450 2228698 2197930 1793868 1757045 1862384 2051593
4175B051593j20866K74216k60911M0909K09787j70137n5376K06943n7914l45654
$$ 2051593 1930727 2204943 1944032 1984941 2194728 2024591 1969215 2176158 2118244 1772590
4165A772590K14034j79057n2969n2013j09682j7794l4636j349l224J57726N7728
$$ 1772590 1986624 1807567 1754598 1702585 1592903 1575109 1540473 1539124 1535900 1693626 1751354
4154A751354j43685J53644m213j41506J93688J53121j77662j21927q1977o5048
$$ 1751354 1607669 1761313 1757100 1615594 1809282 1962403 1784741 1662814 1580837 1515789
4144A515789r5414l2733O9138Q6915K41997P4284P8430k1840m8950k3827L66947
$$ 1515789 1420375 1387642 1456780 1543695 1785692 1859976 1938406 1916566 1867616 1843789 2210736
4133B210736l00459k39248J92690o7912k08402J04294J13335O8455J09159k29111
$$ 2210736 1910277 1671029 1863719 1795807 1587405 1691699 1805034 1873489 1982648 1753537
4123A753537J2905j69283o9713K45514N3181j92136O853J83324j45531R7749l7811
$$ 1753537 1766442 1597159 1527446 1772960 1826141 1634005 1640858 1824182 1678651 1776400 1738589
4112A738589j3395n7073J164J51124j54770j5806j62605K26881R0251l7828M2289
$$ 1738589 1725194 1668121 1669285 1820409 1665639 1649833 1487228 1714109 1804360 1766532 1808821
4101A808821J2585j25818K19700k65109p596M311J42220P6832K5032p0840J0488
$$ 1808821 1821406 1695588 1915288 1650179 1642583 1646894 1789114 1865946 1890978 1820138 1830626
4090A830626o1711M4778J31039K2755o8127j43326K73092J08018j7499M2457J94399
$$ 1830626 1768915 1813693 1944732 1967487 1899360 1756034 2029126 2137144 2119645 2162102 2356501
4079B356501k12803l54333J16257M48013k83904J35465R7329m9186J64639K48955
$$ 2356501 2143698 1789365 1905622 2353635 2069731 2205196 2302525 2253339 2417978 2666933
4069B666933J41258K2167o8237L8996R2281j66064R6954j55878q4229J84005o7542
$$ 2666933 2808191 2830358 2762121 2801117 2893398 2727334 2824288 2668410 2584181 2768186 2700644
4058B700644J08353j14501J68428R8219k41797j23781N5634J4990K02773L9082
$$ 2700644 2808997 2694496 2862924 2961143 2719346 2595565 2651199 2666189 2868962 2908044
4048B908044j74154R4157J3565n33319J03975M07316N8589j46091j16213L3574
$$ 2908044 2733890 2828047 2841612 2308293 2412268 2819584 2878173 2732082 2615869 2649443
4038B649443K73993O0049j50595j16193n3262J0932M3239l8409q2821K10169j22104
$$ 2649443 2923436 2983485 2832890 2716697 2663435 2674367 2717606 2679197 2596376 2806545 2684441
4027B684441J08492J09151k3396k01588J53409o263l17853J59615J0051J3668
$$ 2684441 2792933 2902084 2878688 2677100 2830509 2824246 2506393 2666008 2676059 2689727
4017B689727L74695j67127m58029r1695k47878J85384J36249J60284K18163m4247
$$ 2689727 3064422 2897295 2439266 2347571 2099693 2285077 2421326 2581610 2799773 2755526
4007B755526o3973o0400P7195n4273K23955K3648Q3900j06421m1308p6385J51471
$$ 2755526 2691553 2631153 2708348 2654075 2878030 2901678 2985578 2879157 2837849 2761464 2912935
3996B912935l02944Q8287K57636k63876K25619q616o537J40428j35930j86985
$$ 2912935 2609991 2698278 2955914 2692038 2917657 2909041 2902504 3042932 2907002 2720017
3986B720017J92350p8750k37587P7620O5286r0773L40950j14204J61904J20811
$$ 2720017 2912367 2833617 2596030 2673650 2738936 2648163 2989113 2874909 3036813 3157624
3976C157624q9859J54177k37216k8561j19768K67026L5589K6319J23962J09847
$$ 3157624 3067765 3221942 2984726 2956165 2836397 3103423 3139012 3165331 3289293 3399140
3966C399140K33344L456j63699j70671J77380J63727k68100n7481K90621j96406
$$ 3399140 3632484 3635940 3472241 3301570 3478950 3642677 3374577 3317096 3607717 3411311
3956C411311M8952l03046O5978K39582N6448M9899O2896K35245N3670j9079k57951
$$ 3411311 3460263 3157217 3223195 3462777 3519225 3569124 3632020 3867265 3920935 3901856 3643905
3945C643905o9129J09438J77357m4458j07172N9999J14385Q3157K86361p1042
$$ 3643905 3574776 3684214 3861571 3817113 3709941 3769940 3884325 3967482 4253843 4182801
3935D182801p4306j10579R4180J65630J3879m0111l37731Q9911O1576J54368M9748
$$ 4182801 4108495 3997916 4092096 4257726 4271605 4231494 3893763 3983674 4045250 4199618 4249366
3924D249366l6712J8031J62762K3068L9387R8738j54114J55794J79171J41592
$$ 4249366 4212654 4230685 4393447 4416515 4455902 4554640 4400526 4556320 4735491 4877083
3914D877083k5044R8488J33021K00958j48329K50531R9034j20110Q1689N3178
$$ 4877083 4852039 4950527 5083548 5284506 5136177 5386708 5485742 5365632 5447321 5500499
3904E500499j01693J00165J66394j13674K12582N7213k25767P9853r5960K11616
$$ 5500499 5398806 5498971 5665365 5551691 5764273 5821486 5595719 5675572 5579612 5791228
3894E791228K14245P4118J12275O8768J1088p1313K01793J77143K99858k20108
$$ 5791228 6005473 6079591 6191866 6260634 6271722 6200409 6402202 6579345 6879203 6659095
3884F659095R9012J14502J4609J28792J21034m685o9002o5152K23956L58398J23403
$$ 6659095 6758107 6872609 6887218 7016010 7137044 7132359 7063357 6998205 7222161 7580559 7703962
3873G703962K51514K66648k6097j97257J23929J29363J33248J41608L46783K74540
$$ 7703962 7955476 8222124 8196027 7998770 8122699 8252062 8385310 8526918 8873701 9148241
3863I148241L541O4479J63258M13716J10058J4322J82221k3902J10557L61818
$$ 9148241 9151782 9216261 9379519 9793235 9903293 9917615 10099836 10075934 10186491 10548309
3853A0548309P0522K13589M87181K94147J84236K45467K66503M34301J76461O7726
$$ 10548309 10618831 10832420 11319601 11613748 11797984 12043451 12309954 12744255 12920716 12988442
3843A2988442M70599N09471L55613M41640L46477M17992M33509O70745M45357
$$ 12988442 13459041 13968512 14324125 14765765 15112242 15530234 15963743 16634488 17079845
3834A7079845K46537M53422O98281N79147N20818P88430N73587M52726P89575
$$ 17079845 17326382 17779804 18478085 19057232 19578050 20366480 20940067 21392793 22182368
3825B2182368Q47908J078616R45590J072158J163987J229950J191445J515762
$$ 22182368 23030276 24108892 25054482 26126640 27290627 28520577 29712022 31227784
3817C1227784J971032K179260K707614K848592L410697M109077M871143N426552
$$ 31227784 33198816 35378076 38085690 40934282 44344979 48454056 53325199 58751751
3809E8751751O065042O431508O750437O025433M379729J974409k703617o575601
$$ 58751751 64816793 71248301 77998738 84024171 88403900 90378309 87674692 81099091
3801H1099091r239937j0441349q770655o088677l788563k364446j478943r16501
$$ 81099091 71859154 61417805 52647150 46558473 42769910 40405464 38926521 38010020
3793C8010020o62466k69910j38422l32301n9734j29894J59535M49219L04053M82787
$$ 38010020 37347554 37077644 36939222 36606921 36547187 36417293 36576828 37026047 37330100 37812887
3783C7812887N54484M81697O05459R24429Q27913M74152N35800P58552P92481
$$ 37812887 38367371 38849068 39454527 40378956 41206869 41681021 42216821 42975373 43767854
3774D3767854O08555P39728R27297J130339Q21219J256328J288260J115993J248287
$$ 43767854 44376409 45116137 46043434 47173773 47994992 49251320 50539580 51655573 52903860
3765E2903860J840832J841700J799666K365739K798701K770592K690678K888076
$$ 52903860 54744692 56586392 58386058 60751797 63550498 66321090 69011768 71899844
3757G1899844K902612L011529L045126L051813L250332L745579L148750L277919
$$ 71899844 74802456 77813985 80859111 83910924 87161256 90906835 94055585 97333504
3749I7333504L511794L417270L503895L523045L871533M529152N124758O295531
$$ 97333504 100845298 104262568 107766463 111289508 115161041 119690193 124814951 131110482
3741A31110482P291361P916979Q436663Q442380Q370192P218499M464071N88003
$$ 131110482 138401843 146318822 154755485 163197865 171568057 178786556 183250627 183838630
3733A83838630k627476m569467o896123q238959o808453m389200k553977k039623
$$ 183838630 181211154 176641687 169745564 161506605 154698152 150308952 147754975 145715352
3725A45715352j308707o29138r57599j134614j495226l075124m072439m820270
$$ 145715352 144406645 143777507 142819908 141685294 140190068 137114944 133042505 128222235
3717A28222235n567061n763795n916139n879841m854414l725580k670102j715755
$$ 128222235 122655174 116891379 110975240 105095399 100240985 96515405 93845303 92129548
3709I2129548j012503j27701M42531N17048L98191J0557r51899k071646l712355
$$ 92129548 91117045 90989344 91431875 91948923 92347114 92357671 91405772 89334126 85621771
3700H5621771n086815n647374o009657n129736m161922l575380k782724k237860
$$ 85621771 80534956 74887582 68877925 63748189 59586267 56010887 53228163 50990303
3692E0990303j712699j234580n42751m76296k89041n88772j65503L49654R2415
$$ 50990303 49277604 48043024 47500273 47023977 46734936 46146164 45980661 46330315 46422730
3683D6422730K42328J65691l8837m03876q12013j153372j559361j524655j924199
$$ 46422730 46665058 46830749 46791912 46388036 45576023 44422651 42863290 41338635 39414436
3674C9414436k033614j660023j470553j585661j401824r99205j256678j101000
$$ 39414436 37380822 35720799 34250246 32664585 31262761 30263556 29006878 27905878
3666B7905878r97271j088817q46395r30561r08940q49738j059094o53092o29496
$$ 27905878 26908607 25819790 24973395 24042834 23133894 22284156 21225062 20571970 19942474
3657A9942474p92694q10079r10385m94791n24025l37078l92929n02560k00443
$$ 19942474 19149780 18339701 17429316 16934525 16410500 16073422 15680493 15177933 14977490
3648A4977490k78719n98523j03496k34032m93341r3416m39401m66633k88578l14079
$$ 14977490 14698771 14100248 13996752 13762720 13269379 13175963 12736562 12269929 11981351 11667272
3638A1667272k18008k56490k46717j39608l54662j26822k13641k37332j39747
$$ 11667272 11449264 11192774 10946057 10806449 10451787 10324965 10111324 9873992 9734245
3629I734245R2298j54102N3338N9331j03645l59977j29159J80671j61559m57724
$$ 9734245 9826543 9672441 9725779 9785110 9681465 9321488 9192329 9373000 9211441 8753717
3619H753717K7090j01248l93319k8045o1573k00451l61553Q8976K5766n2875r9989
$$ 8753717 8780807 8679559 8286240 8258195 8196622 7996171 7634618 7723594 7749360 7696485 7596496
3608G596496J25575j2606j94494o7048k7335j38239K5140j46648K84032J84488
$$ 7596496 7722071 7709465 7514971 7447923 7420588 7282349 7307489 7160841 7444873 7629361
3598G629361k72155j5239J13380r116l17372P7552q4852j64374k1539M5518J09301
$$ 7629361 7357206 7341967 7455347 7446231 7128859 7206411 7121559 6957185 6935646 6981164 7090465
3587G090465k48439k6727O6073J67462k06343j38068r544j00547R1909p9597K0945
$$ 7090465 6842026 6815299 6881372 7048834 6842491 6704423 6694879 6594332 6686241 6606644 6627589
3576F627589K96701n5997N2781J43991L9941o0458M0262j08922j39832M29379
$$ 6627589 6924290 6868293 6921074 7065065 7105006 7044548 7084810 6975888 6836056 7265435
3566G265435P6178Q5058J49008K74118r3898m03227j27013J4988K82064o5632
$$ 7265435 7341613 7426671 7575679 7849797 7755899 7352672 7225659 7240647 7522711 7457079
3556G457079J99576J60258j64525J49116J70889l08094j63769R5148l5457L1799
$$ 7457079 7656655 7816913 7652388 7801504 7972393 7664299 7500530 7595678 7560221 7592020
3546G592020J18306K00617J37328K03224K22044k12818j41656J30354K40153N5096
$$ 7592020 7710326 7910943 8048271 8251495 8473539 8260721 8119065 8249419 8489572 8544668
3536H544668K55703J80167K2861K4887j79276K75011J74710J44063J69623L52982
$$ 8544668 8800371 8980538 9003399 9028286 8849010 9124021 9298731 9442794 9612417 9965399
3526I965399j18436k8365R1984J58844p5012n9938J46938J02602J88772K33336
$$ 9965399 9846963 9818598 9910582 10069426 9994414 9934476 10081414 10184016 10372788 10606124
3516A0606124J84237L3127j17693M3133K40922L46921J25540N1264J07409J14543
$$ 10606124 10790361 10823488 10705795 10748928 10989850 11336771 11462311 11513575 11620984 11735527
3506A1735527J23262J39661k3336Q7460K19944L02558J51940j60969J80670J44440
$$ 11735527 11858789 11998450 11975114 12062574 12282518 12585076 12737016 12576047 12756717 12901157
3496A2901157K12526J83015L30928P48843R0669P9019M59754L93884M23696L38599
$$ 12901157 13113683 13296698 13627626 14376469 14467138 14546157 15005911 15399795 15823491 16162090
3486A6162090M37598J49285N5269M85855L34590N16605M47032N28167N68980N28770
$$ 16162090 16599688 16748973 16804242 17290097 17624687 18141292 18588324 19116491 19685471 20214241
3476B0214241Q15806O97889O09414O60426J014082O82963O50904O73496Q40967
$$ 20214241 21030047 21727936 22337350 22997776 24011858 24694821 25345725 26019221 26860188
3467B6860188R54770J003381J170932J162067R85819J078366J333470J177383
$$ 26860188 27814958 28818339 29989271 31151338 32137157 33215523 34548993 35726376
3459C5726376J225023J501233J724363J620622J576029J828575J878773K149773
$$ 35726376 36951399 38452632 40176995 41797617 43373646 45202221 47080994 49230767
3451D9230767K387409K708898L322903L567032L725773M354130M572046N093890
$$ 49230767 51618176 54327074 57649977 61217009 64942782 69296912 73868958 78962848
3443G8962848N664794O495788P468677Q306270R490247J0790122J2428857J4135184
$$ 78962848 84627642 91123430 98592107 106898377 116388624 127178746 139607603 153742787
3435A53742787J6008559J8292282J9697003J9490632J7879521J4128171Q838067
$$ 153742787 169751346 188043628 207740631 227231263 245110784 259238955 268077022
3428B68077022Q73835j0116189k2147826k9442849l0458790k6823413k1564468
$$ 268077022 268950857 258834668 236686842 207243993 176785203 149961790 128397322
3421A28397322j6762758j2768957r944653p422920o102684m812843l817455l797736
$$ 128397322 111634564 98865607 88920954 81498034 75395350 70582507 66765052 62967316
3413F2967316l156423l135079l183510k547190k317452j894776j616788j025697
$$ 62967316 59810893 56675814 53492304 50945114 48627662 46732886 45116098 44090401
3405D4090401j184627j115835p85143q59961n60510n63916m62365r7624m66076
$$ 44090401 42905774 41789939 41004796 40144835 39584325 39020409 38558044 38460420 37994344
3396C7994344m6329M99691Q2206r7253K28108K63746N2800M9997J52222J73592
$$ 37994344 37948015 38447706 38529912 38432659 38660767 38924513 38977313 39027310 39179532 39353124
3386C9353124L05664K58139N93027O59080O11806J403364J868408J865829K209104
$$ 39353124 39658788 39916927 40509954 41169034 41780840 43184204 45052612 46918441 49127545
3377D9127545K611378K822226K567555K640013K546141J952823J221138K27782
$$ 49127545 51738923 54561149 57128704 59768717 62314858 64267681 65488819 65716601
3369F5716601j043236j683416k275511k260718j826008j673696r34257p46622
$$ 65716601 64673365 62989949 60714438 58453720 56627712 54954016 54019759 53273137
3361E3273137m90485l49916r34884q60278p74490k61677k9826J14769N51379N42627
$$ 53273137 52782652 52432736 51497852 50637574 49863084 49601407 49571581 49686350 50237729 50780356
3351E0780356Q83967J491027K166992K536649L203388L752512M581655N230771
$$ 50780356 51664323 53155350 55322342 57858991 61062379 64814891 69396546 74627317
3343G4627317N260292N486868N151550M197286K988077Q09637k176967n252048
$$ 74627317 79887609 85374477 90526027 94723313 97711390 98521027 96344060 91092012
3335I1092012p512064q086503p193588o083296n096453m208059l530725l123377
$$ 91092012 83579948 75493445 68299857 62216561 57120108 52912049 49381324 46257947
3327D6257947k869528k504462j903866j633086j189088r22149p23028l01705Q97
$$ 46257947 43388419 40883957 38980091 37347005 36157917 35235768 34512740 34211035 34211932
3318C4211932R6785R4890O22209P81555J266788J448464J546815J895927J621607
$$ 34211932 34308717 34403607 35025816 35807371 37074159 38522623 40069438 41965365 43586972
3309D3586972J291102J197470R31420K01774q22867k378621l046762l736892l752093
$$ 43586972 44878074 46075544 47006964 47208738 46385871 44007250 40960488 37223596 33471503
3300C3471503l368458l096322k586171j746185j584795j295910j130554p67078
$$ 33471503 30103045 27006723 24420552 22674367 21089572 19793662 18663108 17896030
3292A7896030m74145p55637r58015l53652m84133l88150n66684p57051n89418
$$ 17896030 17421885 16666248 15708233 15354581 14870448 14482298 13915614 13158563 12569145
3283A2569145l98361k06589j76507L4654m89463o87646l68962l0010q8850k10898
$$ 12569145 12170784 11964195 11787688 11822342 11332879 10645233 10276271 10246261 10157411 9946513
3273I946513j68734J67361o7442k6789p1319k43587k89807m18788k22798j7709
$$ 9946513 9777779 9945140 9877698 9850909 9779590 9536003 9246196 8827408 8604610 8586901
3263H586901j46384m37214j91863L436n1807j0848O8528r8912j73108P9945n9579
$$ 8586901 8440517 8003303 7811440 7814876 7763069 7752221 7820749 7721837 7548729 7628674 7569095
3252G569095k47823k5613j30419j26091k1310j61775J70820j35752k09627R4619
$$ 7569095 7321272 7295659 7165240 7039149 7017839 6856064 7026884 6891132 6681505 6776124
3242F776124k37215l3985K5893m6959k35865j56783M3928j13693K92113Q0539
$$ 6776124 6538909 6504924 6530817 6483858 6247993 6091210 6135138 6021445 6313558 6394097
3232F394097j44819P4940R1566l6061m3036p8154Q0956J31696J92755J41601N5237
$$ 6394097 6249278 6324218 6415784 6379723 6336687 6258533 6339489 6471185 6663940 6805541 6860778
3221F860778j21216M3573p5028J22738P9655O2099Q6507r2197N3425J34913K29230
$$ 6860778 6739562 6783135 6708107 6830845 6910500 6972599 7059106 6966909 7020334 7155247 7384477
3210G384477J71079l85141J50839J61234k99775n7643L5205L04894J21114K9297
$$ 7384477 7555556 7170415 7321254 7482488 7182713 7125070 7160275 7465169 7586283 7615580
3200G615580j47134j42665P7047o0291O8700q1532J20012J68755K69013J69237
$$ 7615580 7468446 7325781 7402828 7342537 7411237 7329705 7449717 7618472 7887485 8056722
3190H056722j00258J56670J86865N6891K63178J6959M14019P4777P2468L38567
$$ 8056722 7956464 8113134 8299999 8356890 8620068 8637027 9051046 9125823 9198291 9536858
3180I536858N4118K17674L40464K69061K68041R4737J11106L46286J11790n5801
$$ 9536858 9590976 9808650 10149114 10418175 10686216 10780953 10892059 11238345 11350135 11294334
3170A1294334K66780M34975k3200L2298N47187K76600K45401N38580N63230N31684
$$ 11294334 11561114 11996089 11972889 12005187 12552374 12828974 13074375 13612955 14176185 14707869
3160A4707869M82325R26689O28591Q07716Q16586P69819R92116R66106J031326
$$ 14707869 15190194 16116883 16745474 17553190 18369776 19139595 20131711 21097817 22129143
3151B2129143J563138J420689J587264J304125J669711J353840J123475J286319
$$ 22129143 23692281 25112970 26700234 28004359 29674070 31027910 32151385 33437704
3143C3437704J072238N35609P23613P26833R99969J208841J572584K472787L171386
$$ 33437704 34509942 35045551 35769164 36495997 37495966 38704807 40277391 42750178 45921564
3134D5921564L739785L927030M786180N882982P193642Q447549R009667Q621564
$$ 45921564 49661349 53588379 58374559 64257541 71451183 79898732 88908399 97529963
3126I7529963P664771O445179L871924q62017p490170j3486045j4387805j1963009
$$ 97529963 105194734 111639913 115511837 114649820 107159650 93673605 79285800 67322791
3118F7322791r062095o419049m796930l636923k550132k250985k246843k481686
$$ 67322791 58260696 51841647 47044717 43407794 40857662 38606677 36359834 33878148
3110C3878148k659734k191769k237731k103141j627556j244334q65104q07687
$$ 33878148 31218414 29026645 26788914 24685773 23058217 21813883 20948779 20141092
3102B0141092o09139n83318o26266o60747l65132j61897l69629k88619r3703j0248
$$ 20141092 19531953 18948635 18322369 17661622 17296490 17134593 16764964 16476345 16382642 16372394
3092A6372394J22362j843K35153q0857p0385r9790k06155m67281o65809o88119
$$ 16372394 16494756 16492913 16728066 16647209 16576824 16477034 16270879 15803598 15137789 14449670
3082A4449670o67036o82991o74889p93503o07030k21033K3762k24384l81083j35242
$$ 14449670 13782634 13099643 12424754 11631251 11024221 10803188 10826950 10602566 10221483 10086241
3072A0086241j50584K22859j11964k92251K90558R9330k35027K3964J36102R7624
$$ 10086241 9935657 10158516 10046552 9754301 10044859 10144189 9909162 9933126 10069228 10166852
3062A0166852L9552M19120K38228M03186N51082J38699R4407K18229J72389M0446
$$ 10166852 10206404 10625524 10863752 11266938 11818020 11956719 12051126 12269355 12441744 12482190
3052A2482190k16335n69030l64594j07285j00892J59933K30904J42481p9001J17405
$$ 12482190 12265855 11696825 11332231 11224946 11124054 11283987 11514891 11657372 11578371 11695776
3042A1695776K9263J49277L10926M25048n2855R1619N4914j64969K20114R1742
$$ 11695776 11725039 11874316 12185242 12610290 12557435 12649054 12703968 12538999 12759113 12850855
3032A2850855J66296J87186J93300L91797M62751K59441K77424r4544K96995L10062
$$ 12850855 13017151 13204337 13397637 13789434 14252185 14511626 14789050 14694506 14991501 15301563
3022A5301563J1142o4984K6275p4476j6409M9939J81199Q6641L8795L16573J94605
$$ 15301563 15312705 15247721 15273996 15199520 15183111 15233050 15414249 15500890 15539685 15856258 16050863
3011A6050863L38053L48263M15275M92816l0541m6397K9477N938l26697r2785
$$ 16050863 16388916 16737179 17152454 17645270 17614729 17568332 17597809 17603747 17277050 17184265
3001A7184265N9088M6029M86058L05891N44227K88770K44838N32925L28395L93321
$$ 17184265 17243353 17289382 17775440 18081331 18625558 18914328 19159166 19692091 20020486 20413807
2991B0413807N58503L9649K83161M22012J00145P10877O47304M75782O09111J99912
$$ 20413807 20972310 21011959 21295120 21717132 21817277 22528154 23175458 23651240 24260351 24460263
2981B4460263J22684O76820L83652L75497K41433N07774Q06696Q03543O75425
$$ 24460263 24582947 25259767 25643419 26018916 26260349 26768123 27574819 28378362 29053787
2972B9053787J058365J163770Q61035Q47475O75811N45038n4924k85073l46048
$$ 29053787 30112152 31275922 32136957 32984432 33660243 34205281 34150357 33865284 33519236
2963C3519236p7495l11740m6026J71285M39971R83627J081721J068575Q57497
$$ 33519236 33441741 33130001 33083975 33255260 33695231 34678858 35760579 36829154 37686651
2954C7686651O90847P27346J52821n21727q22732j295290j219486j061469j091078
$$ 37686651 38377498 39104844 39257665 38735938 37913206 36617916 35398430 34336961 33245883
2945C3245883q38165l72136k43151J88652K73139L86051J30073r8010m03387j153085
$$ 33245883 32407718 32035582 31792431 31981083 32254222 32640273 32770346 32672336 32268949 31115864
2935C1115864q12226j453644j638623j319295j595718j332229r83760p22780o76256
$$ 31115864 30303638 28849994 27211371 25892076 24296358 22964129 21980369 21257589 20581333
2926B0581333l71928m34172k36885k01776l83403n13382p09447p66312j400252
$$ 20581333 20209405 19775233 19538348 19336572 18953169 18439787 17730340 16964028 15563776
2917A5563776q27815p34692p00847o84524o04306n52596l97115m13827m55251
$$ 15563776 14735961 14001269 13300422 12615898 12011592 11458996 11061881 10648054 10192803
2908A0192803l32440k33980l93615m94950k06401m23553l34854l63693k22294
$$ 10192803 9860363 9626383 9232768 8737818 8531417 8107864 7773010 7409317 7187023
2899G187023l2307l62621m89902j02418N3821j81393j39476m00444m6016J08081
$$ 7187023 7154716 6792095 6302193 6199775 6253596 6072203 5932727 5532283 5486267 5594348
2889E594348J8510j08467P6890k50623k02956P931k44330p757k19850j26315L6173
$$ 5594348 5612858 5504391 5581281 5330658 5127702 5135633 4891303 4883546 4663696 4537381 4573554
2878D573554J94555j40855k56741m8652M6176J089k35671j90857J9756J80863
$$ 4573554 4768109 4627254 4370513 4321861 4368037 4369126 4133455 3942598 3962354 4143217
2868D143217J60475k12111l6111J53400r3150r6722J86967J59026j12561m35135
$$ 4143217 4303692 4091581 4055470 4208870 4115720 4018998 4205965 4364991 4252430 3817295
2858C817295L8519J98744P3774p0355j52383p9327K4217J55289K09688j91554
$$ 3817295 3855814 4054558 4128332 4057977 3905594 3826267 3850484 4005773 4215461 4023907
2848D023907j69959R7617r0730n429K32937L20673k1813r0172p1049k36691K99347
$$ 4023907 3853948 3951565 3860835 3855406 4088343 4409016 4387203 4297031 4225982 3989291 4288638
2837D288638k882J72027Q3174l21033P7193l1466r5120K72854L0236r5469J21425
$$ 4288638 4285756 4457783 4540957 4219924 4297117 4265651 4170531 4443385 4473621 4378152 4499577
2826D499577J56334l48061L2896o5216p4406J43818m680J13952K68970J54702
$$ 4499577 4655911 4307850 4340746 4275530 4201124 4344942 4340262 4454214 4723184 4877886
2816D877886j37630K76374l25568j61988K30869j4347j38465K1010L00434O415
$$ 4877886 4740256 5016630 4691062 4529074 4759943 4745596 4607131 4628141 4928575 4934990
2806D934990O259J15493j62721k6309J01429N9748k14414l4293j00173Q3833o3285
$$ 4934990 4941249 5056742 4894021 4867712 4969141 5028889 4814475 4780182 4680009 4763842 4700557
2795D700557J54513M2273j74427K56769O1318K25017M81J17396J25216j37145
$$ 4700557 4855070 4897343 4722916 4979685 5041003 5266020 5266501 5383897 5509113 5371968
2785E371968J74185k1103K66791M19589J12458L4630L07271P726O988L99433L9418
$$ 5371968 5546153 5525050 5791841 6211430 6323888 6358518 6665789 6673515 6680503 7079936 7119354
2774G119354O3403R7652J70869J58924J2948M9510r9987k4607K60347J92742J54522
$$ 7119354 7182757 7280409 7451278 7610202 7623150 7672660 7572673 7548066 7808413 8001155 8155677
2763H155677j2035J16357k4092l9276N0052K23615K56151O5550k7373j59860J21487
$$ 8155677 8143642 8259999 8235907 8196631 8246683 8470298 8726449 8791999 8764626 8604766 8726253
2752H726253J15508J85337m9169K57027k2058q2045J42407j20274R9024K01994
$$ 8726253 8841761 9027098 8977929 9234956 9212898 9130853 9273260 9152986 9252010 9454004
2742I454004J84209K46064K38657L56716K55612K28745M85547L45463N97368P33854
$$ 9454004 9638213 9884277 10122934 10479650 10735262 10964007 11449554 11795017 12392385 13126239
2732A3126239N83363Q09563O54366M72851P25303J369151J089201R19951R27602
$$ 13126239 13709602 14519165 15173531 15646382 16371685 17740836 18830037 19749988 20677590
2723B0677590J025219Q60408J035615J012659N67699K30125J15615K91756l01320
$$ 20677590 21702809 22563217 23598832 24611491 25179190 25409315 25524930 25816686 25515366
2714B5515366l86836m1313j92169r0451J61977k67871m90786k86127Q4498k3311
$$ 25515366 25128530 25087217 24895048 24804597 24966574 24698703 24207917 23921790 24006288 23982977
2704B3982977n3041q1681p63879p58213o36092p90829q40275j175327j001533
$$ 23982977 23929936 23848255 23084376 22326163 21690071 20899242 20058967 18883640 17882107
2695A7882107r94286j077979q87540o36887p56845m67836o90797o15577l86667
$$ 17882107 16887821 15809842 14922302 14285415 13528570 13060734 12369937 11754360 11367693
2686A1367693m95234k31912n03263m41096k32604j02957J7942j19518J0644l39659
$$ 11367693 10872459 10640547 10137284 9696188 9463584 9360627 9378569 9259051 9269695 8930036
2676H930036r8160j66503o3741j05658n7508q6840p1981R8058k36248o5513J21828
$$ 8930036 8831876 8665373 8601632 8495974 8438466 8351626 8279645 8377703 8141455 8075942 8197770
2665H197770q8340q3998J84895m7607N5029r598L9002J47886J07410n7191k56850
$$ 8197770 8109430 8025432 8210327 8162720 8217749 8208151 8247153 8395039 8502449 8445258 8188408
2654H188408J41107M28937j45720j5869L00429Q5861k4328J02788o3084N1900
$$ 8188408 8329515 8758452 8612732 8596863 8897292 8983153 8958825 9061613 8998529 9050429
2644I050429K08560k0522q0384p958k13801k5760J26791j37197J38833L4969K15506
$$ 9050429 9258989 9238467 9158083 9150125 8936324 8910564 9037355 8900158 9038991 9073960 9289466
2633I289466j6156J99387K92979q5905n3622J70904J57412Q4943P3134L6334P2753
$$ 9289466 9273310 9472697 9765676 9679771 9626149 9797053 9954465 10039408 10112542 10148876 10221629
2622A0221629L85670K13369J25658K05452K99461L75832R6286N855K21606L74392
$$ 10221629 10607299 10820668 10946326 11151778 11451239 11827071 11923357 11929212 12150818 12525210
2612A2525210L10068K30016K82082K42641L78973J32567J84069N37597N18010
$$ 12525210 12835278 13065294 13347376 13590017 13968990 14101557 14285626 14823223 15341233
2603A5341233L49742L52188L86269L42274N72190P16769N20302N31221L97289
$$ 15341233 15690975 16043163 16429432 16771706 17343896 18060665 18580967 19112188 19509477
2594A9509477K71122O01945N81075N85664N01952J53371m2397M13652M6141q707
$$ 19509477 19780599 20382544 20963619 21549283 22051235 22204606 22162209 22575861 22622002 22613295
2584B2613295Q0499k72334k93569j45764j30636j98091j95218J07631j56244K34170
$$ 22613295 22693794 22421460 22127891 21982127 21851491 21653400 21458182 21565813 21409569 21643739
2574B1643739k35811j2795J56791J02816J23510M49884O53633K80948L08847N44973
$$ 21643739 21407928 21395133 21551924 21654740 21778250 22228134 22881767 23162715 23471562 24016535
2564B4016535N22337M24756L08178O72021P23009Q09449J001625O50180R08554
$$ 24016535 24538872 24963628 25271806 25943827 26666836 27476285 28477910 29128090 30036644
2555C0036644J059279R26338J001858J276243J052278J293662J246096J445772
$$ 30036644 31095923 32022261 33024119 34300362 35352640 36646302 37892398 39338170
2547C9338170J431903J914349J925715K021588K073573K163686K774991L195964
$$ 39338170 40770073 42684422 44610137 46631725 48705298 50868984 53643975 56839939
2539E6839939L355843L667425M093629M391150M700669N168498N564780N857819
$$ 56839939 60195782 63863207 67956836 72347986 77048655 82217153 87781933 93639752
2531I3639752O047642O099921O290851N764888N773854N303883M646875L300577
$$ 93639752 99687394 105787315 112078166 117843054 123616908 128920791 133567666 136868243
2523A36868243K211474R95875m54363j509018k312535k848249l625123l738746
$$ 136868243 139079717 140075592 139621229 138112211 135799676 132951427 129326304 125587558
2515A25587558l413070k913540k627582k396605j903127k049301k042722j962227
$$ 125587558 122174488 119260948 116633366 114236761 112333634 110284333 108241611 106279384
2507A06279384k534936l215099l793615m562373n060438n518956n707060n370918
$$ 106279384 103744448 100529349 96735734 92173361 87112923 81593967 75886907 70515989
2499G0515989n695711n244446m521830m242030l770002l376391k914679k468438
$$ 70515989 64820278 59575832 55054002 50811972 47041970 43665579 40750900 38282462
2491C8282462j944722j845659j771573j501634j290624r10856r05537r83475q87190
$$ 38282462 36337740 34492081 32720508 31218874 29928250 29017394 28111857 27128382 26241192
2482B6241192o66384n67645m91527p06331n01004l92752j52457m46303r0373j92462
$$ 26241192 25574808 25007163 24515636 23809305 23308301 22915549 22763092 22316789 22226416 22033954
2472B2033954m94374k58996k73527j5446M2634j68020o1108K0578K9053q3855
$$ 22033954 21539580 21280584 21007057 20991611 21034245 20866225 20805117 20825695 20854748 20770893
2462B0770893r8535k9016j24895p3129j24423o6821l9913o0434k7258o4609j7973
$$ 20770893 20672358 20643342 20518447 20445318 20320895 20254074 20214161 20153727 20126469 20061860 20043887
2451B0043887O5486J44955Q3524J65551k9506j17531k33881K07318n7326q1630
$$ 20043887 20109373 20254328 20337852 20503403 20473897 20356366 20122485 20329803 20272477 20190847
2441B0190847K05400l6082l0060K4185J91877j37970m0540J35071R8770L37136
$$ 20190847 20396247 20360165 20330105 20354290 20546167 20408197 20367657 20502728 20601498 20938634
2431B0938634L8560P206R6043r9397j43159o0201R8957k19562j33223j87451N7407
$$ 20938634 20977194 20984400 21080443 20981046 20837887 20777686 20876643 20657081 20523858 20336407 20393814
2420B0393814J00236j85544r4874K04652r523r1415j36697R1304K91962L6618
$$ 20393814 20494050 20308506 20213632 20418284 20408761 20317346 20180649 20271953 20563915 20600533
2410B0600533K73295L86010K48985L64731K43996L17165N36987L64392K38561
$$ 20600533 20873828 21259838 21508823 21873554 22117550 22434715 22971702 23336094 23574655
2401B3574655O9862M05338P4551J26881N22551J87700L10030J52001N33037L00166
$$ 23574655 23644517 24049855 24124406 24251287 24773838 24961538 25271568 25423569 25956606 26256772
2391B6256772K45218K89252N84449O85931O20414O49929N91943N45722O46333
$$ 26256772 26501990 26791242 27375691 28061622 28682036 29331965 29923908 30469630 31115963
2382C1115963J147783R10930J154898J308162J204361J174570J306668J359588
$$ 31115963 32263746 33174676 34329574 35637736 36842097 38016667 39323335 40682923
2374D0682923J331059J692766J489014J563900J740816J782204J715530K314849
$$ 40682923 42013982 43706748 45195762 46759662 48500478 50282682 51998212 54313061
2366E4313061K521697K371871K474335K659886L194607L806037M364898M577939
$$ 54313061 56834758 59206629 61680964 64340850 67535457 71341494 75706392 80284331
2358H0284331N121721N864686O740262P220770Q287799R345829J0016321J1436969
$$ 80284331 85406052 91270738 98011000 105231770 113519569 122865398 132881719 144318688
2350A44318688J2228271J3371439J4056507J4507100J4962080J4449229J3277083
$$ 144318688 156546959 169918398 183974905 198482005 213444085 227893314 241170397
2343B41170397J1200022Q981596N539515J131873l163017p728723j1727875j4535078
$$ 241170397 252370419 261352015 266891530 268023403 264860386 257131663 245403788 230868710
2335B30868710j7063715j8288329j8349330j7260004j6072198j4172520j2124743
$$ 230868710 213804995 195516666 177167336 159907332 143835134 129662614 117537871
2328A17537871j0368003r006210p374436o272079n673830m868760m071679l464170
$$ 117537871 107169868 98163658 90789222 84517143 78843313 73974553 69902874 66438704
2320F6438704l414075k833751k707759k243408k176665j986295j849847j795723
$$ 66438704 63024629 60190878 57483119 55239711 53063046 51076751 49226904 47431181
2312D7431181j574445j278538j233695j331439j289080q03845q33645r14359p26868
$$ 47431181 45856736 44578198 43344503 42013064 40723984 39920139 39086494 38172135 37445267
2303C7445267o12865n10575m48507j96639k54302k14705N6338l19075l5486K40364
$$ 37445267 36832402 36321827 35873320 35676681 35422379 35207674 35264012 34944937 34909451 35149815
2293C5149815L47856N34954L98433P94190O53230N69295N75283P36923J006996
$$ 35149815 35497671 36032625 36431058 37225248 37878478 38447773 39023056 39759979 40766975
2284D0766975J173025M12270N05139O39055K31870N79096P69419L94926J97095
$$ 40766975 41940000 42352270 42857409 43496464 43728334 44307430 45076849 45471775 45668870
2275D5668870M57573N48024M76131M90007J35254K03791M08935L62503M29830
$$ 45668870 46126443 46674467 47150598 47640605 47775859 47979650 48388585 48751088 49180918
2266D9180918L10462M64582K16157M02783N67612J76099L46636M30401j8071l82173
$$ 49180918 49491380 49955962 50172119 50574902 51142514 51318613 51665249 52095650 52077579 51695406
2256E1695406k04652k31983o06854n70183m26635j90295j85013l36967j42147
$$ 51695406 51490754 51258771 50651917 50081734 49655099 49464804 49279791 48942824 48800677
2247D8800677L302J58472J59177P5055k0784J79336Q4956k21081m7902j1520N7758
$$ 48800677 48803979 48962451 49121628 49196683 49175899 49355235 49440191 49219110 49171208 49159688 49217446
2236D9217446K45937N6560J29604J37975N82289M47168P85398Q02832Q34677J110114
$$ 49217446 49463383 49519943 49649547 49787522 50369811 50816979 51602377 52405209 53239886 54350000
2226E4350000Q88560P51152Q01096O92193Q99734R90268J069583Q83732J359239
$$ 54350000 55238560 55989712 56790808 57483001 58382735 59373003 60442586 61326318 62685557
2217F2685557J251524J148279J815933J674162K023504K019873K337585K620147
$$ 62685557 63937081 65085360 66901293 68575455 70598959 72618832 74956417 77576564
2209G7576564L017537K908103L134486L407640L829799L636589L520933L374525
$$ 77576564 80594101 83502204 86636690 90044330 93874129 97510718 101031651 104406176
2201A04406176L472839K939526K589359K042768J582436J334398R48797P77292
$$ 104406176 107879015 110818541 113407900 115450668 117033104 118367502 119316299 120093591
2193A20093591P05807J185226P38727P86492J476365J620939J748951K206252
$$ 120093591 120799398 121984624 122723351 123509843 124986208 126607147 128356098 130562350
2185A30562350K047173K200268J998044J475650J130996Q14252N71026j09716
$$ 130562350 132609523 134809791 136807835 138283485 139414481 140228733 140799759 140690043
2177A40690043m72089q35276r60456j392707j811567k097750k332865k809486
$$ 140690043 140217954 139382678 138422222 137029515 135217948 133120198 130787333 127977847
2169A27977847k924190l265056l277499k676862j953390j834528k135100j634140
$$ 127977847 125053657 121788601 118511102 115834240 113880850 112046322 109911222 108277082
2161A08277082j868600j897660k235942k642032l229803l507208l674175m051811
$$ 108277082 106408482 104510822 102274880 99632848 96403045 92895837 89221662 85169851
2153H5169851m116044m187394m071941l696816l448944l240967k960577k431091
$$ 85169851 81053807 76866413 72794472 69097656 65648712 62407745 59447168 57016077
2145E7016077k011809j531825j147592o97616o38195p08181l13180m19661n48431
$$ 57016077 55004268 53472443 52324851 51627235 50989040 50280859 49967679 49548018 48999587
2136D8999587r51508k121617k749925k698830k362117j591431j180973o66820
$$ 48999587 48048079 45926462 43176537 40477707 38115590 36524159 35343186 34676366
2128C4676366o30012n68670m03995j12497J80196L05868J1018K01222K95203L5760
$$ 34676366 34046354 33477684 33073689 32961192 33141388 33447256 33458274 33659496 33954699 33990459
2118C3990459M39171M82161L54547L75108K90717J0536L75400M8191J96114M80829
$$ 33990459 34429630 34911791 35266338 35641446 35932163 35942699 36318099 36366290 36562404 37043233
2108C7043233J96839L46791K14535M53820N89771K87736J77985o38536j092946
$$ 37043233 37240072 37586863 37801398 38255218 38844989 39132725 39310710 38672174 37579228
2099C7579228q72007p89656m49753l43304j31982r3369m12989k52680r9294j19940
$$ 37579228 36707221 35917565 35467812 35124508 34992526 34899157 34486168 34233488 34134194 34014254
2089C4014254K61576K44838K33949K80004R7850l3517K06015L24430K38340M88443
$$ 34014254 34275830 34520668 34754617 35034621 35132471 35098954 35304969 35629399 35867739 36356182
2079C6356182N47114O21013K43030j2327L3325j2717k87836k52899j05284J34822
$$ 36356182 36903296 37524309 37767339 37755012 37788337 37775620 37487784 37234885 37129601 37264423
2069C7264423K08797p2344q1008j24729J90078j05377k00036O0944j60243j89276
$$ 37264423 37473220 37400876 37319868 37195139 37385217 37279840 37079804 37140748 36980505 36791229
2059C6791229j68188k79615m86500r23283m14700l11620q08192m32904n78140
$$ 36791229 36623041 36343426 35856926 34933643 34518943 34207323 33399131 32966227 32388087
2050C2388087m59797m11585m68287j11835j80744k09008o937o4393L24543L04756
$$ 32388087 31928290 31516705 31048418 30936583 30755839 30546831 30539894 30475501 30800044 31104800
2040C1104800N28865O29093M26053O45308R42488R29722Q44836J040726J195056
$$ 31104800 31633665 32262758 32688811 33334119 34276607 35206329 36051165 37091891 38286947
2031C8286947J048096R85350J469671J424101J228455J934471K354088K484857
$$ 38286947 39335043 40320393 41790064 43214165 44442620 46377091 48731179 51216036
2023E1216036K674588L032300L438100L800052M678415N080481N448948N615660
$$ 51216036 53890624 56922924 60361024 64161076 68839491 73919972 79368920 84984580
2015H4984580N860013N911406N836224N678525N248890M371298L561521K734463
$$ 84984580 90844593 96755999 102592223 108270748 113519638 117890936 121452457 124186920
2007A24186920J206046l39368j499291l155293m785606n977737o588468p341825
$$ 124186920 125392966 125053598 123554307 120399014 115613408 109635671 103047203 95705378
1999I5705378p409753p517495p027412o426183o080867n281063m671568m096904
$$ 95705378 88295625 80778130 73750718 67324535 61243668 55962605 51291037 47194133
1991D7194133l793120k949341k425438k234405k105177j913843j323463j466848
$$ 47194133 43401013 40451672 38026234 35791829 33686652 31772809 30449346 28982498
1983B8982498j343883j236850j228305j016503p95237r28474q71124p38563r61698
$$ 28982498 27638615 26401765 25173460 24156957 23361720 22433246 21562122 20823559 19861861
1974A9861861r08561m60902m38692n79908o04662n27531o59910n40098l49334
$$ 19861861 18953300 18492398 18053706 17473798 16869136 16341605 15681695 15141597 14792263
1965A4792263l35743j92590l41494k93531k86625l34009j67362j4388j22277j43844
$$ 14792263 14456520 14263930 13922436 13628905 13342280 13008271 12840909 12826521 12704244 12560400
1955A2560400j3604l2640k78343j2915j54379R6830k59444M3983M2431K11658
$$ 12560400 12546796 12514156 12235813 12222898 12068519 12165349 11905905 11949888 11992319 12203977
1945A2203977k40596p0753J24422k64550k76541m63215j17740k3131l01128j49059
$$ 12203977 11963381 11892628 12017050 11752500 11475959 11012744 10895004 10871873 10570745 10421686
1935A0421686j59741j53929j48957q4425j70946J32298P7784j19320n4513r6634
$$ 10421686 10261945 10108016 9959059 9874634 9703688 9835986 9913770 9794450 9739937 9643303
1925I643303j43955q0333P398l8482k20878j09172J3380j10006R6444n5625L05492
$$ 9643303 9499348 9419015 9426413 9387931 9167053 9057881 9071261 8961255 9057699 9002074 9307566
1914I307566J19921j20562K60427k03175N5739j41035n5321J06000k9532J71446
$$ 9307566 9427487 9306925 9567352 9364177 9419916 9278881 9223560 9329560 9300028 9471474
1904I471474j53142J77115R2708j65146O1589Q1643p2417k28846m5349J34648
$$ 9471474 9318332 9495447 9588155 9423009 9484598 9566241 9493824 9264978 9219629 9354277
1894I354277L6728L05364q9517J74334L29063K8915p819K16297R6353K99044J35908
$$ 9354277 9391005 9696369 9606852 9781186 10110249 10139164 10131345 10347642 10443995 10743039 10878947
1883A0878947P6151J99821J46660K10687J00141J55045J80668N0425M42938J43995
$$ 10878947 10955098 11154919 11301579 11512266 11612407 11767452 11948120 11998545 12441483 12585478
1873A2585478p5152J74326J24635J51631L41171J35932K144K24963Q8704P1253
$$ 12585478 12510326 12684652 12809287 12960918 13302089 13438021 13440165 13665128 13753832 13825085
1863A3825085J72653j29583J97467K73134j660J33059N8431Q6404N73451K07038
$$ 13825085 13997738 13868155 14065622 14338756 14337096 14470155 14528586 14614990 15188441 15395479
1853A5395479j4807K88945K96687J93407J94993M01389L18538J47210K18433K10980
$$ 15395479 15380672 15669617 15966304 16159711 16354704 16756093 17074631 17221841 17440274 17651254
1843A7651254N22740L58606L68933J78660L19081M52242K83666M19131N29827
$$ 17651254 18173994 18532600 18901533 19080193 19399274 19851516 20135182 20554313 21084140
1834B1084140O39327M45824K72720K02265N30355K84151L59220J54118L77802
$$ 21084140 21723467 22169291 22442011 22644276 23174631 23458782 23818002 23972120 24349922
1825B4349922M84969N93323P75848P37889L63653N61991R13548R29550P15448
$$ 24349922 24834891 25428214 26204062 26941951 27305604 27867595 28781143 29710693 30426141
1816C0426141O76081O82661O88646Q54901Q90256J251062R73640Q58231Q33842
$$ 30426141 31102222 31784883 32473529 33328430 34218686 35469748 36443388 37301619 38135461
1807C8135461Q85333J317384J280045R32429J461840J591057J706942J638642
$$ 38135461 39020794 40338178 41618223 42550652 44012492 45603549 47310491 48949133
1799D8949133J960068K003651K431962L133039L349887L121082L337417L450066
$$ 48949133 50909201 52912852 55344814 58477853 61827740 64948822 68286239 71736305
1791G1736305L594496L768261L369373L869227L926929M095897M719417N100060
$$ 71736305 75330801 79099062 82468435 86337662 90264591 94360488 99079905 104179965
1783A04179965N403561O102733P181384Q106698R255305R626502Q891946P793500
$$ 104179965 109583526 115686259 122867643 130974341 140229646 149856148 158748094 166541594
1775A66541594O206292K998610j175093o511878j1251384j2420845j1485973r848418
$$ 166541594 172747886 175746496 174571403 168059525 156808141 144387296 132901323 123052905
1767A23052905p349767m687905l307924k114857q80434K6423N92083P71999J281727
$$ 123052905 115703138 111015233 107707309 105592452 104712018 104738441 105330524 106102523 107384250
1758A07384250K056054K533258L184852L825696M638450N465877O461875P004049
$$ 107384250 109440304 111973562 115158414 118984110 123622560 129088437 135550312 142554361
1750A42554361Q093872Q935310J0243475J1730342J3582495J5444108J8031157
$$ 142554361 150648233 159583543 169827018 181557360 195139855 210583963 228615120
1743B28615120K0398885K3305070K6917953L0796809L4061335L5223159L3696560
$$ 228615120 249014005 272319075 299237028 330033837 364095172 399318331 433014891
1736D33014891K9726702K2409221J0795536o925921k8578623m7784753n6442617
$$ 433014891 462741593 485150814 495946350 489020429 460441806 412657053 356214436
1729C56214436n3591492m5407292l5818574k7323518k0673683j6035317j2681559
$$ 356214436 302622944 257215652 221397078 194073560 173399877 157364560 144683001
1722A44683001j0109428r279650q317422p804467p758642p149130o400589n811354
$$ 144683001 134573573 125293923 116976501 109172034 101413392 94264262 87863673 82052319
1714H2052319n087600m630032l953041l332628l165342k780815k898308k707558
$$ 82052319 76964719 72334687 68381646 65049018 61883676 59102861 56204553 53496995
1706E3496995k595538k232696k381873j937045j618867j482515j600546j503901
$$ 53496995 50901457 48668761 46286888 44349843 42730976 41248461 39647915 38144014
1698C8144014j515240j546532j373372j502765j115524j293781j319581j057753
$$ 38144014 36628774 35082242 33708870 32206105 31090581 29796800 28477219 27419466
1690B7419466p58033r70215j139975q23552k94785p05742r12125o34496n03692
$$ 27419466 26661433 25691218 24551243 23727691 23432906 22727164 21815039 21180543 20676851
1681B0676851l40679j033902n86881p07803m55328o88709m87251q199k21539m22452
$$ 20676851 20336172 19302270 18715389 18007586 17552258 16863549 16376298 16368099 16146560 15724108
1671A5724108k10717j63236q8199k97249k03243k34505l44398k05594n95307j35455
$$ 15724108 15513391 15350155 15261956 14964707 14761464 14526959 14182561 13976967 13381660 13246205
1661A3246205k53782l65370k77165m96800j24487l44469l33054m98115k99861
$$ 13246205 12992423 12627053 12349888 11853088 11728601 11384132 11051078 10552963 10253102
1652A0253102l55128l14578k0378j78337o15382j54158k2634n1622j31191k45171
$$ 10253102 9897974 9583396 9563018 9384681 8769299 8615141 8592507 8540885 8409694 8164523
1642H164523k89710q3309l3634k10605l9131p6631l2412j50986l94525l30226
$$ 8164523 7874813 7791504 7757870 7547265 7508134 7431503 7399091 7248105 6853580 6523354
1632F523354m04355q221k87977k30396q71M2001K0170j54149j22632m5187J84427
$$ 6523354 6118999 6110778 5822801 5592405 5591534 5633535 5653705 5499556 5376924 5331737 5516164
1621E516164K8392j33280j49624J73338l57118m75434k12962M3332k5790l22023
$$ 5516164 5544556 5411276 5261652 5434990 5077872 4602438 4389476 4432808 4407018 4084995
1611D084995j98096n1059r7119j99974J3497j61230j26358J30906j7934K5098
$$ 4084995 3886899 3835840 3738721 3538747 3552244 3391014 3264656 3395562 3377628 3402726
1601C402726J81173O1054N4358P7884o7751j70548n4996K9262J64596k54800J33493
$$ 3402726 3583899 3644953 3699311 3777195 3709444 3538896 3483900 3513162 3677758 3422958 3556451
1590C556451l5917j26442R9217J88691J72421l35836p278j56073m1994n5047p011
$$ 3556451 3520534 3394092 3493309 3682000 3854421 3518585 3511307 3355234 3313240 3258193 3251182
1579C251182l40779J39502L1529r1950j56798j42999l0209n8835k77589K72035
$$ 3251182 2910403 3049905 3081434 2989484 2832686 2689687 2659478 2600643 2323054 2595089
1569B595089m3061O8416l74362L7581P4095j85604P2717j00834J1489J3346p0223
$$ 2595089 2552028 2620444 2246082 2283663 2357758 2172154 2244871 2144037 2155526 2168872 2098649
1558B098649q6047J08135R5117q7065P0097Q8614P1935m06073k03366Q9763k37570
$$ 2098649 2012602 2120737 2215854 2128789 2198886 2287500 2359435 1953362 1749996 1839759 1602189
1547A602189J82J85988M3817k56901L1602l45380J81548J02892j13959L00746
$$ 1602189 1602371 1788359 1832176 1575275 1606877 1261497 1443045 1545937 1431978 1732724
1537A732724J52581k83847j15875J74955k48353j37534J9514N6692O1739K4489
$$ 1732724 1885305 1601458 1485583 1660538 1412185 1274651 1294165 1350857 1412596 1437085
1527A437085l19867j87811O7131J74536O6498k0685J19633J7344J11975l9330
$$ 1437085 1117218 929407 996538 1171074 1237572 1216887 1336520 1353864 1465839 1426509
1517A426509J08708J14842l1013K18046q734n2987k3237m2879n4795J28705J54494
$$ 1426509 1535217 1650059 1619046 1837092 1828358 1775371 1752134 1709255 1654460 1783165 1937659
1506A937659k82358l06168J78226m2515j07410j07256R008O5859J07361k23140
$$ 1937659 1655301 1349133 1527359 1484844 1377434 1270178 1279186 1345045 1452406 1229266
1496A229266l8522L38474O7961J53621j22998K79873r2503j28578K7199P1024
$$ 1229266 1190744 1529218 1597179 1750800 1627802 1907675 1815172 1686594 1713793 1784817
1486A784817J3732J68271J50346n1492m6725O4091K60301J62430j57893o0048
$$ 1784817 1798549 1966820 2117166 2065674 2018949 2083040 2343341 2505771 2347878 2287830
1476B287830L7277J61241j32945n6044n3276R674P0920k27706k03257J39070k31391
$$ 2287830 2325107 2486348 2353403 2297359 2244083 2253757 2324677 2096971 1893714 2032784 1801393
1465A801393j03951R2885J80353n0347L9783q6533J31046j0067j48848K8069K99135
$$ 1801393 1697442 1790327 1970680 1920333 1960116 1873583 2004629 1994562 1845714 1873783 2172918
1454B172918k2027j88199p1561j16592K20457O8127J44878J09401Q5708J52085
$$ 2172918 2150891 1962692 1891131 1774539 1994996 2063123 2208001 2317402 2403110 2555195
1444B555195j12760j85913L32496J63255L94729J73355m2894p7639K69028K86089
$$ 2555195 2442435 2256522 2589018 2752273 3147002 3320357 3277463 3199824 3468852 3754941
1434C754941l13878M0197L1050j45037j48734k07693m0446l36250j79684k09665
$$ 3754941 3441063 3481260 3512310 3367273 3218539 3010846 2970400 2634150 2454466 2244801
1424B244801M6651k18099j10796k4523m372k5091k62534l5679l0672l32776n8577
$$ 2244801 2291452 2073353 1962557 1938034 1933662 1908571 1646037 1610358 1579686 1246910 1188333
1413A188333k21960k78980J2212J13997J36465j40249p6220K8902n6903N9854
$$ 1188333 966373 687393 699605 813602 950067 809818 733598 762500 705597 765451
1403G65451l2761j59874j96356k7640J41353m3456J83606j12150J34049N5942
$$ 765451 732690 572816 376460 348820 490173 446717 630323 518173 652222 708164
1393G08164p0094K2107o0267j12611J85484r0984J43468O3733l0242J80191J58132
$$ 708164 638070 660177 599910 487299 672783 581799 725267 789000 758758 938949 1097081
1382A097081l06069j80142N0198Q2898q3066j52357k9211r9657L073K9967J00697
$$ 1097081 791012 610870 661068 743966 660900 508543 479332 379675 382748 412715 513412
1371E13412n4480j09817L7748R1478j07150O4229j3583j4147k16829Q9802K13471
$$ 513412 458932 349115 386863 478341 371191 435420 421837 407690 190861 280663 494134
1360D94134j36438o097K8742J06324k44150N0789K82316j79049l2906K7413m3805
$$ 494134 357696 351599 380341 486665 242515 293304 575620 396571 363665 391078 347273
1349C47273P62J67909j8792j20101j25716O3304K05358M9019l13496p3310K67885
$$ 347273 348035 515944 497152 377051 251335 314639 519997 569016 255520 182210 450095
1338D50095R2034l91318j98847K32305L68639j2678j09738j46115j70463N0167
$$ 450095 542129 150811 -48036 184269 552908 540230 430492 284377 113914 164081
1328A64081K63968j43432N4226N2800j92987j498k6465M2327p9651K0012p8704
$$ 164081 428049 284617 338843 391643 198656 197158 170693 213020 133369 153381 74677
1317G4677K33079p574j09796J09377p8077O9527k7497p0767k77407J34130K34376
$$ 74677 307756 300182 190386 299763 221686 291213 263716 192949 -84458 49672 284048
1306B84048Q1328j34419q8436j26574J61643K74985j2229j2535N8762L25454l41569
$$ 284048 365376 230957 142521 15947 177590 452575 440346 427811 486573 812027 470458
1295D70458k76477M0836L03144R9419l65065R72N3698P307M9926J21526O7477
$$ 470458 193981 234817 537961 637380 272315 273287 326985 334292 384218 505744 573221
1284E73221M9613j98488j97708n8791Q8782L8481o0598J12607j26495K6943O1297
$$ 573221 622834 424346 226638 167847 256629 295110 234512 347119 220624 247567 308864
1273C08864j12460K4679r2872Q7372j32959J49418J86300k3959r240J13777k53224
$$ 308864 196404 221083 128211 215583 82624 232042 418342 394383 385143 498920 245696
1262B45696j12311Q1478J91765K7702k94250K62213J07355K77695K02024k50415
$$ 245696 133385 214863 406628 434330 140080 402293 509648 787343 989367 738952
1252G38952k77697J51684K49442P3378j36974J48972q7252l21912k26659M2959
$$ 738952 461255 612939 862381 935759 798785 947757 860505 538593 311934 354893
1242C54893J81478j60074j56837m2059P205J6632r1892J80902K77037j70101m7742
$$ 354893 536371 376297 219460 177401 184606 201238 109346 290248 567285 397184 349442
1231C49442P82J09246j71294j09591J18200m685J66576j19769r9687O0264n5725
$$ 349442 350224 459470 288176 178585 296785 292100 458676 338907 239220 299484 243759
1220B43759J75509J13992j35299j58090k05589J116J28914K30213k57865k30105
$$ 243759 419268 533260 397961 239871 34282 35398 164312 394525 136660 -93445
1210i3445N3417K08022P786p0718l71449M29039J99878o1228j84440N1857p8280
$$ -93445 -40028 167994 175780 105062 -266387 162652 362530 301302 116862 168719 90439
1199I0439J47005J74903l203k4841k8539j33836L7564J51532o5381J7001J54496
$$ 90439 237444 412347 409144 384303 355764 221928 259492 411024 345643 362644 517140
1188E17140q5930r4781Q9109q0935K83553q1497j21907J61922j12362o9348j57996
$$ 517140 431210 336429 425538 344603 628156 546659 424752 586674 474312 404964 246968
1177B46968Q414K31511r0556M0032R0926m5663M7864j83415j42609J86806J27455
$$ 246968 255382 486893 396337 436369 527295 481632 529496 346081 203472 390278 517733
1166E17733j3076j44655M8778j65160J17378K0247j40124q8268J43185J31566
$$ 517733 504657 360002 408780 243620 360998 381245 241121 152853 296038 427604
1156D27604J08231J23170J16702k4468n8617J6149J03242l6127j92022L8176j02849
$$ 427604 535835 659005 775707 751239 692622 708771 812013 775886 583864 622040 519191
1145E19191k42791L44815J90862r3768l3362M0007L20538j50055k80585J24300
$$ 519191 276400 621215 812077 718309 684947 724954 1045492 895437 614852 739152
1135G39152r4057K4522O2195j72157J40344N0067l52337O431K54532M2252m1240
$$ 739152 645095 669617 731812 559655 699999 750066 397729 404160 658692 700944 659704
1124F59704j85278j37812K20668K31922N0488p2562l8740j32565j97143l880J26852
$$ 659704 474426 336614 557282 789204 839692 767130 728390 595825 398682 394802 521654
1113E21654n9386J70179L7846J6387Q0754r1176l7477Q1646L8298M7593p9717
$$ 521654 462268 632447 670293 686680 767434 676258 638781 720427 758725 806318 726601
1102G26601J02872J79947J80701k36010l03512J38393J81009J58458n1657j90290
$$ 726601 829473 1009420 1190121 954111 650599 788992 970001 1128459 1076802 886512
1092H86512M4561J3801n1372Q635K08904q8944R1059Q1844j12097q0683n0398
$$ 886512 931073 944874 893502 902137 1111041 1022097 1113156 1195000 1082903 1002220 951822
1081I51822o3407P2397k21421p2909J27405K45470L18576K58355j0248j16609
$$ 951822 888415 960812 739391 666482 793887 1039357 1357933 1616288 1606040 1489431
1071A489431K16669j01511j7907J22159J20437n9302n4577K44173M6330N5998
$$ 1489431 1706100 1604589 1586682 1708841 1829278 1769976 1715399 1959572 2005902 2061900
1061B061900J07178k93950k08891p5533K87895J99506j0473j08435j5549R9824
$$ 2061900 2169078 1875128 1666237 1590704 1878599 2078105 2067632 1959197 1943648 2043472
1051B043472J766J33318J05142J67618J67470n0059p4796j35390J04560j16335
$$ 2043472 2045238 2178556 2283698 2451316 2618786 2568727 2493931 2358541 2463101 2346766
1041B346766k0276k6250K06472Q9251l44472L72809J70250j97687j64012M5191
$$ 2346766 2326490 2300240 2506712 2595963 2251491 2624300 2794550 2596863 2432851 2478042
1031B478042M8717J3974o5943M04037K08850K77001K03995J2138J26606k20697
$$ 2478042 2526759 2540733 2474790 2878827 3087677 3364678 3568673 3580811 3707417 3486720
1021C486720m7217N0062J70846K15594k2064J2664R3275R3591L48560M7816P0713
$$ 3486720 3439503 3489565 3660411 3876005 3853941 3866605 3959880 4053471 4402031 4449847 4520560
1010D520560M7093R8332L21531J25160j6519K91008M74490N07842L80538L17164
$$ 4520560 4567653 4665985 4987516 5112676 5096157 5387165 5861655 6369497 6750035 7067199
1000G067199J00900L87984L40002N29130K95492L23959K33676N19759M93599O73198
$$ 7067199 7168099 7556083 7896085 8425215 8720707 9044666 9278342 9798101 10291700 10964898
990A0964898M08279L86657O66785O36358Q29082Q96771J249655J116863J164778
$$ 10964898 11373177 11759834 12426619 13062977 13892059 14788830 16038485 17155348 18320126
981A8320126J600223J369828J645026J373439J712123K149754K665575L054797
$$ 18320126 19920349 21290177 22935203 24308642 26020765 28170519 30836094 33890891
973C3890891L696515M656442N805810O893845Q708771R085846Q202266P042508
$$ 33890891 37587406 42243848 48049658 54943503 63652274 72738120 80940386 87982894
965H7982894O747630N245615L70288j1891361k0240004j6903354j1354991p340823
$$ 87982894 94730524 99976139 100346427 88455066 68215062 51311708 39956717 32615894
957C2615894n429738l941794k971112j840042j123680p75334r86127m42706n44041
$$ 32615894 27186156 23244362 20273250 18433208 17309528 16534194 15548067 15105361 14561320
948A4561320p17215q11149j091083j279465p88790o92888m78017m71381m50869
$$ 14561320 13844105 13032956 11941873 10662408 9873618 9180730 8702713 8231332 7780463
939G780463m70167m51198l39065k34150k89101j88771l83118o9623l14375l29186
$$ 7780463 7310296 6859098 6520033 6285883 5996782 5808011 5424893 5355270 5040895 4711709
929D711709n393j55800m06990k47272k99817q5826l3610l50023j00647k01447
$$ 4711709 4706316 4550516 4143526 3896254 3596437 3510611 3477001 3126978 3026331 2824884
919B824884k87543J48289J8109J07929j18553q8873j50055j72316o0043j8528
$$ 2824884 2537341 2685630 2703739 2811668 2693115 2604242 2454187 2281871 2221828 2203300
909B203300j93916R4921m7914l1179j97950k5031j46796o6039M82769J17890k41528
$$ 2203300 2009384 2104305 2056391 2025212 1827262 1802231 1655435 1589396 2072165 2190055 1948527
898A948527q7551j07707k22591M18J1369o0292J01760m7579J81681r9168j26209
$$ 1948527 1860976 1753269 1530678 1531096 1542465 1482173 1583933 1536354 1718035 1618867 1492658
887A492658k73849q8538L95706k59331j37042o390k09658k7754j8586J9724L37858
$$ 1492658 1218809 1130271 1525977 1266646 1129604 1123214 913556 885802 867216 886940 1224798
876A224798m9952m41462o3173M0770P4871L4455J2077R3941j57096j1789k65368
$$ 1224798 1174846 733384 670211 710981 785852 820307 832384 926325 769229 757440 492072
865D92072L7077K58264k21480j38792o4128p9656q0577J7865O7230j1503R392
$$ 492072 529149 787413 565933 427141 363013 283357 202780 220645 287875 276372 285764
854B85764K9623K97776K74184l41973k86501n7900k18305K95065Q7772k4425k49009
$$ 285764 315387 613163 887347 545374 258873 200973 -17332 277733 365505 341080 92071
843I2071M8463J3874J56863j20832n0818j7036L2925R348j52760q370J48164j01248
$$ 92071 140534 154408 311271 190439 139621 122585 155510 164858 12098 3728 151892 50644
831E0644j19698K07451Q9588o7254j4116N9388j62173K09724N5517N4981Q3286
$$ 50644 -69054 138397 227985 160731 146615 206003 43830 253554 309071 364052 447338
820D47338j04250J4144j53855J90066l8284l38984J75993J83115p7628j64209
$$ 447338 343088 357232 203377 393443 355159 16175 192168 375283 297655 133446
810A33446k17175J92754J91400o3323j82225l0479J0950j20599N1462Q3071J25809
$$ 133446 -83729 109025 300425 237102 54877 24398 35348 -85251 -33789 49282 175091
799A75091N5894o5825m6692m7231J26475r9973P8901K8837m0298R4193j3254l1051
$$ 175091 230985 165160 118468 71237 197712 97739 176640 205477 165179 259372 246118 215067
787B15067j23732J58103L5948j06757K09191l33309k0518J15469j42271J71562
$$ 215067 91335 249438 285386 178629 387820 54511 33993 149462 7191 178753
777A78753j54303r8191P6330J16106J46589p1068M3790p7229k15010J48834N0999
$$ 178753 24450 -73741 2589 118695 265284 194216 238006 160777 -54233 94601 145600
766A45600m6364l09690n4973K3978p7925K99853K29638J87432j57411k96648j98012
$$ 145600 99236 -210454 -265427 -241449 -319374 -19521 210117 397549 240138 -56510 -254522
755b54522J45400J24336k21465J07066K29962J9054q3735k11840J27176J78076
$$ -254522 -109122 15214 -206251 -99185 130777 149831 66096 -145744 -18568 159508
745A59508K9306j60864k8289j09092k31676N634J51966N1486N3703J40414p9409
$$ 159508 188814 27950 -339 -109431 -341107 -335473 -183507 -132021 -78318 62096 -17313
734a7313j12758k31185J73017o0683K1079j70856P2495J01775J65310N11J63780
$$ -17313 -130071 -361256 -188239 -248922 -227843 -398699 -326204 -224429 -59119 -58608 105172
723A05172J68752p4610j80747j29202L1583m7241J19843M2272l9919p221p1756
$$ 105172 273924 199314 18567 -110635 -79052 -126293 -6450 35822 -4097 -11318 -83074
712h3074j74657J6839R8708J15252J57125j21675N1812J21829m74863q180J35095
$$ -83074 -257731 -240892 -142184 -26932 130193 8518 60330 182159 -292704 -300884 -165789
701a65789N0231k6007K34795m9924j63159q2918K545L44016P9692J64893J06580
$$ -165789 -115558 -141565 93230 43306 -119853 -202771 -200226 143790 223482 388375 494955
690D94955K4715l20996k32610j88275j81894K36141K59469J89071J58717j54941
$$ 494955 519670 198674 -33936 -222211 -404105 -167964 91505 280576 439293 284352
680B84352P2107J29669p5410m0478j46460O8748J33174J04951j96815j07472P7500
$$ 284352 356459 486128 410718 370240 223780 292528 425702 530653 333838 226366 303866
669C03866q0521k30842O1337j5955n5874j58252L33542o3536Q0104J71207k15998
$$ 303866 223345 -7497 53840 37885 -17989 -176241 157301 93765 173869 345076 129078
658A29078J66513o2991p823p6q3151j0746k05689j13929o282P0384J56107j81498
$$ 129078 295591 232600 224777 224701 141550 130804 -74885 -188814 -195096 -124712 31395 -150103
646a50103m850j8730k09371O2744L36639j84285J01006j19744M7877k37029J12564
$$ -150103 -154953 -173683 -383054 -320310 16329 -167956 -66950 -186694 -138817 -375846 -263282
635b63282J53451J8149p4291J3550j12111J12122J4942r3706Q5076K8976j11912
$$ -263282 -109831 -91682 -165973 -152423 -264534 -152412 -137470 -231176 -146100 -117124 -229036
624b29036O4776N8498R3163M1605n4055j94388o114J14476n0541j24249j2724
$$ -229036 -164260 -105762 -12599 29006 -25049 -219437 -225551 -111075 -161616 -285865 -298589
613b98589K03255M2729k78101J08764J97143j35290J11908j63505J01428K40933
$$ -298589 -95334 -52605 -330706 -221942 -24799 -160089 -48181 -211686 -110258 130675
603A30675L7757j97310k9049o7758m7093j00262J21500P7502l2253J19663L427
$$ 130675 168432 -28878 -57927 -125685 -172778 -273040 -151540 -74038 -106291 13372 16799
592A6799k52750L8692J00980j89490l45881L83984O1902k90335q947J12859K4102
$$ 16799 -235951 -197259 -96279 -285769 -631650 -247666 -185764 -476099 -485046 -372187 -348085
581c48085K00939k2931J0197q3769K74440J7499j63065R4933L8976o0586J89643
$$ -348085 -147146 -170077 -159880 -243649 30791 48290 -114775 -19842 19134 -41452 148191
570A48191m9314k39350j3253J55749l7944O6874j63592m1911L932j34516K41913
$$ 148191 98877 -140473 -153726 2023 -35921 30953 -132639 -174550 -170618 -305134 -63221
559f3221K64037l9447j29372r9402J52179k015P0663J50437k01029m80779m6908
$$ -63221 200816 161369 31997 -67405 84774 82759 153422 303859 102830 -377949 -424857
548d24857K98354j17375J37754k43474o3743m902N2368J17024q3143K22059k5894
$$ -424857 -126503 -243878 -106124 -349598 -413341 -418243 -365875 -248851 -331994 -109935 -135829
537a35829o7169k2019j49259q7392k6105J53425J54090J1582r4215J02835J08118
$$ -135829 -202998 -225017 -374276 -461668 -487773 -334348 -180258 -168676 -262891 -160056 -51938
526e1938j49353n2253J86201k6513p1747j88612J94569J09769j08112o3776J10372
$$ -51938 -201291 -253544 -67343 -93856 -165603 -354215 -159646 -49877 -157989 -221765 -111393
515a11393p6468q7814J14949J27642j07543J01928j65261o586J14126J15980o1790
$$ -111393 -187861 -275675 -160726 -33084 -140627 -38699 -203960 -210546 -96420 19560 -42230
504d2230k15786k3454j08265O7766m7690j09565n186J43503O8971P1894o9242
$$ -42230 -258016 -281470 -389735 -321969 -369659 -479224 -484410 -340907 -271936 -200042 -269284
493b69284J04435l3751j02908l9400k11892M9J74114K96384J04735K20206j31923
$$ -269284 -164849 -198600 -301508 -340908 -552800 -552751 -378637 -82253 22482 242688 110765
482A10765k20691P8875O8704l4608N14O3900m1880N3637P8376j65860k70690P6368
$$ 110765 -109926 -31051 37653 3045 3559 67459 25579 79216 157592 -8268 -278958 -202590
470b02590j16948R9027J42395k805r4178J80379J05759j61106j25347k13628P9353
$$ -202590 -319538 -220511 -78116 -80921 -175099 5280 111039 -50067 -175414 -389042 -309689
459c09689K33623q2176j90709K1805N3435k4203J35747P7844j00794k07745N3759
$$ -309689 -76066 -158242 -348951 -327146 -273711 -297914 -162167 -84323 -185117 -392862 -339103
448c39103L23604J38274j31252q4629O455j52379L6805j7461P0368L6760o4751
$$ -339103 -15499 122775 -8477 -93106 -86651 -239030 -202225 -219686 -149318 -112558 -177309
437a77309N5217L10323j63551j34345n4518M3510p1785l02466K33696L7212R8893
$$ -177309 -122092 188231 24680 -109665 -164183 -120673 -192458 -494924 -261228 -224016 -125123
426a25123j13190j2920O1271k21363P0881q486j5926l919O0156K8548k7263M2101
$$ -125123 -238313 -251233 -189962 -411325 -340444 -348930 -364856 -368775 -308619 -280071 -307334 -265233
414b65233k2343J6669K67292K9252k23514J7927K81213k42470K5844L6781Q4153
$$ -265233 -287576 -270907 -3615 25637 -197877 -179950 101263 -141207 -115363 -78582 5571
403E571j48172k55884O4377K0416j39628N57477j02581j24794O8903p1743L3721
$$ 5571 -142601 -398485 -334108 -313692 -453320 104157 1576 -123218 -54315 -126058 -92337
392i2337Q8198q5544k50366K71119p5168m173k22512j16417J54720K15230J43016
$$ -92337 -4139 -89683 -340049 -68930 -144098 -148271 -370783 -487200 -332480 -117250 25766
381B5766j18736r2443Q1972k04179j7776Q4811K56252M6393j67967K7746j36523
$$ 25766 -92970 -185413 -103441 -307620 -325396 -240585 15667 62060 -105907 -78161 -214684
370b14684J64429J64768j9820j6057l3290k0887j81837N9355j60171j89532L22849
$$ -214684 -50255 114513 94693 78636 45346 24459 -157378 -98023 -258194 -447726 -124877
359a24877Q1958k70413J20491l20987Q157R4057J55589p7619P0108R4516j80082
$$ -124877 -42919 -313332 -192841 -513828 -505671 -411614 -256025 -333644 -263536 -169020 -349102
348c49102J72021Q4955K6721J55447m0579k70820j35206Q8401j99079j5024J22013
$$ -349102 -177081 -92126 -65405 90042 49463 -221357 -356563 -268162 -467241 -482265 -360252
337c60252K00978J68924n6173r5043J07707K2252p7299p4538k28486J28527K69803
$$ -360252 -159274 9650 -46523 -141566 -33859 -11607 -88906 -163444 -391930 -263403 6400
326F400j03421j31350Q8366J07196k91816m6486N1850J51284k45254K9714q7995
$$ 6400 -97021 -228371 -140005 -32809 -324625 -371111 -319261 -167977 -413231 -383517 -471512
315d71512K02051K77739j84639L4815N2862m1251m8617l7509j7659j5309M1212
$$ -471512 -269461 8278 -176361 -141546 -88684 -129935 -178552 -216061 -233720 -249029 -207817
304b07817J66637j98300M6684j13091n3744J22878k27749L5251L16096j95203
$$ -207817 -41180 -239480 -192796 -305887 -359631 -236753 -464502 -429251 -113155 -308358
294c08358K73994r0906j57188Q126J0205K6937o8628K3369k8709J23332l4128
$$ -308358 -34364 -125270 -282458 -274332 -264127 -237190 -305818 -282449 -311158 -187826 -221954
283b21954m4359J07927J23078O0448J81433j30308l31097J52024l39719m7836
$$ -221954 -266313 -158386 -35308 25140 206573 76265 -254832 -102808 -442527 -490363
273d90363n0209O420K07496J54532j49701N9212O7966j52214O9913m6382M2274
$$ -490363 -540572 -534152 -326656 -172124 -321825 -262613 -194647 -346861 -276948 -323330 -281056
262b81056Q8442L9321L1869p575k3369N0927R9190J68445k8387l23788J40274
$$ -281056 -192614 -153293 -121424 -128999 -152368 -101441 -2251 166194 137807 -185981 -45707
251d5707l17765j88500K68186L0840j0031J16892m3640o1457J05193M3090r0057
$$ -45707 -363472 -551972 -283786 -252946 -262977 -146085 -189725 -251182 -145989 -102899 -192956
240a92956K0427L2723M0359Q0199j35104k04672o0353P7990m8113J29112j28619
$$ -192956 -172529 -139806 -99447 -19248 -154352 -359024 -419377 -341387 -389500 -260388 -389007
229c89007J0606O1355J09279O8849k15357J6042K11879J4363j82514O063n0924
$$ -389007 -378401 -317046 -207767 -138918 -354275 -338233 -126354 -111991 -294505 -288442 -339366
218c39366q7162K05259L9712k04530j05695O7826q6019R3990j55753J5733R8388
$$ -339366 -426528 -221269 -181557 -386087 -491782 -423956 -509975 -415985 -571738 -556005 -457617
207d57617j50467L51935p7901p6534N1411J13387L1665N1245k964m6077k92402
$$ -457617 -608084 -256149 -334050 -410584 -359173 -245786 -214121 -162876 -165840 -211917 -504319
196e04319O6781J41763p1231j09216o1153K12944k4744K50844K3402j91680j8033
$$ -504319 -437538 -295775 -367006 -476222 -537375 -324431 -349175 -98331 -74929 -266609 -284642
185b84642J44203j52074j57177j07133j63508K34143K27070J48761R3391Q9650
$$ -284642 -140439 -292513 -449690 -556823 -720331 -486188 -259118 -110357 -16966 72684
175G2684J19790k38975j07822o9090j30760J12092J41017k5938j64195L4850R4848
$$ 72684 192474 -46501 -154323 -223413 -354173 -242081 -101064 -127002 -291197 -256347 -161499
164a61499k17427j65626Q1408K12841J52075q7717l17620J44619O3133j71754
$$ -161499 -378926 -544552 -463144 -250303 -98228 -185945 -503565 -358946 -295813 -467567
154d67567M4169J24656o883M7447n0763N500L9248j13592M4821n6539p150l4825
$$ -467567 -423398 -298742 -305625 -258178 -308941 -303441 -264193 -377785 -332964 -389503 -396653 -431478
142d31478o7775n9897J98392K03347k06152k4901R8206Q6970k67453r6894K83141
$$ -431478 -499253 -559150 -360758 -157411 -363563 -388464 -290258 -203288 -470741 -567635 -284494
131b84494K6984p1465q4227p1333r35q5878j37149J04015K30793P5672J0847J53173
$$ -284494 -257510 -328975 -413202 -484535 -485470 -571348 -708497 -604482 -373689 -298017 -287170 -133997
119a33997j22097q3657M855m1018J12418k7830k14099j6281K30979J54716k1465
$$ -133997 -256094 -339751 -334896 -375914 -263496 -291326 -505425 -521706 -290727 -136011 -157476
108a57476j20247O07p3041r7719j09920K57425R0682r3028j24119N5030L1082
$$ -157476 -277723 -277116 -350157 -447876 -557796 -300371 -209689 -302717 -426836 -371806 -340724
97c40724J11136O1483j01510k64270j39267J38771K26096j40345r5639N7402m2411
$$ -340724 -229588 -168105 -269615 -533885 -673152 -534381 -308285 -448630 -544269 -486867 -529278
86e29278J7140N7881L8368n6930k7510R6411N6736P739J12908j2009j52031n19
$$ -529278 -512138 -454257 -415889 -472819 -500329 -403918 -347182 -339443 -226535 -238544 -390575 -391094
74c91094o874O1313j50383J45069j14057P7223O0343j21597N6308K0659J64092
$$ -391094 -397968 -336655 -487038 -341969 -456026 -378803 -318460 -440057 -383749 -363090 -198998
63a98998j03047N5109l05259J06954J52385K07198l0851j62461j40988K10029
$$ -198998 -302045 -246936 -552195 -445241 -292856 -85658 -116509 -278970 -419958 -209929
53b09929q5869p8151J27992l0914k51273L3953N3007l5287L7083n8439l7904N2861
$$ -209929 -295798 -373949 -245957 -276871 -528144 -494191 -441184 -476471 -439388 -497827 -535731 -482870
41d82870k7226j05418J84601o423j68801R2952J06179j30987K5821L6841M8605
$$ -482870 -510096 -615514 -430913 -437336 -606137 -513185 -407006 -537993 -512172 -475331 -426726
30d26726Q404o9310K5736L7998J56023j70128P0463m4748M379n1716J9747J56149
$$ -426726 -418322 -487632 -461896 -423898 -267875 -438003 -367540 -412288 -407909 -459625 -439878 -283729
18b83729J01973j20884j18450l9477J23315j41214M7645n0106m9288q5170N3539
$$ -283729 -181756 -302640 -421090 -460567 -337252 -478466 -430821 -480927 -530215 -615385 -561846
7e61846M4192L2755K36130n4114k69664M8242J37351
$$ -561846 -517654 -484899 -248769 -302883 -572547 -524305 -386954
0c86954
$$ -386954
$$ Imaginary data points
##PAGE= N=2
##DATA TABLE= (X++(I..I)), XYDATA
16383e431127N8710k5355J0015Q7767n9477J42389j0098J32058J08561J60768
$$ -5431127 -5372417 -5397772 -5387757 -5299990 -5359467 -5217078 -5227176 -5095118 -4986557 -4825789
16373d825789R2976J22907P8885O0065j8984J04014p1153K7515N5736J04041Q3114
$$ -4825789 -4732813 -4609906 -4531021 -4470956 -4489940 -4385926 -4457079 -4429564 -4373828 -4269787 -4186673
16362d186673j15722J9220K1451J82115P5444J19839M0823N3949P6366l9302Q8054
$$ -4186673 -4302395 -4283175 -4261724 -4079609 -4004165 -3884326 -3843503 -3789554 -3713188 -3752490 -3664436
16351c664436q6915M3538K35559j47141L18006P7382P5323J17112n3916j19193
$$ -3664436 -3751351 -3707813 -3472254 -3619395 -3301389 -3224007 -3148684 -3031572 -3085488 -3204681
16341c204681q3851L36709M3599P272m364o9702M3024J48463Q4967k3052K42509
$$ -3204681 -3288532 -2951823 -2908224 -2900952 -2905316 -2975018 -2931994 -2783531 -2698564 -2721616 -2479107
16330b479107J55122l4095j33539O9416J8755p3164P2550K31931J09488J1010
$$ -2479107 -2323985 -2358080 -2491619 -2422203 -2403448 -2476612 -2404062 -2172131 -2062643 -2051633
16320b051633n4266O5148L2044J3783j4280L36865J69647O9318k1233J3893Q0610
$$ -2051633 -2105899 -2040751 -2008707 -1994924 -2009204 -1672339 -1502692 -1433374 -1454607 -1440714 -1360104
16309a360104j05847J95965k1625j04653m8679n4055J30881k0981O1764J77165
$$ -1360104 -1465951 -1269986 -1291611 -1396264 -1444943 -1498998 -1368117 -1389098 -1327334 -1150169
16299a150169J30944Q3988M1537M9496J13980J31522K5558j36693O9045n1261
$$ -1150169 -1019225 -935237 -893700 -844204 -730224 -598702 -573144 -709837 -640792 -692053
16289f92053l1517R6417K98088r0290J1230J39408J19081l3967K994P1488J2866
$$ -692053 -723570 -627153 -329065 -419355 -408125 -268717 -149636 -183603 -180609 -109121 -96255
16278i6255m7467N4857K1244P2502J46365N6819L0019j43075J56903k2916N4423
$$ -96255 -143722 -88865 -67621 4881 151246 208065 238084 95009 251912 228996 283419
16267B83419j19513k03807J52229L35936r8216N9405O22J23062M7113j8991J7982
$$ 283419 163906 -39901 112328 448264 350048 409453 410075 533137 580250 561259 579241
16256E79241j12057N5339K16443K57293j49940k68794J6213L59245Q1531K6427
$$ 579241 467184 522523 738966 996259 846319 577525 593738 952983 1034514 1060941
16246A060941J04643J4894l7114r3020Q893M0663j05482j05526K97165j2698Q8065
$$ 1060941 1165584 1180478 1143364 1050344 1059237 1099900 994418 888892 1186057 1173359 1261424
16235A261424K57698j33476j16787Q8816J60911P9611Q112j5409l973k3364J19263
$$ 1261424 1519122 1385646 1268859 1357675 1518586 1598197 1606309 1590900 1586927 1563563 1682826
16224A682826J36623L6825J50847q9359n2265l4592r2832m545K26910J04725o8312
$$ 1682826 1819449 1856274 2007121 1917762 1865497 1830905 1738073 1733528 1960438 2065163 1996851
16213A996851O616q6710n1210P0479Q6007Q3378p4039J03557K88892n6741k75687
$$ 1996851 2003467 1916757 1865547 1936026 2022033 2105411 2031372 2134929 2423821 2367080 2091393
16202B091393k1677O6539l4351J68123k26237J70764J5483L8580J12632r5348
$$ 2091393 2069716 2136255 2101904 2270027 2043790 2214554 2230037 2268617 2381249 2285901
16192B285901K64108j3440j62725N4102K34125K02150p4064k64530K0850k05274
$$ 2285901 2550009 2536569 2373844 2427946 2662071 2864221 2790157 2525627 2546477 2341203
16182B341203r2885J82617J80017K02376K0995k99895p7087m4781J3895L97516
$$ 2341203 2248318 2430935 2610952 2813328 2834323 2534428 2457341 2412560 2426455 2823971
16172B823971M306j96885j17877Q2161J26974n0663l3096k08287M625K52171l330
$$ 2823971 2828277 2631392 2513515 2595676 2722650 2671987 2638891 2430604 2435229 2687400 2684070
16161B684070j0436K77962j20420k68682j46096R7528K58899K5005q7297J68072
$$ 2684070 2673634 2951596 2831176 2562494 2416398 2513926 2772825 2797830 2710533 2878605
16151B878605q1649k34813O0271M05794L5208j28188k05986J3049R5374j76583
$$ 2878605 2796956 2562143 2622414 3028208 3063416 2935228 2729242 2742291 2837665 2661082
16141B661082L22851K6995j65804l8176K51815j49766K33313J9470L5777o0173
$$ 2661082 2983933 3010928 2845124 2806948 3058763 2908997 3142310 3161780 3197557 3137384
16131C137384r5747L5571l1280j26575q7684J35998j14146j10657K18889r517
$$ 3137384 3041637 3077208 3045928 2919353 2831669 2967667 2853521 2742864 2961753 2952236
16121B952236l3783L00530N9608K1660m5303j57955r5481o707L0534J33509k24653
$$ 2952236 2918453 3218983 3278591 3300251 3254948 3096993 3001512 2994805 3025339 3158848 2934195
16110B934195J93090R3581k24208J11541Q35J51017k4789l4340m826j1874j50472
$$ 2934195 3127285 3220866 2996658 3108199 3109034 3260051 3235262 3200922 3196096 3184222 3033750
16099C033750J12571J47211k57449J48528K07836p3322m5685K89466J21143j65697
$$ 3033750 3146321 3293532 3036083 3184611 3392447 3319125 3273440 3562906 3684049 3518352
16089C518352k45577K4310j088j08718J10920k3300k03253K63591k9806j12544
$$ 3518352 3272775 3297085 3295997 3187279 3298199 3274899 3071646 3335237 3305431 3192887
16079C192887J01185j6102q7418j8352J53434k0090m3153j11423r3708p0426J64507
$$ 3192887 3294072 3277970 3190552 3172200 3325634 3305544 3262391 3150968 3057260 2986834 3151341
16068C151341K80181j48698k23690r3749K1300J14880J09596O9413k9847J8302
$$ 3151341 3431522 3282824 3059134 2965385 2986685 3101565 3211161 3280574 3250727 3269029
16058C269029N027Q7782q6940N6707j45328j9435R9516K28887n9081k988J64122
$$ 3269029 3274056 3361838 3274898 3331605 3186277 3166842 3266358 3495245 3436164 3433176 3597298
16047C597298j44624l82116p923K88894r1681n9690q549R6066L3053K40166j04057
$$ 3597298 3452674 3070558 3062635 3351529 3259848 3200158 3191609 3287675 3320728 3560894 3456837
16036C456837k68266q232L29268m3700m4931J077j16132n5594o2152l8027K05622
$$ 3456837 3188571 3180339 3509607 3465907 3420976 3422053 3305921 3250327 3188175 3150148 3355770
16025C355770r2540l1318N2168k0071K92253P4074j20736j56305k40248Q7386
$$ 3355770 3263230 3231912 3284080 3264009 3556262 3630336 3509600 3353295 3113047 3200433
16015C200433L42816n812J4835k24719m0555K16315j7756r5313j5886P9641O5166
$$ 3200433 3543249 3537437 3552272 3327553 3286998 3503313 3485557 3390244 3374358 3453999 3519165
16004C519165O006K00221o3310k93727K4753j73555m0590J36399J37926j20315
$$ 3519165 3525171 3725392 3662082 3368355 3393108 3219553 3178963 3315362 3453288 3332973
15994C332973j01541Q6648M5432k23081J00497j11725J37011J65501j02781K3234
$$ 3332973 3231432 3318080 3363512 3140431 3240928 3129203 3266214 3431715 3328934 3352168
15984C352168J11118J78701q2352j6875J527j49128j95289M7898r016M4901J93300
$$ 3352168 3463286 3641987 3559635 3542760 3544287 3395159 3199870 3247768 3238752 3283653 3476953
15973C476953L5498L0877p9737j33086K50402r540p8210o3984J50019r2169k5596
$$ 3476953 3512451 3543328 3463591 3330505 3580907 3571367 3493157 3429173 3579192 3487023 3461427
15962C461427m3477j99064n2366J15947K53758o9204j24754l7203J07987j41058
$$ 3461427 3417950 3218886 3166520 3282467 3536225 3467021 3342267 3305064 3413051 3271993
15952C271993m8690J32743k22241R4559J56674J25361j25428J56450j6679j43604
$$ 3271993 3223303 3356046 3133805 3228364 3385038 3510399 3384971 3541421 3524742 3381138
15942C381138R8464L8914j3031j19898j6677R1514m3933q2071Q7822l9024j38689
$$ 3381138 3479602 3518516 3505485 3385587 3368910 3460424 3416491 3334420 3422242 3383218 3244529
15931C244529Q5930k7024K55276K1953k02060N3041L0560k05153r1577L04413
$$ 3244529 3330459 3303435 3558711 3580664 3378604 3431645 3462205 3257052 3165475 3469888
15921C469888O4136R5545P4855l30890l86048L17931j78182j03143J31060J04229
$$ 3469888 3534024 3629569 3704424 3373534 2987486 3305417 3127235 3024092 3155152 3259381
15911C259381j25195j09757K09076L20895j09659j5283J46940j56852k0179n1186
$$ 3259381 3134186 3024429 3233505 3554400 3444741 3429458 3576398 3419546 3399367 3348181
15901C348181J83820J5031O1921r1122Q8552j25613q6112N6215J23404k12953
$$ 3348181 3532001 3547032 3608953 3517831 3606383 3480770 3394658 3450873 3574277 3361324
15891C361324j89953R7387o6128J47050J1071q7742J32202J43925m9071p5823
$$ 3361324 3171371 3268758 3202630 3349680 3360751 3273009 3405211 3549136 3500065 3424242
15881C424242N573k4445j54194K5350l083K34013o2884j77402m2978K2859K45780
$$ 3424242 3429815 3405370 3251176 3276526 3273443 3507456 3444572 3267170 3224192 3247051 3492831
15870C492831J2593Q498j23481J24738O3779j47120j78644J60324j37172k97812
$$ 3492831 3505424 3513922 3390441 3515179 3578958 3431838 3253194 3413518 3276346 2978534
15860B978534K18840J21642K26428J15776j35864K5096k08985k43491Q3727P7356
$$ 2978534 3197374 3319016 3545444 3661220 3525356 3550452 3341467 3097976 3181703 3259059
15850C259059r180j42221K71608Q8185J9924J0880J02562J4290L4553l8233j60834
$$ 3259059 3249879 3107658 3379266 3467451 3487375 3498255 3600817 3615107 3649660 3611427 3450593
15839C450593P61J5089J25873n8098l5967j313j8374J50650J274M9407l47659
$$ 3450593 3451354 3466443 3592316 3534218 3498251 3496938 3478564 3629214 3630488 3679895 3332236
15828C332236M9100n404j8515K77629k4344l02976j4824J16794J25742J44672
$$ 3332236 3381336 3375932 3357417 3635046 3610702 3307726 3292902 3409696 3535438 3680110
15818C680110n4476j17264o3150J38714J74885j87590j90334J97416O7357n4991
$$ 3680110 3625634 3508370 3445220 3583934 3758819 3571229 3380895 3578311 3645668 3590677
15808C590677Q2649k15469j69095q7283J17697P1699p9199J18961K99J0106j68397
$$ 3590677 3673326 3457857 3288762 3201479 3319176 3390875 3311676 3430637 3430936 3441042 3272645
15797C272645N4542R4374K9307j32539N6051P0409L7542l5486K92339j32206o6948
$$ 3272645 3327187 3421561 3450868 3318329 3374380 3444789 3482331 3446845 3739184 3606978 3540030
15786C540030j99688O9826J39417J78789j2350j3124J15396k13553k38502k76698
$$ 3540030 3340342 3410168 3549585 3728374 3716024 3702900 3818296 3604743 3366241 3089543
15776C089543J36730J69474R1871P449K07607j62387m4332j9156j69961J28920
$$ 3089543 3226273 3395747 3487618 3495067 3702674 3540287 3495955 3476799 3306838 3435758
15766C435758K8651N0624P0954k6340q3908q22q5067j74286K03957K23189l2391
$$ 3435758 3464409 3515033 3585987 3559647 3475739 3474917 3389850 3215564 3419521 3642710 3610319
15755C610319q9383j09763L5608j2819n8794j98564O8452P496J34233K72116J15203
$$ 3610319 3520936 3411173 3446781 3433962 3375168 3176604 3245056 3252552 3386785 3658901 3774104
15744C774104o5971j90004l820j26074R7458j39612K2529o0460j64548J1206J0044
$$ 3774104 3708133 3518129 3514309 3388235 3485693 3346081 3368610 3308150 3143602 3154808 3164852
15733C164852n2930p6300m18J0157J54944P7209L21703J4704j57108K0789L9048
$$ 3164852 3111922 3035622 3035204 3045361 3200305 3277514 3599217 3613921 3456813 3477602 3516650
15722C516650j65330m9716J45937j35915J43972j83002J20601Q893N8968M6935
$$ 3516650 3351320 3301604 3447541 3311626 3455598 3272596 3393197 3402090 3461058 3507993
15712C507993J70891J49339l16938P4211J4747r2578M7347K6007J33160j25988
$$ 3507993 3678884 3828223 3511285 3585496 3600243 3507665 3555012 3581019 3714179 3588191
15702C588191j80892q9940o3894N9275Q9299J85216K38293l7595l25258r9074
$$ 3588191 3407299 3317359 3253465 3312740 3402039 3587255 3825548 3787953 3462695 3363621
15692C363621L56025q6055q9907o428M9291m8451J79069K57189k35948k83082
$$ 3363621 3719646 3633591 3543684 3537256 3586547 3538096 3717165 3974354 3738406 3455324
15682C455324K4418r6372j19814J98779k2949L3715J25762p9106j14043J78151
$$ 3455324 3479742 3383370 3263556 3462335 3439386 3473101 3598863 3519757 3405714 3583865
15672C583865o2894p4730L8838J37646q4432P0590P6370j49745k46496J12496
$$ 3583865 3520971 3446241 3485079 3622725 3538293 3608883 3685253 3535508 3289012 3401508
15662C401508r9138j1753r8399R2180J92234M1272P718j6662N4888O7690k11610
$$ 3401508 3302370 3290617 3192218 3284398 3476632 3517904 3525622 3508960 3563848 3631538 3419928
15651C419928J45834J53057j78387J53986K9340j72463m7527m8278J1834P8923
$$ 3419928 3565762 3718819 3540432 3694418 3723758 3551295 3503768 3455490 3467324 3546247
15641C546247m732j30366M0661O1710j99721m807K10855k1504J87701J02976j12690
$$ 3546247 3541515 3411149 3451810 3513520 3313799 3308992 3519847 3498343 3686044 3789020 3676330
15630C676330J57689j43596k59060J34730L8384Q7104j67143K56107j51040j10254
$$ 3676330 3834019 3690423 3431363 3566093 3604477 3691581 3524438 3780545 3629505 3519251
15620C519251O6999j76175M14960j05134j67793L34959J04371n7234k64274k49896
$$ 3519251 3586250 3410075 3825035 3719901 3552108 3887067 3991438 3934204 3669930 3420034
15610C420034M4112m222P5151O8284R5087p273P9370k62060p6768R078q0863l5392
$$ 3420034 3464146 3459924 3535075 3603359 3698446 3691173 3770543 3508483 3431715 3440793 3359930 3324538
15598C324538j5352J42820J17332j52274J78235j71990N6944K72016J57042m35093
$$ 3324538 3309186 3452006 3569338 3417064 3595299 3423309 3480253 3752269 3909311 3474218
15588C474218n5322J33903l96105R7037K44925O5383k7328O1037J64537r1981
$$ 3474218 3418896 3552799 3156694 3253731 3498656 3564039 3536711 3597748 3762285 3670304
15578C670304k36342J03746l54518K42505K90880k14785O8019m6217k29050J50634
$$ 3670304 3433962 3537708 3183190 3425695 3716575 3501790 3569809 3523592 3294542 3445176
15568C445176R5803k43884J06481J08898O7857j56269J82571k45315K7822R2883
$$ 3445176 3540979 3297095 3403576 3512474 3580331 3424062 3606633 3361318 3389140 3482023
15558C482023J6860N6095r508k72231L1747o7961J16667O4504p594l1589N5936
$$ 3482023 3498883 3554978 3545470 3273239 3304986 3237025 3353692 3418196 3410602 3379013 3434949
15547C434949J1439r9409J00914K6936Q9664L6027n2735p2182J295Q6940K7696
$$ 3434949 3446388 3346979 3447893 3474829 3564493 3600520 3547785 3475603 3476898 3563838 3591534
15536C591534j1219M7138o3177j55376j81983J08285j5005J37435j12475k3631
$$ 3591534 3580315 3627453 3564276 3408900 3226917 3335202 3320197 3457632 3345157 3321526
15526C321526j68139J41561K33299M8979J36201l07249Q1816j63408J0663J92721
$$ 3321526 3153387 3294948 3528247 3577226 3713427 3406178 3487994 3324586 3335249 3527970
15516C527970L0903J73036j64535J81915R8545p634j94482k2844l70398j28561
$$ 3527970 3558873 3731909 3567374 3749289 3847834 3840200 3645718 3622874 3252476 3123915
15506C123915K13228j00017o2793L06602J49893p8061q2092k35335k7022N15094
$$ 3123915 3337143 3237126 3174333 3480935 3630828 3552767 3470675 3235340 3208318 3723412
15496C723412j9806r2433j54787P1416k9613k6442k07286j1499J03662q6528r344
$$ 3723412 3703606 3611173 3456386 3527802 3498189 3471747 3264461 3252962 3356624 3270096 3260752
15485C260752j0288L75280p6955J29437j60967n8550K80679j56342j27124K6870
$$ 3260752 3250464 3625744 3548789 3678226 3517259 3458709 3739388 3583046 3455922 3482792
15475C482792J67553j4754k45459k2564O8070j2226L5826j15530L1392p3120K54145
$$ 3482792 3650345 3635591 3390132 3367568 3435638 3423412 3459238 3343708 3375100 3301980 3556125
15464C556125k4209R5787K724k28566K6278R3025J8308l4838j53816N946j6983
$$ 3556125 3531916 3627703 3630427 3401861 3428139 3521164 3539472 3504634 3350818 3356764 3339781
15453C339781j330m2653k5595J75732j00305J51966j20210K9796J16279r1252
$$ 3339781 3338451 3295798 3270203 3445935 3345630 3497596 3377386 3407182 3523461 3432209
15443C432209L69570k33937l8204K00818j62882N4446k45154J79100j77385m7045
$$ 3432209 3801779 3567842 3529638 3730456 3567574 3622020 3376866 3555966 3378581 3331536
15433C331536J86844j84336J3519K01517j35303j50002J05210J97037P4826q7659
$$ 3331536 3518380 3334044 3347563 3549080 3413777 3263775 3368985 3566022 3640848 3553189
15423C553189p68Q7835n4724J3100n2870m6167j01879J76028J12045j88265Q9712
$$ 3553189 3552421 3640256 3585532 3598632 3545762 3499595 3397716 3573744 3685789 3497524 3587236
15412C587236o6985j52469n9311q4985K01073j54517K80506L30235R5427k01046
$$ 3587236 3520251 3367782 3308471 3223486 3424559 3270042 3550548 3880783 3976210 3775164
15402C775164j31621k9849k26030P947r4073o3426J01241N4626J45052j35011
$$ 3775164 3643543 3613694 3387664 3395611 3301538 3238112 3339353 3393979 3539031 3404020
15392C404020J15475j00849n5813J20517l4958J68796j7807O8580k08082O9448
$$ 3404020 3519495 3418646 3362833 3483350 3448392 3617188 3599381 3667961 3459879 3529327
15382C529327K56372r2198j82660N6705P349P9905P2246p7819m51192J21233J31412
$$ 3529327 3785699 3693501 3510841 3567546 3574895 3654800 3727046 3649227 3198035 3319268 3450680
15371C450680n6217q3754J59575J10873p6669K19170l42704j64411Q6919L24545
$$ 3450680 3394463 3310709 3470284 3581157 3504488 3723658 3380954 3216543 3303462 3628007
15361C628007K72930k57083p0642j8939k55264P9004L569K6060K40121K05430
$$ 3628007 3900937 3643854 3573212 3554273 3299009 3378013 3381582 3407642 3647763 3853193
15351C853193l1839n7136j17983p094j05897j07867j59070K8483O0684o0783J92677
$$ 3853193 3821354 3764218 3646235 3639141 3533244 3425377 3266307 3294790 3355474 3294691 3487368
15340C487368j45231m9586K68187k1830j2394k73947l3352J31112L88286Q2926
$$ 3487368 3342137 3292551 3560738 3538908 3526514 3252567 3219215 3350327 3738613 3821539
15330C821539k85997m3895K04738j3119j44258J73773l5319k4807J15827m4160
$$ 3821539 3535542 3491647 3696385 3683266 3539008 3712781 3677462 3652655 3768482 3724322
15320C724322m5916J7841J22271K72799k44003j58107r9468m0948L3831Q1018
$$ 3724322 3678406 3696247 3818518 4091317 3847314 3689207 3589739 3548791 3582622 3663640
15310C663640j14812l2758M6748K016j16030r373R7204L3609J11707r936n9867
$$ 3663640 3548828 3516070 3562818 3564834 3448804 3439431 3536635 3570244 3681951 3672015 3612148
15299C612148k59815j72869K38846J31263k3643R9263J25530j55859l1421L1798
$$ 3612148 3352333 3179464 3418310 3549573 3525930 3625193 3750723 3594864 3563443 3595241
15289C595241n2101m5138J0816j02219R3593j24446K5914j44580j91143K27905
$$ 3595241 3543140 3498002 3508818 3406599 3500192 3375746 3401660 3257080 3065937 3293842
15279C293842K34719J35948J41997K6299l1162j30875R3454p5927j76641j24333
$$ 3293842 3528561 3664509 3806506 3832805 3801643 3670768 3764222 3688295 3511654 3387321
15269C387321m1631J08082J9496j0246j54733j4830J38029J35372J62899J11288
$$ 3387321 3345690 3453772 3473268 3463022 3308289 3293459 3431488 3566860 3729759 3841047
15259C841047k02755r4874j30212Q4785o1677j42094K30296K35955M4748j65802
$$ 3841047 3638292 3543418 3413206 3497991 3436314 3294220 3524516 3760471 3805219 3639417
15249C639417j61037J14718o7613L9591L1954l6158M9536J71064P1377J024k64596
$$ 3639417 3478380 3593098 3525485 3565076 3597030 3560872 3610408 3781472 3852849 3853873 3589277
15238C589277L3633J51403p1159J79714m6164j15980k11085j19299r6403L0517
$$ 3589277 3622910 3774313 3703154 3882868 3836704 3720724 3509639 3390340 3293937 3324454
15228C324454L16687M3933r3861O2344r9190J8777n8239q6247k01014K55025o7055
$$ 3324454 3641141 3685074 3591213 3653557 3554367 3573144 3514905 3428658 3227644 3482669 3415614
15217C415614P1624K32805k5500L1154N9054m4179q1560m6544J42906K7193l4696
$$ 3415614 3487238 3720043 3694543 3725697 3784751 3740572 3659012 3612468 3755374 3782567 3747871
15206C747871K5838o8565m1790Q015J9455j6032Q3075j34488Q1734l7942k12232
$$ 3747871 3773709 3705144 3663354 3671369 3690824 3674792 3757867 3623379 3705113 3667171 3454939
15195C454939J38723R6330q6233j72019N3877L95568j0695k2593k55605j83498
$$ 3454939 3593662 3689992 3603759 3431740 3485617 3881185 3870490 3847897 3592292 3408794
15185C408794r1739J75813J36727o6731J69537M5922p4290J30894K346j83385
$$ 3408794 3317055 3492868 3629595 3562864 3732401 3778323 3704033 3834927 3837273 3653888
15175C653888K8635J09225j47953q1264k09679n5010J75622R6595j11521k7546
$$ 3653888 3682523 3791748 3643795 3562531 3352852 3297842 3473464 3570059 3458538 3430992
15165C430992J06639l5871K4114J36750q5699N2035k37661K16993J20026j9218
$$ 3430992 3537631 3501760 3525874 3662624 3576925 3628960 3391299 3608292 3728318 3709100
15155C709100o424R8959n6252k08844K78756r3556j0993l10456N3349K0357j72164
$$ 3709100 3702676 3801635 3745383 3536539 3815295 3721739 3710746 3400290 3453639 3473996 3301832
15144C301832R2643L9760L3544J78147L37784n6605k93966k71514K79972q390
$$ 3301832 3394475 3434235 3467779 3645926 3983710 3927105 3633139 3361625 3641597 3633207
$$ [...]
##END NTUPLES=NMR SPECTRUM
##END=
