##TITLE=1H_EC-3249x
 DMSO,8 sc, 
 10.03.2021
##JCAMPDX= 6.0         $$ Bruker NMR JCAMP-DX V2.0
##DATA TYPE= NMR SPECTRUM
##DATA CLASS= NTUPLES
##ORIGIN= UXNMR, Bruker Analytische Messtechnik GmbH
##OWNER= root
$$ XWIN-NMR		Version 3.5
$$ Wed Mar 10 10:43:35 2021 Russian Standard Time (UT+4h)  she@DPX200
##.OBSERVE FREQUENCY= 200.131506
##.OBSERVE NUCLEUS= ^1H
##.ACQUISITION MODE= SIMULTANEOUS
##.ACQUISITION SCHEME= undefined
##.AVERAGES= 8
##.DIGITISER RES= 18
##SPECTROMETER/DATA SYSTEM= spect
##.PULSE SEQUENCE= zg30
##.SOLVENT NAME= DMSO
##.SHIFT REFERENCE= (INTERNAL, DMSO, 0, 15.9958)
##AUDIT TRAIL= $$ (NUMBER, WHEN, WHO, WHERE, WHAT)
$$ ##TITLE= Audit trail, XWIN-NMR		Version 3.5
$$ ##JCAMPDX= 5.01
$$ ##ORIGIN= Bruker BioSpin GmbH
$$ ##OWNER= she
$$ F:/spectra/data/she/nmr/H-F/1/pdata/1/auditp.txt
$$ ##AUDIT TRAIL=  $$ (NUMBER, WHEN, WHO, WHERE, WHAT)
(   1,<2021-03-10 10:42:23.90 +0400>,<she>,<DPX200>,
      <created by zg, POWCHK disabled, PULCHK disabled
       configuration hash MD5:
       00 E9 B6 7A A2 85 ED C7 34 08 36 98 17 FE 4E 26
       data hash MD5: 16K
       BE AE 2D D0 3E 3C B6 DC 2D C6 E5 C8 1A 77 41 9A>)
(   2,<2021-03-10 10:42:26.37 +0400>,<she>,<DPX200>,
      <Start of raw data processing
       efp BC_mod = 2 LB = 0.24 FT_mod = 6 PKNL = 1 PHC0 = -11118.14 PHC1 = 10.20094 SI = 16K 
       data hash MD5: 16K
       58 9D DC 2D 26 49 41 59 9D A0 67 A0 7F 35 53 99>)
(   3,<2021-03-10 10:42:45.78 +0400>,<she>,<DPX200>,
      <pk PHC0 = -1.478881 PHC1 = -0.4 
       data hash MD5: 16K
       32 8E FA 97 7C 85 03 76 38 12 32 7D 26 53 7D A9>)
(   4,<2021-03-10 10:42:49.26 +0400>,<she>,<DPX200>,
      <abs ABSG = 5 
       data hash MD5: 16K
       2F 96 89 CD C4 AA 24 C4 24 43 C5 CA 2B 02 E9 55>)
$$ ##END=
$$ 
$$ hash MD5
$$ 03 42 D3 BA AB F6 89 F7 D8 51 5B F1 01 45 2E 36
##$RELAX= 
##$RELAX= 
##$RELAX= 
##$RELAX= 
##$RELAX= 
##$RELAX= 
$$ Bruker specific parameters
$$ --------------------------
##$DU= <F:/spectra>
##$EXPNO= 1
##$NAME= <H-F>
##$PROCNO= 1
##$TYPE= <nmr>
##$USER= <she>
##$AMP= (0..31)
100 100 100 100 100 100 100 100 100 100 100 100 100 100 100 100 100 100 
100 100 100 100 100 100 100 100 100 100 100 100 100 100 
##$AQSEQ= 0
##$AQ_mod= 1
##$AUNM= <au_zg>
##$AUTOPOS= <>
##$BF1= 200.13
##$BF2= 200.13
##$BF3= 200.13
##$BF4= 200.13
##$BF5= 200.13
##$BF6= 200.13
##$BF7= 200.13
##$BF8= 200.13
##$BYTORDA= 1
##$CFDGTYP= 0
##$CFRGTYP= 5
##$CHEMSTR= <none>
##$CNST= (0..31)
1 1 145 1 1 1 1 1 1 1 1 1 1 1 1 1 1 1 1 1 1 1 1 1 1 1 1 1 1 1 1 1 
##$CPDPRG= <>
##$CPDPRG1= <>
##$CPDPRG2= <>
##$CPDPRG3= <>
##$CPDPRG4= <mlev>
##$CPDPRG5= <mlev>
##$CPDPRG6= <mlev>
##$CPDPRG7= <mlev>
##$CPDPRG8= <mlev>
##$CPDPRGB= <>
##$CPDPRGT= <>
##$D= (0..31)
0 1.2 0 0 0 0 0 0 0 0.06 0 0.03 0 0 0 0 0.0002 0 0 0 0 0 0 0 0 0 0 0 0 
0 0 0 
##$DATE= 1615358543
##$DBL= (0..7)
120 120 120 120 120 120 120 120 
##$DBP= (0..7)
150 150 150 150 150 150 150 150 
##$DBP07= 0
##$DBPNAM0= <>
##$DBPNAM1= <>
##$DBPNAM2= <>
##$DBPNAM3= <>
##$DBPNAM4= <>
$$ [...]
##$SUBNAM3= <"">
##$SUBNAM4= <"">
##$SUBNAM5= <"">
##$SUBNAM6= <"">
##$SUBNAM7= <"">
##$SUBNAM8= <"">
##$SUBNAM9= <"">
##$SW= 16.9725357007746
##$SWIBOX= (0..15)
0 0 2 0 0 0 0 0 0 0 0 0 0 0 0 0 
##$SW_h= 3396.73913043478
##$TD= 16384
##$TD0= 1
##$TE= 0
##$TE2= 300
##$TE3= 300
##$TEG= 300
##$TL= (0..7)
0 120 120 120 120 120 120 120 
##$TP= (0..7)
150 150 150 150 150 150 150 150 
##$TP07= 0
##$TPNAME0= <>
##$TPNAME1= <>
##$TPNAME2= <>
##$TPNAME3= <>
##$TPNAME4= <>
##$TPNAME5= <>
##$TPNAME6= <>
##$TPNAME7= <>
##$TPOAL= (0..7)
0.5 0.5 0.5 0.5 0.5 0.5 0.5 0.5 
##$TPOFFS= (0..7)
0 0 0 0 0 0 0 0 
##$TUNHIN= 0
##$TUNHOUT= 0
##$TUNXOUT= 0
##$USERA1= <user>
##$USERA2= <user>
##$USERA3= <user>
##$USERA4= <user>
##$USERA5= <user>
##$V9= 5
##$VALIST= <valist>
##$VCLIST= <CCCCCCCCCCCCCCC>
##$VD= 0
##$VDLIST= <DDDDDDDDDDDDDDD>
##$VPLIST= <PPPPPPPPPPPPPPP>
##$VTLIST= <TTTTTTTTTTTTTTT>
##$WBST= 1024
##$WBSW= 4
##$XGAIN= (0..3)
0 0 0 0 
##$XL= 0
##$YL= 0
##$YMAX_a= 173569
##$YMIN_a= -182319
##$ZGOPTNS= <>
##$ZL1= 120
##$ZL2= 120
##$ZL3= 120
##$ZL4= 120
##$ABSF1= 15.96263
##$ABSF2= -1.010032
##$ABSG= 5
##$ABSL= 3
##$ALPHA= 0
##$AQORDER= 0
##$ASSFAC= 0
##$ASSFACI= 0
##$ASSFACX= 0
##$ASSWID= 0
##$AUNMP= <proc_1d>
##$AZFE= 0.1
##$AZFW= 0.1
##$BCFW= 0
##$BC_mod= 2
##$BYTORDP= 0
##$COROFFS= 0
##$CY= -3
##$DATMOD= 1
##$DC= 0
##$DFILT= <>
##$DTYPP= 0
##$F1P= 0
##$F2P= 0
##$FCOR= 1
##$FTSIZE= 16384
##$FT_mod= 6
##$GAMMA= 0
##$GB= 0
##$INTBC= 1
##$INTSCL= 2.992141e-10
##$ISEN= 128
##$LB= 0.24
##$LEV0= 0
##$LPBIN= 0
##$MAXI= 10000
##$MC2= 0
##$MEAN= 0
##$ME_mod= 0
##$MI= 1.114404
##$NCOEF= 0
##$NC_proc= -8
##$NLEV= 6
##$NOISF1= 3.799351
##$NOISF2= 2.8
##$NSP= 0
##$NTH_PI= 0
##$NZP= 0
##$OFFSET= 15.99578
##$PC= 1
##$PHC0= -11119.62
##$PHC1= 9.800941
##$PH_mod= 1
##$PKNL= yes
##$PPARMOD= 0
##$PSCAL= 0
##$PSIGN= 0
##$REVERSE= no
##$SF= 200.130003134212
##$SI= 16384
##$SIGF1= 3
##$SIGF2= 2
##$SINO= 5.538805
##$SIOLD= 16384
##$SREGLST= <1H.CDCl3>
##$SSB= 0
##$STSI= 16384
##$STSR= 0
##$SW_p= 3396.73913043479
##$SYMM= 0
##$S_DEV= 0
##$TDeff= 16384
##$TDoff= 0
##$TI= <>
##$TILT= no
##$TM1= 0
##$TM2= 0
##$TOPLEV= 0
##$USERP1= <user>
##$USERP2= <user>
##$USERP3= <user>
##$USERP4= <user>
##$USERP5= <user>
##$WDW= 1
##$XDIM= 16384
##$YMAX_p= 354617549
##$YMIN_p= -1203538
$$ End of Bruker specific parameters
$$ ---------------------------------
##NTUPLES= NMR SPECTRUM
##VAR_NAME=  FREQUENCY,     SPECTRUM/REAL,   SPECTRUM/IMAG
##SYMBOL=    X,             R,               I
##VAR_TYPE=  INDEPENDENT,   DEPENDENT,       DEPENDENT
##VAR_FORM=  AFFN,          ASDF,            ASDF
##VAR_DIM=   16384,         16384,           16384
##UNITS=     HZ,            ARBITRARY UNITS, ARBITRARY UNITS
##FACTOR=    0.207333158178282, 1,           1
##FIRST=     3201.235499763, 0,              0
##LAST=      -195.503630671794, 0,           0
##MIN=       -195.503630671794, -1203538,    0
##MAX=       3201.235499763, 354617549,      0
$$ Real data points
##PAGE= N=1
##DATA TABLE= (X++(R..R)), XYDATA
$$ [...]
7745 6594654 7134574 6772229 7086107 7518122 7692523 7697572 8021924 7925329 8796139 9140245
7735 9140245 9079590 8912214 9422417 9674636 10181400 10529277 10561375 11386645 12210342 12767324
7725 12767324 13519527 13980438 14371902 14737360 15682689 16868904 17747130 18631425 19336268
7716 19336268 20934201 22623548 23968860 25794224 27968719 29989560 31851329 34074347
7708 34074347 37158918 40038111 42604695 44484667 45981329 47588674 48398699 48946339
7700 48946339 49406767 49045184 48373068 47185101 45953996 44728390 42406108 40068943 38200604
7691 38200604 36008742 33472079 31573927 30013282 28566491 27444334 26588195 25651925
7683 25651925 24953110 24586400 23916083 23849480 23560083 23774840 23854631 24571704 24818324 26027266
7673 26027266 27059474 27917187 29431164 30543770 32423362 33946696 35088396 37011720
7665 37011720 38527248 39422025 40620658 41076184 41237038 40873512 40564587 40018990 39092692
7656 39092692 38055563 36562357 34614072 32532214 30257390 27858579 25641809 23829885
7648 23829885 22100254 20375280 18947744 17612666 16316494 14972181 14065108 13166244
7640 13166244 12356889 11851659 11482093 11120630 10679782 10097162 9413890 9128261 8669361
7631 8669361 8099665 8008970 7418826 7429404 7521496 6811718 7074165 6895948 6567708 6246626
7621 6246626 5860481 5710688 5297974 5407982 5087600 5210204 5560309 4905941 4111238 4224043
7611 4224043 4947735 4827013 4625015 4675134 4573213 4016079 4033152 3811838 3832357 4075364
7601 4075364 3927866 3537349 3775680 4026125 3894308 3789921 3517107 3174624 3183551 3015881
7591 3015881 3401743 3123111 2882377 2872194 2563857 2720607 2642921 2970827 2977806 3051729
7581 3051729 2537457 2994094 2988634 3104654 2854905 1758175 2305922 2397628 2398226 2124580
7571 2124580 1910869 2134750 2161603 2043731 2137825 2497814 2218709 1837507 1613983 1857774
7561 1857774 1924540 1858361 1982595 1577889 1563449 1383774 1484377 1227762 1112992 1353512
7551 1353512 1275227 1283510 2013947 1864398 1498497 1102296 1139012 1142847 964951 838669 1041608
7540 1041608 1015230 836132 1098954 910231 1330909 928677 1093033 1230436 1228264 556303
7530 556303 803371 789780 1034245 999835 1117262 955012 799715 666562 655797 630902
7520 630902 493388 407809 640965 770393 667830 573064 1011250 752164 577424 783521
7510 783521 988198 1197054 647703 476175 267598 664324 881675 761544 825497 1053158
7500 1053158 888572 679292 861457 792605 751727 1399814 1572545 1091336 717161 811413
7490 811413 447007 327985 198493 433094 614315 488376 589201 777753 507569 594850
7480 594850 335387 489959 364738 145076 652488 624606 273587 -44914 267556 325894
7470 325894 -48510 2190 1683 -81315 64400 296053 383136 387754 426232 214007 466212
7459 466212 495694 707094 635395 355650 512612 394694 504263 833814 1261061 903577
7449 903577 611139 421400 899861 1151404 570109 -165047 -369827 146872 -156262 7314
7439 7314 210288 75339 257986 240239 569818 455746 227587 -165967 2069 462530
7429 462530 16008 -341828 -323006 -218071 -121065 -328145 62366 -106598 242555 313987
7419 313987 376259 -97333 306887 452100 -117819 92510 29269 540330 -58730 -474731
7409 -474731 -382126 -34734 -96882 16516 145181 135414 -86213 620481 575640 127295 168399
7398 168399 -162814 -331091 -240057 101463 26018 -172295 155540 348582 185875 332434
7388 332434 826855 294994 -51475 -84633 -69064 -293111 -137173 394865 159884 471883
7378 471883 1143575 912774 350593 -122849 57921 -17462 -302182 -446737 -411550 100479
7368 100479 265519 674073 397778 162614 369338 544433 539622 853324 816472 941491
7358 941491 624133 462409 125103 -89658 -62783 467563 293562 262859 356120 181301
7348 181301 133938 -356142 -169313 -272743 -265218 -75457 -259434 -576787 -37330 -347813
7338 -347813 76033 470416 320081 131864 218457 352433 500171 615877 104517 72654
7328 72654 328105 688199 630920 523959 234075 -427794 -133134 -200856 -202576 96260 389630
7317 389630 479362 589549 449555 402102 518125 154519 -102971 291284 262595 126918
7307 126918 265470 351297 85483 322543 147042 -73215 -23073 -72749 32004 203313
7297 203313 617312 143088 339141 558088 414023 571163 617313 515858 519833 734021
7287 734021 668580 467831 492608 371711 -9617 -59812 -204596 27597 230717 266833
7277 266833 260767 198441 -190542 -330020 400895 158589 -345836 -251216 380721 154336
7267 154336 2070 -115752 -31970 -140692 54165 229115 147723 -147084 4391 138447
7257 138447 -482810 -357870 271795 128634 171302 -30809 -294013 -525064 143472 -103541
7247 -103541 -32333 236878 -206703 -320994 -334399 304285 217610 -42968 -299160 -132434
7237 -132434 387569 -9180 59153 -111964 11179 20355 -133213 219430 120541 45692 228324
7226 228324 626723 127672 492295 348646 49953 53230 93724 183282 -613628 -960333
7216 -960333 -167219 143024 59588 -335642 -517774 -592824 -389943 -222140 -27874 -173849
7206 -173849 -208749 119849 -13966 -461442 -498071 62390 154629 -292691 -684471 -442118
7196 -442118 -713189 -586174 151735 -249064 -175147 102977 -22860 37722 146076 196989
7186 196989 -92151 -36056 -231674 -126427 -26337 -202385 -102370 -251093 -51723 -281746
7176 -281746 94280 119982 -27625 -362998 -405028 -372988 -277264 -223069 -143075 60016 -35315
7165 -35315 -6875 256316 -100791 -78929 130346 146948 -229077 -348719 -120489 -87905 25489
7154 25489 78724 12746 -97784 81920 -251409 35241 -565923 -173697 46029 -287542
7144 -287542 -425400 -354900 -461628 -239677 264469 224526 109174 24157 1136 -361 -195256
7133 -195256 -235946 116021 -327167 -256738 119768 -357161 -483389 -254727 386649 191647
7123 191647 163931 -213772 -311763 -444832 -77257 395531 56174 272315 605325 122354
7113 122354 -443287 266966 50019 -347844 -132302 430680 545933 -15308 169803 320375
7103 320375 106177 22703 90344 62754 311179 -210563 -348022 20281 120396 128249 106127
7092 106127 608114 233042 -260614 -444725 -312854 -288833 -108784 -201923 -326309 111032
7082 111032 11931 158025 532245 289253 149110 46810 -231565 -576541 -555761 -221387
7072 -221387 222856 119652 366805 85222 43821 225272 183101 -17174 -238575 -549441
7062 -549441 -644041 -208436 250590 -70385 -322452 -192284 -219319 -157206 155754 -13921
7052 -13921 -142435 -24105 220005 -316722 -322307 -276313 -236931 -277527 -332945 -18711 -249556
7041 -249556 -367660 33174 24743 -183917 99802 32639 465956 -405226 -535811 -571894
7031 -571894 -412739 -375635 -420034 -225732 -545858 -527327 -36546 -127683 -267793 50119
7021 50119 271849 -111793 -281919 -493644 -139040 -279969 -346646 -248444 96494 146373
7011 146373 -618995 -372654 -532344 -217025 -91809 -19008 -212100 -81976 240558 285071
7001 285071 160840 285390 577309 334820 101580 31921 -232569 -270966 -271949 -171959 -262229
6990 -262229 -182544 194464 267796 -58498 -184276 171064 154295 -302659 -216760 95916
6980 95916 29873 -285123 -135928 -176336 -249483 -197464 -555457 -328233 -477490 -6758 -123580
6969 -123580 -384149 -278290 133148 120902 112203 86363 -199056 -63546 51520 240981
6959 240981 338774 -75707 -270403 -486011 -366349 -64475 -160254 -236114 -141560 44647
6949 44647 117829 -127688 -75860 -69635 347774 325608 -360041 -598314 -538593 -178304 197026
6938 197026 247446 121277 -271347 -592164 -163488 28972 154948 -241131 -404926 -737937
6928 -737937 -1060390 -422388 -73073 -244622 82952 284389 -272589 -395101 302253 -212843
6918 -212843 -147698 29543 579056 324274 10604 51069 286617 289184 110155 -412588
6908 -412588 -677923 -451237 -56609 -174217 -225520 -65299 -17392 159388 60056 78857
6898 78857 217462 277484 103911 319695 170172 82068 509657 429670 161603 -331227
6888 -331227 -268320 391609 -305171 -332305 -355739 -109147 -169567 -134515 -12136 65719 176949
6877 176949 -58917 -31175 851013 472717 405884 226216 229847 575553 398275 382298 592628
6866 592628 719626 703652 410923 -256029 -169663 -44002 174016 217096 151347 1296
6856 1296 171483 2662 -301687 -136487 -200584 -170200 -77727 -466585 -743920 -371813 56758
6845 56758 -177183 -398870 -499413 -85616 -415760 -360316 -320589 -505322 -113137 466787
6835 466787 360726 98750 498374 -66849 -401710 -778047 -323768 -88220 143992 59093
6825 59093 61430 107915 -8052 -24306 -205564 -476209 -266596 -212889 -417181 145232 273638
6814 273638 178059 -83536 -358907 -176483 324712 -16724 -312214 63906 315554 60544
6804 60544 148673 -3365 -77468 -167258 -378058 -222148 23974 -326656 110756 568045
6794 568045 18890 78428 355324 -177967 -75253 331370 116150 -122272 138379 -89342
6784 -89342 -527561 -288062 9154 -239619 -523763 -153985 209956 184392 227499 655933
6774 655933 641768 535663 189647 416782 385238 6452 214085 57482 -176438 22410
6764 22410 187826 285745 557239 411256 95136 -102213 9560 270697 318421 187171
6754 187171 207517 -203126 46221 354400 280098 71124 -254239 -127269 -73946 -89558
6744 -89558 -266876 79719 51067 -126158 -71954 -158096 103673 102720 116487 -137031 -416133
6733 -416133 -207045 -133259 -339113 -610886 -367567 -69669 88764 -204504 -419324 -836682
6723 -836682 -330798 -21437 232241 393408 105689 377 396870 214789 -2687 58287
6713 58287 -126600 158393 -156351 -880 -108797 -444137 -182792 41824 -159155 -177015
6703 -177015 -304835 -319615 -223982 113673 330091 -20454 -61192 77512 -242136 -496236
6693 -496236 -800231 -763219 -524707 -186225 97745 -364378 -269966 -134184 -569672 -992440
6683 -992440 -654457 -400136 -620825 -369327 3122 101630 -285911 -56237 -266619 -46141
6673 -46141 360851 140155 130122 259104 192760 642718 466505 -426941 -460883 -617068
6663 -617068 -313887 -73461 -5948 168882 224897 -253630 -361037 -400954 -66082 -55034
6653 -55034 120692 -474990 -362315 -120562 156852 292382 225935 455138 954480 514853
6643 514853 -175072 -73523 -409494 -184398 -39510 246625 367578 94789 -65108 -16064
6633 -16064 -316113 -151816 -133277 236247 138435 -92354 -385571 -449656 -258998 -211885 230361
6622 230361 -30388 -15448 -144450 -193906 173368 -239843 -315478 -215809 148223 124790 -39319
6611 -39319 -511950 -607373 -422897 39155 145446 -5239 96162 488503 107726 15642
6601 15642 48302 -420525 -322962 -304557 -159661 87788 226252 260710 -15698 295577 785509
6590 785509 777400 630300 486037 194817 -233343 -76093 40951 -64504 36676 42585
6580 42585 403463 219688 -215169 -434661 -39044 65918 -344228 192355 346137 333323
6570 333323 -134887 -87795 117157 24557 -487600 -299161 241664 -187738 -443026 -280030
6560 -280030 -741188 -863870 96663 -140688 -154529 117356 89835 12522 -223498 11596
6550 11596 229692 -169917 -196011 38557 -29516 127982 -259213 -36426 -62254 302885
6540 302885 439521 490279 182317 -113111 -413614 460393 168254 -560946 -138259 -26721
6530 -26721 -183981 54871 -139634 150081 454368 319964 -4488 -235900 -172384 -112301
6520 -112301 -154654 -321391 -116254 -503911 -444031 -225842 -513327 -442547 79264 -63531
6510 -63531 -89973 -330025 -149471 -362270 236904 251006 77845 151411 89338 57108 18702
6499 18702 -207919 88013 108003 117825 118661 -135532 -39839 -490620 -471896 -155689 -200243
6488 -200243 -104724 125239 -140683 -218368 -235703 -129140 -66767 -130854 178302 152902 -437342
6477 -437342 -594488 -456393 -109184 -284533 -54680 74597 -290362 27920 -322774 -218381
6467 -218381 -80366 30382 330743 76146 56369 -92636 -44906 92089 -76662 -81113
6457 -81113 -264551 36252 124562 119945 491235 542248 558168 133734 -59604 144700 64809
6446 64809 274858 -154969 -62862 -230175 -50371 -27596 -170209 243952 236085 358989 407264
6435 407264 130085 -143730 -89448 -95467 -52649 54365 -98976 -3672 -39165 -160721 5039
6424 5039 -218913 -470127 -696196 -313914 -7125 241946 293873 -61813 -232954 -170511
6414 -170511 277772 -362998 -291016 71315 472528 545007 766229 683222 178584 255589
6404 255589 -366464 -609197 -750144 -444039 -214803 154835 -111679 250142 -380238 -448010
6394 -448010 -148938 -238695 -336229 -436286 -371040 -759559 -74699 -84438 -368364 150616 13503
6383 13503 8829 -28549 -97937 -279463 -51532 49524 -119288 -353362 -332884 -46127 -67891
6372 -67891 -322112 -287807 -321610 -272258 -524131 -88649 248950 212110 36710 174439 -10320
6361 -10320 -233482 130995 212879 25454 282704 193267 124501 292167 678914 703671 427070
6350 427070 535745 585231 520035 100237 316385 85031 -241831 -152219 497097 387699
6340 387699 -177383 -461208 -190580 121281 123965 389227 -148991 -197589 255473 -406735
6330 -406735 -408573 -729052 -616855 -642166 -350359 -146486 -190868 148171 -393 -430644
6320 -430644 -87649 -221330 145531 -209813 -402231 -10818 241249 200057 95127 -41560
6310 -41560 390593 404968 28245 188083 244743 -79679 -265973 158594 127600 15002
6300 15002 57042 20626 92558 -13205 22898 506270 501143 388610 482579 491021 311035
6289 311035 40847 76068 -70976 88403 172995 -42428 52308 256615 -154732 -268278
6279 -268278 130637 71950 -67584 -572824 -531524 -500695 -484881 -237106 208344 212012 -4216
6268 -4216 110534 361099 141927 220923 445232 -164208 -214342 -523885 -743853 -585665
6258 -585665 -539267 -229645 -448348 -91150 -163908 -84395 236543 352540 36672 -238054
6248 -238054 -343944 -3171 -48644 -8391 368743 458944 492656 512673 432211 239139 96082
6237 96082 -53100 27563 108963 334924 572885 457720 -95035 202820 107788 -163328
6227 -163328 -203609 -302340 59599 144365 27747 223124 314607 498043 367971 -127162
6217 -127162 149229 57898 19411 -598356 -376524 -97130 -164981 -249812 -338061 -427917 -78890
6206 -78890 -65895 155028 116326 76213 208577 69431 163721 221037 373094 243231 606893
6195 606893 324007 113957 220214 313070 503365 77029 128810 -20392 -133166 268730
6185 268730 247016 498869 -151 -261226 13711 86693 40744 4796 199622 -28653
6175 -28653 -363602 -530056 -609512 -35969 -230657 -423061 -241628 -524801 -242465 257976
6165 257976 192746 143300 -458189 -721646 -129363 201159 -42374 -164241 103649 -254530
6155 -254530 -503494 -614006 -657066 -93972 -53004 88244 -140473 291371 540069 265773
6145 265773 427209 203450 -47732 -258815 84826 107130 -413453 -129182 9151 -368999
6135 -368999 -499297 -311050 -259692 -374563 -357176 -332704 -370163 -57266 112945 91144 91899
6124 91899 359460 469912 197968 39219 86738 261736 -140920 19781 81710 -83431
6114 -83431 -324442 -326158 -489676 -267447 47151 567976 764778 278535 328262 205309
6104 205309 273718 69634 -1117 183442 177276 148823 -90803 -203317 -190907 12757 322713
6093 322713 15314 -91287 50541 -100914 -331112 -743263 -707429 -674306 -527535 -693227
6083 -693227 -734154 -414057 -334373 -271845 -77522 -4017 162735 62566 -420770 -97037
6073 -97037 -494969 -680308 -294910 74616 -271811 -45686 11514 -226835 -531174 -297463
6063 -297463 3841 -32904 43806 -172963 -119111 226862 215057 -7286 -103615 390211 98079
6052 98079 192629 -84729 -104823 -130075 -420242 -325829 -86584 -82366 -47738 -5297 -134245
6041 -134245 206772 4613 488779 215160 281310 424786 83127 221812 458402 64158
6031 64158 290326 317325 279418 -71113 -52609 301161 -52852 -112068 -113421 48507 44777
6020 44777 119831 -54363 -129768 145902 350527 605897 539991 135452 -152001 -96401 200244
6009 200244 674916 299686 -11892 -239585 38966 377817 871621 506637 397737 448355
5999 448355 433494 -54642 358405 181657 -206685 -75895 269226 296155 -46521 204549
5989 204549 323655 324642 94374 -186256 -71872 -155811 -50472 114568 273206 152018
5979 152018 60615 -85617 -180644 208241 474607 550243 193505 456839 516162 823897
5969 823897 575261 284752 63440 327039 206578 301538 170509 396214 123593 -72460
5959 -72460 247198 270114 225618 404372 373335 276399 649432 414355 560925 702967 339897
5948 339897 93536 -39230 171481 410281 433542 143351 272451 626627 672774 503463
5938 503463 107938 236473 -35705 -110908 -121229 262357 310371 130917 205626 53382
5928 53382 -240271 -23343 99894 75314 292324 93532 280310 -19204 -661917 -336382
5918 -336382 54333 160923 -115583 -370014 -20050 584990 394374 254720 596814 725815
5908 725815 607890 199279 155395 250844 400162 283640 219831 164558 211546 385744 578075
5897 578075 308365 569457 686803 638832 282553 -71699 -378111 -427179 -347996 -173556
5887 -173556 -137631 -138395 468162 379675 58651 -315749 -285307 -256025 -330677 192417 124724
5876 124724 219930 13462 -46324 -260002 -325994 -742219 -81670 95694 49738 90530 124344
5865 124344 394499 732203 686016 442414 351197 75732 252461 395495 438486 538184
5855 538184 490553 -124641 104489 219545 -116898 -499216 -133807 67841 -119251 -175573
5845 -175573 -124281 48902 384841 723391 287051 75626 372662 628359 867313 543681
5835 543681 581955 107293 151276 180792 -174516 321713 666120 672686 526334 91201 -32537
5824 -32537 113163 322244 75899 74277 84770 36338 -46016 133067 -42465 -445445 -237893
5813 -237893 -140886 65576 117363 143652 501248 790640 1006477 807763 312729 -91879
5803 -91879 136807 192855 -190760 -224000 222560 252525 -239561 -155899 171083 -155496 141909
5792 141909 -344719 -379422 -471950 73348 -99871 -261818 254371 374812 373000 -220375
5782 -220375 -222201 430001 182174 203774 298992 48680 512786 311310 288399 193763 86409
5771 86409 328416 925810 950391 627985 551869 200140 335035 481240 239706 668156
5761 668156 404824 588371 622910 589350 613389 210348 -356175 -190842 175170 228435
5751 228435 375013 232807 115404 -298559 -487666 -601176 -221940 57192 96350 311968
5741 311968 414003 109832 466995 677672 227441 364335 480158 150293 145238 309394
5731 309394 308014 810413 649996 124196 371896 263198 -294317 408183 635235 816502
5721 816502 436686 313542 84361 -220331 -86081 66748 443946 837955 733399 583869
5711 583869 898711 684937 837623 950392 466575 462600 290235 180096 233230 256340
5701 256340 220064 572451 414031 280792 415192 579551 346825 341499 595470 475961
5691 475961 643810 749807 563404 609989 658876 904460 779231 732154 669934 948726
5681 948726 1122985 512699 1025288 766637 245797 -313836 -242490 262742 286808 353873
5671 353873 708346 655719 291587 515922 680677 779266 888673 606034 219304 338578
5661 338578 322628 194462 217640 381223 615975 372554 566030 7679 280819 356612
5651 356612 401552 606582 731660 861087 434331 896617 1278397 919725 608165 361815
5641 361815 195774 213085 -253252 23386 101000 162802 31230 -338534 -284127 357304
5631 357304 372978 487688 596849 230721 224224 618506 237441 356487 600563 429448
5621 429448 176107 418021 953480 548053 124017 394728 817700 741575 634358 906365
5611 906365 907762 697357 376528 513022 1294859 801307 879285 783212 726412 627829 720970
5600 720970 576966 821425 194942 223871 979731 879795 720068 681850 867595 861386 667397
5589 667397 842700 848551 934013 1018888 1196433 1164581 900637 870281 968726 696266 489813
5578 489813 786668 787639 1032337 875011 635928 783255 1000684 1202303 1246478 1228361 1256200
5567 1256200 1416859 1097984 988658 1087488 784808 1108196 1158237 1166209 1299757 1248862
5557 1248862 1380396 1126347 1170595 1306974 1140316 846142 777986 873195 886604 897981
5547 897981 783073 689770 1014508 1014803 1331093 1487047 1341957 1037273 681676 705070 661661
5536 661661 992381 907134 854223 1076287 846408 676652 885858 905422 888789 927315 941207
5525 941207 996707 888068 621268 918010 1008286 669885 914080 996676 486578 711903
5515 711903 818539 1215745 1091785 776729 304300 272488 533837 299096 425172 940020
5505 940020 689404 904377 774497 989717 1112378 722621 625868 759477 938552 786894
5495 786894 617630 659368 857298 456648 495428 623918 886804 1007522 1011830 1152625
5485 1152625 1045947 1005783 1227648 1368828 975024 695779 766065 943192 1214012 1114384
5475 1114384 1062379 1060189 825565 1115164 1054887 764374 920371 983952 860783 821537 999870
5464 999870 1188748 1279301 1118991 538885 661051 643752 961852 1220752 1033125 803864
5454 803864 1175789 681506 975953 1182775 956245 961268 543724 683660 506806 1036949
5444 1036949 1006731 999537 885654 725783 1006021 1261040 1106025 1203872 1408657 1504699
5434 1504699 1555667 1338695 1067064 1317114 1464798 1321135 807772 1413593 1721185 1609482
5424 1609482 1675285 1534877 894644 1092921 1295542 1459720 1825899 1977218 1656911 1406758
5414 1406758 1331453 1676382 1369459 1404958 1341496 1112595 1155006 1369371 1581953 1254708
5404 1254708 1854893 1707790 1636517 1387030 1272313 931739 1460309 2167747 1983895 1604530
5394 1604530 1661375 1726579 1637785 1735736 1528954 1682931 1609910 1664655 1473372 1403261 1533523
5383 1533523 1810431 2200078 2532030 2222140 2125664 2235951 2096237 2136629 2356019 1768701
5373 1768701 2029958 2355952 2249221 2252517 2021081 2366254 2067585 1635033 1749614 2149518
5363 2149518 2266976 2423124 2422028 2327371 2469054 2561962 1965578 2095803 2284534 2423466
5353 2423466 2865230 2325075 1958488 2288148 2490104 2805601 2398989 2403149 2799459 2456054
5343 2456054 2125162 2276283 2636630 2720607 2737910 2593035 2421345 2714219 2632123 2705223
5333 2705223 2729756 2847938 2972686 3262882 2635500 2458016 2843082 3202676 3088806 3348960
5323 3348960 3367546 2939092 3077126 3301862 3134223 2840918 2875229 3260598 2837296 2637947
5313 2637947 3442923 3484873 3673281 3625498 3207808 3375500 3737568 3701264 3784254 3349186
5303 3349186 3334494 3461665 3941804 3993394 4196337 4339331 4151680 4662491 4622811 4727310
5293 4727310 4579729 4286933 4724030 5150191 5033587 4990075 4947935 4994916 5024665 4839008
5283 4839008 5199881 5212785 5344872 5650697 5580388 5712587 6514184 6562714 6061235 6032594
5273 6032594 6591490 6820824 6976315 7349817 7798240 7953758 7645194 7933906 8293268 8385198
5263 8385198 8636456 9027234 9656923 9714691 9854254 10216414 10738573 10923643 10983328 11279867
5253 11279867 12333502 13130476 13828275 14076925 14143406 14712846 15134322 15553296 16344299
5244 16344299 16730443 16770588 16777139 17390808 18186004 17680445 18222525 17862639 17909016 18382462
5234 18382462 18196167 18346145 19022763 19288338 18873042 18806293 19494537 19830662 19854050 19676030
5224 19676030 19255679 19419415 19024440 18698001 18334032 18553104 18377655 17742508 17490177
5215 17490177 17377672 17102040 16636788 16986385 16861176 17313756 17217565 16971761 17205926 17429327
5205 17429327 17413673 17865767 17993626 18333570 18731418 18929440 19310617 19601521 20373457 21300099
5195 21300099 21900381 22117004 22638836 23398027 24224462 25114761 26425078 27687463 29019320
5186 29019320 29487151 30175943 31502528 33018602 34224547 35607133 37058723 38063345
5178 38063345 39431193 40677776 41973792 43155641 43635873 44300686 44749562 45296682 45744379
5169 45744379 46251516 46284866 46495188 46789001 46370691 46577040 46405383 45921673 45705873 45395547
5159 45395547 45098505 44737923 44366396 44253112 44022642 43519183 42702853 42024827 41598085
5150 41598085 40778597 40592694 40105846 39887511 39467358 39031361 38652313 38607621 38245182 37841772
5140 37841772 37585995 37831097 37591768 37161088 38116163 38405660 38880118 39444260 39525811 39782708
5130 39782708 40712777 41162497 41370625 41774398 42040014 41999883 42296120 42532992 42837645 42972727
5120 42972727 42817338 42701701 42273940 41097679 40815301 40674224 40080618 39849664 39581654
5111 39581654 39248967 38672513 38263496 38825332 39097929 38886159 38735438 38850318 38835095 39193556
5101 39193556 39564397 39709561 39964095 40647800 40955561 41255677 41727154 42571233 42758118
5092 42758118 43462941 44510513 45082317 45358207 45589887 46049894 46173102 46656313 46798863
5083 46798863 47331172 48069851 48420206 48888855 49062365 49380383 49958119 50356752 50172944
5074 50172944 50426378 50823540 51560592 52211238 52553158 53057718 53958646 54980876 55626788
5065 55626788 56649467 57214472 57837206 58798233 59604861 59654214 60040789 59766216 60517672
5056 60517672 60755413 60901369 61315753 61081320 60723745 60816340 61186862 61367917 61400483 62219148
5046 62219148 62994871 63745018 64493232 64960319 66253989 67246222 68029325 69758896 71580586
5037 71580586 73105459 74032333 75407841 76954448 78092113 78914351 79990996 80860884 81518378
5028 81518378 81371939 80755082 80245615 80384372 79413803 77764866 76397428 74807755 73487068
5019 73487068 72113146 70054789 68079838 66508637 65050641 63733491 62345623 60882890
5011 60882890 59234196 58544618 57131956 56528915 55824912 54878880 54132973 53813822 53212897
5002 53212897 52532919 51903058 51461055 51338450 50882176 50311073 49666941 48827272 47808346
4993 47808346 46973344 45670519 43862146 42893706 42063779 39987101 38279931 37371934 35964917
4984 35964917 34253169 33071768 31848612 31054838 29695802 28120265 27145339 26096848
4976 26096848 25426686 24224887 23294768 22711267 22095177 20955848 20434336 19526443 19059595
4967 19059595 18344972 17434636 16970930 16792515 16610355 16016629 15615296 15140714 14835645
4958 14835645 15174812 14184596 13659383 13569419 12998915 12748873 12518803 12761859 12477686 12151911
4948 12151911 12067983 11878886 11439859 10781695 10699728 10485187 10225345 10014541 10295566 10177588
4938 10177588 9555550 9719971 9400752 9259142 9083834 8827055 8181008 8111256 7744094 7752765
4928 7752765 8127137 8060282 7617861 7498541 7632670 7199427 6942633 6890396 6788637 6807428
4918 6807428 6861680 6534285 6174178 6236043 6250996 6119408 6065828 6266879 6364568 5877454
4908 5877454 5403678 5129841 4740297 4563187 4853772 5171561 5510828 5900096 5323682 4620292
4898 4620292 4711424 4977498 5096395 5392648 5265344 4803719 4410814 4139617 4518437 4674538
4888 4674538 4595430 4238000 3922389 4079472 3920223 4242443 4109480 4109850 4142166 3956258
4878 3956258 3935661 4223837 3969166 4161686 4009157 3674875 4038608 3955196 4381573 4189525
4868 4189525 4037230 4105532 3640561 3536808 3608115 3416631 3100512 3173176 3636108 3502972
4858 3502972 3493510 3634719 3762766 3702504 3498143 3274661 3560159 3137988 3022329 3189154
4848 3189154 2810173 2532968 2343711 2438938 2700856 3397914 3534482 3191861 3192241 3065898
4838 3065898 3002030 3327024 3374245 3167525 2824974 2830469 2865480 2801073 2682625 2770847 2707803
4827 2707803 2602262 2641797 2894899 2829559 2778984 2845746 2881353 2646826 2183281 2065903
4817 2065903 1932899 2398812 2821692 3057765 3135735 3305037 3338278 3243381 3188696 2677822
4807 2677822 3013960 3427950 2907243 2898878 3091059 2969163 2820703 2516240 2625325 2262549
4797 2262549 2183939 2267425 2425261 2762223 2691223 2821594 2848238 2331627 2329647 2420905 2709870
4786 2709870 3265124 2801640 2679189 2384389 2380331 3069972 3208378 2630174 2425728 2308105
4776 2308105 2611004 2754169 2389123 2176999 2692173 3017658 2822335 2536144 2481596 2167527
4766 2167527 2377407 2495786 2612215 2917096 2565247 2688053 2648236 2746717 2651865 2741004
4756 2741004 2342518 2216307 2538884 2413973 2399142 2663223 2568576 2545661 3040409 2974751
4746 2974751 3012481 2339816 2142232 2684417 2670354 2581488 2865151 3197024 2655517 2747052
4736 2747052 3052060 2942984 2921282 2512218 2605233 2493750 2561017 2551119 2374039 2513663
4726 2513663 2272950 2785315 2842874 2859098 3270640 2838057 2753471 3046235 3093406 3246906
4716 3246906 3319736 2768181 3118486 3419341 3391100 3208028 3230538 3100240 3118620 3437660
4706 3437660 3646390 3233334 2913467 3280528 3541428 3792085 3814831 3937938 3581190 3697690
4696 3697690 4135535 4005674 3626928 3950507 4288682 4422620 4367247 4272004 4011384 4380810
4686 4380810 4623988 4468412 4557836 4935603 4647352 4352204 4525564 4155247 4339286 4394566
4676 4394566 4814661 4801415 4741651 4815059 4990366 5032962 5118016 5076752 5162376 5404657 5551782
4665 5551782 5839151 5481813 5513814 5785673 6040977 6092152 6178463 6453163 6984590 7165304
4655 7165304 7579345 7481595 7505612 8009482 8408697 8884569 8550009 8346771 9092146 9380708
4645 9380708 9803357 9746630 9950004 10184583 10427285 10787399 11433065 11661489 11932385 12356194
4635 12356194 12630581 12711206 13364166 13952447 13814537 14288241 15191016 15957882 15746303 15986884
4625 15986884 16316169 15948195 16167447 17101235 17472400 17539849 17361254 17350491 17497493 18172839
4615 18172839 18296112 18440202 19272722 19776429 20533922 20200896 20264782 20897260 21535429 22090427
4605 22090427 22244283 22994705 22643928 22769035 22997193 23429293 24004992 24314914 24544469
4596 24544469 24657920 24781841 24747951 25293641 25523394 25509800 25676458 25809064 26382670 26733818
4586 26733818 26505170 26766860 27133468 26583315 26623861 27240828 27529981 27657155 27980287 28351842
4576 28351842 28526963 29301893 30020071 29980135 29946635 30209140 30304134 30548992 31272739 31909055
4566 31909055 32068896 32578582 32614490 32157295 32876098 33528279 33411555 33266710 33018773 33158979
4556 33158979 33283776 33238289 33101652 32499104 31979231 31319917 31240567 31163317 30667610 30100307
4546 30100307 29553855 29017681 28156060 27233284 26678683 25914595 25202233 25055615 25013601 24579385
4536 24579385 24491265 24199537 23583583 23004994 22548538 23018248 22580230 22183981 22186953 22159575
4526 22159575 22203620 21967910 21996768 21864183 21938246 22151037 22418460 21915027 21894250 21938333
4516 21938333 22141489 22337457 22527539 22111566 22240410 22555846 22750125 22878072 22820291 23188317
4506 23188317 23040968 23431815 23976109 24062149 23520361 23736999 24189576 24358326 24270522 24994849
4496 24994849 24875238 24639453 24966744 25056992 24714842 25134569 25190240 25069320 25004873 24884765
4486 24884765 25282346 25619342 25699692 25735396 26227147 26362404 26596598 26664244 26665788 26707964
4476 26707964 26625037 26471652 26855039 26935240 27455673 27907434 28293002 28486159 28254728 28264526
4466 28264526 28131795 28338363 28622566 28605388 28685700 28984281 28732086 28594981 28519401 27951830
4456 27951830 28031802 28195187 28007608 27969691 27671583 27676274 27853741 27867607 27547637 27261813
4446 27261813 27574991 27239578 26991842 26582736 26510542 26915527 26583774 26629384 26116804 25679173
4436 25679173 25496490 25396034 25162743 24943723 24620838 24604172 24195751 23627440 23293022 22530003
4426 22530003 22758317 22892059 22354750 21979257 21164122 20889366 20787242 21094033 21194424
4417 21194424 21189200 21099003 20254276 19946933 19499646 19353112 19224273 18475378 17887898 17459024
4407 17459024 17634547 17524208 17042184 16678807 16330935 15399824 14506657 14833426 14648616
4398 14648616 14717207 13940137 13264878 13643723 13272449 13057853 12638310 12815391 12729062 11857260
4388 11857260 11362195 11174274 11059898 10933895 10674929 10558734 10974491 11028640 10085845 9790942
4378 9790942 9295078 8680781 8705190 8722324 8891645 8459584 8687401 8449244 7959015 8150159
4368 8150159 7939479 7961565 7526618 6560493 6630909 7176946 7347620 7027576 6520937 6359767
4358 6359767 6237544 5996205 5994409 6229242 6112063 5912949 6233824 6101006 5851696 6261205
4348 6261205 6123492 5695566 5977056 5862212 5910182 5660176 5532091 5503914 5203455 4770603
4338 4770603 4459682 4939262 5486447 5322565 5231796 4938782 5299699 4906417 4529906 4799843
4328 4799843 4951991 4989424 4821794 4498086 4892724 5087537 5093130 4859274 4277801 4675219
4318 4675219 4291747 4098552 4287228 4518473 4453613 4197971 4384755 4735341 4725036 4625052
4308 4625052 4671447 4673749 5037288 5049768 4935684 5153769 5454695 5422128 5046579 4726604
4298 4726604 4791857 5104405 5311892 5255922 5198047 5471654 5707693 5860263 6031759 6321620
4288 6321620 6503688 6694827 6990565 6954576 6675103 6920820 7074828 7189813 7317929 7438147
4278 7438147 7335813 7536635 7884952 7878422 7936219 8224209 8183850 8298625 8122795 8603743
4268 8603743 8908840 8742303 8682512 8931660 9214528 9535036 9522260 9670229 9972384 9976879
4258 9976879 10070149 10277756 10557435 10541067 10722212 11192699 11764614 11894109 12307946 12206375
4248 12206375 12152021 12409720 12795288 13164967 13628644 13629663 13875958 14259434 14390924 14704146
4238 14704146 14736337 14973795 15280229 15361124 15344108 16004745 16339699 16379784 16104911 16464333
4228 16464333 16776102 17081092 17325916 17712332 17863411 17566478 17685384 17746581 18317798 18151187
4218 18151187 18711944 18988850 19231423 19919197 19868287 19996142 20214287 20306317 20212315 20216431
4208 20216431 20748312 21206342 20828712 20991747 21652961 22092291 22599353 23068691 22810456
4199 22810456 23290507 23576508 23803728 23441248 23686155 24130565 24182009 25025597 25771349 25553827
4189 25553827 25244929 25771077 26235156 26716495 26997960 27353840 27946156 28206611 28390027
4180 28390027 28830862 28757536 28698547 29053417 30064276 30849750 31380816 31636030 32260642 32611800
4170 32611800 33195086 33408962 34424373 35558555 36138673 36815319 37645756 38515172 39173147
4161 39173147 39592757 40097827 41143891 41339010 41334869 41323305 41243749 41273536 41080598 40396405
4151 40396405 40372554 39740773 38706350 38572331 37861389 37505362 36712881 35415234 34765853
4142 34765853 34222136 33664171 33292855 32652494 32139091 32104259 31983994 31485369 30452488
4133 30452488 30374331 31024516 31119860 30923999 30543820 30457136 30417516 30672147 30518677 30437972
4123 30437972 30469546 30134360 29971680 29621036 29962103 30376715 30540189 30519837 30689617 30447720
4113 30447720 30619475 31469533 32186052 32721039 32925152 32663733 33128661 34251365 34663077
4104 34663077 35322011 35212280 35639040 36085436 36569025 37017584 37574769 37707026 37747487 38866010
4094 38866010 38898816 38767737 38991629 39093694 39651402 40165149 40307833 40756771 40735311 40725719
4084 40725719 40662354 40491654 40505216 40933404 41507831 41386994 41197777 41357295 41905532 41594509
4074 41594509 41532830 41675265 41822680 41750341 41361204 41157865 41008474 40857506 40791628 41014333
4064 41014333 40951749 40785858 40362417 40623661 40715770 40894681 40564212 40163227 40135391 40068402
4054 40068402 39882361 39998439 39815448 39351030 38998896 38233511 38269456 38388781 37976671 37817610
4044 37817610 37554342 37775365 38012404 37188679 37450480 37363806 37322969 37649438 37351248 37315134
4034 37315134 37583355 38158719 38353363 38973847 39168871 39800640 39950569 40083588 40765975
4025 40765975 40818829 40716175 40955408 41119202 41296067 41197340 40900615 40099804 40028553 40058829
4015 40058829 39480799 39097400 38924739 38328519 37935228 37408226 36486919 36418989 35984260 35077951
4005 35077951 34227301 33760486 33089432 32068101 31700217 31312320 30508779 29242118 28222316
3996 28222316 27706340 27214018 26126331 25397214 25008596 23917699 23300928 22552491 22198527
3987 22198527 21473986 20763531 20283115 20082365 19434249 18922752 18272499 17978228 17479080
3978 17479080 17240975 17066031 16235598 15917932 15758003 15656281 15602253 15520658 15298367 14715877
3968 14715877 14694196 14794102 15067783 15101634 14815378 14846253 14894022 14828150 14459761 14200529
3958 14200529 14014282 14512499 14556318 14105796 14274888 14476478 14310981 13694671 14019253 14118175
3948 14118175 13992919 13634286 13453679 13317007 12911121 12483044 12226808 12178794 11492484 11558703
3938 11558703 11527375 10994982 10902774 10812270 9953673 9727481 9754243 9806246 9575470 9532739
3928 9532739 9383802 9195726 9436668 9385871 9201580 8814543 8492217 8564122 8525068 8263969
3918 8263969 8089766 7777420 7386950 7076436 7019657 7048582 6880584 6819115 6678269 6653868
3908 6653868 6217536 6448237 6440002 6480193 6323501 5767547 5354297 5275079 5251261 5397593
3898 5397593 5398503 5001513 4991990 4810653 4971004 4570517 4940868 4956848 5216418 4933227 4982063
3887 4982063 4543596 4036228 4166807 4109155 4115268 4121762 4363342 4544032 4331803 4113327
3877 4113327 3892909 3536577 3286644 3076244 3043507 2966076 3187260 3451454 3796846 3743932
3867 3743932 3598297 3793349 3512716 3320620 3485510 3283102 3548653 3626496 3827541 3417473
3857 3417473 3155356 3279112 2986868 2922681 2849105 2805771 3013693 3233833 3553679 3694826
3847 3694826 3446324 2877403 2696304 2771817 3154333 3212206 3211729 3313051 3330408 2933189 3340246
3836 3340246 3361680 2660944 2247709 2525364 2923474 2713663 2938976 3154037 2779303 2636499
3826 2636499 2636325 2726895 2878388 2778063 2315979 1861358 2403011 2600296 2488597 2448531
3816 2448531 2342351 2550674 2947685 2393100 2258994 2914575 2909541 2495032 2469643 2206965
3806 2206965 2091597 2186318 2576843 2736667 2671968 2415249 2246622 2575901 2135531 2304846
3796 2304846 2158572 2137680 2269884 2334357 2393518 2409683 2646106 2387778 1923170 1945464
3786 1945464 2317132 2540005 2102140 1994520 2023481 2281689 2276042 2171861 2406583 2405282
3776 2405282 2246655 2107749 2075627 1625570 1506765 1569258 1615337 1570728 1975667 1719126
3766 1719126 2008058 2239682 2386478 2572200 2845919 2417300 2143508 2189698 2246838 2478952
3756 2478952 2260657 2354379 2335415 2581959 2574345 2237132 2202717 2127661 2473825 2183375 1971268
3745 1971268 1732827 1646418 1804326 1893135 2091802 2164214 2242087 2140733 2336156 2338797 2227156
3734 2227156 2332907 2684055 2352183 2347502 2317167 2255869 2491416 2358614 2179789 2384279
3724 2384279 2391965 2003558 2187574 2510081 2687359 2423148 2500153 2505496 2671150 2664605 2789871
3713 2789871 2671680 2034947 1846151 1907243 2567564 2856574 2897352 3068157 3221311 2953508
3703 2953508 2860708 3045342 3058449 2807759 2826054 3059484 3036780 3160355 3265429 3090987
3693 3090987 3194713 3283651 2899009 3137873 3367558 3288569 2940343 3045925 3660469 3816992
3683 3816992 3698545 3615358 3580112 3324166 2943735 2302151 2546515 2579373 2761980 2705670
3673 2705670 2591095 2630836 2591979 2413243 2310076 2260555 2466742 2804748 2688420 2622020
3663 2622020 2623551 2569402 2661916 2360409 2320267 2588222 2843310 2773632 2271887 1745455 1495598
3652 1495598 1911790 2275735 2696849 2877699 2628386 2477223 2349531 1959477 2141220 2148029
3642 2148029 2404034 2382547 2376918 2650959 2356325 2098620 2337917 2696062 3083024 3246747
3632 3246747 3024464 2920160 2768849 2806630 3122825 2835668 2640919 2501057 2829027 2976633
3622 2976633 2700854 2835753 2754767 2596887 2375240 2836679 2661788 2790252 2988667 2880404
3612 2880404 3093025 3166828 2663076 2765964 3253490 3204824 3189372 3448147 3944239 3680819
3602 3680819 3342432 3258193 2885480 2883720 2938715 2932742 3357639 3434364 3143947 3598306 3656869
3591 3656869 3419036 3266680 3417355 3643671 3271908 3372207 3460712 3234574 3337839 3704796
3581 3704796 3610434 3700442 3956199 4334547 4050367 3940418 4024502 4171725 4310081 4149501
3571 4149501 4262306 4233668 3891023 3852770 3461409 3737404 3866144 3532414 4224878 4369167
3561 4369167 4386791 4516330 4656123 4475523 4023894 4001886 4477480 4907276 5136894 4961115
3551 4961115 5224809 5574945 5342040 5133614 5149678 5318323 5338173 5067243 5114312 5488812
3541 5488812 5533537 5264172 5245481 5733320 5936629 6006199 5733525 5935005 5620568 5427995
3531 5427995 5706049 5750795 5628580 5594374 5796202 5675083 5268223 5208389 5403631 5853863
3521 5853863 5451191 5203190 5542793 5577689 5549497 5381552 5463607 5519293 5607367 5649763 5706313
3510 5706313 5790681 6091469 6599100 6481966 6498690 6421875 6590770 6930613 6614450 6776299
3500 6776299 7013233 6936060 6856159 6479486 6206932 6544754 7017396 7423853 7594005 7536957
3490 7536957 7104072 7120632 7423798 7852176 8271236 8309704 8468336 8546529 8699097 8759312
3480 8759312 8799014 9076707 9020360 9035427 9020426 9535338 9399300 9368930 9665228 9918371
3470 9918371 10091818 9669176 10017418 10355838 10420034 10629119 10672792 11674352 11868436 11499425
3460 11499425 11762821 12383858 12595855 12795933 13273566 13752546 13810500 13795577 14182787 14641335
3450 14641335 14861212 15409915 15604212 15706922 16144586 16289097 16627100 17219878 17228347 17195884
3440 17195884 17772748 18461675 19253960 19287469 19102589 19253839 19673696 19700199 20289288 20924053
3430 20924053 21323634 21786053 22237130 22823595 23291244 23974195 24766016 25219684 25523721
3421 25523721 25923841 26469529 27070539 27583383 28024040 28252966 29026100 29407592 30232007
3412 30232007 31163132 32065219 32998317 33781750 34700365 35584723 36992389 37989035 39121194
3403 39121194 40077564 41845217 43228068 44748262 46543784 48335096 50621638 52387985
3395 52387985 54627466 57179966 59850502 63080846 65882446 69560524 73631135 78331763
3387 78331763 83868641 89339600 95422208 101880112 108469880 115445368 121574723 127910347
3379 127910347 134719175 141473502 147725044 154534990 161346205 168640134 176700863 184450327
3371 184450327 191354354 196461385 200597156 203921136 207341904 210877765 215259228 219869823
3363 219869823 223803283 225831963 224590011 221645050 217945089 213502983 209184689 205265994
3355 205265994 202508567 198713183 194434867 188955679 181877421 174129282 166792219 160231580
3347 160231580 153332283 146915716 141210928 135270436 128885467 122188835 115866726 110036178
3339 110036178 104456827 99490534 94612957 90943724 88140028 85561504 83445038 81366474
3331 81366474 80268156 79736128 78978595 79198914 79445353 79147001 78985937 79712844 80379392
3322 80379392 81021805 81955590 82438900 83575034 84052047 84706340 85076206 84585162 84371715
3313 84371715 83907370 82882747 81603476 80685426 79685243 78681125 77601108 76109706
3305 76109706 75236725 74442032 73690707 73171760 72758461 72764536 72522894 72852020 73084629 73648688
3295 73648688 74223818 75060307 76238281 77227854 78409941 79735805 80657783 81966842 82949154
3286 82949154 83922196 84676219 84775917 85232287 84984908 84573590 83846826 83576993 82531204
3277 82531204 82020811 81879404 81008762 80476942 80431871 80160842 80092272 80797846 81281277 82065887
3267 82065887 82928291 84011347 85668885 87422190 89055566 90778119 93756996 96740349
3259 96740349 100062586 103828452 107457187 111607303 116270113 121755631 127167661 133386747
3251 133386747 140850492 148083725 155645660 164403187 174132071 184599837 195874354 208019465
3243 208019465 220933173 233898928 245806433 255995795 263866146 268274365 268474024 264963765
3235 264963765 257672720 246847245 233633681 219078924 203705827 188904593 174189839
3228 174189839 160632368 148970459 138854330 128981248 120571159 113178690 106532927 100459768
3220 100459768 95055131 90504529 85573115 81265445 77398806 74044749 70655887 67367281
3212 67367281 64573478 61881799 58945161 56088588 53885976 51979656 49817690 48162094
3204 48162094 46476783 44144539 42515327 41526054 40250346 38981751 38419304 37294624
3196 37294624 36161956 35361447 34456249 32883808 31993249 31335247 30951338 30071234 29275674
3187 29275674 28677859 27562363 26915284 26384685 26000015 25691511 25110828 23512992 23337793
3178 23337793 23028444 22655910 21916770 21420821 20895655 20430665 19702728 19221280 18831137
3169 18831137 18737018 18211558 17861048 17705774 16967336 16449430 16623726 16818450 16215583 16076552
3159 16076552 16219557 15408342 14984769 14792682 14942079 14574682 14265732 14118545 13645965
3150 13645965 13740345 13156716 12762535 12608306 12335816 12000054 12410821 12283365 12045498 11911928
3140 11911928 11551519 11231578 11467635 11469073 11557146 11429340 11266909 10595713 10443972 10610055
3130 10610055 10669263 10277023 10351121 10002601 9552944 9776010 9211570 9292440 9218013 9097710
3120 9097710 8884395 9061208 8804082 8279188 8112587 8324975 8683424 8340157 8183193 7708357
3110 7708357 7879743 7637492 7810214 7839613 7446461 7752096 7304664 7218110 7666666 8131863
3100 8131863 7897694 7575211 7566719 7571134 7710347 7664777 7146906 7039854 6976675 6643772 6483970
3089 6483970 6741437 7083597 6910612 6833293 6705988 6323197 6659285 6814224 6403542 6308978
3079 6308978 6440380 6704850 6885150 6863014 6622211 7011013 7159185 7343914 7031570 6629355
3069 6629355 6803189 6824089 6669604 6323786 6423522 6473578 6715269 6565745 6866433 7137362
3059 7137362 7352723 7050732 6738348 6493127 7190892 7090128 7164224 7334296 7143337 7139848
3049 7139848 7283857 7425566 7524476 7289396 7288880 7707630 7911128 8079645 7489209 7783011
3039 7783011 7552686 7581689 7695248 7935106 8076124 7990667 8168790 8693423 9049377 9194432
3029 9194432 9014900 8939442 9253510 9153847 9114511 9424257 9533999 9401849 9137840 9451702
3019 9451702 9131168 9525090 9366721 9219520 9165171 9184438 8788404 8437086 8724926 8839189
3009 8839189 9203947 9166989 8803970 8692794 8815025 8183760 8105089 8144961 8293821 8866934
2999 8866934 8705761 8694932 8537690 8524300 8778841 9112635 9164612 8917911 9239382 9371830
2989 9371830 9946016 10292652 10252404 10131067 10452628 10891364 10872849 11254314 11582417 11728165
2979 11728165 12474828 12367855 12619110 13123846 13726553 14297091 14696604 16063319 17080214
2970 17080214 17580047 18338648 18791276 19871782 21420431 22259525 23739390 25809189 28144978
2961 28144978 30484106 33019426 35746468 38236552 38907218 37446842 35471522 32243212
2953 32243212 29653231 26861289 24522606 22623915 21133085 19996051 19410319 18683084
2945 18683084 18245435 18155176 17563350 17369911 17503337 17356366 17094410 16827069 16858392 16877114
2935 16877114 17029355 17079041 16774013 17020231 16798376 17079753 17242543 17074588 16912117 16773118
2925 16773118 17343044 18005004 18043995 17871303 17965565 18561727 18837281 18805828 18622749 18817628
2915 18817628 19177975 19452998 19468580 19395032 19333638 19932489 19951698 20041061 20497217 21278271
2905 21278271 22058220 22084549 21986635 22089474 22628100 23210680 23638621 24209126 24477608 24834715
2895 24834715 25692534 26476158 27166351 27805114 28595649 29344553 29873727 30953205 32199739
2886 32199739 33367744 34438949 35280943 36469669 37767144 39292959 40772699 42609614
2878 42609614 43822572 45716676 47641624 49328091 51362717 53350621 55500624 57768304
2870 57768304 59998253 62566598 64759383 67570351 70222643 72652274 75559162 78720507
2862 78720507 81710874 84562591 87745772 90805912 93713111 96742562 100267966 103560616
2854 103560616 106724251 109671232 112833508 115681955 118861176 121394939 123243588 125270930
2846 125270930 127840354 130077691 132063799 134050220 136087613 137740818 138818446 140186832
2838 140186832 141569215 142369218 142786269 142780780 142552004 142113027 141763839 141093417 140066178
2829 140066178 139156867 137827765 136221542 134697136 133129291 131203181 128534830 126489418
2821 126489418 124679476 122704123 120162932 117426179 115031838 112315369 109275970 106582653
2813 106582653 103944161 101298438 98416323 95702647 93366540 91040855 88843086 86259698
2805 86259698 83736659 81128162 78743490 76957568 75319756 73603938 71395170 69343042
2797 69343042 67841400 66519814 64937137 63730034 62616953 61727127 60416668 59258335
2789 59258335 58486528 57879838 57619008 56840531 56088614 55895414 55698699 55220439 55074530
2780 55074530 54979323 54747733 54530447 54955758 54706955 54510552 54490369 54600166 54584824 55131378
2770 55131378 55697053 56147662 56663795 57394882 58119354 58631473 58786418 59306140 60496623
2761 60496623 61798323 62538566 63328673 64440980 65492770 67436281 69233333 70544012
2753 70544012 72593089 74595377 76857244 79549633 82182186 84573500 87293973 90290993
2745 90290993 93623906 97773161 101936556 106246984 110925052 115969360 120869677 126683921
2737 126683921 133245123 140460500 148448292 156867054 166253668 175985707 186517832 197715337
2729 197715337 209755234 222347813 236020898 250536428 265508776 279905607 294185101
2722 294185101 307665711 319882369 330508469 339531119 346379042 350800143 353786883 354617549
2714 354617549 353659477 352009975 349659577 346097444 342134874 337751868 332637755 327333532
2706 327333532 321001673 313947692 305384411 295685533 284921022 272635019 260427909 246994880
2698 246994880 233450760 220070725 207095215 194462982 182432959 172131502 161151577
2691 161151577 150917525 142579770 134075592 126627232 119606179 113445263 107951219 102737436
2683 102737436 98043164 93501478 89069321 85282499 81929787 78892350 75780376 72905912
2675 72905912 70495493 67498022 65203408 63360660 61761150 60442642 58508041 56927296
2667 56927296 55179933 53837505 53039876 51370198 49889631 49012666 48015390 46874675 45725882
2658 45725882 44695507 43522420 42823129 41675916 40612140 39609233 39299778 38262881
2650 38262881 37374820 36512446 35704316 35434148 34949275 34098769 33555905 32833928 32281489
2641 32281489 31577802 31035393 30448286 29887682 29453846 28924960 28376900 28046018 27643594
2632 27643594 26814392 26601490 26717124 26473101 25677995 25322751 24713605 24243698 24382609
2623 24382609 24370102 24256759 24039247 23833119 23701411 23762764 23905729 23498079 23003920 22645546
2613 22645546 22533336 22435834 22390569 22069720 22234205 22101720 22010529 21968526 22132889 21883034
2603 21883034 21827220 21717404 21793360 22418639 22303686 22169365 22168888 21927128 22132094 21899740
2593 21899740 21722660 21487197 21638197 21733356 21807353 21688597 21597760 21450348 21683009 22360045
2583 22360045 22372091 22355579 22271642 22242205 22455518 22923554 23414600 23306797 23580858 24038671
2573 24038671 23962014 24067390 24714747 25075138 24913308 25108619 25588446 26427126 26512593 26774680
2563 26774680 26865557 27044681 27606412 28075910 28513525 28826913 29187941 29557129 30522714 31183837
2553 31183837 31592915 31557332 32046170 32910534 33100945 33552182 34224276 34954009 35625776 36094153
2543 36094153 36992669 37464245 38316584 38971369 39642790 41063077 41347457 41833376 42962007
2534 42962007 43613055 45025371 45768582 46296565 46777756 47487499 48264537 49356306 49992997
2525 49992997 50514204 51936255 52449194 53354456 54160754 55009236 56093901 57362840 58385115
2516 58385115 59770291 61166295 62970446 64303284 65679949 67311774 69231736 71596790
2508 71596790 73758094 75782081 78597796 81495451 84387117 87840122 91321043 95557607
2500 95557607 99228471 103427170 108445096 113358678 119091610 125085364 131350993 138677718
2492 138677718 146056487 153675621 162098873 170744468 179693421 189477485 199076725 208265398
2484 208265398 218081186 228160365 237054300 245147132 253722572 261287439 268394970 275303462
2476 275303462 281900546 288060171 293824935 298907028 303909605 308501599 312058283 314562687
2468 314562687 316069387 317317946 316303638 313934290 310683209 305832947 300341380 294051156
2460 294051156 287586160 280074280 272350576 264194128 256308851 248308995 240437307 232561284
2452 232561284 223599405 214827334 206041596 197523143 188389170 179308007 170584792 161833616
2444 161833616 153632786 145791770 137498761 130265468 124152321 118110404 112196302 106602798
2436 106602798 101860676 97628445 93532114 89978109 86613312 83419399 80869361 77437212
2428 77437212 75083658 72690712 70637643 69272850 67988416 66821844 64964603 63218380
2420 63218380 61930839 60711669 59103920 58028904 57293019 56693870 56141529 55053295 54136065
2411 54136065 53674850 53020586 52217821 51644066 51182535 50611622 50041032 49238163 48598894
2402 48598894 48144895 48057786 47119487 46419050 46536204 46499440 46143963 45779571 45310836 45104567
2392 45104567 44629145 44346725 44334080 43815570 43322817 43631346 43440321 43170922 42844839 42330837
2382 42330837 42591422 42519652 42774689 42761286 42368953 42624054 42777805 42997919 43229259 43444796
2372 43444796 43428107 43579540 44365084 44653168 45040577 45576048 46463874 47042922 47301280 48196945
2362 48196945 48768561 49886247 50427208 51054419 52160726 53432959 54678722 55876313 56791680
2353 56791680 58015513 59559970 61044374 63006427 65232263 67208643 69543441 72108497
2345 72108497 74571657 77226473 80574372 83947252 87381551 91277466 95769952 99959375
2337 99959375 104693396 109591038 114969293 121136713 127213981 133205101 139641443 146153243
2329 146153243 151469613 157113548 161587724 165352542 168232450 168805554 168478729 167673952
2321 167673952 166008476 163738333 161927708 160031375 158094262 156754743 155698258 156048352
2313 156048352 156853355 158478235 160598038 163149445 166682773 170716366 175505194 181187548
2305 181187548 187118717 194404418 202189961 210808019 219028662 227679325 236197427 244012674
2297 244012674 251474351 257579875 261024891 261641940 259999046 255995205 249484804 240907666
2289 240907666 231692754 222345940 212387638 203046371 193729800 185503439 178777185 172400646
2281 172400646 166113583 160766393 157349043 154497667 151661351 149204007 147753019 147340399
2273 147340399 147181282 147626559 149100144 150951180 152903229 154296916 155476313 157133588
2265 157133588 157744914 157488086 156322679 153830611 150258805 144949530 138589628 132298316
2257 132298316 125025773 117865938 111142631 104732909 98591815 92650211 87627673 82613144
2249 82613144 78139140 74452099 70458204 66710378 63551191 60618973 58477709 55907447
2241 55907447 53456672 51171670 49067005 47110011 45818322 44237242 42654531 41218651
2233 41218651 40097790 38780750 37265157 35902466 34961173 33871097 32814531 31650511
2225 31650511 31156475 30172473 29325603 28966638 28366288 27489445 27030781 25934284 25566508
2216 25566508 25092657 23984274 23124209 22388812 21853378 22190437 22002484 21201081 20409868
2207 20409868 20047961 19851837 19525043 19525671 19198488 18900438 18728970 18101659 17621796 17519419
2197 17519419 16684353 16411593 15765600 15665173 15730081 15397924 15178940 14990501 14364625 13807910
2187 13807910 14194742 13746050 13602530 13444527 12987089 13297476 12941349 13037034 12835983 13189133
2177 13189133 12553958 12480387 12388605 12246626 11958099 11982073 12031967 11706803 11327506 10936755
2167 10936755 10949427 11021169 11069773 10916389 10651800 10300726 10039879 10166196 10042216 10073858
2157 10073858 10192646 9949294 9460667 9223825 9457026 8876996 8921983 8750321 8374098 8730004
2147 8730004 8737416 8656339 8030087 7691051 7849475 7788393 7806831 7438278 7580263 7354219
2137 7354219 7466198 7297306 7241217 7037644 6592207 6674393 6089206 6162957 6586496 6156331
2127 6156331 5645305 6066907 6490901 5960161 5778871 5428039 5293436 5547715 5464341 5505247
2117 5505247 5529998 5302418 5397215 5450979 5015179 4916870 4763634 4668583 4907072 5244283
2107 5244283 5535641 5376355 4979824 4785109 4724111 4252560 4314718 4754577 4396607 3962632
2097 3962632 4036983 4312991 4216346 4218796 4342100 4121038 3915618 4311748 4018945 3886535
2087 3886535 3695282 3742916 4089343 3571999 3047073 3274154 3509808 3329950 3610187 3309151
2077 3309151 3417518 3672698 3573215 3490305 3482867 3368468 3568942 3576895 3418295 3271627 2968406
2066 2968406 3509366 3479018 3100085 2821276 3134306 3283919 3410404 3262863 2743014 3144268
2056 3144268 2932870 3281567 3476449 3228095 3628690 3165454 3030040 3050053 3421393 3705347
2046 3705347 3350133 3357400 3447379 3345881 3130613 2882508 2991763 3345606 3169611 2638062
2036 2638062 2346479 2988330 3200305 3181815 2979544 2855683 2526706 2250251 2352739 2184504
2026 2184504 2101103 2481440 2568313 2867346 3041090 2588941 2657838 2721734 2610125 2805066
2016 2805066 2782211 2757014 2772760 2438535 2347474 2277204 2024919 2199108 2552095 2187485
2006 2187485 2532811 2627616 2279738 2684617 2414703 2125781 2632536 2971945 2942440 2607546
1996 2607546 2288139 2576485 2921551 2914607 2355838 2296447 2403403 2747092 2622723 2331401
1986 2331401 2241613 2523616 2389718 2611852 2954932 2986558 2949786 2436787 2518270 2384439
1976 2384439 2172480 2168162 1984540 2384388 2858867 2411149 1815928 1645075 1668818 1442625
1966 1442625 1930294 2294950 2530498 1942535 1879703 2063910 2104690 2302396 2365017 2239688
1956 2239688 2694848 2929603 2635691 2122101 1895804 2017085 1830354 1661510 1695506 1663263
1946 1663263 1592621 1531896 1639409 1658193 1822990 1883942 1663537 1458774 1809967 2367898
1936 2367898 2189896 1931336 1546507 935390 1009506 1164030 1323868 1523357 1778837 1803581
1926 1803581 1202324 898541 929988 922731 1128445 1381028 1271556 1245358 644887 946188
1916 946188 1369318 1150578 1016322 843426 843475 995895 832227 629547 779673 767854 616008
1905 616008 503858 868468 1063203 1150451 1081245 653285 702910 773836 787728 742340 780864
1894 780864 707006 899885 1018496 630483 805527 709663 254480 693069 664271 1022684
1884 1022684 1414324 1179904 1079318 1194342 772690 670499 485824 551514 556196 725325
1874 725325 1026454 570022 296389 628004 502946 -1061 446714 950770 755733 855586
1864 855586 786273 991079 1043713 1105540 1119452 1109860 1366605 695215 519737 744922 420924
1853 420924 290322 542944 812389 1008981 861876 850792 910610 546704 533466 376847
1843 376847 -108700 -70931 283036 371076 -27971 458865 537578 601036 545617 605723 1252948
1832 1252948 1660940 937369 1013157 1178982 923320 475894 378393 685570 612964 246688
1822 246688 216834 458387 757982 1071469 1165287 803685 1042495 1273823 1121606 1087503
1812 1087503 1062724 655488 580321 763700 927816 894745 540669 881253 689729 572174
1802 572174 1000660 750135 248117 718216 893211 906274 869634 869083 1459402 1243983 747495
1791 747495 1077592 757724 904636 1129030 884832 888698 1140768 1120475 783521 997552
1781 997552 1228232 1219018 1180802 1225433 1367923 883362 931026 1027514 1050432 1469190 1392179
1770 1392179 1010154 689889 433731 537832 868435 1065959 1078784 1014306 439724 602879
1760 602879 819365 656001 737505 360653 317488 499106 694878 870105 929743 960966
1750 960966 678953 359817 528948 707902 821315 861042 685591 733690 951444 689891
1740 689891 809437 919648 1110220 1112504 984630 715576 165836 430437 400911 579121
1730 579121 578335 724142 539489 1091252 1015671 366288 369839 207743 738829 888986 540192
1719 540192 746046 470350 543460 558486 268355 386106 537099 565311 627703 607571 689739
1708 689739 556994 449133 813838 714112 1033039 730709 281114 -221123 238719 502008
1698 502008 131691 107283 -46189 -169460 242341 200724 245236 429896 765030 769467 567379
1687 567379 491045 226018 63092 118891 381245 673107 864803 618273 175648 -28741
1677 -28741 -28323 291277 618727 357544 56585 -308251 -56059 125186 82923 386603 97371
1666 97371 69097 193515 78463 -281187 -254587 161280 439835 585576 601552 425966
1656 425966 54000 76660 252334 317816 92083 213646 222741 230141 124730 95919 220565
1645 220565 452435 346839 -47827 -218001 -448051 -367732 -132199 -578 118782 165147
1635 165147 322908 303451 253471 192784 268587 -64478 -59921 233926 172475 230884 -578929
1624 -578929 -84749 114014 -178364 -153117 -202155 -465488 -85045 185009 -93151 8221
1614 8221 -199374 -195602 -102064 104566 276889 -380262 -779274 -568861 -123814 11402 -52727
1603 -52727 229791 100211 100440 -30171 -63147 119193 -172391 -31643 167094 2518 -373608
1592 -373608 -718583 -607469 -461984 729 64764 126585 318467 335129 -226754 -352294
1582 -352294 27618 35179 1163 132945 142616 -173524 168408 230875 182053 273396 -61461
1571 -61461 124199 340930 368567 266217 163252 279997 322785 455296 242182 -430409
1561 -430409 -283345 -270247 -187666 47253 378745 364788 190716 65450 269114 -62444
1551 -62444 127913 2306 -157585 -240706 -380349 -341288 -8977 52267 -12123 179568 -11201
1540 -11201 -51672 -208271 -68489 253300 -227869 -219087 348162 224501 210957 260686 57649
1529 57649 -46831 48053 -367957 -220000 -118079 -185522 -732284 -388747 -289414 -25926
1519 -25926 203568 -189675 -321798 -278102 6373 113533 -98271 -218659 -57253 386708
1509 386708 626803 315410 206490 280509 245171 91811 -355721 -540615 -174602 242528
1499 242528 104888 254217 67414 -249292 -256315 111376 225313 -8040 72552 10917
1489 10917 -70923 308410 435372 287712 308342 -9392 311962 77335 -268383 -374557
1479 -374557 -252380 -128912 -92140 269237 106250 105651 145064 -1357 -180352 -44243 311974
1468 311974 275645 567139 136239 30242 138321 69559 166281 -75611 92517 124107
1458 124107 113471 81312 -26344 104044 59938 -196116 170083 540309 34633 -511414
1448 -511414 -637439 -292683 -84062 127106 307604 398932 765876 586639 21544 -275746
1438 -275746 52701 30888 499313 709207 532948 687943 393187 264630 154243 -41592
1428 -41592 390808 264801 346517 156222 2853 311056 384256 -33376 -27828 217781 278258
1417 278258 -131581 -236241 90426 17630 63627 88993 319335 450438 527471 584476 313479
1406 313479 -58830 44424 396352 765858 247301 282971 259026 567851 655169 346704
1396 346704 -115897 -329960 -239138 -206924 207671 460942 704439 216850 -282889 -168823
1386 -168823 80832 131743 86280 254642 277022 112622 57770 397241 350717 -24929 -74741
1375 -74741 -78508 192467 222851 419913 576981 680863 571675 542703 486924 151322 11423
1364 11423 355665 291712 30719 387594 124870 421095 24727 -90297 -42378 199219
1354 199219 421055 763694 966516 702334 328915 209954 40758 188050 320981 482690
1344 482690 713831 352204 175466 189387 152525 147213 71210 8821 509844 757229 461284
1333 461284 544955 475308 30408 272089 293527 5146 -164695 21288 135637 244421
1323 244421 414092 -22239 157145 498313 186205 114534 292117 -69263 -112040 -283644
1313 -283644 244238 42111 -578992 3434 118511 697056 490735 160955 138695 -235769
1303 -235769 -312602 -343323 -609823 -208414 66869 647847 259987 -223017 142378 -129659
1293 -129659 -41154 432942 456083 378126 53224 216845 -201076 -239187 374829 646350
1283 646350 349084 -188748 -463694 -916646 -936427 -648549 -420962 -20960 -354088 -239529
1273 -239529 88619 114808 624640 689111 -247081 -241683 -187599 -77564 248318 219038 218407
1262 218407 341277 364499 523968 323775 517198 7841 127412 189404 -272518 -67282
1252 -67282 80333 -3665 -63734 -221307 -266476 236279 310168 324957 87250 130951 -254661
1241 -254661 12100 -221359 -1271 296306 647796 879492 1020787 883639 787265 349612
1231 349612 732346 929322 541353 670516 755339 251656 194890 550750 776783 272842
1221 272842 -92851 221035 97502 249350 615403 237598 194315 -162783 41718 157373
1211 157373 152974 -113675 -97754 -442005 102309 57905 -46528 442379 -49228 145052
1201 145052 127232 134479 -412636 -646019 -392639 47485 -103289 -104433 88506 12233 16705
1190 16705 269404 135067 278892 311284 433022 577124 322039 200247 449909 67101
1180 67101 459623 47474 46078 477617 647739 389390 279483 67427 209625 393667
1170 393667 370365 263718 259427 145254 60209 203845 440816 258109 534824 206279
1160 206279 7132 -86626 -70777 185148 156937 271611 136953 -256680 21463 581736
1150 581736 29359 85054 -140713 -3562 483776 640427 175179 -42027 -205964 118084
1140 118084 83256 85722 102961 548103 700600 509635 257234 347410 330411 -369634 -741754
1129 -741754 -434010 168940 -104191 -19572 87516 -247979 8603 377042 580253 561466
1119 561466 430299 264464 482307 640177 798568 612354 945623 550806 194621 -60440
1109 -60440 -160614 -128307 119726 125344 214420 174860 538146 206317 -104252 -253382 -230802
1098 -230802 257630 99668 -266761 -148129 174517 -48108 102474 535964 789689 132635
1088 132635 313490 571334 491837 583410 819654 349937 348496 19217 139814 476881
1078 476881 349 65023 478445 398532 129331 284050 548876 406658 387158 741095
1068 741095 923711 840675 1099346 1264825 917791 741172 1005132 950174 1156875 1082994
1058 1082994 1246896 1274354 1134287 1128473 1303507 1487438 1490004 1183231 1019371 790306
1048 790306 836561 822932 982166 1483437 1493760 932468 1024467 1286270 1626180 1376552
1038 1376552 1475164 1493011 1353995 1387161 1403418 1502474 1257835 1246805 1386421 1690465 1960539
1027 1960539 2344260 2044440 2673316 2837427 2441999 2536776 2298991 1950368 2273438 2513270
1017 2513270 2647753 2380358 2505259 2430706 2194283 2636093 2566249 2954921 3187988 2890280
1007 2890280 3067991 2714183 2815258 2930548 3302258 3564448 3581437 3536723 3761263 4135173
997 4135173 4668664 4149135 4197948 4275207 4258423 4633375 4868049 4421539 4552490 4823329
987 4823329 4836592 5183919 5507910 6161342 6334617 6211199 6169153 6464465 6288742 6285333
977 6285333 6677915 7072017 7559799 8263433 9178796 9603672 9933134 10360446 10580418 11928592
967 11928592 12734337 13338852 14379593 14809818 15546893 17130030 18547988 19899273 21058922
958 21058922 22580486 23974883 25675702 28308092 30426736 32787129 36460986 40921526
950 40921526 46406351 52688119 59480831 65635461 72892743 81349983 88529565 88905544
942 88905544 83368030 76208510 68273995 59230294 51518593 44495332 38159972 33863936
934 33863936 30434486 27353833 24873891 23526724 21976162 20343439 18537567 17420582
926 17420582 16834985 15827254 14684907 13940848 13160725 11806685 11156042 10563685 9872567
917 9872567 8900128 8280138 8157168 7828212 7580969 7212392 6658041 6233377 6501424 5800345
907 5800345 5569228 5597319 5904818 5821122 4983366 4728023 4796085 4562515 3931205 3320504
897 3320504 3743294 3577690 3211667 3643502 3426581 3136455 3244905 3044725 3231319 3064276
887 3064276 2647827 2652250 3041903 3191837 2846002 2224162 1902953 2020648 1907043 2035598
877 2035598 2076918 1633246 1274652 1599402 1630373 1312112 1800528 1620823 1430683 1344764
867 1344764 1118369 1113973 864455 1304420 1510086 2062135 2347702 1576975 1191019 1492156
857 1492156 1465741 1838311 2193649 1415772 1476877 1460119 1291559 1017983 1385302 916389
847 916389 945075 979021 793022 1064621 965245 947216 712599 911594 1076694 399624 42832
836 42832 316802 729587 1116899 827202 795265 429513 776266 1109345 622059 1005413
826 1005413 1043642 664317 644941 391683 319088 133763 -182980 131503 175624 84864 528098
815 528098 645936 515008 799887 922979 393972 18063 -412433 -181827 -462220 276172
805 276172 661910 384837 -80739 -253825 14686 -127532 -1554 220699 295027 108786
795 108786 43985 98695 -58748 128034 533820 469984 220528 789701 840224 572298 739806
784 739806 860837 856567 181464 109838 344410 740534 842376 522920 312135 301005 113270
773 113270 77232 290904 100090 -201679 25804 2541 -247042 384602 395845 142568
763 142568 -107723 206268 483183 490877 332231 377534 271566 -54775 21094 443052 -146699
752 -146699 -255385 167146 422732 178585 -449542 -287239 -357009 -228577 -155819 -692115
742 -692115 -456371 70366 -219491 60742 -303304 -241393 -193994 -254452 -484013 -351820
732 -351820 -610193 -756431 -135627 -206542 -22023 296663 -104489 -436339 -537254 -632950
722 -632950 -429577 -122501 -49969 -85092 -71620 75746 128924 -343191 -401389 -331475 -51048
711 -51048 124011 -479291 16795 -141389 -211947 -287825 73182 125917 -488312 -717662 -465365
700 -465365 -740355 -420682 84502 -24772 -29661 -237576 -325544 -216114 347388 441938 28811
689 28811 -225907 230732 117800 -84369 -71284 201867 -286922 -406618 -136011 -88262
679 -88262 186420 190201 -123534 -183048 -359071 -41422 -49525 127051 210708 79037 -177462
668 -177462 -316357 -252214 -132000 55988 172650 371493 100413 -321809 142403 581096
658 581096 496593 514074 340843 250782 262963 318407 -249447 -148250 497310 623955 62233
647 62233 428039 256504 -68480 43953 -189952 -2505 429033 775395 623564 -107624
637 -107624 -567888 -554417 -325658 195142 342636 -214537 154498 151318 49492 -247268
627 -247268 -399736 -116201 102655 207351 -214066 -359101 -291759 15438 49037 -536059
617 -536059 -402836 -334507 317113 230212 -182139 -114184 -595618 -453004 -780282 -498040
607 -498040 -355303 -174313 -499193 -411916 -290684 -308136 40861 432406 22114 -234581
597 -234581 -639134 -110155 -329334 -477733 -451359 -430933 50427 67581 -1382 -397692 -611666
586 -611666 -668307 -670838 -334280 113609 -54650 -97414 -416621 -640654 -358950 182503 49427
575 49427 -168717 -153342 69346 374759 311061 191711 108716 -86870 53849 -331442 -608861
564 -608861 -605617 -383870 -275084 -59007 -500724 -289553 -75645 -305067 65297 313181
554 313181 -181771 -130715 111993 -92453 12140 41051 -39213 -250791 233832 -310674
544 -310674 -287377 253708 -108947 78139 33489 -230047 -549289 -432559 57684 48723 -214818
533 -214818 -762397 -746791 -370734 -291543 6598 56649 -115464 -132125 -828376 -658513 -231410
522 -231410 161049 -297878 -114182 -55302 -399972 22671 -119695 -634467 -296741 -320104
512 -320104 -638415 -743942 -370314 -173463 -561518 -491214 -110098 -137978 -792293 -198990
502 -198990 203057 42550 -212954 -428764 -418657 -115568 -400631 -223871 -539757 -543849
492 -543849 -778548 -407293 -495799 -457214 -241973 -788293 -1038561 -768670 -578878 -742103
482 -742103 -404354 -188848 161814 -254929 -282795 -374849 -756013 -482024 -411412 -394958 -68004
471 -68004 -290802 -369986 -159986 190747 -50207 -6049 -52843 -13227 -35106 -523200 -507072
460 -507072 -87575 -89356 -332249 454313 528259 164234 21835 43372 163896 -187521 -258849
449 -258849 -192295 -186569 -61234 -447270 -524278 -439994 -627841 -467948 -389575 -282362 -144192
438 -144192 -145754 -306837 -528215 -644948 -437328 -107981 41432 -619430 -857102 -204992
428 -204992 -402568 -448249 -641293 -417576 -442426 -492196 -255332 -312984 -90961 -281279 -635434
417 -635434 -718950 -669152 -809507 -762772 -590048 -546332 -539066 302437 29442 -422131 -456022
406 -456022 -274040 -310954 -717611 -457326 -257905 96960 -214560 -433078 -70254 -193042
396 -193042 148331 241022 -15244 -52906 -52753 -435367 -553707 -661674 -1117774 -852791 -552731
385 -552731 -466453 -638527 -558397 -908349 -1132690 -1139494 -1150192 -489050 -765766 -589386 60776
374 60776 -276261 -529318 -482846 -63758 -89941 -275064 -242295 -653661 -441884 -163254 -570921
363 -570921 -323450 -545515 -600953 -760761 -290212 -409321 -501573 -526760 -626976 -322005
353 -322005 -516144 -461229 -460094 -484683 -504482 -48570 -221598 -275555 -560271 -214040 -254749
342 -254749 -49947 22143 -221559 55975 114451 50533 -318848 -254224 -387153 -552388 -364810
331 -364810 93487 161473 94368 -566298 -1098963 -1108076 -1029120 -543456 -87424 -163123 -355390
320 -355390 -673036 -877520 -960410 -1143223 -527631 -93936 -361189 -716819 -601797 -337438
310 -337438 -243101 50424 -59164 -701280 -746566 -623668 -522093 -448353 -470381 -375593 -389103
299 -389103 -505393 -501621 -477962 -552772 -78121 -627343 -483009 -669933 -776068 -886809 -834970
288 -834970 -560148 -235185 -413884 -828867 -761989 -712056 -273278 -848554 -658120 -136811
278 -136811 104239 87408 -311608 -606363 -409366 -672594 -736129 -855360 -629972 -880433
268 -880433 -896724 -590063 -592238 -764584 -793416 -609540 -142724 -4473 -362457 -583596 -403627
257 -403627 -599819 -832891 -758744 -294704 -610040 -478406 -504739 -521084 -211195 -51837
247 -51837 -57820 -67847 -303355 -597189 -503812 -288178 -532949 -181004 -95183 -651485 -537097
236 -537097 51287 132915 -484361 -867170 -1158673 -533084 -817694 -1186362 -839456 -305151
226 -305151 -187822 -144450 -483370 -184542 90795 -300046 -972702 -913189 -855971 -671350
216 -671350 -1022215 -827429 -1046631 -933103 -299814 -317088 -713357 -442100 -200888 -710081
206 -710081 -515963 -502606 -821443 -686683 -601481 -696430 -766258 -520056 -479158 -550252 -489847
195 -489847 -601311 -915066 -724397 -459870 -533164 -439119 -314759 -316791 -593285 -679349 -610392
184 -610392 -363697 -777209 -1006261 -837922 -868606 -1021406 -915401 -538338 -403560 -504183
174 -504183 -652592 -411583 -378706 -399346 -657304 -753825 -907587 -1010856 -711956 -670390 -615598
163 -615598 -348793 -535685 -751456 -563591 -545003 -581919 -190760 -168227 -395785 -209551
153 -209551 -506575 -682265 -622789 -230079 -371364 -749206 -588798 -389055 -663819 -965512
143 -965512 -779642 -511152 -804623 -929010 -812674 -591051 -869536 -1106273 -1320295 -931120
133 -931120 -508306 -398511 -607576 -930422 -1252314 -1205987 -841331 -509238 -832988 -836837
123 -836837 -547238 -585539 -925390 -1041674 -791458 -846774 -717991 -717556 -662890 -787927 -457566
112 -457566 -227570 -466134 -554391 -580841 -610451 -556835 -624629 -557182 -639031 -506101 -647555
101 -647555 -663637 -716617 -811257 -640630 -652055 -611779 -699138 -676920 -176930 -348299 -707951
90 -707951 -607859 -563201 -704532 -922562 -775592 -660580 -727001 -911198 -724251 -569634
80 -569634 -910342 -886164 -818684 -637202 -432336 -591980 -615627 -618585 -501430 -506573 -758786
69 -758786 -552759 -499372 -843230 -1016550 -624056 -423647 -566169 -424727 -549991 -782265
59 -782265 -936360 -744245 -985941 -835011 -797523 -835283 -873648 -803320 -702084 -427550 -588891
48 -588891 -755007 -932428 -1132883 -1118629 -1032569 -951113 -796796 -769115 -626855 -649016 -1170735
37 -1170735 -988493 -854002 -854368 -534583 -776091 -796150 -643877 -811057 -873663 -696635 -593392
26 -593392 -533728 -375419 -957676 -823366 -488150 -776513 -748783 -739389 -885968 -809580 -1019528
15 -1019528 -613823 -802031 -1296226 -850099 -849731 -931919 -703122 -622221 -560912 -714615 -721316
4 -721316 -676788 -839157 -946735 -791295
0 -791295
$$ Imaginary data points
##PAGE= N=2
##DATA TABLE= (X++(I..I)), XYDATA
16383 -5530739 -5539374 -5628259 -5342732 -5117550 -5445814 -5387148 -5179470 -5053382 -5078448 -5076908 -5103056
16372 -5103056 -5050532 -4891792 -4853876 -4714980 -4617032 -4301328 -4501681 -4505415 -4262586 -3854134
16362 -3854134 -4034281 -4357339 -4089368 -4099317 -4417073 -4157033 -3716853 -3538270 -3477181 -3544204
16352 -3544204 -3608972 -3548070 -3678932 -3396508 -3164566 -2906767 -3028029 -3178829 -3091701 -3146180
16342 -3146180 -2942071 -2783205 -2750923 -2748333 -2845699 -2919761 -3042156 -2714660 -2643374 -2512285
16332 -2512285 -2213470 -2090755 -2156365 -2376306 -2302641 -2091821 -1908420 -1972624 -1866461 -1776814
16322 -1776814 -2234975 -2107676 -2007247 -1620794 -1378644 -1239231 -949719 -1260138 -1211004 -929167
16312 -929167 -876524 -947468 -987972 -741367 -746329 -996345 -872596 -764711 -687397 -610231 -419200
16301 -419200 -687069 -767381 -655379 -610962 -304996 -267515 -398905 -255936 -441658 -684369
16291 -684369 -260477 235748 174678 248163 516910 372485 435704 510545 456426 575823
16281 575823 836206 604546 683224 759681 514571 723802 931877 1069305 823986 660540
16271 660540 705784 942436 1280539 1498561 1393148 1242466 1152146 891585 1449036 1538494
16261 1538494 1349751 1354031 1465480 1513551 1286830 1606587 1818443 1849181 1863734 1692703
16251 1692703 1595505 1732459 1912094 2035879 1956125 2196323 2078028 1841096 1957918 1998949
16241 1998949 2259805 2713450 2535187 2316668 2226161 1947044 2027747 2160894 2022297 1841126
16231 1841126 2303041 2564844 2496497 2617710 2513408 2751683 2819568 2491558 2527057 2784678
16221 2784678 2899515 3175169 3008653 2954643 3173703 3215838 3518431 3511210 3603220 3718591
16211 3718591 3348678 3166827 3094294 2984298 3051776 2627083 2662047 2998775 3155961 3367446
16201 3367446 3130424 3324597 3340914 3332374 3113057 3155022 3259530 3053285 3307575 3619330
16191 3619330 3635843 3752764 3676701 3183998 3433929 3674846 3716265 3487825 3545600 3473511
16181 3473511 3232709 3611413 4002063 3671755 3666825 3693043 3855545 4113735 4102395 3736614
16171 3736614 3518171 3848019 3619960 3731310 3726906 3583957 3892929 3817003 3684130 4028574
16161 4028574 4386757 4452908 4146579 4001826 4047244 3988878 3684313 3806564 4243233 4201653
16151 4201653 3721529 3859151 4091458 4312146 3985809 4104876 4330673 4034345 4363941
16142 4363941 4566919 4464911 4470163 4147956 4042929 4331739 4572088 4673486 4766762 4322232
16132 4322232 4356739 4600713 4324919 4453772 4191461 4157006 4213423 4442412 4389574 4512840
16122 4512840 4615801 4194955 4130827 4362738 4223424 4016684 4323260 4244280 4319017 3876320
16112 3876320 4510418 4784229 4229515 3797978 4264766 4910853 4713658 4506246 4856015
16103 4856015 4900525 4382029 4270009 4196748 4191630 4778036 5046977 4544242 4745464 4254333
16093 4254333 4389506 4364088 4079288 4418144 5175232 5009446 4894157 4846376 4777280 4756990
16083 4756990 4504354 4635090 4355403 4364123 4467965 4397456 4702459 4390755 4056243 4399692
16073 4399692 4644712 4584671 4598715 4432898 4782422 4863359 4686598 4730006 4343912 4644311
16063 4644311 4789890 4881906 4933909 4613161 4466132 4800176 4476690 4412759 4471244 4375283
16053 4375283 4887085 4747916 5155231 5231337 5009989 4562729 4357997 4550657 5130363 5084754
16043 5084754 4271079 4551444 4597827 4585574 4479878 4356383 4971423 4727345 4507860 4507002
16033 4507002 4686753 4687042 4581754 4341020 4406068 4573025 4404552 4491711 4896977 4289527
16023 4289527 4351459 4435275 4506759 5078593 4870296 4379411 4572595 4637644 4748779 4454999
16013 4454999 4593978 5118171 5012479 5303444 4715089 4456633 4840773 4699011 4484078
16004 4484078 4315751 3949048 4158895 4337005 4650015 5106348 5174131 5194199 4983451 4505905
15994 4505905 4690520 4795934 4669210 4212361 4282390 4236652 4289874 4559662 4656979 4107474
15984 4107474 4444617 4760314 4903711 4560184 4681201 4611427 4660115 4582224 4154670 4344881
15974 4344881 4824953 4868407 4369929 4808878 4819215 4509039 4993541 4926684 4478893 4086553
15964 4086553 4540621 4561878 4694586 4867644 5048874 5201037 4526188 4557401 4492754 4430403
15954 4430403 4452562 4686258 4717665 4309565 4569935 4972018 5265381 5364641 5168196 4728661
15944 4728661 4515866 4863817 4828604 4635698 4155687 4067863 4268972 4486879 4843302 5183866
15934 5183866 4932646 4643855 4924119 4697494 4559407 4575368 4865293 4983695 4630431 4270580
15924 4270580 4637954 5316977 4830337 4758596 5004311 4915282 4751339 4807825 4287547 4204766
15914 4204766 4339715 3979140 4294932 4485873 4392054 4655866 4820754 4981234 5145090 4815225
15904 4815225 4463370 4518927 4959773 4974508 4621694 4811076 5112369 5044035 4706883 5096402
15894 5096402 4788444 4565604 4498793 4634922 4573710 4685552 4831027 4539224 4643182 5079237
15884 5079237 5260058 4899687 4953436 5117537 5329795 5073232 5124422 5221806 4911477 4954516
15874 4954516 4620448 4808239 5181649 4570636 4433250 4601123 5084472 5097059 5199093 5349903
15864 5349903 5445874 4844822 4993024 4605723 4427469 5005885 4674435 4714931 4466207 4178171
15854 4178171 4713226 4689926 4183984 4493431 4543718 4862416 4796641 5081084 4576512 4667222
15844 4667222 4857393 4622047 4484052 4855957 5226548 4997253 4699487 4225428 4527790
15835 4527790 5032059 5083058 5386797 5656192 5541562 5302375 5146943 4989024 4421351 4221034
15825 4221034 4422356 4876856 4576037 4473611 5047376 4860734 4554951 4276532 4477354
15816 4477354 4830985 4870362 4429275 4508486 4643619 4486764 4397844 4581682 4682983 4699459
15806 4699459 4549483 4495877 4444982 4680269 4421093 5235210 5436176 5161828 5550813 4981459
15796 4981459 5120155 5182022 4803865 4746877 4773073 4502038 4800593 4870373 4616449 4501207
15786 4501207 4253067 3815079 4397183 4839525 4690889 4899983 4754815 4361542 4172008
15777 4172008 4444698 4656207 4709612 4702140 4409060 4140407 4037524 4299974 4340294 5071491
15767 5071491 5201917 4692234 4376979 4748985 4792399 4485501 4416288 4568543 4870925 5031566
15757 5031566 4269930 4566196 4914189 5002675 4853441 4781709 4897383 5008219 5033334 4907538
15747 4907538 5014397 4595122 5044191 4699491 4415681 4922304 4964056 5113439 5193604 5331459
15737 5331459 5074606 4741258 4900601 5001613 5064628 5216660 4635959 4506967 5095013 4988338
15727 4988338 4856371 4993607 4985449 4856105 4606281 4595397 4659155 4861021 4860584 5295528 5402665
15716 5402665 5006323 5130821 4856476 4823691 4821141 4641661 4808383 4661792 4842072 5196178
15706 5196178 5259915 4755609 4930831 5125713 4892542 4603106 4230000 4345883 4253431 4510171
15696 4510171 4626094 4490615 4526720 4419997 4585553 4737838 4851070 4794603 4529007 4502638
15686 4502638 4312466 4560667 4867573 5000909 4868305 4815228 4604468 4964753 5404416 4991852
15676 4991852 4737100 4851391 4509384 4552934 4438049 4636275 4899252 4419120 4341366 4748113
15666 4748113 5029972 4788561 4788278 4802651 4385949 4549176 5011293 4932218 4392808 4477450
15656 4477450 4501494 4499383 4823902 4915343 5260002 5207794 4928707 4753059 4441844 4820874
15646 4820874 5006238 4829440 5130884 5139658 5193805 5284340 4437623 4451745 4814919 4513232
15636 4513232 4661384 4902401 4903729 5196723 5139687 4814543 4434876 4520068 4657332 4852033
15626 4852033 5026652 5030713 4837093 4781922 4654275 4819491 4778394 4975494 4785443 4729487
15616 4729487 5230250 4778604 4512595 4664773 4804971 5101510 5153703 4829269 4778309 4831084
15606 4831084 4825541 4515545 4946338 4936464 5046397 5292511 5086663 5027674 4844960 4882249
15596 4882249 4903648 4842708 4957120 4670935 4494817 4872133 4833560 4983219 4889344 4499026
15586 4499026 4634451 5128657 5304098 5081828 5017864 4865253 5093107 4930307 4798953 4980715
15576 4980715 5211493 4950862 4666557 4972628 5458612 5538653 4764666 4680989 4862079 5123675
15566 5123675 5333007 5316325 5124411 4554885 4319632 4986550 5624106 5248041 4945179 5423073
15556 5423073 4993839 4698306 4934907 4668592 5155576 4898352 4707146 4807577 4830666 5019328
15546 5019328 5177028 5413709 4947633 4846804 4971870 4895449 4705824 4646583 4934915 5034796
15536 5034796 5034659 4946690 5137411 5113102 4919653 5160791 5527456 5486160 5611994 5285580
15526 5285580 4684057 4724225 4844000 4968773 5628422 5148424 5079785 5319797 5103856 5355054
15516 5355054 5291748 5095963 5195433 4978349 5186008 5508891 5158832 4739739 4596367 4613475
15506 4613475 4713231 5639364 5530701 4969086 5218375 5173398 5272036 5087959 4456142 4387128
15496 4387128 4115312 4742196 4971563 4632342 5023718 4664654 4285751 4424637 5099797
15487 5099797 5264236 5428064 5385643 5502193 4778580 4834756 4947411 4825885 4943148 4928879
15477 4928879 5017232 5095808 5182025 5459012 5385891 5024055 5092812 5044489 4829818 4766947 5005206
15466 5005206 5300389 5580118 5574086 5707629 5522588 4933914 4905312 4989035 4795064 5130412
15456 5130412 5408933 5255729 5240703 5219587 5158393 5437428 5010452 4776600 4709715 5024714
15446 5024714 4990561 4815805 4726942 4555848 4736514 5263127 5085790 5009182 4731658 5068204
15436 5068204 5436777 5101237 5067442 5010126 5045152 4720151 4720871 4733414 4881085 5401925 5269703
15425 5269703 4855629 4986827 5119201 4952010 4954150 4541124 5008325 5016030 4766526 4888774
15415 4888774 4595829 4574736 4950651 4713038 4480798 4551289 5025006 5140516 5413749 5157518
15405 5157518 5314030 5578696 5004997 4727130 4824447 5243661 5571274 4959000 4525953 4809716
15395 4809716 4790547 4680939 5035375 5152618 4851060 5093208 5223825 4891110 4623585 5208689
15385 5208689 5385175 5218333 5394136 5383804 5232133 5493163 5414876 5037574 5162483 4648056
15375 4648056 4785387 4986595 4916559 5199418 5099965 5570622 5411434 4740717 4970946 5093678
15365 5093678 4700525 4672559 4741315 4899565 5065973 4521710 4637602 5073709 4925979 5122834
15355 5122834 4843671 4498160 4970953 5411146 5440629 5305225 5122503 5160441 5123844 5441985
15345 5441985 5259712 4903340 4923911 5227771 4930199 4800449 5021863 5121817 5011059 4984429
15335 4984429 4839786 5097631 5128083 4612648 4562363 5000959 5013094 4963565 4943942 4967745
15325 4967745 4767893 4957935 5152506 5331483 4907545 4493603 5279083 5444475 4936108
15316 4936108 4624056 4863749 5361632 5266318 5320226 5115591 5095725 5407403 5598905 5024932
15306 5024932 4954573 5098530 5019335 5182409 5061513 4561409 4852730 4628962 4344741 4789208
15296 4789208 4590136 5055700 5317721 5042219 5010071 4779232 4123791 4531093 5308473 5101120
15286 5101120 4660771 5100894 4912791 4469664 4614093 5239036 5271473 5284129 5340033 5368164
15276 5368164 5134829 5381900 5489081 5353421 5321609 5442330 5628738 5630309 5219619 4650554
15266 4650554 4564156 4658663 4767157 4978695 4987333 4607820 4832105 4848995 4317275 4598423
15256 4598423 5000657 5138997 5295456 5504776 5598372 5431772 5106322 4846076 5069868 4995803
15246 4995803 5056908 4275192 4349335 4639013 5007809 4647192 4539929 4833804 5318169 5227868
15236 5227868 5069763 5152587 5115859 5288281 5181443 5509134 5559885 5519964 5244787 5527561
15226 5527561 5617765 5528928 5278082 5271816 5295072 5419900 5738340 5172878 5314888 5749053
15216 5749053 5224091 5030545 5131675 5178278 5243954 5142624 4948680 5271193 5308739 5343628
15206 5343628 5130659 5050593 4988612 4454404 4470773 4903896 5191045 5658801 5075299 5061693
15196 5061693 5086515 5186147 5406992 5388483 5123486 5286952 5243209 5350441 5395864 5376387
15186 5376387 5720526 5719635 5621080 5703496 5304725 5275949 5218940 4998753 5119243 5306352 5368531
15175 5368531 5377925 5088745 5150641 4930943 4844405 4785626 4962910 4951738 4753488 5405849
15165 5405849 5153843 4794476 4879238 4778562 5025133 5247870 4879035 4827772 5279648 5089180
15155 5089180 4941423 5401957 5166231 5116387 4758448 4985547 5087387 5034485 5139926 5178922
15145 5178922 5170036 5389565 5051900 4966836 5074548 4960558 4697358 5057875 5042911 4819776
15135 4819776 4940860 4863126 4970091 4878170 4805146 4901159 4539853 4794477 4946949 4580047
15125 4580047 4938940 5103913 4780934 4930218 4844728 5293125 5702684 5502869 5646444 5775598
15115 5775598 4947039 4909341 4979517 5269383 5954176 5710434 5428168 5032671 4938779 5097644
15105 5097644 5457938 5150490 5517603 5738647 5521699 5281763 5171955 5362328 5363287 5041854
15095 5041854 4639359 5066557 5317562 5140976 5289324 5420383 5439607 5548237 5864583 5848052
15085 5848052 5722472 5113032 5143572 5563120 5428610 5485587 5451428 5686754 5545722 5556997
15075 5556997 5392774 5290667 4938039 5039220 5170244 5055252 5101149 5660337 5411705 5232753
15065 5232753 5351368 5027489 5269037 5413838 5112414 5108830 5358619 4838935 4901731 5125884
15055 5125884 5171596 5057939 5162275 5213966 4912205 5051884 4898632 5164971 5119191 5550805
15045 5550805 5325918 5077885 5204000 5143304 4943565 4780586 4773752 4846338 5591195 5543476
15035 5543476 5560603 5356741 5260224 5207498 5436947 5004859 4958330 5676134 5513073 5084636
15025 5084636 5007784 5161039 5064763 5113142 5344461 5248106 5249956 5651816 4903479 4808441 5282828
15014 5282828 5520432 5648121 5673278 5560995 4932254 5098804 5212228 5114311 4978664 4814453
15004 4814453 4905715 5169079 5116598 5487241 5548787 5533456 5253490 5347123 5167465 5287945
14994 5287945 5146433 5560194 5277845 5016464 5195673 4548730 4687233 4845419 4900293 5275616
14984 5275616 5265034 5284109 5261064 4960720 4948812 4760626 5055359 5404742 5197475 4706056
14974 4706056 4591067 4981666 5178077 5057905 5020613 5075878 4991797 4976706 4719330 4908913
14964 4908913 4992882 4910704 5191741 5193284 5312736 5406322 5179325 5500060 5357287 5280899
14954 5280899 5076020 4547512 5197402 5456887 4914310 4848860 4639646 4554550 4844578 5412475
14944 5412475 5496974 4991653 4922122 5210245 5456001 5126261 5023355 5137257 5199469 5410171
14934 5410171 5583995 5708274 5639770 5521029 5493947 5145493 4954238 4979915 5498794 5678994
14924 5678994 5014285 4811181 5104922 4953445 5079958 5233546 5352377 5400018 5434586 5545687
14914 5545687 5345910 5198524 5211515 5303106 5133967 5182103 5078573 4889285 5221072 5446535
14904 5446535 5677588 5219704 5046441 4977934 5100244 5448457 5373688 5559607 5217800 5068664
14894 5068664 4885013 4639275 4515464 4465428 4826311 4502346 4899492 5069404 5407350 5318611
14884 5318611 5197950 4905079 4741714 4935873 5310987 5068751 4904680 5075844 5309855
14875 5309855 5245101 5318815 5116404 5151952 5115415 5341570 5349563 5130282 5666887 5354846
14865 5354846 5150542 5456628 5459619 5253365 5141783 5316310 5436271 5123081 5363140 5234210
14855 5234210 5436952 5198095 5021095 5282741 5403172 5053309 5214184 5413043 5428899 5258919
14845 5258919 5034269 5335323 5458283 5456058 5615960 5396126 5661021 5290941 5163449 5309850
14835 5309850 5068105 5116828 4966498 5230637 5026651 5101377 5187344 5400201 5487424 5305153
14825 5305153 5363709 5098128 5519401 5380418 5291023 5476802 5176200 4985328 5395199 5490777
14815 5490777 4951169 5698649 5880515 5786855 5660970 5549024 5098942 4942331 5083373 5352436
14805 5352436 5410850 5241715 5401535 5033472 5141438 5038270 4877937 5006478 4683737 4937840
14795 4937840 5355791 5290151 5748535 5741215 4823034 4993268 5202341 4888282 4774703 5159526
14785 5159526 5232147 5321919 5127853 5101757 5129012 5184966 5478743 5234721 5516586 5583679
14775 5583679 5527906 5248742 5447528 5649964 5463289 5261650 5332626 5372587 5436004 5433764
14765 5433764 5680505 5621620 5886789 5689027 5433214 5419611 5860563 5528966 5304517 5357474
14755 5357474 5318328 5027971 5035971 6007636 5861065 5397057 5552282 5441638 5259622 4546621
14745 4546621 5083249 5357838 5327953 5481194 5531822 5436597 5006048 5057819 5348912 5197082
14735 5197082 5425886 5199983 5201571 5412215 5400400 5401851 5397997 6008670 5632245 4974807 5257429
14724 5257429 5226117 5372017 5854841 5555476 5145911 4693358 5114250 4996108 5265837 4979652
14714 4979652 5007158 4988122 5009465 5181242 5123716 5402683 5329971 5267296 5534711 5697236
14704 5697236 5403489 5138781 5167717 5236988 5563404 5544096 5808667 5622981 5158829 5193938
14694 5193938 5198393 5313296 5715560 6078797 5884185 5613602 5103034 5174591 5738665 5415620
14684 5415620 4897545 5270192 5280672 5213573 5511764 5663772 5583433 5388261 5589218 5373028
14674 5373028 5426778 4953512 5159491 5497735 5706016 5686647 5621740 5291953 4680645 5195916
14664 5195916 5646028 5132650 5140151 5221837 5138497 5231257 4925869 4728352 4992064 5186676
14654 5186676 5245852 5106983 5246954 5145132 4967939 5488773 5517287 5333982 5186804 5482016
14644 5482016 5158032 5068252 5318441 5222897 5655430 5775386 6197524 5995146 5363307 5110614
14634 5110614 5187001 5088742 5195372 5178868 5488057 5432841 5613902 5566467 5388600 5470954
14624 5470954 5430973 6036264 6110361 5847946 5605096 5341504 5310676 5327058 5928439 6215259
14614 6215259 5819667 5525697 5613618 5637388 5233601 4818898 4827355 5195075 4934792 5066754
14604 5066754 5166836 5189907 5159275 5197455 5529262 5654576 5413021 5475482 5768365 5531380
14594 5531380 5350330 5209582 5522984 5618817 5195170 5285620 4777853 4866495 4772090 4913598
14584 4913598 5194567 5538865 5890890 6221245 5928268 5517536 5517419 5477085 5694276 6007233
14574 6007233 5939845 5515262 5388451 5357463 4927398 5105310 4753257 4712261 5336875 5566536
14564 5566536 5538857 5576124 5436242 5378959 5176049 5211847 5457570 5822128 5061376 5250718
14554 5250718 5781677 6041317 5368665 5249805 5120682 5164966 5355557 5193264 5546396 5590661
14544 5590661 5368287 5442269 5589689 5375737 5251925 5572763 5812955 5181735 5098194 5164754
14534 5164754 5592274 5792236 5293735 5132174 5260366 5270824 5217576 5288736 5434796 5499778
14524 5499778 5649481 5298396 5518552 5751594 5570259 5152963 5257903 5430310 5651603
14515 5651603 5814384 5787901 5513961 5235160 5060285 5348486 4994884 4873805 5069468 5130959
14505 5130959 5531343 5264322 5346102 5439277 5244750 5368010 5478633 5730505 5636364 5534469
14495 5534469 5146481 5276252 5370016 5801010 5881687 6182043 5674407 5301227 5974687 5857151
14485 5857151 5754052 5814751 6065935 5978303 5594966 5923849 5349045 5375773 5682210 5320381
14475 5320381 5745450 6059412 5322269 5193350 5125279 5180101 5582231 5466989 5219732 5299398
14465 5299398 5189263 4838888 5049991 5338303 5562578 5322209 4928077 5422225 5631661
14456 5631661 5836201 5995978 5909634 5440206 5389704 5315541 5507922 5682865 5677617 5374778
14446 5374778 5344488 5611253 5426684 5500012 5769482 5857164 5492919 5590873 4948452 4917787
14436 4917787 5276303 5316560 5626793 5625737 5228173 5712925 5636316 5664859 5487740 5443972
14426 5443972 5771634 5436406 5242974 5202359 5342991 5638951 5385856 5273524 5159217 5325348
14416 5325348 5116758 5623354 5500578 5491153 5860692 5956544 5834471 5357181 5274232 4831907
14406 4831907 4768152 5290593 5558572 5485335 5618988 5643496 5954006 6100903 6156549 6005806
14396 6005806 5337726 5384794 5944807 5720616 5299085 5686426 5873808 6112366 5664136 5869582
14386 5869582 5926915 5445046 5555748 5368712 5608531 5541235 5763530 5654254 5275536 5494985
14376 5494985 5075341 5121083 5368768 5085441 5048441 5174941 5407639 5358581 6170855 5920820
14366 5920820 5826349 6022180 5451828 5278908 5308213 5531324 5135788 5274687 5280772 5252004
14356 5252004 5335367 5307881 5108449 4986975 5370059 5308946 5363548 5325507 5431476 5448868
14346 5448868 5459883 5675559 5725307 5906013 6004494 6126219 5735903 5616830 5921146 5687831
14336 5687831 5659554 5573558 5366142 5619239 5539469 5364306 5765554 5905272 6012558 6103832
14326 6103832 6057500 5987019 5658381 5511379 5375488 5630524 5888114 5974212 5821001 5458194
14316 5458194 5277860 5972109 5973981 5534690 6025568 5942063 5607061 5264450 5481852 6100142
14306 6100142 5643164 5742811 5454322 5362265 5499573 5666149 5985300 6170726 5829654 5341665
14296 5341665 5266471 5498804 5690278 5540843 5523223 5577419 5766458 5608805 5428324 5205278
14286 5205278 5792874 5493930 5742994 5820352 6097481 6020410 6194835 6264523 5939686 5852623
14276 5852623 5468937 5509288 5720872 6063125 6135763 5914473 5578884 5501186 5801305 5827303
14266 5827303 5300635 5093043 5116225 5356485 5686753 5896634 5501069 5398075 5612334 5410782
14256 5410782 5599148 5944131 5916872 5734580 5447073 5501880 5695595 5440366 5289189 5802421
14246 5802421 6298837 5973146 6024105 6585857 6260642 5671295 5132066 5502944 5713078 6155196
14236 6155196 6363235 5922531 5833417 5696815 5952127 5915056 5863720 5945794 6091262 5841058
14226 5841058 5871524 5672474 5497469 5727625 5747165 5646311 5576782 5434080 5346139 5748596
14216 5748596 6182437 5913414 5507804 5509245 5832867 5887635 5647359 5661927 5780592 5907980
14206 5907980 5483012 5381722 5754583 5509900 5673173 5819473 5822377 6016671 5758655 5544135
14196 5544135 5586099 5446463 5455148 5538789 5703797 5035015 4653659 5077752 5171756 5415748
14186 5415748 5952918 5935477 5949589 5864805 5692704 5712341 5842630 6018557 6009375 5704784
14176 5704784 5834492 5780578 5838872 6026925 6079772 5756709 5603362 5492790 5770396 5994943
14166 5994943 5911937 6587096 6177632 5821053 5927517 5973075 5954345 6069043 5912458 5663580
14156 5663580 5822150 6046200 5720325 5751858 5474354 5593817 5537945 5245302 5532400 6099350
14146 6099350 6191869 5961517 5830783 5886220 5695984 5866158 5784175 5817983 5711403 5730112
14136 5730112 5691906 5814617 5826210 5624113 5314712 5261387 5401122 5340546 5254925 5644415
14126 5644415 5835199 6181501 6020194 5925333 6271080 5845871 5408132 5901469 6169889 6079796
14116 6079796 5829537 5519938 5817955 5747562 5856394 5842833 6145425 6310235 6035459 5910707
14106 5910707 5762373 5714485 5697918 5974453 5885402 5905071 5619675 5457106 5818729 5554244
14096 5554244 5339074 5441725 5240377 5837993 6160865 5791497 5639938 5257995 5275587 4983120
14086 4983120 5252414 5761129 5830827 5859321 5795651 5706670 5641219 5482145 5717073 5679999
14076 5679999 5699500 5700626 5589840 5669990 6035517 5963160 5907292 5508074 5479356 5755348 5628265
14065 5628265 5741073 5788508 5558009 5655060 5525519 5419277 5557807 5511508 5478451 5803899
14055 5803899 6139492 6382275 5863910 5809140 5570953 5781582 5751923 5833950 5735191 5804792
$$ [...]
##END NTUPLES=NMR SPECTRUM
##END=
