##TITLE=1H_EC-3249
 CDCl3,8 sc, 
 4.03.2021
##JCAMPDX= 6.0         $$ Bruker NMR JCAMP-DX V2.0
##DATA TYPE= NMR SPECTRUM
##DATA CLASS= NTUPLES
##ORIGIN= UXNMR, Bruker Analytische Messtechnik GmbH
##OWNER= root
$$ XWIN-NMR		Version 3.5
$$ Thu Mar  4 11:45:57 2021 Russian Standard Time (UT+4h)  she@DPX200
##.OBSERVE FREQUENCY= 200.1315066352
##.OBSERVE NUCLEUS= ^1H
##.ACQUISITION MODE= SIMULTANEOUS
##.ACQUISITION SCHEME= undefined
##.AVERAGES= 8
##.DIGITISER RES= 18
##SPECTROMETER/DATA SYSTEM= spect
##.PULSE SEQUENCE= zg30
##.SOLVENT NAME= CD3CN
##.SHIFT REFERENCE= (INTERNAL, CD3CN, 0, 15.9771)
##AUDIT TRAIL= $$ (NUMBER, WHEN, WHO, WHERE, WHAT)
$$ ##TITLE= Audit trail, XWIN-NMR		Version 3.5
$$ ##JCAMPDX= 5.01
$$ ##ORIGIN= Bruker BioSpin GmbH
$$ ##OWNER= she
$$ F:/spectra/data/she/nmr/H-F/1/pdata/1/auditp.txt
$$ ##AUDIT TRAIL=  $$ (NUMBER, WHEN, WHO, WHERE, WHAT)
(   1,<2021-03-04 11:44:43.18 +0400>,<she>,<DPX200>,
      <created by zg, POWCHK disabled, PULCHK disabled
       configuration hash MD5:
       00 E9 B6 7A A2 85 ED C7 34 08 36 98 17 FE 4E 26
       data hash MD5: 16K
       58 38 06 9F A9 D2 9F 7D 07 DB 4E 8E 31 3D E2 58>)
(   2,<2021-03-04 11:44:45.89 +0400>,<she>,<DPX200>,
      <Start of raw data processing
       efp BC_mod = 2 LB = 0.24 FT_mod = 6 PKNL = 1 PHC0 = -10923.11 PHC1 = 13.40094 SI = 16K 
       data hash MD5: 16K
       74 C2 F8 95 EB CF 49 B6 1C 9E F3 85 FB 54 6C DF>)
(   3,<2021-03-04 11:45:06.62 +0400>,<she>,<DPX200>,
      <pk PHC0 = -195.5012 PHC1 = -4.8 
       data hash MD5: 16K
       DA 09 5F D3 95 74 CA 5E A5 2A B4 98 DC A5 07 64>)
(   4,<2021-03-04 11:45:10.40 +0400>,<she>,<DPX200>,
      <abs ABSG = 5 
       data hash MD5: 16K
       85 44 4E 44 CF FB FB EC E8 6E F1 E0 AF 6F BC 63>)
$$ ##END=
$$ 
$$ hash MD5
$$ 64 9C 27 90 D6 14 19 E3 31 8C 8F 56 DD E7 64 B4
##$RELAX= 
##$RELAX= 
##$RELAX= 
##$RELAX= 
##$RELAX= 
##$RELAX= 
$$ Bruker specific parameters
$$ --------------------------
##$DU= <F:/spectra>
##$EXPNO= 1
##$NAME= <H-F>
##$PROCNO= 1
##$TYPE= <nmr>
##$USER= <she>
##$AMP= (0..31)
100 100 100 100 100 100 100 100 100 100 100 100 100 100 100 100 100 100 
100 100 100 100 100 100 100 100 100 100 100 100 100 100 
##$AQSEQ= 0
##$AQ_mod= 1
##$AUNM= <au_zg>
##$AUTOPOS= <>
##$BF1= 200.13
##$BF2= 200.13
##$BF3= 200.13
##$BF4= 200.13
##$BF5= 200.13
##$BF6= 200.13
##$BF7= 200.13
##$BF8= 200.13
##$BYTORDA= 1
##$CFDGTYP= 0
##$CFRGTYP= 5
##$CHEMSTR= <none>
##$CNST= (0..31)
1 1 145 1 1 1 1 1 1 1 1 1 1 1 1 1 1 1 1 1 1 1 1 1 1 1 1 1 1 1 1 1 
##$CPDPRG= <>
##$CPDPRG1= <>
##$CPDPRG2= <>
##$CPDPRG3= <>
##$CPDPRG4= <mlev>
##$CPDPRG5= <mlev>
##$CPDPRG6= <mlev>
##$CPDPRG7= <mlev>
##$CPDPRG8= <mlev>
##$CPDPRGB= <>
##$CPDPRGT= <>
##$D= (0..31)
0 1.2 0 0 0 0 0 0 0 0.06 0 0.03 0 0 0 0 0.0002 0 0 0 0 0 0 0 0 0 0 0 0 
0 0 0 
##$DATE= 1614843882
##$DBL= (0..7)
120 120 120 120 120 120 120 120 
##$DBP= (0..7)
150 150 150 150 150 150 150 150 
##$DBP07= 0
##$DBPNAM0= <>
##$DBPNAM1= <>
##$DBPNAM2= <>
##$DBPNAM3= <>
##$DBPNAM4= <>
$$ [...]
##$SUBNAM3= <"">
##$SUBNAM4= <"">
##$SUBNAM5= <"">
##$SUBNAM6= <"">
##$SUBNAM7= <"">
##$SUBNAM8= <"">
##$SUBNAM9= <"">
##$SW= 16.9725356469052
##$SWIBOX= (0..15)
0 0 2 0 0 0 0 0 0 0 0 0 0 0 0 0 
##$SW_h= 3396.73913043478
##$TD= 16384
##$TD0= 1
##$TE= 0
##$TE2= 300
##$TE3= 300
##$TEG= 300
##$TL= (0..7)
0 120 120 120 120 120 120 120 
##$TP= (0..7)
150 150 150 150 150 150 150 150 
##$TP07= 0
##$TPNAME0= <>
##$TPNAME1= <>
##$TPNAME2= <>
##$TPNAME3= <>
##$TPNAME4= <>
##$TPNAME5= <>
##$TPNAME6= <>
##$TPNAME7= <>
##$TPOAL= (0..7)
0.5 0.5 0.5 0.5 0.5 0.5 0.5 0.5 
##$TPOFFS= (0..7)
0 0 0 0 0 0 0 0 
##$TUNHIN= 0
##$TUNHOUT= 0
##$TUNXOUT= 0
##$USERA1= <user>
##$USERA2= <user>
##$USERA3= <user>
##$USERA4= <user>
##$USERA5= <user>
##$V9= 5
##$VALIST= <valist>
##$VCLIST= <CCCCCCCCCCCCCCC>
##$VD= 0
##$VDLIST= <DDDDDDDDDDDDDDD>
##$VPLIST= <PPPPPPPPPPPPPPP>
##$VTLIST= <TTTTTTTTTTTTTTT>
##$WBST= 1024
##$WBSW= 4
##$XGAIN= (0..3)
0 0 0 0 
##$XL= 0
##$YL= 0
##$YMAX_a= 313358
##$YMIN_a= -364551
##$ZGOPTNS= <>
##$ZL1= 120
##$ZL2= 120
##$ZL3= 120
##$ZL4= 120
##$ABSF1= 15.9792
##$ABSF2= -0.9934616
##$ABSG= 5
##$ABSL= 3
##$ALPHA= 0
##$AQORDER= 0
##$ASSFAC= 0
##$ASSFACI= 0
##$ASSFACX= 0
##$ASSWID= 0
##$AUNMP= <proc_1d>
##$AZFE= 0.1
##$AZFW= 0.1
##$BCFW= 0
##$BC_mod= 2
##$BYTORDP= 0
##$COROFFS= 0
##$CY= -3
##$DATMOD= 1
##$DC= 0
##$DFILT= <>
##$DTYPP= 0
##$F1P= 0
##$F2P= 0
##$FCOR= 1
##$FTSIZE= 16384
##$FT_mod= 6
##$GAMMA= 0
##$GB= 0
##$INTBC= 1
##$INTSCL= 2.992141e-10
##$ISEN= 128
##$LB= 0.24
##$LEV0= 0
##$LPBIN= 0
##$MAXI= 10000
##$MC2= 0
##$MEAN= 0
##$ME_mod= 0
##$MI= 1.114404
##$NCOEF= 0
##$NC_proc= -7
##$NLEV= 6
##$NOISF1= 3.799351
##$NOISF2= 2.8
##$NSP= 0
##$NTH_PI= 0
##$NZP= 0
##$OFFSET= 15.97713
##$PC= 1
##$PHC0= -11118.61
##$PHC1= 8.60094
##$PH_mod= 1
##$PKNL= yes
##$PPARMOD= 0
##$PSCAL= 0
##$PSIGN= 0
##$REVERSE= no
##$SF= 200.130007500037
##$SI= 16384
##$SIGF1= 3
##$SIGF2= 2
##$SINO= 5.538805
##$SIOLD= 16384
##$SREGLST= <1H.CDCl3>
##$SSB= 0
##$STSI= 16384
##$STSR= 0
##$SW_p= 3396.73913043478
##$SYMM= 0
##$S_DEV= 0
##$TDeff= 16384
##$TDoff= 0
##$TI= <>
##$TILT= no
##$TM1= 0
##$TM2= 0
##$TOPLEV= 0
##$USERP1= <user>
##$USERP2= <user>
##$USERP3= <user>
##$USERP4= <user>
##$USERP5= <user>
##$WDW= 1
##$XDIM= 16384
##$YMAX_p= 354435923
##$YMIN_p= -608086
$$ End of Bruker specific parameters
$$ ---------------------------------
##NTUPLES= NMR SPECTRUM
##VAR_NAME=  FREQUENCY,     SPECTRUM/REAL,   SPECTRUM/IMAG
##SYMBOL=    X,             R,               I
##VAR_TYPE=  INDEPENDENT,   DEPENDENT,       DEPENDENT
##VAR_FORM=  AFFN,          ASDF,            ASDF
##VAR_DIM=   16384,         16384,           16384
##UNITS=     HZ,            ARBITRARY UNITS, ARBITRARY UNITS
##FACTOR=    0.207333158178281, 1,           1
##FIRST=     3197.50313396443, 0,            0
##LAST=      -199.235996470353, 0,           0
##MIN=       -199.235996470353, -608086,     0
##MAX=       3197.50313396443, 354435923,    0
$$ Real data points
##PAGE= N=1
##DATA TABLE= (X++(R..R)), XYDATA
$$ [...]
5911H25552l0848J01348J8668Q8811o639j77221k01758L0915J63938m8831j82475
5900E81460R9367M0124j13382J79520k09574m2617l1301J60632j07601o5903J7052
5889E07777l9555Q6507J18585j946R1858n5577q230l2342Q8917l9470j36343J16120
5877F96301P959M1073J8569j16088Q1139k09269J9627P3606m3768j12873k33J52186
5865F08229J70504j69892J8475R4178q4379L6355J0357M7926n3581m4479R045
5854F42738K7573r879O4803j22774J70540k4247j90675J67468j38790j50009K54971
5843F91719J10414m6552J2671J24671j39074Q6645j8065j45897R3756k4071O2798
5832H09015J07486J59418r9968n1489j268k13416J8802P41k7089J0681O3806N4450
$$ plain form
5911 825552 794704 896052 914720 1003531 996892 819671 617913 648828 812766 763935 581460
5900 581460 680827 720951 607569 787089 577515 534898 503597 664229 556628 490725 507777
5889 507777 468222 554729 673314 671368 763226 707649 699419 667077 755994 716524 580181 696301
5877 696301 704260 745333 763902 647814 728953 519684 539311 612917 569149 456276 456043 608229
5865 608229 778733 608841 627316 721494 637115 673470 683827 731753 678172 633693 642738
5854 642738 670311 660432 725235 602461 773001 748754 558079 725547 586757 436748 691719
5843 691719 802133 755581 768252 892923 753849 840494 822429 676532 770288 746217 809015
5832 809015 916501 1075919 975951 924462 923194 709778 728580 729321 702232 712913 776719 831169
5820H31169M5217r4241L8064k1327O5864K70214j259p6695j93370P7683K00070
5809A141389j03732j18196J7469L42169K6681j82935j73544L2263K21777M7632
5799A250973q6481J6939P0957J00887r4424O036J43192J17037J0541k8652m6071
5788A460934K9849j12624Q3755J58028N8350O198r8374J45237m5824m4512O9891
5777A710908K16358J35176j29992k8664j4263J02894J27607J85201l1859K8576
5767B301942M3509M3844J92782J28909K26937j09507q6598j5006P9026R7222J46954
5756C050014J03901L4030J06160J24923k7265q5903n6641K54501J74270o802q7212
5745C583976J08974J11145Q9234J90658l8311J65773J74791R8759J29555J02395
$$ plain form
5820 831169 876386 782145 820209 798882 864746 1134960 1133701 1057006 863636 941319 1141389
5809 1141389 1037657 919461 936930 1279099 1305780 1122845 949301 981564 1203341 1250973
5799 1250973 1164492 1181431 1252388 1353275 1258851 1264887 1408079 1525116 1535657 1507005 1460934
5788 1460934 1490783 1378159 1461914 1619942 1678292 1684490 1586116 1731353 1685529 1641017 1710908
5777 1710908 1927266 2062442 1932450 1903786 1889523 1992417 2120024 2305225 2273366 2301942
5767 2301942 2345451 2389295 2582077 2710986 2937923 2828416 2741818 2726812 2805838 2903060 3050014
5756 3050014 3153915 3187945 3294105 3419028 3391763 3305860 3249219 3503720 3677990 3671188 3583976
5745 3583976 3692950 3804095 3893329 4083987 4045676 4211449 4386240 4484999 4614554 4716949
5735D716949j8637K9017J25020K40263K24362J09902k0824J03231K23794k7439
5725E705638R4131K18132L27221N6130R4254K41638J24923K23628K15424L41643
5715G642762K33873L68530K37425J92287N14381J00314K70169M50872K82071M45844
5705A0738528L38848M80471O51302M76672O07982M99263M71667O96733P69647
5696A5731113P15861O53243Q11769O95921R44748J089209Q18634J033742J179361
5687B3673601J012810J326899J282330J482573J403710J403592J294435J451258
5679C4331208J446602J477447J324662R13158P99256Q48534N64968L08161M06
5670D2014402j45406l75008p67292j104485j237906j137039j458757j545799j435302
$$ plain form
5735 4716949 4698312 4727329 4852349 5092612 5316974 5426876 5406052 5509283 5733077 5705638
5725 5705638 5799769 6017901 6345122 6401252 6495506 6737144 6862067 7085695 7301119 7642762
5715 7642762 7876635 8245165 8482590 8674877 9189258 9289572 9559741 10010613 10292684 10738528
5705 10738528 11077376 11557847 12209149 12685821 13293803 13793066 14264733 14961466 15731113
5696 15731113 16446974 17100217 17911986 18607907 19552655 20641864 21460498 22494240 23673601
5687 23673601 24686411 26013310 27295640 28778213 30181923 31585515 32879950 34331208
5679 34331208 35777810 37255257 38579919 39493077 40292333 41140867 41705835 42013996 42014402
5670 42014402 41868996 41493988 40726696 39622211 38384305 37247266 35788509 34242710 32807408
5661C2807408j485926j570282j323791j363906j404568j374265j242594j187597
5653B1854479j047843j159495q50057q67322o42965p93382p05378o42884o78072
5644A4467081o80010n62524m47854n14220n57188o25813m39631l79162l16717
5635I943962l25422m04761j75210m09590k71177k64157k43437k28497k22120o5585
5625G334006l5495K2730k79885m20545j08643J278k99670k67997j55721k74060
5615E515998j70593k81947k26350j82294k2167j14243r3782q413j59912q6330
5605D169967j77632k11238p7137m5251M148j97103q1714r449j37034O3691n9486
5594C241762j24773k26469j758Q2867j75645J28298j87354j2733j9610j43750
$$ plain form
5661 32807408 31321482 29751200 28427409 27063503 25658935 24284670 23042076 21854479
5653 21854479 20806636 19647141 18797084 17929762 17286797 16493415 15788037 15145153 14467081
5644 14467081 13787071 13224547 12776693 12262473 11705285 11079472 10639841 10260679 9943962
5635 9943962 9618540 9213779 9038569 8628979 8357802 8093645 7850208 7621711 7399591 7334006
5625 7334006 7298511 7321241 7041356 6620811 6512168 6513446 6213776 5945779 5790058 5515998
5615 5515998 5345405 5063458 4837108 4654814 4632647 4518404 4424622 4416209 4256297 4169967
5605 4169967 3992335 3781097 3703960 3658709 3662857 3465754 3384040 3374591 3237557 3301248 3241762
5594 3241762 3116989 2890520 2888762 2971629 2795984 2924282 2736928 2724195 2704585 2560835
5584B560835L6882k08969k04220q7852J40793j45273l1845n4980N5981m8177J65295
5573B178470p6062j04676N845J6738j43394n5633O6963O8364P6000j5146j44810
5562A872659j56753j58340M1418O5217p0883K7987O4405j11167l8258j42636o8989
5551A324660k2521l1668O8891J51380j28386n6058j1392O4960j03364j20086j775
5540A134641J4821J88234o8032k26053p9434l4725R3470l9831l1324J68976j37056
5529I83687r7772p7722Q4771O7339J01080j36565n8008P9468O8867l6437j85735
5518G92973J639p2082p4557K43848n8919r8433K65190k42403j58871N4912J2853
5507F66150l978r2312O0595J72618m0135o9130m5649n4613J38802M5368J95055
$$ plain form
5584 2560835 2597717 2388748 2184528 2096676 2237469 2092196 2060351 2005371 2061352 2013175 2178470
5573 2178470 2102408 1997732 2003577 2020315 1876921 1821288 1888251 1956615 2032615 2017469 1872659
5562 1872659 1715906 1557566 1598984 1664201 1593318 1621305 1685710 1574543 1536285 1393649 1324660
5551 1324660 1302139 1270471 1339362 1490742 1362356 1306298 1294906 1359866 1256502 1136416 1134641
5540 1134641 1149462 1337696 1269664 1043611 964177 929452 1022922 983091 951767 1120743 983687
5529 983687 885915 808193 892964 960303 1061383 924818 866810 946278 1015145 978708 792973
5518 792973 794612 722530 647973 891821 832902 734469 999659 757256 598385 653297 666150
5507 666150 662172 569860 630455 803073 762938 693808 648159 593546 732348 777716 972771
5496I72771j67351r4469k3483j2377J39211j57059j55625o1927J41397R7176m9218
5485F29046p5168O1084q5794J47025N2039j25029o4455K4173J30383n1506M7554
5474F89352J5246k8732M9177K13544k7549j71275p4117n27K773J08064k3489N3542
5462H06009J56164l8035k34387k674q9279J44355n6899n3408P2554P5504j63980
5451F15924j13931j7502k2886K09340O337j00594N8358r1807o191n3326J57597
5440F41319l19l1765k3807N8599J65852J97681k05755k1810K078l8332m1352p0389
5428F32000K47238j17029j72452k7956n0324J9737K03032Q2459k03570k35798
5418C77337N8026p9469J07658L6260l788J46960J04010j92942J14362k8693N7779
$$ plain form
5496 972771 805420 710951 687468 675091 814302 657243 501618 439691 581088 678264 629046
5485 629046 553878 614962 529168 676193 728232 603203 538748 562921 693304 641798 689352
5474 689352 704598 675866 725043 938587 911038 739763 665646 665119 667892 775956 752467 806009
5462 806009 962173 924138 689751 687077 597798 742153 685254 631846 704400 779904 615924
5451 615924 501993 484491 461605 670945 677282 576688 635046 543239 537048 483722 641319
5440 641319 641000 609235 585428 644027 809879 1007560 801805 779995 782073 743741 702389 632000
5428 632000 879238 762209 589757 561801 511477 531214 734246 816705 613135 377337
5418 377337 435363 355894 463552 499812 496024 642984 746994 554052 668414 639721 697500
5407F97500p2040L8872O4768r5966q5920P3904p8130P6496J93645k6203j27802
5396F59124L6019j87299j4959l8960J33935J99990j14476k16408q481J12436J10141
5385F71062n3647q5221Q3202K0200j4193j4620p50m9364m7300n4350P3624j04696
5373D23947k3817j268P9674J1559Q2152j13100L9715P2386q0731P6982N9733n1747
5361E75485O6650N8270p5543m5138l2702J6904J8905k535p908j32072K3748O0930
5349E24994j46780l1523K08223K8085j42646m5588N1822P6587Q1296J21761j47898
5338E78333L68P0793o1732o1029R8935L2994o2114K2617j6249L8068O7913j49519
5326E59378R124Q5561K5995l319J70827J80232j39979j31806k9691n2679O8733
$$ plain form
5407 697500 625460 664332 729100 633134 547214 621118 542988 619484 813129 786926 659124
5396 659124 695143 507844 492885 453925 587860 787850 673374 456966 448485 560921 671062
5385 671062 617415 532194 615396 635596 621403 606783 606033 556669 509369 455019 528643 423947
5373 423947 400130 398862 478536 490095 572247 459147 498862 571248 490517 567499 627232 575485
5361 575485 642135 700405 624862 579724 547022 563926 582831 580296 572388 440316 464064 524994
5349 524994 378214 346691 554914 582999 440353 394765 446587 523174 604470 726231 578333
5338 578333 578701 649494 587762 526733 625668 658662 596548 619165 602916 640984 708897 559378
5326 559378 568502 654063 680058 676739 847566 1027798 887819 756013 726322 673643 742376
5315G42376l6048O7481p3162m6077J84583r9150J4028l8884L3724O7560J29481
5304I45912j5832J79O205J0143k17415L4467J10442J15033r125J00824r9837q3638
5292H97358N4335L5555p781J51078j46927m3313O6273J15388j39335j21699J20074
5281I81006j88315J94976l3604j46281K04872r18O8173J27000j10065J90015j30435
5270A156424j33151o781q2312p3658K8897J54191M1597k8857l2719P3708M3813
5259A141152J0957K24824k0545n4377j96218J05594N8806J65844l4426j2977K0898
5248A409532P3343L2201k3253j10918J21450j11020K45711K13770l7057n809p1425
5237A736525l95q087O2035Q0061J81118q8734k7878m2346q329p7772J29243R0620
$$ plain form
5315 742376 706328 773809 700647 654570 839153 740003 754031 715147 748871 816431 945912
5304 945912 930080 930259 936464 946607 729192 763659 874101 989134 980009 1080833 980996 897358
5292 897358 951693 987248 979467 1130545 983618 940305 1006578 1121966 982631 860932 981006
5281 981006 792691 987667 954063 807782 1012654 1011736 1079909 1206909 1096844 1286859 1156424
5270 1156424 1023273 1016492 934180 860522 889419 1043610 1085207 1056350 1023631 1097339 1141152
5259 1141152 1152109 1376933 1356388 1302011 1105793 1211387 1270193 1436037 1401611 1388634 1409532
5248 1409532 1482875 1515076 1491823 1380905 1502355 1391335 1637046 1850816 1813759 1807950 1736525
5237 1736525 1736130 1728043 1790078 1870139 2051257 1962523 1934645 1892299 1883970 1806198 1935441 2026061
5225B026061J42426J65654K9776J0489J6223J46939N0610J6477J02708M966J71276
5214B883605J93952O909L2844o6254j64552L4657O8432Q6673J3949K24240K97104
5203C611559O1876j50555J7220J6829J40735J42821j13545p1244J02079L20805
5193D078580K97935P7615J89970K3870O3365k3914Q3579o4423O87J37889L81311
5182E246464L44952p4649l3708J45821M06897J74043j0054K9183J55324J81853
5172F566126M3613K78512J14117K88770L35739J20189L79634J95133J83596J88926
5162H694355K36332L02156K84320L17988K64095K53278N21741K68245L08305N86193
5152A2037008M40358N74914R26222P00968M69499P35830Q04429Q57741J043205
$$ plain form
5225 2026061 2168487 2334141 2363917 2374406 2390629 2537568 2588178 2604655 2707363 2712329 2883605
5214 2883605 3077557 3084466 3117310 3051056 2886504 2921161 2989593 3076266 3090215 3314455 3611559
5203 3611559 3673435 3522880 3540100 3556929 3697664 3840485 3726940 3655696 3757775 4078580
5193 4078580 4376515 4454130 4644100 4667970 4731335 4707421 4791000 4726577 4727264 4865153 5246464
5182 5246464 5591416 5516767 5483059 5628880 6035777 6209820 6199766 6228949 6384273 6566126
5172 6566126 6609739 6888251 7002368 7291138 7626877 7747066 8126700 8321833 8505429 8694355
5162 8694355 8930687 9232843 9517163 9835151 10099246 10352524 10874265 11142510 11450815 12037008
5152 12037008 12477366 13052280 13978502 14679470 15148969 15884799 16689228 17546969 18590174
5143A8590174J208704J283428J338416J610133J894268K002123K150879K258079
5135C2336204K422346K809943K931611K805526K541044J847016P91913l64201
5127D8121402j167287j947168k090386k099941j867875j554898j170382q20794
5119C5402671r10868l76807p7214N6411K19032O22876R19880R68875J232183J458833
5109C9515872J845320K287370K641830L026589L487396M149412M598368N072511
5101F6624668N532319N536985N355638M613625K881704O39233k203346m877915
5093H4102911o419896o883191o405931n524650m754299l831850l504196k707251
5085D4071647k351970k218207j747372j427955j045744p01215n86364l79561q8216
$$ plain form
5143 18590174 19798878 21082306 22420722 24030855 25925123 27927246 30078125 32336204
5135 32336204 34758550 37568493 40500104 43305630 45846674 47693690 48485603 48121402
5127 48121402 46954115 45006947 42916561 40816620 38948745 37393847 36223465 35402671
5119 35402671 34491803 34114996 34037782 34094193 34313225 34936101 35855981 36824856 38057039 39515872
5109 39515872 41361192 43648562 46290392 49316981 52804377 56953789 61552157 66624668
5101 66624668 72156987 77693972 83049610 87663235 90544939 91184172 88980826 84102911
5093 84102911 77683015 70799824 64393893 58869243 54114944 50283094 46778898 44071647
5085 44071647 41719677 39501470 37754098 36326143 35280399 34579184 33992820 33613259 33525043
5076C3525043M11388N41159Q10881Q26077J174097J595922J702112J726574K033107
5067D4346360K035689J703932J385452L66457q00286j891617k720041l442713
5059D0983233l555802l319149k707247k601081k277047k133802j762463j453907
5051B1172735j278694j363969j346385j113721q21632o91219o05706o91777o36707
5042A2622925o18499m25833m47467n29652l11973m31043k90294l89685l87265
5033H791214l54013l01168j62751j46990k89959j56295j61995l01402k00846k34936
5023F480859J92152j89926k75487j90309l03211j28645j85301P9279k21547k52659
5013E005205k23887j44028m8981j49481k30386j7330K5050J84398j51469k08694
$$ plain form
5076 33525043 33936431 34477590 35288471 36114548 37288645 38884567 40586679 42313253 44346360
5067 44346360 46382049 48085981 49471433 49837890 49037604 47145987 44425946 40983233
5059 40983233 37427431 34108282 31401035 28799954 26522907 24389105 22626642 21172735
5051 21172735 19894041 18530072 17183687 16069966 15248334 14557115 13951409 13259632 12622925
5042 12622925 12004426 11578593 11131126 10601474 10289501 9858458 9568164 9178479 8791214
5033 8791214 8437201 8136033 7973282 7826292 7536333 7380038 7218043 6916641 6715795 6480859
5023 6480859 6673011 6483085 6207598 6017289 5714078 5585433 5400132 5479411 5257864 5005205
5013 5005205 4781318 4637290 4588309 4438828 4208442 4191112 4216162 4400560 4249091 4040397
5003D040397j5251j68246J25277l8655j62860p1482n8160n1994k07783q3117n7401
4992C250725o6233j45139K0183R4955o9411M8645j94518L491m3360l5792q0218
4981B783328o6299N1548L6383r6044j81267j15974K2622Q1756o5808Q543l5182
4970B423606m2505k53514j02946j41908p6651R6175O5923J05712j10138m3520
4960A920234J517l7128q991P2865m9494j03057J04118J9232j08981j25867p2193
4949A612255k1845j18428P5272J79769J80490l15482j41159K2467J01383M9005
4939A623727O7920n1173M5183Q7820j94711J29175k10631l1200J26555J2424m7201
4928A557888q8481J18569j05704K0559R5317k6688P707O0079k620j15262J10894
$$ plain form
5003 4040397 4025146 3856900 3982177 3943522 3780662 3709180 3651020 3599026 3391243 3308126 3250725
4992 3250725 3184492 3039353 3059536 3154491 3085080 3133725 2939207 2942698 2899338 2863546 2783328
4981 2783328 2717029 2768577 2804960 2708916 2527649 2411675 2434297 2516053 2450245 2458788 2423606
4970 2423606 2381101 2127587 2024641 1882733 1806082 1902257 1968180 2073892 1963754 1920234
4960 1920234 1921751 1884623 1875632 1948497 1899003 1795946 1900064 1919296 1810315 1684448 1612255
4949 1612255 1590410 1471982 1547254 1727023 1907513 1592031 1450872 1473339 1574722 1623727
4939 1623727 1691647 1640474 1685657 1773477 1578766 1707941 1497310 1466110 1592665 1605089 1557888
4928 1557888 1469407 1587976 1482272 1502831 1598148 1571460 1579167 1639246 1636626 1521364 1632258
4917A632258N3538n1029J16513o968p3817o8471J47744k3213j07613J32050j19976
4906A631016M1588P7235l0732j15905j71067J0633l3273k6683J12870l9726k24270
4895A231686K6607M1653j6780P3599j70591M524k9308J1203k15545R6030J12098
4884A165176K354N9668k3039P4207k9501M2601k1329r6644L6464J60585k24865
4873A145677l29901N3347N8742J49290L15784k04383j36547Q0767J24445j07935
4863A149286k34258J31307K23111r278N9449K056j02719Q1541M1083N3714j12150
4852A283142j20204o2861K5154P4666P0590l268p4185j01293Q5400M1892J21430
4841A340463n7503m8283Q3757n6540j2199o8853R4511K01847N9046k32549j14905
$$ plain form
4917 1632258 1685796 1634767 1751280 1744312 1670495 1602024 1749768 1726555 1618942 1750992 1631016
4906 1631016 1672604 1749839 1719107 1603202 1432135 1442768 1409495 1382812 1495682 1455956 1231686
4895 1231686 1258293 1299946 1283166 1356765 1186174 1190698 1161390 1172593 957048 1053078 1165176
4884 1165176 1167530 1227198 1204159 1278366 1248865 1291466 1270137 1173493 1209957 1370542 1145677
4873 1145677 815776 869123 927865 1077155 1392939 1188556 1052009 1132776 1257221 1149286
4863 1149286 915028 1046335 1269446 1260168 1319617 1321673 1218954 1300495 1341578 1395292 1283142
4852 1283142 1162938 1100077 1125231 1199897 1270487 1267219 1193034 1091741 1177141 1219033 1340463
4841 1340463 1282960 1234677 1318434 1261894 1249695 1180842 1275353 1477200 1536246 1303697 1188792
4830A188792N2725K26096p0483j25014K27226L0609q5555q6065K41229N2135l0091
4819A621604j82654r9395Q7825N8191J34359R1995j4673j38873P9494N8177k444
4808A693606l15862j84516O2057P4619N8426j21660K25227J10438j72099N4914
4798A485150K29714l554r7838k3171q0020j1844K96089j15668J25503K79290j06114
4787A977537j66026l954K00149j12232N1285j05388P6400Q6402l1844k6138o4982
4776A881209K8463o6837j83035R4020Q5841N4291O0755L32L846p474j58137Q0523
4764A873797J12242k0471J11589J25726m1180m331P0281K1925M8236p4841j79499
4753B043474L4501k5788R4691J36175j67542J48034K2129Q923j10587J80054l787
$$ plain form
4830 1188792 1241517 1467613 1397130 1272116 1499342 1529951 1444396 1358331 1599560 1651695 1621604
4819 1621604 1438950 1339555 1427380 1485571 1619930 1711925 1697252 1558379 1637873 1696050 1693606
4808 1693606 1377744 1193228 1255285 1329904 1388330 1266670 1491897 1602335 1430236 1485150
4798 1485150 1714864 1711310 1613472 1590301 1510281 1498437 1794526 1678858 1804361 2083651 1977537
4787 1977537 1811511 1807557 2007706 1895474 1946759 1841371 1917771 2004173 1972329 1946191 1881209
4776 1881209 1909672 1842835 1659800 1753820 1839661 1893952 1954707 1955039 1958885 1951411 1793274 1873797
4764 1873797 1986039 1965568 2077157 2202883 2161703 2157372 2227653 2249578 2297814 2222973 2043474
4753 2043474 2077975 2052187 2146878 2283053 2115511 2263545 2285674 2294597 2184010 2364064 2360277
4742B360277p6614K2194j20641R1717J78770j8232l8965m3560j33472M1930J64670
4731B428074J34220j71312J14819N8501J20219K0848p1117l7909p0738Q7222J32386
4720B745213P0365l5473l0024M9817O4557n3374j07939J6580M6366Q4862m1770
4709B809180n4951K52339L9608n9583J08726j7869k813Q1004Q5187o3469J56902
4698C334261r9679o0055J35689J58996O3024J08893J14228L2377N7651J05245
4688C950630M3471O0642J01682K747M1764K24958J78687K8688M4793K23007L78784
4677E279853K30084J56560J669J30878J64089K6155P3692J98294J52994J47822
4667F562090J35772J82365L2873J61059K52721R5965J46558Q7746J09830K07229
$$ plain form
4742 2360277 2283663 2305857 2185216 2276933 2455703 2437471 2398506 2354946 2221474 2263404 2428074
4731 2428074 2562294 2390982 2505801 2564302 2684521 2705369 2634252 2596343 2525605 2612827 2745213
4720 2745213 2815578 2780105 2750081 2799898 2864455 2811081 2703142 2719722 2766088 2850950 2809180
4709 2809180 2754229 3006568 3046176 2986593 3095319 3077450 3074637 3155641 3240828 3177359 3334261
4698 3334261 3234582 3174527 3310216 3469212 3532236 3641129 3755357 3787734 3845385 3950630
4688 3950630 3994101 4054743 4156425 4159172 4200936 4425894 4604581 4633269 4678062 4901069 5279853
4677 5279853 5509937 5666497 5668166 5799044 5963133 5989288 6062980 6261274 6414268 6562090
4667 6562090 6697862 6880227 6913100 7074159 7326880 7422845 7569403 7657149 7766979 7974208
4657G974208o00K47279J65708j647N340K14299J90754J53621P6972l9933K42443
4646I228444K12626K32514L39763m9861P1426J88221M56646K38502M10495K41568
4636A1570344K44920L21419K81359M52419N54438L44409L83226O75210M62314
4627A5290058N03115N15692P46956O03989O91923O37952Q72277R45396J054190
4618B1861548J107139J259768J200202R89922J371561J740893J639122J838894
4610C3009049K301843K129982K193603K948018L285677L315379L750440M300742
4602E7234733M854142N196914N652185O165024O513148O691819O651433O424374
4594A05383772O174729N864149N765087N574944M867814L898397K553042Q38177
$$ plain form
4657 7974208 7973608 8220887 8386595 8384948 8390288 8604587 8795341 8948962 9025934 8986001 9228444
4646 9228444 9441070 9673584 10013347 9963486 10034912 10223133 10679779 10918281 11328776 11570344
4636 11570344 11815264 12136683 12418042 12870461 13424899 13769308 14152534 14827744 15290058
4627 15290058 15793173 16308865 17055821 17659810 18351733 18989685 19861962 20807358 21861548
4618 21861548 22968687 24228455 25428657 26418579 27790140 29531033 31170155 33009049
4610 33009049 35310892 37440874 39634477 42582495 45868172 49183551 52933991 57234733
4602 57234733 62088875 67285789 72937974 79102998 85616146 92307965 98959398 105383772
4594 105383772 111558501 117422650 123187737 128762681 133630495 137528892 140081934 140920111
4586A40920111j422088l649683n105291o140638o656224o780701o830311o954755
4578I7380420p007104p113276o970931o637660n984341n532483m921250m048397
4570D9164978l674349l216730k830611k748645k269600k028238j789899j679391
4562B8927515j602362j431963j167405r68518j148816j023630q62528q80936r80404
4553A8860953q84629n97825n09115p99045o84248m82830l57490o69271o23022
4544A3253478m16460k76754m89509l70895l34243l54175l40856l79692l44161
4535I946733k99037l84290j12078j67971l05971l00003j06936q8338k39545k01063
4525G741501k34373l06491n7483j97600l45348o8857k6115k4601q5709j26987
$$ plain form
4586 140920111 139498023 135848340 130743049 124602411 117946187 111165486 104335175 97380420
4578 97380420 90373316 83260040 76289109 69651449 63667108 58134625 53213375 49164978
4570 49164978 45490629 42273899 39443288 36694643 34425043 32396805 30606906 28927515
4562 28927515 27325153 25893190 24725785 23757267 22608451 21584821 20722293 19841357 18860953
4553 18860953 17976324 17378499 16869384 16070339 15386091 14903261 14545771 13876500 13253478
4544 13253478 12837018 12560264 12070755 11699860 11365617 11011442 10670586 10290894 9946733
4535 9946733 9647696 9263406 9151328 8983357 8677386 8377383 8270447 8182109 7942564 7741501
4525 7741501 7507128 7200637 7143154 6945554 6600206 6531349 6505234 6480633 6394924 6267937
4515F267937r0205q9507l33892N015j10884j71543R0468o6460j40453j18220N0138
4504E292394j32832j68444l2626N1214k565j4010j27120k51461j37805j17525
4494D359220R2232j02148q6812J33686j72187j73904J0266k13334n3716j31641
4484C661662J66587j83370n5281J59176j06829j741l04532o5552K7210n18J8452
4473C315264l12151q4112L7139m2998k54288k63182o4965K12099R1291j21698
4463B512399K3796J9374o9313j27930J45310J13834k17665P706R2650j51094k65801
4452B083266p9587P9863j2861J25335q7884j27010o0284l6594L470N7463j98093
4441A747084m6192K1938k2220K8996j5789L9833j44491n1026J22927m1727M7418
$$ plain form
4515 6267937 6177732 6088225 5754333 5759348 5648464 5476921 5567389 5500929 5360476 5242256 5292394
4504 5292394 5159562 4991118 4958492 5009706 5007141 4993131 4866011 4614550 4476745 4359220
4494 4359220 4451452 4349304 4262492 4396178 4223991 4050087 4060353 3847019 3793303 3661662
4484 3661662 3828249 3644879 3589598 3748774 3641945 3640204 3335672 3270120 3297330 3296812 3315264
4473 3315264 3003113 2919001 2956140 2913142 2658854 2395672 2330707 2542806 2634097 2512399
4463 2512399 2536195 2555569 2486256 2358326 2503636 2617470 2399805 2407511 2500161 2349067 2083266
4452 2083266 2003679 2083542 2070681 2196016 2108132 1981122 1920838 1884244 1887714 1945177 1747084
4441 1747084 1700892 1722830 1700610 1729606 1713817 1753650 1609159 1558133 1681060 1639333 1686751
4430A686751N8823j24966n6417j2531j20168J74178j25518j21581n8218Q4970
4420A385323m529r471P3168j5343p7842k63680M8037J18942P2057n409j41360
4409A179893j88075K40503j1839j10085n5971K7767L03j46424L1883K86950n3951
4398A200954q7275k7311Q8816m4046j30279r3923J3394J46810q2964q0952M6002
4387I49226J4046N6827r2159J0262P6710j63329K05276P2410k38830K9869K364
4376I22672K68682q6852M9451J60283j71457j32862k24570J43363P6455L8531
4366A043696J81398j20199k79355M9179O8671R9041j65520k1004m0259J12397
4356I28045m6519j23207J08228j56596K01680K5303p4824q3879J68963M7739K8923
$$ plain form
4430 1686751 1745574 1620608 1564191 1551660 1431492 1605670 1480152 1358571 1300353 1385323
4420 1385323 1380794 1371323 1444491 1429148 1351306 1087626 1135663 1254605 1326662 1321253 1179893
4409 1179893 991818 1232321 1220482 1110397 1054426 1082193 1082496 936072 967955 1254905 1200954
4398 1200954 1113679 1086368 1175184 1131138 1000859 906936 920330 1067140 984176 903224 949226
4387 949226 963272 1020099 927940 938202 1014912 851583 1056859 1129269 890439 920308 922672
4376 922672 1191354 1104502 1153953 1314236 1142779 1009917 785347 928710 1005165 1043696
4366 1043696 1225094 1104895 825540 874719 943390 1042431 876911 855907 815648 928045
4356 928045 881526 758319 866547 709951 911631 936934 862110 778231 947194 994933 1023856
4345A023856M1356o2721j29682k72706J38316N8181K368O3040L4491j84575K3763
4334G35687j1235J13573L8651m4629J56201J32948N3514n1219q0665j80478k9301
4323H33047J9971J5268n8665J12829J09940m3512j14161p9519O4373N68p8165
4312G81974P7045P0892r835M2450q8297J43903O3012m4671k6916r7341J53514
4301A065730m836r4655j27340j2077Q5158j81612J63301J40119j06932j44920
4291G81936j4971J47516q9900p848q961J3403J86687J08416r8259Q0117O8032
4280A166168n8720j0143o5979L2178K0378J67590L2524N7881k0599k8427J16781
4269A409632M4840O6153J43553J17875k85328J8504o3104j07433R9949K3222O3255
$$ plain form
4345 1023856 1065212 1002491 872809 600103 738419 796600 798968 862008 896499 711924 735687
4334 735687 724452 838025 876676 832047 988248 1121196 1174710 1123491 1042826 862348 833047
4323 833047 853018 868286 809621 922450 1032390 988878 874717 795198 859571 860139 781974
4312 781974 859019 929911 920076 962526 874229 1018132 1081144 1036473 1009557 912216 1065730
4301 1065730 1060894 966239 838899 826822 911980 730368 893669 1033788 926856 781936
4291 781936 766965 914481 824581 816733 807772 821175 1007862 1116278 1018019 1098136 1166168
4280 1166168 1107448 1097305 1031326 1063504 1083882 1251472 1283996 1341877 1321278 1292851 1409632
4269 1409632 1454472 1520625 1664178 1782053 1496725 1515229 1452125 1344692 1444641 1467863 1531118
4258A531118q2428J88350n2056j2438j53509M1387q9791r8065k1866k9419J09258
4247A330541R0084N4708o8104m0744l4123L09529P0509R0768q964N5715K21041
4236B070960j53564j0164j13919k23055j29339K2922k05318j58130l0648M6636
4226A116381j14358J7389J88991q0800n1231K5745l8738j09566o4558l7084k6217
4215H25954J83728j2886j46051J19038O1793j23871p1479J08614q7438K31343
4205A088745n1398j94008j3213p6802K36906j4467j69594J83817l5580j03038
4195H51368J1307K2336n4579p0293J75192P9349P2654o6323j55179J70293p0888
4184I65237K8879J36526j49785j46839J38431k4385j00153J22602P6002j23234
$$ plain form
4258 1531118 1448690 1637040 1584984 1572546 1419037 1460424 1370633 1272568 1250702 1221283 1330541
4247 1330541 1420625 1475333 1407229 1366485 1332362 1641891 1712400 1803168 1794204 1849919 2070960
4236 2070960 1917396 1907232 1793313 1570258 1440919 1463841 1258523 1100393 1069745 1116381
4226 1116381 1002023 1019412 1208403 1127603 1076372 1102117 1063379 953813 889255 852171 825954
4215 825954 1009682 996796 850745 969783 1031576 907705 836226 944840 857402 1088745
4205 1088745 1037347 843339 830126 753324 990230 975763 806169 989986 954406 851368
4195 851368 862675 885011 830432 760139 935331 1014680 1087334 1021011 865832 1036125 965237
4184 965237 994116 1130642 980857 834018 972449 948064 847911 970513 1046515 923281
4174I23281M0436J04686K21680j71348Q2828L5553m6407j79354M9582K7448l2836
4163A055549K8501J92245M4214q0872j86076n9081M3062n23J27203o0557J6445
4152A120110o988P874j50570R1407J20282L14849j28108l4378K0390k18750J8776
4141A154894J61026r0655m3390J85628j06319j19170m910Q0540R2929k8089Q6134
4130A368618O6051K8071R0932j36620n1599J72301N0180r0902j6383J04583j39234
4119A445998n2973R5746q9642L3975J69605J39010j46861k2706J48536j54301
4109A566387K5648Q1580K6068O725R7623p292j88999J82274J7510J8605M3637
4098A869766J18149q7140k9884q2229R5243J31682j8423Q5614O1959R5731p2061
$$ plain form
4174 923281 963717 1068403 1290083 1118735 1201563 1237116 1190709 1011355 1060937 1088385 1055549
4163 1055549 1084050 1276295 1320509 1239637 1053561 994480 1037542 1037019 1164222 1103665 1120110
4152 1120110 1113122 1120996 970426 1061833 1182115 1496964 1368856 1334478 1354868 1136118 1154894
4141 1154894 1315920 1225265 1181875 1367503 1261184 1142014 1137104 1217644 1310573 1282484 1368618
4130 1368618 1434669 1462740 1553672 1417052 1365453 1537754 1587934 1497032 1480649 1585232 1445998
4119 1445998 1393025 1488771 1399129 1433104 1602709 1741719 1594858 1572152 1720688 1566387
4109 1566387 1592035 1673615 1699683 1706408 1804031 1796739 1607740 1790014 1807524 1826129 1869766
4098 1869766 1987915 1900775 1870891 1788662 1883905 2015587 1997164 2082778 2144737 2240468 2168407
4087B168407J36213k69100m3665M1957o128j98830J25366j7299Q108L9726J79751
4076B164506k06885m0065K1966j04754J18900J04273j00933r0489K93380j16212
4066B043687j90736N4336J90838R1210o3818J07919j60650M8724J08825j81807
4056B048528J62146r050J32324L7089j5680J1755n1092k36279Q8067J44102m4364
4045B267546J06504J29231m4299O0471q5677k11155K32026o9649R2955j0201j29858
4034B337894k0625M2126j4979O7254Q4678K33032J60133j84032L8059J35634J1207
4023B890381l41481P5677k54628J57875K07250k5349J12556M7674m5579L278m6983
4012B780671L3945K62336P8584L6666r2301o0232R7390K16303N2295J7219n6517
$$ plain form
4087 2168407 2304620 2035520 1991855 2033812 2027684 1828854 1954220 1936921 1945029 1984755 2164506
4076 2164506 1957621 1917556 1939522 1834768 1953668 2057941 1957008 1866519 2159899 2043687
4066 2043687 1852951 1907287 2098125 2189335 2125517 2233436 2072786 2121510 2230335 2048528
4056 2048528 2210674 2201624 2333948 2371037 2355357 2367112 2316020 2079741 2167808 2311910 2267546
4045 2267546 2374050 2503281 2458982 2519453 2433776 2222621 2454647 2384998 2477953 2467752 2337894
4034 2337894 2317269 2359395 2344416 2411670 2496348 2729380 2889513 2705481 2743540 2879174 2890381
4023 2890381 2548900 2624577 2369949 2527824 2735074 2709725 2822281 2869955 2824376 2827654 2780671
4012 2780671 2814616 3076952 3155536 3192202 3099901 3039669 3137059 3353362 3405657 3422876 3366359
4001C366359J52120j65340P2119n5254L545K85026l4455J25544O678r865N4762
3990C801239k86O4073J48022R0473O4482O7266p0858J73388M008J77410Q8883
3979D608100P562O7328J86614k9073r0685J01372K5199K92992L9056M1676J8207
3968E268348L25703J78085J86084O4683J77790K61251J93006J74845J51214l8061
3958F942948J485r6374J60126J42703k1984m8559K90009J16358J1263J70423J94713
3947G863111K81567L08145J42309J53561K15001L99866L62044M14639L70050L79734
3937A0890027N21005N74955N34651M93228N07704P13083M24490L31192L37365
3928A5327700J8874j05226k93550j1313l02034k02575k33662j52516O254N0435
$$ plain form
4001 3366359 3518479 3353139 3425258 3370004 3373549 3658575 3624120 3749664 3756342 3746477 3801239
3990 3801239 3800953 3865026 4013048 4103521 4168003 4235269 4164411 4337799 4341807 4519217 4608100
3979 4608100 4615662 4682990 4869604 4840531 4749846 4851218 4876417 5169409 5208465 5250141 5268348
3968 5268348 5594051 5772136 5958220 6022903 6200693 6461944 6654950 6829795 6981009 6942948
3958 6942948 6944433 6848059 7008185 7150888 7128904 7080345 7370354 7486712 7497975 7668398 7863111
3947 7863111 8144678 8452823 8595132 8748693 8963694 9363560 9725604 10140243 10510293 10890027
3937 10890027 11411032 11985987 12520638 13013866 13521570 14234653 14659143 14990335 15327700
3928 15327700 15346574 15241348 14947798 14936485 14634451 14431876 14198214 14045698 14051952 14102387
3918A4102387J61420Q6396L7596M74920L72953M83495O01834N86543N00519P96662
3908A8204725O84796R30905J145021R64112J086304J440085J297276J322942J356712
3899B8432878Q29026N42794L11999m48964j060748j141580j225325j142742j015059
3890B4082279p31471n01094m30966l82355k62793O721J66318J71639L34046M11036
3880B2863360N39408O98912O98194P87598J046104J038328J389681J604800J551739
3871C2218124J651627J568302J712690J310028Q45215L05836l09045j023036j682157
3862C6597584k030145j957838j657552j434158j123427p94521m84786q67419m36650
3853B5811088j8303j35517L6183k6948J64545L44456O50363O49985O41299P85276
$$ plain form
3918 14102387 14263807 14350203 14387799 14862719 15235672 15719167 16321001 16907544 17408063 18204725
3908 18204725 18889521 19820426 20965447 21929559 23015863 24455948 25753224 27076166 28432878
3899 28432878 29261904 29804698 30116697 29667733 28606985 27465405 26240080 25097338 24082279
3890 24082279 23350808 22849714 22418748 22036393 21773600 21780321 21946639 22118278 22452324 22863360
3880 22863360 23402768 24101680 24799874 25587472 26633576 27671904 29061585 30666385 32218124
3871 32218124 33869751 35438053 37150743 38460771 39305986 39611822 39302777 38279741 36597584
3862 36597584 34567439 32609601 30952049 29517891 28394464 27599943 27115157 26247738 25811088
3853 25811088 25792785 25657268 25693451 25666503 25831048 26175504 26825867 27475852 28117151 28902427
3843B8902427Q73033J061499J079220J314460J208152J087643J070101P74402
3835C7370937N15003O560o45681j294642j308791j288130j240846j031732r93255
3826C0089423o37956m15190m13144k88293q789m1626J97830J78904M45672L65329
3816B9472160N23025M95855P90799J195325R64443J218778J234028J316703J339553
3807C8550669J422317J431407J459387J249700Q37116P16575Q06249M03870K89205
3798D7166495M93190P13705Q44006P66500O49269M56934M71672L5192O7424K63832
3788E1928219K64366N17556O54526P79122O18398P35642J144911J253081J222473
3779E9118294J231152J585438J827127K405103K572310K995385L420222L659454
$$ plain form
3843 28902427 29775460 30836959 31916179 33230639 34438791 35526434 36596535 37370937
3835 37370937 37885940 37892500 37246819 35952177 34643386 33355256 32114410 31082678 30089423
3826 30089423 29451467 29036277 28623133 28334840 28326051 28284425 28482255 28661159 29106831 29472160
3816 29472160 29995185 30491040 31281839 32477164 33441607 34660385 35894413 37211116 38550669
3807 38550669 39972986 41404393 42863780 44113480 44950596 45667171 46473420 46877290 47166495
3798 47166495 47659685 48373390 49217396 49983896 50633165 51090099 51561771 51596963 51664387 51928219
3788 51928219 52192585 52710141 53364667 54143789 54762187 55497829 56642740 57895821 59118294
3779 59118294 60349446 61934884 63762011 66167114 68739424 71734809 75155031 78814485
3771G8814485L800089L639722L265686K358032J195665j08556j021784k329265
3763H9614074k673918k723975k442528j469505p51016j77158N28054R40082J917264
3754H2761374K115422K568002K799531L183447L196756K844594K467326J580954
3746A03517406N13808k82918j318045k089213k555534l109821l191811l062711
3738H8421161k450054j900921j322044j226829l98975O9253M09362P23902R29543
3729H3254398R18642J315285J409637J370738J335506J294596J187242J286042
3721I3372086J083901Q83281P70344L67240K5996k40441m42952o99809r83523
3712I4136123j025764j233565j149531j020898j202399j001313j361658j124708
$$ plain form
3771 78814485 82614574 86254296 89519982 91878014 93073679 92965123 91943339 89614074
3763 89614074 86940156 84216181 81773653 80304148 79553132 79375974 79904028 80844110 82761374
3754 82761374 84876796 87444798 90244329 93427776 96624532 99469126 101936452 103517406
3746 103517406 104031214 103748296 102430251 100341038 97785504 94675683 91483872 88421161
3738 88421161 85971107 84070186 82748142 81521313 81122338 81191591 81600953 82324855 83254398
3729 83254398 84173040 85488325 86897962 88268700 89604206 90898802 92086044 93372086
3721 93372086 94455987 95339268 96109612 96476852 96502848 96262407 95819455 95119646 94136123
3712 94136123 93110359 91876794 90727263 89706365 88503966 87502653 86140995 85016287
3704H5016287r64342r53438p38128n58731n18355n44493n15168n85909p82815
3695G8854908j359632j445870j790454j773027j629544j755790j877237j754836
3687F5468518j943913j622245j480707j561407j730497j361608j290437j339596
3679E3138108j226605r66343q42249j049646r10920r15804r00007q79538r09714
3670D4537282r58735q91246j105265j067804j225272j006456r81712r50492q96649
3661C5453651r12824q69224r38954j002752r96945q57673p55802r88087q58081
3652B7273309p35160j046106p56862n64889m80874o08424p80055n42971p26726
3643B1031242n86291n87679p21131m69459k84058n27510m57287k17176l04336
$$ plain form
3704 85016287 84051945 83098507 82360379 81801648 81283293 80738800 80223632 79637723 78854908
3695 78854908 77495276 76049406 74258952 72485925 70856381 69100591 67223354 65468518
3687 65468518 63524605 61902360 60421653 58860246 57129749 55768141 54477704 53138108
3679 53138108 51911503 50945160 50102911 49053265 48142345 47226541 46326534 45446996 44537282
3670 44537282 43578547 42687301 41582036 40514232 39288960 38282504 37300792 36350300 35453651
3661 35453651 34540827 33671603 32732649 31729897 30732952 29875279 29119477 28131390 27273309
3652 27273309 26538149 25492043 24735181 24170292 23689418 23080994 22300939 21757968 21031242
3643 21031242 20444951 19857272 19136141 18666682 18382624 17855114 17397827 17180651 16876315
3634A6876315m85212m57041m29513k81912k91916l36215k42836k02056k87463
3625A3862151j37959k95318m26881r8795k07908q6299m27045k90774j21984j44872
3615A1624316n6945N029L831J3019l15126q8062P3291k32145r1852j45969k12286
3604A0577101k02686r2094k83722k69952m38560k01895j36239j92964k61120j34662
3594H363207n7576J6527k55371l4751j06434j84644k11300M0019K5844j76669
3584G418852k59703j02274n5119o6085r3818N3756k29582r6490o3337j61391J1758
3573F356567m5689L6705j26841j15442j76066P4724J21141K145j33835M1320o3106
3562E971623j54497m5263m0889O8851n1308j29837p3781L9246M6033R8384j02713
$$ plain form
3634 16876315 16391103 15934062 15504549 15222637 14930721 14594506 14351670 14149614 13862151
3625 13862151 13724192 13428874 13001993 12903198 12695290 12608991 12181946 11891172 11769188 11624316
3615 11624316 11567371 11572400 11576231 11589250 11274124 11186062 11259353 11027208 10935356 10789387 10577101
3604 10577101 10374415 10282321 9998599 9728647 9290087 9088192 8951953 8758989 8497869 8363207
3594 8363207 8305631 8322158 8066787 8032036 7925602 7740958 7529658 7569677 7595521 7418852
3584 7418852 7159149 7056875 7001756 6935671 6841853 6895609 6666027 6569537 6506200 6344809 6356567
3573 6356567 6310878 6347583 6220742 6105300 5929234 6003958 6125099 6127244 5993409 6034729 5971623
3562 5971623 5817126 5771863 5730974 5799825 5748517 5618680 5544899 5584145 5630178 5728562 5625849
3551E625849j17893j30238j81776J09522P8454l3544k55997J14985K3132J36183
3541E368677p9990L0985k3088P1764M7434k56594K7808n2694l1021J1606p1227
3530E043660R9205j1394j3039n7830j5550n140l9607P50j34075L2403R8280J08409
3518E106072k7061k1560Q8247O8854j00945j51260J27224k2831J27280J15922
3508E309942J9585m8823J64040j00878R270K19703m9831j08701K0968j15544P6825
3497E396556k9211m294J46976N6577N5772l7751j16011k431K40555J2679j1975
3486E707442K10794J0125r0157j47356n7254n5417R1682N7280n9519P5014k7475
3475E715159N4335J99589o2541q3530m221Q8459K19908J49860J07984l9370j27168
$$ plain form
3551 5625849 5507956 5377718 5195942 5305464 5383918 5350374 5094377 5209362 5232494 5368677
3541 5368677 5288687 5319672 5296584 5368348 5415782 5159188 5186996 5134302 5103281 5114887 5043660
3530 5043660 5142865 5131471 5118432 5060602 5045052 5039912 5000305 5001055 4866980 4899383 4997663 5106072
3518 5106072 5079011 5057451 5145698 5214552 5113607 4962347 5089571 5066740 5194020 5309942
3508 5309942 5329527 5280704 5444744 5343866 5353136 5572839 5523008 5414307 5435275 5319731 5396556
3497 5396556 5367345 5363051 5510027 5566604 5622376 5584625 5468614 5466183 5706738 5719417 5707442
3486 5707442 5918236 5928361 5838204 5690848 5633594 5578177 5669859 5727139 5667620 5742634 5715159
3475 5715159 5769494 5969083 5906542 5823012 5818791 5907250 6127158 6277018 6385002 6345632 6218464
3464F218464r454N4805O2708J66295l6734L34686K2346L7144J01302k0528j9924
3453F911110M4333l9228K32966J70880J16665J18069J74175J43907J30958J62577
3443H166412J26225J65870K08927J26238J23882M4530j4340J44539Q1153k8896
3433I144540J03980K08862q962J00937J9858K25459P3519P9522K21478n833P7972
3422A0241332M8342J97110L52358K09739L22365J37568M8187J60779K03752K50594
3412A2172126Q3208K22443J37713K36420K57794K13875L05777K34800K37964L84438
3402A4486558K45541K01503L43132N32866M68424M52539K63858M52271M81478
3393A7928170K74983N11834L93591N10055O38028M68390L25698N88914N59730
$$ plain form
3464 6218464 6209010 6263815 6326523 6492818 6456084 6790770 6813116 6850260 6951562 6931034 6911110
3453 6911110 6955443 6916215 7149181 7320061 7436726 7554795 7728970 7872877 8003835 8166412
3443 8166412 8292637 8458507 8667434 8793672 8917554 8962084 8947744 9092283 9173436 9144540
3433 9144540 9248520 9457382 9448420 9549357 9569215 9794674 9868193 9947715 10169193 10163360 10241332
3422 10241332 10289674 10486784 10839142 11048881 11371246 11508814 11557001 11717780 11921532 12172126
3412 12172126 12255334 12477777 12615490 12851910 13109704 13323579 13629356 13864156 14102120 14486558
3402 14486558 14732099 14933602 15276734 15809600 16278024 16730563 16994421 17446692 17928170
3393 17928170 18203153 18714987 19108578 19618633 20256661 20725051 21050749 21639663 22199393
3384B2199393L50762O34743J51283N89360N32574K90769N05208N88201Q56835
3375B6699128N07132N85493O21572P39270R77366J179595J095078J234565J476097
3366C5115296J431460J471385J648256J801787K238239K628181K721853L065951
3358E2122408L252849L614556L855289L727882L469842K783439J700916N38764
3350G5065945o32277j726099k258446k323418j805002j655826j001881m55628
3342F3207368r4375K24705O35230Q83095J176651J509750J865629K213203K644313
3333G4265569L006555L609216L928128M609592N329703N681038O646228P677833
3325A14753862Q687926R374636J0200359J0399004J0061527R049877O841076M098642
$$ plain form
3384 22199393 22550155 23184898 23336181 23925541 24458115 24748884 25254092 25842293 26699128
3375 26699128 27206260 27791753 28413325 29152595 30129961 31309556 32404634 33639199 35115296
3366 35115296 36546756 38018141 39666397 41468184 43706423 46334604 49056457 52122408
3358 52122408 55375257 58989813 62845102 66572984 70042826 72826265 74527181 75065945
3350 75065945 74433668 72707569 70449123 68125705 66320703 64664877 63662996 63207368
3342 63207368 63112993 63337698 63972928 64856023 66032674 67542424 69408053 71621256 74265569
3333 74265569 77272124 80881340 84809468 89419060 94748763 100429801 107076029 114753862
3325 114753862 123441788 132816424 143016783 153415787 163477314 172527191 179368267 183466909
3317A83466909K007551J143188K119902M374437P154543J0340491J3697223J6827588
3309B41131832J9241638J9649053J7834124J3445221O713442r33338q829002j6283051
3301B91969919k1322690k3610669k3626286k1238817j7253309j3075014r594518
3294A62248616p156720n584552m835993m442698m186705m609033m555652n325305
3286A21551958o122368o693995p138471o725146o869324o471462n882801m989155
3278G0659236m553719l966409l337331l261504l067477k695227k285289k181210
3270D5311070j926818j637628j901734j551744j446627j514389j152058j082012
3262C3098060r71286j076741j095641q78863q17164p77066n03292p63952n72982
$$ plain form
3317 183466909 185474460 186617648 188737550 193111987 200266530 210607021 224304244 241131832
3309 241131832 260373470 280022523 297856647 311301868 318015310 317081972 308252970 291969919
3301 291969919 270647229 247036560 223410274 202171457 184918148 171843134 162248616
3294 162248616 155091896 149507344 144671351 140228653 136041948 131432915 126877263 121551958
3286 121551958 115429590 108735595 101597124 94871978 88002654 81531192 75648391 70659236
3278 70659236 66105517 62139108 58801777 55540273 52472796 49777569 47492280 45311070
3270 45311070 43384252 41746624 39844890 38293146 36846519 35332130 34180072 33098060
3262 33098060 32126774 31050033 29954392 29075529 28258365 27481299 26978007 26214055 25641073
3253B5641073n11271o83948o13451n48478n48342m72360k51017o64576m99102
3244B0848528m57450n00417l30417l03116n6714k53403m55735n37993k72936k62094
3234A7418253k58653j76628k46160l57834j70391k26388j87149k32911l87443
3225A5174696L9431j15991l89667j03031r4309m0063l9628k11943j43530Q7103
3215A4163068m46368j45068p2910r4429q4883O5945k05914l50905k43946J04835
3205A2689425M2178j17886k28989j32408q0084p3886r6664j8165l3632K9570n2585
3194A1926874k82295j40753j35362j26856r1360q6086j11011L646q3828k02331
3184A0670638j04001J8761j45740R7486J49019L28193p1935o8788j86899N7820
$$ plain form
3253 25641073 25129802 24445854 23832403 23283925 22735583 22263223 22012206 21347630 20848528
3244 20848528 20391078 19890661 19560244 19257128 19200414 18947011 18491276 17953283 17680347 17418253
3234 17418253 17159600 16982972 16736812 16378978 16208587 15982199 15795050 15562139 15174696
3225 15174696 15214127 15098136 14708469 14605438 14511129 14471066 14431438 14219495 14075965 14163068
3215 14163068 13716700 13571632 13498722 13404293 13319410 13385355 13179441 12828536 12584590 12689425
3205 12689425 12731603 12613717 12384728 12252320 12172236 12098350 12001686 11983521 11949889 11979459 11926874
3194 11926874 11644579 11503826 11368464 11241608 11150248 11064162 10953151 10956797 10872969 10670638
3184 10670638 10566637 10585398 10439658 10537144 10686163 11014356 10942421 10873633 10686734 10744554
3174A0744554J52124o2044J03561M6564N2415J53276P512k0012n0580J71674J16152
3163A1415196J4577k2582O5494L62959J31909Q6649J72636J86935K3161n7338
3153A2379596J50409M5909O7055R2104J38583J33473L55753K93884K32423K41470
3143A4130659N30563M35774M17830L32025N67622O61048M29644K33679L86090
3134A8124934J95446n672k36884o514l0513j1017k7065K23930K80674K13263M75527
3123A9196109O14007N92371R42656J216548J083840J295112J279554J169856O61556
3114B8051609l13939j127705j379879j113581r41057n83012m40754k92479m10362
3105B1448841q5489j7928j61033j78946l63039j19129j0292o186L96796L94049
$$ plain form
3174 10744554 10896678 10834634 10938195 10984759 11037174 11190450 11197962 11177950 11127370 11299044 11415196
3163 11415196 11429773 11407191 11472685 11835644 11967553 12054202 12226838 12413773 12436934 12379596
3153 12379596 12530005 12575914 12642969 12735073 12873656 13007129 13362882 13656766 13889189 14130659
3143 14130659 14661222 15096996 15514826 15846851 16414473 17075521 17505165 17738844 18124934
3134 18124934 18320380 18314708 18077824 18071310 18040797 18029780 18002715 18226645 18507319 18720582 19196109
3123 19196109 19810116 20402487 21345143 22561691 23645531 24940643 26220197 27390053 28051609
3114 28051609 27737670 26609965 25230086 24116505 23175448 22592436 22151682 21859203 21448841
3105 21448841 21363352 21345424 21184391 21005445 20642406 20523277 20512985 20506799 20903595 21297644
3095B1297644J5957J67888M69200L50678M19942L72166M97488O75360N07909N85619
3085B5359851N44471O26152O06358O55718P19889J021603J146130J258621J314738
3076C3253531J385711J343620J437697J333412J300451J656191K149891K414572
3068D6275076K576287K495989K941304L357870L528976L892898M779946N165063
3060G5013409N937048O660817Q411504J0083364J1817814J4039111J7419571K2044893
3052A71427531K8074058L2109105L7380977M0510370L1247848J3686034j2108371
3045C42327552n1964809o2440803m4475983l0507133k0917788j5208072j1707887
3038A05105077r982478q294275p326827o323066n482087m602885m393583l475246
$$ plain form
3095 21297644 21313601 21481489 21950689 22301367 22721309 23093475 23590963 24266323 24774232 25359851
3085 25359851 25904322 26530474 27136832 27792550 28512439 29534042 30680172 31938793 33253531
3076 33253531 34639242 35982862 37420559 38753971 40054422 41710613 43860504 46275076
3068 46275076 48851363 51347352 54288656 57646526 61175502 65068400 69848346 75013409
3060 75013409 80950457 87611274 96022778 106106142 117923956 131963067 149382638 171427531
3052 171427531 199501589 231610694 268991671 309502041 340749889 354435923 342327552
3045 342327552 290362743 227921940 183445957 152938824 132021036 116812964 105105077
3038 105105077 95122599 86828324 79501497 73178431 67696344 63093459 58699876 55224630
3030E5224630k943843k425412k022015j567205j757557j423784j380245j325492
3022D0379077j218851j193115j387439j048909j122058r21952r26463p41791m17934
3013C1400565n32176m52433n58551n96793m09234n50015m57741m96027k26261
3004B7121334j09875j79392n4488N278k85243n7318N5472j08824j68612j86252
2994B6032080m9416J12495k15006j26230J31288m049N4357M58342Q6502j3750
2984B6466613K31611L93674N8426J32983J79138K04863K35192J90193J5449J64139
2974B8272281L94144K25818J83346L70094L59865L85736L08353K88377M04594
2965C1192608M16394K47671L49911O11317N64496M87800M54586P07779O48830
$$ plain form
3030 55224630 52280787 49855375 47833360 46266155 44508598 43084814 41704569 40379077
3022 40379077 39160226 37967111 36579672 35530763 34408705 33486753 32560290 31818499 31400565
3013 31400565 30868389 30415956 29857405 29260612 28851378 28301363 27843622 27347595 27121334
3004 27121334 27011459 26832067 26777579 26782857 26497614 26440296 26495768 26386944 26218332 26032080
2994 26032080 25982664 26095159 25880153 25753923 25885211 25881162 25935519 26393861 26480363 26466613
2984 26466613 26698224 27091898 27150324 27283307 27462445 27667308 27902500 28092693 28108142 28272281
2974 28272281 28666425 28892243 29075589 29445683 29805548 30191284 30499637 30788014 31192608
2965 31192608 31609002 31856673 32206584 32817901 33382397 33870197 34324783 35032562 35681392
2956C5681392M89840L37294O42283O81916N76190P88410P98287Q40972R79366
2947D1815950R30770J126432R92452J201274J076639J420130J568295J329330
2939E1461272J721190K117641J953947K042441K350993K305580K417020K287866
2931F8657950K301484K225232K346303K214621K073997K163609K024079K060928
2923H6068203K185572K124544K473590K402360K407843K515281K688930K386844
2915A05253167K225678K267674K048735J843030J546017J585950J470444J240998
2907A19481693J586259J267661J305610J362692J038625R92796P95638Q39797
2899A28670771N53288M02807J9147k85690k98751p14501q69574r35866r62588
$$ plain form
2956 35681392 36171232 36508526 37150809 37832725 38408915 39197325 39995612 40836584 41815950
2947 41815950 42746720 43873152 44865604 46066878 47143517 48563647 50131942 51461272
2939 51461272 53182462 55300103 57254050 59296491 61647484 63953064 66370084 68657950
2931 68657950 70959434 73184666 75530969 77745590 79819587 81983196 84007275 86068203
2923 86068203 88253775 90378319 92851909 95254269 97662112 100177393 102866323 105253167
2915 105253167 107478845 109746519 111795254 113638284 115184301 116770251 118240695 119481693
2907 119481693 121067952 122335613 123641223 125003915 126042540 127035336 127830974 128670771
2899 128670771 129224059 129626866 129646013 129360323 129061572 128347071 127477497 126541631 125579043
2890A25579043j005567r83398r56129j132715r79306j268022j271835j451544
2882A16530527j511881j785741j941280k023682j962401k213993k365490k437557
2874A00288502k515709k412269k665848k701272k544677k745888k549892k738176
2866G9414771k682955k397953k591042k606024k493144k371497k421501k444188
2858E9406467k367847k378972k296370k022779j926855j870127j829004j779391
2850D2935122j666360j469543j533268j353932j105582j192117r66609q78946
2842C2768765o95776n42073r18730p52472l93301o25612n09124o79302l53054
2833B7299321j68837l68515k91318l60890l05795k87364k32012m4180j76877k76112
$$ plain form
2890 125579043 124573476 123590078 122633949 121501234 120521928 119253906 117982071 116530527
2882 116530527 115018646 113232905 111291625 109267943 107305542 105091549 102726059 100288502
2874 100288502 97772793 95360524 92694676 89993404 87448727 84702839 82152947 79414771
2866 79414771 76731816 74333863 71742821 69136797 66643653 64272156 61850655 59406467
2858 59406467 57038620 54659648 52363278 50340499 48413644 46543517 44714513 42935122
2850 42935122 41268762 39799219 38265951 36912019 35806437 34614320 33647711 32768765
2842 32768765 32072989 31530916 30612186 29859714 29466413 28840801 28331677 27652375 27299321
2833 27299321 27130484 26761969 26470651 26109761 25803966 25516602 25284590 25240410 25063533 24787421
2823B4787421j04989q8565k37702q907j09282r1103l20829L46172J52847R844
2813B4334907K20649j3366j98899M3455L00401Q3204J79040J09194M4572J7737
2803B5120894L36014J74379L3694o8779L81927J97530Q5782K22960K57771K73667
2793B7015839J56819L43125K05146L48190K73392K33019K13395K41445N33640
2784B9564010L16967L93997L25683K72163J35636M66616L74697M19994N48832
2775C2818595O37078N98589K96721O10347M83100P43650P82641O68825O06979
2766C8246525O34884J000256J059466Q95879J081203J428007J306536J441558
2758D7094314J137479J274548J699430J762699J802786K070178K299906K521796
$$ plain form
2823 24787421 24682432 24593867 24356165 24347258 24237976 24146873 23826044 24172216 24325063 24334907
2813 24334907 24555556 24542190 24343291 24386746 24687147 24770351 24949391 25058585 25103157 25120894
2803 25120894 25456908 25631287 25664981 25596202 25978129 26175659 26261441 26484401 26742172 27015839
2793 27015839 27172658 27515783 27720929 28069119 28342511 28575530 28788925 29030370 29564010
2784 29564010 29880977 30274974 30600657 30872820 31008456 31475072 31849769 32269763 32818595
2775 32818595 33455673 34054262 34350983 34961330 35444430 36188080 36970721 37639546 38246525
2766 38246525 38881409 39881665 40941131 41837010 42918213 44346220 45652756 47094314
2758 47094314 48231793 49506341 51205771 52968470 54771256 56841434 59141340 61663136
2750F1663136K702844K673864K880117L369547L602215M048467M285044M822582
2742I0047816N271435N842538O275436O986706P908387Q728370R506574J0636604
2734A51203866J1787049J3376069J5001032J6567725J7767658J8927925J9599785
2727B64231109J9048641J7376559J4958615J1061754P091149L570993K01840j983756
2719C35556904l308278l654270l374854l027844k501831j536494j384365j966444
2711C14802524k685687l836656n992917q640084j1596846j4146570j6419109j7775628
2703B33709027j8319068j7828795j6361932j4855727j3541480j2012675j0504615
2696A30284735r395357q452942p526701o761178n909713n273487m721616m406573
$$ plain form
2750 61663136 64365980 67039844 69919961 73289508 76891723 80940190 85225234 90047816
2742 90047816 95319251 101161789 107437225 114423931 122332318 131060688 140567262 151203866
2734 151203866 162990915 176366984 191368016 207935741 225703399 244631324 264231109
2727 264231109 283279750 300656309 315614924 326676678 333767827 337338820 337540660 335556904
2719 335556904 332248626 328594356 325219502 322191658 319689827 318153333 316768968 314802524
2711 314802524 312116837 308280181 302287264 293647180 282050334 267903764 251484655 233709027
2703 233709027 215389959 197561164 181199232 166343505 152802025 140789350 130284735
2696 130284735 120889378 112436436 104909735 98148557 92238844 86965357 82243741 77837168
2688G7837168l813534l507962l259127k817805k625638k415380k428064k242450
2680E4727208j767410j747790j656778j733450j434414j315124j425380j151064
2672D2495798r99361j008859j065454q53757p50062p74294q66830n84492p63966
2663C4828723q77217n08667k75324o28997n40180l12322l49348n78326m57058
2654C0301284l59669l21991l57540l08933j49964l59137j43615j97946j65156
2645B7937333j76777k38507m23529M4165l3153j58752k99922j74209j47901P395
2635B6336143l6773j2229N924N905P4102n0828K03325n0426L2899L01441L22507
2624B7131990K69038O9095L60187J93813Q0304M62157L96840L44135M52231K51792
$$ plain form
2688 77837168 74023634 70515672 67256545 64438740 61813102 59397722 56969658 54727208
2680 54727208 52959798 51212008 49555230 47821780 46387366 45072242 43646862 42495798
2672 42495798 41496437 40487578 39422124 38568367 37818305 37044011 36177181 35592689 34828723
2663 34828723 33951506 33442839 33167515 32538518 31998338 31686016 31336668 30758342 30301284
2654 30301284 29941615 29619624 29262084 28953151 28803187 28444050 28300435 28102489 27937333
2645 27937333 27760556 27522049 27098520 27142685 27109532 26950780 26650858 26476649 26328748 26336143
2635 26336143 26299370 26287141 26293065 26298970 26373072 26322244 26525569 26475143 26508042 26809483 27131990
2624 27131990 27401028 27470123 27830310 28024123 28104427 28566584 28963424 29307559 29759790 30011582
2614C0011582M18859Q00389N68050N52300N85086O23119P27131J042406J051376
2605C6380298O66573J061949R13660R29979R72096R88331J079086Q83998J057635
2596D4933605J055558R84139J313822J329065J450113J477513J343388R45778
2588E4832981O44381P09695P25506O47128N30112O28293O60789O27991N65311
2579F0572187P22812P29500R35558O79197O36598O23621N51312N28141N13191
2570F6492117L40367L94746M23749K93388N77972P88747P85365R99126J178516
2561G2274093J255231J543687J690430J838199J933974K179437K544782K607842
2553H7867675L278884L371920L787295M439232N123246N689635O282184O887711
$$ plain form
2614 30011582 30430441 31230830 31798880 32351180 32936266 33559385 34286516 35328922 36380298
2605 36380298 37046871 38108820 39022480 39952459 40924555 41912886 42991972 43875970 44933605
2596 44933605 45989163 46973302 48287124 49616189 51066302 52543815 53887203 54832981
2588 54832981 55477362 56187057 56912563 57559691 58089803 58718096 59378885 60006876 60572187
2579 60572187 61294999 62024499 62960057 63639254 64275852 64899473 65450785 65978926 66492117
2570 66492117 66832484 67227230 67650979 67944367 68522339 69311086 70096451 71095577 72274093
2561 72274093 73529324 75073011 76763441 78601640 80535614 82715051 85259833 87867675
2553 87867675 91146559 94518479 98305774 102745006 107868252 113557887 119840071 126727782
2545A26727782P606703Q678237R865060J0441531J1220605J1790003J1792446
2538A98122367J1212748J0359634R100635P306728N469754M112533M145509M455975
2530B54285883N203106O205501P187940P967657Q286722Q124789P040923N581983
2522C09884504L369903M08480k586040n660498p622883r460845j0265649j0465303
2514B67601669j0346446r361734q188365p521107o810150o359413o676114o885046
2506B05453294p197806q217500r372839j0533775j1238225j1080613j0908969
2499A36903567j0372252r393464q260895p629142o644261o125408n453376m895268
2491G8129501m402773l897469l647703l310925k893492k765455k574967k266104
$$ plain form
2545 126727782 134334485 143012722 152877782 163319313 174539918 186329921 198122367
2538 198122367 209335115 219694749 228795384 236102112 241571866 245684399 249829908 254285883
2530 254285883 259488989 265694490 272882430 280850087 289136809 297261598 304302521 309884504
2522 309884504 313254407 313662887 311076847 305416349 297793466 288332621 278066972 267601669
2514 267601669 257255223 247893489 239705124 232184017 225373867 219014454 212338340 205453294
2506 205453294 198255488 190037988 180665149 170131374 158893149 147812536 136903567
2499 136903567 126531315 117137851 108876956 101247814 94603553 88478145 83024769 78129501
2491 78129501 73726728 69829259 66181556 62870631 59977139 57211684 54636717 52370613
2483E2370613k183215j802639j876134j727322j475926j519759j549957j376181
2475C8859480j065007j178222j132860j144765j083572q36300p70779p45764q26654
2466C0075557p41127q14174n54546n85375o11524n74891o72230m99516l39291
2457B4682883o40780n99155m15664o78097k50490j71622l46018n40039n21544
2448B0519474m02931l57851k70898j70771l54087l21380k44226l04426l07730
2439A7785174l54479o8570j166l8268j51079O8029j03736j31296N0512K49451
2429A7304572J02180J70071l9184j03660j81071j99216r7409j76742l87633l91073
2419A6000835k24659k14057k80410k78171l61254k26924l10296l39705k47960
$$ plain form
2483 52370613 50187398 48384759 46508625 44781303 43305377 41785618 40235661 38859480
2475 38859480 37794473 36616251 35483391 34338626 33255054 32418754 31647975 30902211 30075557
2466 30075557 29334430 28520256 27965710 27380335 26768811 26193920 25521690 25022174 24682883
2457 24682883 24042103 23442948 23027284 22349187 22098697 21927075 21581057 21041018 20519474
2448 20519474 20116543 19758692 19487794 19317023 18962936 18641556 18397330 18092904 17785174
2439 17785174 17430695 17362125 17360959 17322691 17171612 17239641 17135905 17004609 17055121 17304572
2429 17304572 17406752 17576823 17537639 17433979 17252908 17053692 16956283 16779541 16391908 16000835
2419 16000835 15776176 15562119 15281709 15003538 14642284 14415360 14105064 13765359 13517399
2410A3517399J2295o5077j57779j08911O6503j0211J07104M6457k62183q5439
2400A3060158j9496K11448J48790J24483J33984J36878P0078j51019k59696k02189
2390A3253419m24498m76067l81927m51025m03505k05744m11889j32600l50215
2381A0015949l31630k87188l06081j31768k53839j442j01676l03330N8820m0117
2371H317698j58625j74577j71068r8340m7691j33128j75286j68435K07925o7872
2361G330601k74847k16933k43962p687n1138m7572r645K335p3588J09938r5534
2350F421968r1095j04348o7148k4198l438j21628O9180J27936l8443k4080j21667
2339F023039J4415J90360K04009N5323l41999k13800j81194M9278J15899k01112
$$ plain form
2410 13517399 13529694 13464617 13306838 13197927 13264430 13254219 13361323 13407780 13145597 13060158
2400 13060158 13040662 13252110 13400900 13525383 13659367 13796245 13866323 13715304 13455608 13253419
2390 13253419 12828921 12352854 11970927 11519902 11116397 10910653 10498764 10366164 10015949
2381 10015949 9684319 9397131 9091050 8959282 8705443 8704001 8602325 8298995 8357815 8317698
2371 8317698 8159073 7984496 7813428 7715088 7667397 7534269 7358983 7190548 7398473 7330601
2361 7330601 7055754 6838821 6594859 6587172 6536034 6488462 6478817 6481152 6407564 6517502 6421968
2350 6421968 6330873 6226525 6159377 6135179 6131741 6010113 6079293 6207229 6168786 6144706 6023039
2339 6023039 6037454 6227814 6431823 6487146 6145147 5931347 5750153 5799431 5915330 5714218
2329E714218R0860j6444J02226j03422N3793L1950k3632l4231L0292j06311j09877
2318E629422J30736J1640K3447j11236J44985Q6058j54510k6362N0858l012j7820
2307E764206j57917Q0268L9544R8319M9610j08569k6529Q1171n5520Q0766N7970
2296E903319n6229J97905J61532l09q6077n3535O8034K5547R4881L8568l0358
2285F263278l0872J82085o5893l569J07621j31131J25604J50845M0185j12886
2275F525267R7029j34464K29871J93979L470p624n6776K06794K3780k11242M9245
2264F919329Q0411J01894R8327j2653M8366O7767L1809n2554j83343Q0272k7716
2253G151909J83630J87866J15934j44298K58793J98995L5133K56488J63838J24938
$$ plain form
2329 5714218 5805078 5788634 5890860 5787438 5841231 5873181 5849549 5815318 5845610 5739299 5629422
2318 5629422 5760158 5771798 5795245 5684009 5828994 5915052 5760542 5734180 5785038 5782026 5764206
2307 5764206 5606289 5686557 5726101 5824420 5874030 5765461 5738932 5820103 5764583 5845349 5903319
2296 5903319 5847090 6044995 6206527 6206218 6120141 6066606 6134640 6160187 6255068 6293636 6263278
2285 6263278 6232406 6414491 6348598 6345029 6452650 6321519 6447123 6597968 6638153 6525267
2275 6525267 6622296 6487832 6717703 6911682 6915152 6907528 6850752 7057546 7081326 6870084 6919329
2264 6919329 6999740 7101634 7199961 7187308 7235674 7303441 7335250 7282696 7099353 7179625 7151909
2253 7151909 7335539 7523405 7639339 7495041 7753834 7952829 7987962 8244450 8408288 8533226
2243H533226K4829M6873J08864J16400Q9751J61071L44970L17130J13155J48556
2233A0004825K61803K06901q7926K19882K76226K88771J74969L38735J69237L8867
2223A1892290J62622L52433R0128K28642L50472J46006K43756K87259J00118L08873
2213A4162599L46623K01729K40954K41340K68619J69165K10750K82046M28953
2204A6552778L03237L15264N73673M28278O9676L04514M10046K45193K42846K77872
2194A9723377L50838N64031M13081M10725M89332M96945L75064O38610P87927
2185B4249930L90794N25145N53239P76501P18077P14979P80849O23000P58414
2176C0090928Q60612O38562L64814L53203N05060N20544M87241M05676L78616
$$ plain form
2243 8533226 8558055 8604928 8713792 8830192 8919943 9081014 9425984 9743114 9856269 10004825
2233 10004825 10266628 10473529 10385603 10605485 10881711 11170482 11345451 11684186 11853423 11892290
2223 11892290 12054912 12407345 12497473 12726115 13076587 13222593 13466349 13753608 13853726 14162599
2213 14162599 14509222 14710951 14951905 15193245 15461864 15631029 15841779 16123825 16552778
2204 16552778 16856015 17171279 17744952 18173230 18242906 18547420 18957466 19202659 19445505 19723377
2194 19723377 20074215 20638246 21051327 21462052 21951384 22448329 22823393 23462003 24249930
2185 24249930 24640724 25165869 25719108 26495609 27213686 27928665 28709514 29332514 30090928
2176 30090928 30951540 31590102 31954916 32308119 32813179 33333723 33820964 34226640 34605256
2167C4605256L65458M70030K98096K73602M55516N62548N09237P45398P79223
2158C9064364Q56729P42790Q22516R56584J135884J305849J542174J523210J722213
2149D9672313J810250J625923K058231K219326K310996K557205K544870K715439
2141F7514553L212149L624051L855053M116028M593214N438217N676676O209314
2133A04239255P028832P991801R156629J0615891J2095986J3715160J5533697
2126A80377251J8029851K0814145K3762797K5405788K5699575K3245079J6626118
2119C33960604N741563q256039k0957403k8393362k8628020k4710327j9889715
2112B08867301j5584771j2210629r746545p587028n988276m403140l060251j935833
$$ plain form
2167 34605256 34970714 35440744 35738840 36012442 36467958 37030506 37539743 38285141 39064364
2158 39064364 39921093 40663883 41486399 42442983 43578867 44884716 46426890 47950100 49672313
2149 49672313 51482563 53108486 55166717 57386043 59697039 62254244 64799114 67514553
2141 67514553 70726702 74350753 78205806 82321834 86915048 92353265 98029941 104239255
2133 104239255 111268087 119259888 128416517 139032408 151128394 164843554 180377251
2126 180377251 198407102 219221247 242984044 268389832 294089407 317334486 333960604
2119 333960604 339702167 331446128 310488725 282095363 253467343 228757016 208867301
2112 208867301 193282530 181071901 171325356 163738328 157750052 153346912 150286661 148350828
2104A48350828n75097M86067J438727L457089M490504O038938P200748R094665
2096A79982469J1145617J3160290J5613668J8352401K0587214K1610701K0904676
2089C01357036J6580947P863847m375535j8003224k8194880l1740947k9231811
2082B14255433k4873273k0169017j6367800j3741972j1771810j0307655r068092
2075A07955814p707256o920690o205260n371055m631465m136031l593224l100228
2067F6290605k791433k660807k616160k412195k208138k132508k085484k225800
2059D7158080k093673j556031j646917j511695j360318j226735j211747j247267
2051C5303697j063628p57495r19632q42773r79214q96850q39453q48753o31479
$$ plain form
2104 148350828 147775731 148261798 149700525 153157614 157648118 163687056 170887804 179982469
2096 179982469 191128086 204288376 219902044 238254445 258841659 280452360 301357036
2089 301357036 317937983 325801830 321426295 303423071 275228191 243487244 214255433
2082 214255433 189382160 169213143 152845343 139103371 127331561 117023906 107955814
2075 107955814 100248558 93327868 87122608 81751553 77120088 72984057 69390833 66290605
2067 66290605 63499172 60838365 58222205 55810010 53601872 51469364 49383880 47158080
2059 47158080 45064407 43508376 41861459 40349764 38989446 37762711 36550964 35303697
2051 35303697 34240069 33482574 32562942 31720169 30740955 29844105 29004652 28155899 27524420
2042B7524420k76939n40220o54178k16149l76068l74712m63928n43108l02482
2033B3776636n31962m80504m33751n32254n83757l85050m59144k63018k36406
2024A9870790l99834k13482j26073j43063k20952n76327m41283q7619l83620m58274
2014A6820263l50896m24231m41351l42384j84656l49459k59162j21688k68373
2005A4078063k61050k23054j92529l1009j56257j54919r0948N1531k72512j72876
1995A2574440j56984j927j02606l9590o3399o1569j23108o7028m46062j04276
1985A1407891j03388l57831j79261k00433k76694j39466m0016k54489k94149k85302
1975I276862j51116l7899k60937k02765j50791p1777N2756J1157Q3886q4594j46691
$$ plain form
2042 27524420 27247481 26707261 26053083 25836934 25460866 25086154 24622226 24079118 23776636
2033 23776636 23244674 22764170 22330419 21798165 21214408 20829358 20370214 20107196 19870790
2024 19870790 19470956 19257474 19131401 18988338 18767386 18191059 17749776 17662157 17278537 16820263
2014 16820263 16469367 16045136 15603785 15261401 15076745 14727286 14468124 14346436 14078063
2005 14078063 13817013 13593959 13401430 13370421 13214164 13059245 12968297 13019828 12747316 12574440
1995 12574440 12417456 12415529 12312923 12273333 12209934 12148365 12025257 11958229 11512167 11407891
1985 11407891 11304503 10946672 10767411 10566978 10290284 10150818 10110802 9856313 9562164 9276862
1975 9276862 9125746 9087847 8826910 8624145 8473354 8401577 8454333 8465490 8549376 8464782 8318091
1964H318091o9268p8758k15758j13277N901L7589N1848J66585r4302J5743L164
1953H027558j3320m0479Q2625l2361M973l1618J25552P830J10474j54576p4904
1942H011754j4474J47222J29172J12440J7428q651J03874K39145K59561Q5323
1932I082794J63337N9456O7182K27841L24819K92245M07549M18426L15495M55346
1922A1814490N82396L81459K99558M55890M59828M19343R3008q2977j05530O6097
1912A4383562m3933j60451k19991j99727k44615j40312n0743k36324j98779j76645
1902A2712042m7055k62827j72313o5276Q4031N203N1439K65401J44037J33926
1892A2848608L33473N71295O18527P92564O41707O44510R08290P88857J034992
$$ plain form
1964 8318091 8248823 8170065 7954307 7841030 7846931 7884520 7936368 8102953 8008651 8024394 8027558
1953 8027558 8014238 7973759 8056384 8024023 8028996 7997378 8122930 8130760 8241234 8086658 8011754
1942 8011754 7997280 8144502 8273674 8386114 8403542 8394891 8498765 8737910 8997471 9082794
1932 9082794 9246131 9305587 9372769 9600610 9925429 10217674 10625223 11043649 11359144 11814490
1922 11814490 12396886 12778345 13077903 13533793 13993621 14412964 14505972 14422995 14317465 14383562
1912 14383562 14339629 14179178 13959187 13759460 13514845 13374533 13323790 13087466 12888687 12712042
1902 12712042 12664987 12402160 12229847 12164571 12248602 12253805 12305244 12570645 12714682 12848608
1892 12848608 13182081 13753376 14371903 15164467 15806174 16450684 17358974 18147831 19182823
1883A9182823J101571R97991J183413R69236N90843M06159J52377k44888m20995
1874B3918530r18830r25688r42191o28284m87975n76624n95345q04724q96513
1865A7142356r61219j075036j096041o97990l48312m32232m04256o3247k72520
1856A1791503l2229R6519Q8959p4501K46436K34651J13281M85476M88898L05927
1846A3744920M96453N88508N36701O17541L69852K90923J30099p8974k63801l95529
1836A6036693m45954l90686m29531p12208k62944m95278n04412p55938m67342
1827A1572400m82506m44451l96899n03388k52225k85626k64056j34526o1081k05332
1817H542310L7332j35825j8559r4253l26487l13529j52866j31354q7678j53405
$$ plain form
1883 19182823 20284394 21282385 22465798 23435034 24025877 24432036 24584413 24339525 23918530
1874 23918530 22999700 22074012 21131821 20503537 20015562 19438938 18843593 18038869 17142356
1865 17142356 16181137 15106101 14010060 13312070 12963758 12531526 12127270 12064023 11791503
1856 11791503 11759274 11855793 11944752 11870251 12116687 12351338 12464619 12950095 13438993 13744920
1846 13744920 14241373 14829881 15366582 15984123 16353975 16644898 16774997 16696023 16432222 16036693
1836 16036693 15590739 15200053 14770522 14058314 13795370 13300092 12795680 12039742 11572400
1827 11572400 11089894 10645443 10248544 9745156 9492931 9207305 8943249 8808723 8747642 8542310
1817 8542310 8579642 8443817 8425258 8331005 8004518 7690989 7538123 7406769 7319091 7165686
1807G165686l85669k28164k06228j02824j45549j62256j92452j52896Q8888l440
1797E675096n3541K6100J50865J14664o5541P4036Q2149J7704P8998P4292J15276
1786F290098J62063J29391j36269j40792j16939k05796k24701n2938l11242j19324
1776E273551k85694k69798r5071k34198q0055M4516j26416q6739n0689k38370
1766C851037o889o9572m6154J20353j0634o7140M5892k27524j29788q4594q9386
1755C285601m0555J5648Q2766j22832M8877k36954k71723J2355m1698J38309p9768
1744B790026j72692j39399j06269J16834K5224j36215j83474J2897J66128m3170
1734B329890o6440K0608J1182j11088o047j55996j9854L3606j18639J04685j54628
$$ plain form
1807 7165686 6780017 6551853 6345625 6242801 6097252 5934996 5742544 5589648 5678536 5675096
1797 5675096 5621555 5647655 5798520 5913184 5847643 5921679 6003828 6021532 6100530 6174822 6290098
1786 6290098 6452161 6581552 6445283 6304491 6187552 5981756 5757055 5704117 5392875 5273551
1776 5273551 4987857 4718059 4622988 4388790 4308735 4353251 4226835 4140096 4089407 3851037
1766 3851037 3844148 3774576 3728422 3848775 3838141 3771001 3816893 3589369 3459581 3374987 3285601
1755 3285601 3245046 3260694 3343460 3220628 3269505 3032551 2760828 2773183 2731485 2869794 2790026
1744 2790026 2617334 2477935 2371666 2488500 2513724 2377509 2194035 2206932 2373060 2329890
1734 2329890 2263450 2284058 2295240 2184152 2178105 2022109 2002255 2035861 1917222 2021907 1867279
1723A867279Q8330l2077l14066l6042K80259m4787j22807j57000K8596j2876q9981
1712A454828m8098j13653k7603J9443N9545m137J55168N3822o3293k3529r1673
1701A370820J4779j88997M679j9k6038M3307N1494j14014j5497o002j28967N8811
1689A064356Q1407j7496L338K8988J1257K20233l606j21570k3347L2380n3708
1678A222232N9600P0657n138j98013K3927m1667m8578M0957j59548J10399O1569
1667A136397k70710K3820p2924J59332o149J48944M8986r9973R4075L6916j06819
1656A091895k54958J39883J09919o9649P9970K5188r064k30095q7121P6315N7202
1645I29485l585Q4038Q8988L0708k3481P6135J0161k03671m0998j91960l7892
$$ plain form
1723 1867279 1955609 1923532 1609466 1573424 1853683 1808896 1686089 1529089 1557685 1544809 1454828
1712 1454828 1406730 1293077 1265474 1284917 1344462 1340325 1495493 1549315 1486022 1462493 1370820
1701 1370820 1385599 1196602 1201281 1201262 1175224 1218531 1270025 1156011 1140514 1134512 1005545 1064356
1689 1064356 1145763 1128267 1131605 1160593 1171850 1392083 1388477 1266907 1243560 1275940 1222232
1678 1222232 1281832 1352489 1347351 1149338 1173265 1131598 1083020 1123977 964429 1074828 1136397
1667 1136397 865687 889507 816583 975915 969766 1118710 1167696 1067723 1161798 1198714 1091895
1656 1091895 836937 976820 1086739 1017090 1097060 1122248 1113184 883089 795968 872283 929485
1645 929485 925900 1009938 1098926 1129634 1106153 1182288 1192449 988778 947780 755820 717928
1634G17928L2578r2268K70555j0675j77455k4366J30819L8825p4954L4958P7625
1623I23570j91593j10294O4562J54677Q0546M6615K63364k469N7359m4600K1557
1612A263294n2884j71615j11109N9541j6512P8244Q741j08849n9211J37976K43088
1601A270704R1205j47048p1247o3776J15571p9762p7642k2781K24722j2805J33241
1590A360382j42640k1023j7347q5133P0451J16943r2371O569J60695j11883J04790
1579A349433N8355J16437k39508m2039J71372J09080j17697k2533K22312O3600
1569A668812J06230M480j9302J21438j00337N2823J19078j25148R6098J41121
1559B065293j0576J45073J8708J30383k314j40983J03826J21386J69656R6876
$$ plain form
1634 717928 750506 658238 928793 918118 740663 716297 847116 885941 810987 845945 923570
1623 923570 731977 621683 686245 840922 921468 968083 1231447 1228978 1286337 1241737 1263294
1612 1263294 1210410 1038795 927686 987227 970715 1048959 1057700 948851 889640 1027616 1270704
1601 1270704 1361909 1214861 1143614 1079838 1195409 1115647 1038005 1015224 1239946 1227141 1360382
1590 1360382 1217742 1196719 1179372 1094239 1164690 1281633 1189262 1195831 1356526 1244643 1349433
1579 1349433 1407788 1524225 1284717 1242678 1414050 1523130 1405433 1382900 1605212 1668812
1569 1668812 1775042 1779522 1760220 1881658 1781321 1834144 1953222 1828074 1924172 2065293
1559 2065293 2054717 2199790 2218498 2348881 2346567 2205584 2309410 2430796 2600452 2697328
1549B697328n6993K80605J68608L5920K8057K81574J60475q7787J51558K01973
1539C861318o2723J85921K32801J80945l32518n4155K55198K3839m4258P6459
1529D322827N8512k2940M0970M3267J21664J09453J82337K45693J47756K33310
1519E482849J53699P6385L75526K80242K87373j16390J11937P5757N9555j9238
1509F767695m8699K35909K50265j08468K40054K68060j3407r9096q4042l4853
1499G373418m5907q4079Q9030J70103l2641k22039J8150n0705L0970L36692J90234
1488G773226M4967p7305J22529J41409J60858K78966K85446k2059M16150K47383
1478I371570L41758J73448J36775j82519l10816k19177l76444j68144O1066k54120
$$ plain form
1549 2697328 2640335 2920940 3089548 3125468 3153525 3435099 3595574 3507787 3659345 3861318
1539 3861318 3798595 3984516 4217317 4398262 4065744 4011589 4266787 4290626 4246368 4322827
1529 4322827 4381339 4358399 4399369 4442636 4564300 4673753 4856090 5101783 5249539 5482849
1519 5482849 5636548 5712933 6088459 6368701 6656074 6539684 6651621 6727378 6786933 6767695
1509 6767695 6718996 6954905 7205170 7096702 7336756 7604816 7591409 7492313 7408271 7373418
1499 7373418 7327511 7243432 7332462 7502565 7469924 7247885 7266035 7215330 7246300 7582992 7773226
1488 7773226 7818193 7740888 7863417 8004826 8165684 8444650 8730096 8708037 9124187 9371570
1478 9371570 9713328 9886776 10023551 9841032 9530216 9311039 8934595 8766451 8827517 8573397
1468H573397j61177j43539j52905j39732k26748P2711l01053j01451j62183N9180
1458G316500P1476n8694j54201j18800l5185q9431m6875j53766J21647k04855
1448F647816O5055K04768o2947L2578R1752L5871J76216J92373J78971p8305k8206
1437G455942n1147l69922j52217k98517m44070l63864j8696j62767l26047m67096
1427D801599l55275n4840N993j22586k00296m7045r244J395J80883O4640j17162
1416D148062k52925r4414j33490j21529k69408m7418j02489p0468j2378P4002
1406C117545l7584l9624j16957o1196J58822L1216r5715k99741j72402N1304Q0136
1395B615804k80360l06762m1669j05259j45131j90608m3407J76800r5422j93054
$$ plain form
1468 8573397 8412220 8268681 8115776 7976044 7749296 7822007 7520954 7419503 7257320 7316500
1458 7316500 7387976 7329282 7175081 7056281 7021096 6931665 6884790 6731024 6852671 6647816
1448 6647816 6712871 6917639 6854692 6887270 6979022 7014893 7191109 7383482 7562453 7484148 7455942
1437 7455942 7404795 7034873 6882656 6584139 6140069 5776205 5757509 5594742 5268695 4801599
1427 4801599 4446324 4391484 4397477 4274891 4074595 4027550 4018306 4019701 4200584 4265224 4148062
1416 4148062 3895137 3800723 3667233 3545704 3276296 3228878 3126389 3055921 3043543 3117545
1406 3117545 3079961 3040337 2923380 2862184 3021006 3052222 2956507 2656766 2484364 2535668 2615804
1395 2615804 2335444 2028682 1987013 1881754 1736623 1546015 1502608 1679408 1583986 1390932
1385A390932j01440q5328Q4096J87842j07772k6567j36128M8942r2509j77655
1375I84413j6505M1118j28294n6725J17214n1619j33477L0488j01117M2135L09181
1364A036812j2304j71204j40085N5505L0519j54183j41145J14610l0814l9363
1354E48348O2826K5977n5469p819P9502m2975j98176J2233R5832m5705r877m0881
1342D23816J7081N5585m3259O0560M3941k79946j3849K00211J7552r4757M5377
1331D32312o1745M9905Q7356j31097j53669j18356K00748j48222o6898J70970
1321B61304P7761J10721p4941j34077j05549j1762n5377J79144j6323M4453N9130
1310C34484l10333J69977J61381j653N3413o9316L9573L1L7447j81648j17401
$$ plain form
1385 1390932 1289492 1204164 1288260 1476102 1368330 1341763 1205635 1254577 1162068 984413
1375 984413 967908 1009026 880732 824007 941221 889602 756125 786613 685496 727631 1036812
1364 1036812 1024508 853304 713219 768724 799243 645060 503915 618525 587711 548348
1354 548348 611174 637151 581682 573863 653365 610390 412214 424447 520279 474574 464697 423816
1342 423816 440897 496482 453223 513783 557724 277778 263929 464140 481692 386935 432312
1331 432312 370567 420472 507828 376731 223062 104706 305454 157232 90334 261304
1321 261304 339065 449786 374845 240768 135219 123457 68080 247224 230901 275354 334484
1310 334484 24151 194128 355509 353856 407269 337953 377526 377557 415004 233356 115955
1299A15955K1921J18365O3898j4320M0801J3587j48724O4201J06938j86513K4680
1288B20789n8568M0107J7105k6258r692r8832p1209J6371O4220M2996P0147j4162
1276A93014J5219J12499M2447k6368J08971O7252k40175l0381M6509j7953m8250
1265B22784j04054J23169L7610j38023j23539J28146M4225o2622o0510M1852k9172
1254G9866J38504O6773j75522N5585K24947R2090N1396j04781j01982m2052J1012
1243B95836J80773R4112j818j60640K4523j39849L5662J63798j29658j52033m0986
1232A69720R8650N8351m086P2312j33116l1238J44557j72584k6801K05417k14901
1221A66281j3408m3662J7239K00308J15977q5565j25879k7012m7159j0303o3008
$$ plain form
1299 115955 137876 256241 320139 305819 346620 360207 211483 275684 382622 196109 220789
1288 220789 162221 202328 219433 193175 183483 84651 13442 29813 94033 137029 207176 193014
1276 193014 208233 320732 363179 336811 445782 513034 272859 242478 288987 271034 222784
1265 222784 118730 241899 279509 141486 17947 146093 190318 127696 67186 109038 79866
1254 79866 218370 285143 109621 165206 390153 482243 533639 428858 326876 284824 295836
1243 295836 476609 570721 568903 408263 432786 292937 328599 492397 362739 210706 169720
1232 169720 268370 326721 322635 394947 261831 230593 375150 202566 175765 381182 166281
1221 166281 152873 109211 126450 326758 442735 357170 231291 204279 157120 146817 83809
1210H3809k1548J02677J76826K1998j69056P388Q5183N2916q3677k06162j7540
1199C2814j06323J96710J65551j80895O888P4284J6713j07387R3764K01464o7700
1188C25883j07960M6611L4988j93041j13472J78432J04862P0201k09611N1993
1178A88886O007R4619J00085p2929l7714O5429p5435o5567Q4229j2606N7369N0353
1166C82726j34354n2128J01758M9771j09663q2935L1178n0262p5147O9381R9382
1155B29707q5593P4280O6147j18007j56468K04088Q5923n5125j07711J45166l3378
1144B49029k1837Q098q6127J09981Q1393j98488n3448m4722o441m6549J00736
1133I1625K7091N7603P8377r1352l9265J03658J20355J58244l10260l2369J51010
$$ plain form
1210 83809 62261 164938 341764 363762 194706 202094 287277 340193 256516 50354 32814
1199 32814 -73509 123201 288752 107857 114745 189029 205742 98355 192119 393583 325883
1188 325883 217923 264534 299522 106481 -6991 171441 276303 346504 136893 188886
1178 188886 194893 289512 389597 316668 278954 344383 268948 203381 287610 275004 332373 382726
1166 382726 248372 196244 298002 347773 238110 155175 186353 136091 60944 130325 229707
1155 229707 144114 218394 284541 166534 10066 214154 300077 244952 137241 282407 249029
1144 249029 227192 235290 149163 259144 340537 142049 88601 43879 37438 -9111 91625
1133 91625 118716 176319 254696 163344 124079 227737 348092 506336 196076 163707 314717
1122C14717j33768J8254J24325J6741P7425M0382p2471N2450K5538K4875R3995
1111E82463k48318k04043K4508Q7365J31411n5857l2722L1813n2628O9735Q7014
1100D20741p0789R9274J49781j86178j47404j615P7896J41935p7172j6803J34366
1089E24032m5816j48449J27561J42240M6728j38039J3858o0984K7629N0348J6905
1078E56013j19058m7634J7953J1832l1193J41571J63652J22789k26002l5035m971
1067E49917j9496K27281N2918j21446j79490M9473J79986R9773M4849J32713J22576
1056A139054j46120J1553j3896k3906R7187J07143k3899M6669q1363J57845N6330
1045A326597J11934M8650m8843j72417J08411P564r4813K22892j05504j58072
$$ plain form
1122 314717 180949 199203 323528 340269 417694 458076 385605 438055 463593 488468 582463
1111 582463 334145 130102 154610 241975 373386 317529 284807 316620 263992 333727 420741
1100 420741 349952 449226 599007 412829 265425 263810 341706 483641 406469 389666 524032
1089 524032 478216 329767 457328 599568 646296 508257 522115 461131 488760 539108 556013
1078 556013 436955 389321 407274 419106 387913 529484 693136 815925 589923 554888 549917
1067 549917 530421 757702 810620 689174 509684 559157 739143 838916 883765 1016478 1139054
1056 1139054 992934 1004487 990591 966685 1063872 1171015 1147116 1193785 1112422 1270267 1326597
1045 1326597 1438531 1487181 1438338 1265921 1374332 1381896 1287083 1509975 1404471 1246399
1035A246399Q4548J07521J5201K79969j39173J9964q913j13859k02335n1279J73511
1024A411554J58529n1779m785L2311J50369J43786J7642J14795J52920j8026j01074
1013B006242l1266P7667J75063M7084L1755J46832P259P2308P7918K6058K03060
1002B839980o754P2039K65859J70740Q0741J69355K60283J70757p2525M4022K1966
991D016463L62328J92532L59828K85815K01187K98214M51698P68360K70934N12014
981G719373N64537O28209O59134O40248O42081P88923O32493Q03555J073818J343594
971A5495965J506256K030023K329270L052447L709966M461349N224743O111704
963D3921723O481348M671440J936960k304909q903348r783597o904870m852956
$$ plain form
1035 1246399 1330947 1438468 1453669 1733638 1594465 1614429 1605516 1491657 1289322 1238043 1411554
1024 1411554 1570083 1518304 1513519 1545830 1696199 1839985 1857627 1972422 2125342 2107316 2006242
1013 2006242 1974976 2052643 2227706 2274790 2306545 2453377 2460636 2532944 2610862 2636920 2839980
1002 2839980 2833226 2905265 3171124 3341864 3422605 3591960 3852243 4023000 3950475 3994497 4016463
991 4016463 4378791 4571323 4931151 5216966 5418153 5716367 6168065 6936425 7207359 7719373
981 7719373 8283910 8912119 9571253 10211501 10853582 11642505 12274998 13078553 14152371 15495965
971 15495965 17002221 19032244 21361514 24413961 28123927 32585276 37810019 43921723
963 43921723 50403071 55074511 57011471 54706562 45803214 36019617 29114747 24261791
955B4261791l340959k551057j741795j634561j492557j326412r41054p19043n80432
946I933921o46132l82381o29770o59271m73941m58744o00255l53979l54799k08725
936E165924k97619j35798m21780k55128J2948j35048l05404k05806N8537j95686
926C285140k90005r6237r1690k25070k6113R3589j24433k62525j58276m4220k9353
915B030807k0344j03774J3682J6988o3151J0563l2460j88153p6880J80277j3018
904A754537l05760p5157J7155r1840r1966j25303N2032K814J05448O5400k16297
893A091063k112K5123j37027J59104l1642k26796n6713K96173p1569k54374p5751
882G15479L947P8142l1432k5380m3009n1013K74598n6831q6900j84087k5753J57500
$$ plain form
955 24261791 20920832 18369775 16627980 14993419 13500862 12174450 11233396 10514353 9933921
946 9933921 9287789 8905408 8275638 7616367 7142426 6683682 6083427 5729448 5374649 5165924
936 5165924 4868305 4732507 4310727 4055599 4068547 3933499 3628095 3422289 3480826 3285140
926 3285140 2995135 2898898 2807208 2582138 2556025 2649614 2525181 2262656 2104380 2060160 2030807
915 2030807 2010463 1906689 1920371 1937359 1874208 1884771 1852311 1664158 1587278 1767555 1754537
904 1754537 1448777 1373620 1390775 1298935 1206969 1081666 1133698 1136512 1241960 1307360 1091063
893 1091063 1088951 1114074 977047 1136151 1104509 877713 821000 1117173 1045604 791230 715479
882 715479 719426 797568 766136 740756 697747 646734 921332 864501 777601 593514 567761 725261
870G25261j45261j28893L7438O6602N5530q1618j44696L04616J74440r6540l6137
859G30742k54225J39194P2558k79693N8367J6754M1951r1557J55481l6418R5959
848F49113O0529j28657m027j28532M022p1494Q8046P0725l8429j29199m0635j805
836C29657j27275M5872J6774M125k7934j31640P1411K69641q9272L8680N2737
825D52776o4626o8175j31520j07332J34158J57598j47194J2405k0256l8661K7338
814B06511L960N2955O6590j1946j39512J3045J15070j5345k27316K04517Q0927
803C49456o8833k91043J4425R4203j84666O7190J79227L2526r945J16005j9668
792B78877M9247P2610j52178j14455n2161k33244j02077K36339N6026R8093K7001
$$ plain form
870 725261 580000 451107 488545 555147 610677 529059 384363 688979 863419 766879 730742
859 730742 476517 615711 688269 408576 466943 483697 525648 434091 589572 553154 649113
848 649113 709642 580985 576958 448426 452448 380954 469000 539725 501296 372097 331462 329657
836 329657 202382 248254 265028 269153 241219 109579 180990 450631 361359 400039 452776
825 452776 388150 319975 188455 81123 215281 372879 225685 238090 217834 179173 206511
814 206511 210471 263426 330016 318070 178558 191603 306673 291328 64012 268529 349456
803 349456 280623 -10420 4005 98208 -86458 -19268 159959 192485 182540 298545 278877
792 278877 328124 400734 248556 134101 81940 -151304 -253381 -17042 38984 137077 164078
781A64078q7603R0993R0023N75p7939k01666n1391J68574J40047q9194j12589
770C3908P4710m3186N426q9170j40009M2800k5103o5108K10288l4870L0577J71217
758A71480J25861j41709N0457r1521m7190j00861J29797R130j38986q7308Q8773
747c2077R686j67013j20177j0336J05330J55810J54773O8221k0021j10331N0039
736H3904J36330M1528O5326j91491k23490J48929j86697o6868R1444J2841N958
725h2286J54167j08866j02502j6800r451R7175o4354j823J6793Q7960L4353L1110
713C5476K2270L4868m9579j8371P5657m987j58428J40674r3627k31122J36904
702a10265r780Q7860J16557r432L5348j35790N7924O6465k5368r1353K8986K11184
$$ plain form
781 164078 76475 167468 257491 258066 180127 -21539 -72930 95644 235691 146497 33908
770 33908 108618 65432 70858 -18312 -158321 -115521 -140624 -205732 4556 -30314 263 171480
758 171480 297341 155632 206089 114568 67378 -33483 96314 105444 -33542 -120850 -32077
747 -32077 -22391 -189404 -309581 -319917 -214587 -58777 95996 164217 144196 33865 83904
736 83904 220234 261762 327088 135597 -87893 61036 -125661 -192529 -101085 -88244 -82286
725 -82286 71881 -36985 -139487 -156287 -165738 -68563 -132917 -134740 -117947 -29987 4366 35476
713 35476 57746 92614 43035 24664 100321 95334 -63094 77580 -16047 -247169 -110265
702 -110265 -120045 -32185 84372 74940 110288 -25502 32422 98887 73519 -17834 11152 222336
690B22336j16971j78044p5367N489J8367L0510K01175J93039m5160n0160k90480
679h5266M8987J05777r9352J8267P134J34008q5546J3650q268k04447J50168M0266
667C5378j03138m5946J36442j33215J00263o0031m9021r883J26226J38127J25382
656B60584r4617R9595m0885o0074j97596j18422n5191L5425J73922m2569M0035
645B07j62090K37451M2822j13320J14815j07164r7341J51695O1335j6248l21448
634b09286L9564M8051Q6224P8113L1859p3864j5592P3675j68836j40604L922k8260
622b75034O4373J98149J25142p4605L9895j98139O9833J51993j33667m0599p8726
611a51385L4100K07756P2971k48005J6226P2969M7695o6346m3886J27803j24896
$$ plain form
690 222336 105365 -72679 -148046 -142557 -124190 -93680 107495 300534 255374 205214 -85266
679 -85266 -36279 69498 -29854 -11587 -4453 129555 44009 57659 49391 -155056 -4888 35378
667 35378 -67760 -113706 22736 -110479 -10216 -70247 -119268 -129151 -2925 135202 260584
656 260584 165967 265562 224677 164603 -32993 -151415 -206606 -171181 2741 -39828 207
645 207 -161883 75568 118390 5070 119885 12721 -84620 67075 128410 112162 -209286
634 -209286 -169722 -121671 -35447 42666 74525 661 -14931 58744 -110092 -250696 -246774 -275034
622 -275034 -210661 -12512 112630 38025 77920 -120219 -50386 101607 -32060 -72659 -151385
611 -151385 -117285 90471 163442 -84563 -68337 4632 52327 -14019 -57905 69898 -54998
600e4998j21405j3874J87930m3695r9756k384k71785o2217K22396J28130M4859
589h6799l2608l9117o0574J60931J39065n2284J48890j75817n7373o5584m7041
578a68311j6615J41236J2561P9739j87579j89277J74448j71079J50330J29224
568d5323J24379N8038L4730q9012q6914J05524j6142j80741o3136L47004k7201
557A61206j30592j51380j65121K43975R0672j73246j47523J35455n3026m5359
547b34939J59865o7600L5837K04457k7131k28793o2955o0407m9299k1821J03228
536b49558J26416R5256o1716M7184K7706n9464r7308p2035m7116Q6668P9402K3378
524a01187Q7452M0103j19344j38602N6426L1038o1190j01012N6802K6245K44347
$$ plain form
600 -54998 -176403 -190277 -2347 -46042 -145798 -148182 -419967 -482184 -259788 -131658 -86799
589 -86799 -119407 -158524 -219098 -58167 80898 28614 177504 1687 -55686 -121270 -168311
578 -168311 -184926 -43690 -31129 48610 -138969 -328246 -153798 -324877 -174547 -45323
568 -45323 79056 137094 171824 82812 -4102 101422 85280 -95461 -158597 188407 161206
557 161206 30614 -120766 -285887 -41912 48760 -124486 -272009 -136554 -189580 -234939
547 -234939 -75074 -142674 -106837 97620 70489 -158304 -221259 -281666 -330965 -352786 -249558
536 -249558 -123142 -27886 -89602 -42418 -14712 -74176 -171484 -243519 -290635 -203967 -124565 -101187
524 -101187 -13735 26368 -92976 -231578 -175152 -144114 -205304 -306316 -249514 -223269 21078
513B1078J51833r4981l7471O9911q1802j09820j96864K81037m8817j55090J32426
502f8560q7242K6425J14932l7142r9535J27661q4120p3622J70168k498k9790j07180
490a50503j65566M4219J38557O5017P9581j81833l5154n3876R5172l179L1364
479a36201K03668j31636J3218K6496q9979o9559O4624J20400N8524o5277j29441
468a35163j198O3841R440m3905l8517l5575n6440l0386M3195Q8267m1726q697
456a86864l4351Q5422r116P5153J47565j572j32964k11127N6132J64099j52067
445a99690R6632J66409L7668j09958j69134J3952M906j12238J18200m36j13060
434b66749K05764J4510l6978Q2790l321l6420l9012J16872r884K3080K5933J2277
$$ plain form
513 21078 172911 77930 40459 110370 28568 -81252 -278116 2921 -45896 -200986 -68560
502 -68560 -155802 -129377 -14445 -51587 -151122 -23461 -107581 -181203 -11035 -13533 -43323 -150503
490 -150503 -316069 -271850 -133293 -68276 11305 -170528 -205682 -259558 -164386 -167565 -136201
479 -136201 67467 -64169 -50951 -24455 -114434 -183993 -119369 1031 59555 -5722 -135163
468 -135163 -136361 -72520 -63080 -106985 -145502 -181077 -237517 -267903 -224708 -136441 -178167 -186864
456 -186864 -221215 -135793 -144909 -69756 77809 76237 -56727 -267854 -211722 -47623 -199690
445 -199690 -103058 63351 101019 -8939 -178073 -164121 -159215 -271453 -153253 -153689 -266749
434 -266749 -60985 -46475 -83453 -663 -3984 -40404 -79416 37456 27572 50652 76585 88862
422H8862k8891o9636j26630m599J69240J35679l22660k876J66760j85802O2133
411a18420N0346j71021o1906J62075O8852o0906n1838n5252o3024K75568j50014
400a75540j59047L5773j94218J63150O1198K5501K45275r9826p323J25362j27633
389a07328o4301n408J1878Q920J29460M1970j42006l7486J56863M9825P1528j40897
377b6982j09772n3082n2881J57514o1299P1483K8260K7269r9728n7047O5182J8758
365i2325j00754o5847j9245o3086k9804O3858L8427R6502j45059M6678J50284
354a20371J65013r2166k44625K22032m1686k13312J15204J08301M5804p2282j05727
343b33815L15484J06413k13779o5721o1314m2414J1696L4764m4043k2861K13791
$$ plain form
422 88862 59971 -9665 -136295 -140894 28346 164025 -158635 -161511 5249 -180553 -118420
411 -118420 -68074 -239095 -301001 -138926 -70074 -130980 -182818 -238070 -301094 -25526 -175540
400 -175540 -334587 -298814 -493032 -329882 -268684 -243183 2092 -97734 -105057 20305 -107328
389 -107328 -171629 -177037 -165159 -156239 -26779 15191 -126815 -164301 -7438 42387 113915 -26982
377 -26982 -136754 -189836 -242717 -85203 -146502 -75019 -46759 -19490 -119218 -176265 -111083 -92325
365 -92325 -193079 -258926 -278171 -341257 -371061 -307203 -268776 -172274 -317333 -270655 -120371
354 -120371 44642 -47524 -292149 -70117 -111803 -325115 -209911 -101610 -55806 -128088 -233815
343 -233815 81669 188082 -25697 -91418 -152732 -195146 -183450 -148686 -192729 -215590 -1799
332a799o7455n8866q9311L2798l7620l047o8527O0666J25519o0722K163Q3091
320h3110p5353O104M0570p6383r7617L2882p502O1963Q7805j23973j2743j50388
308c97745L3498P7209k4476j2127J49751p5977O8597l9675N8353N303J39871k1645
296c9063j25460l4316K842k6760J0299J11177l526j51530K2660J31080P1090R9091
284F7584j33347q4034j18157K3317K19514m7623j08000l8974M1069J3534N251
273a59866n1617l1848j24771J66691J67651q5427k02653j25897O3572p8574k0299
262d83038J15553K08870J24020k7390j86338K0696q4693k45L32p0325J14416j8135
250b86277n878K6929p9590O6572J84965k5873K6437q2215n9606j82584p4273K85818
$$ plain form
332 -1799 -69254 -128120 -217431 -184633 -222253 -225300 -293827 -233161 -107642 -168364 -166201 -83110
320 -83110 -158463 -152359 -111789 -188172 -285789 -252907 -260409 -198446 -110641 -234614 -247357 -397745
308 -397745 -364247 -287038 -311514 -323641 -173890 -249867 -181270 -220945 -162592 -157289 -17418 -39063
296 -39063 -164523 -198839 -195997 -222757 -212458 -101281 -104807 -256337 -233677 -102597 -31507 67584
284 67584 -65763 -149797 -267954 -244637 -25123 -72746 -180746 -219720 -178651 -165117 -159866
273 -159866 -211483 -243331 -368102 -201411 -33760 -119187 -321840 -447737 -384165 -462739 -483038
262 -483038 -367485 -158615 -34595 -61985 -248323 -227627 -312320 -312565 -312233 -382558 -268142 -286277
250 -286277 -292155 -265226 -344816 -278244 -93279 -119152 -92715 -174930 -234536 -417120 -491393 -205575
238b05575o1882J95992j53201j3133k42999J10348J54605k7126L7572l1225q1477
227c18101L3072j41o9901J13884R2519o8915j8191J0870n48m6005j41746K3681
215c89522q599n1452K13590n7424M8520K08704L083q2027j72042Q3960P0390Q2533
203e0286l4044j26801j00958q4544j04171K77872n6153n0504J31525q6679k5633
192c10376R5610J2233K002k447j5214L0655J07481r43P7990n9414j48986Q6021
$$ plain form
238 -205575 -267457 -71465 -224666 -237799 -480798 -370450 -215845 -242971 -205399 -236624 -318101
227 -318101 -285029 -285170 -355071 -241187 -148668 -217583 -235774 -224904 -225452 -271457 -413203 -389522
215 -389522 -398121 -449573 -235983 -293407 -244887 -36183 -33100 -115127 -287169 -203209 -132819 -50286
203 -50286 -84330 -211131 -312089 -396633 -500804 -222932 -279085 -329589 -198064 -284743 -310376
192 -310376 -214766 -202533 -200531 -202978 -218192 -187537 -80056 -80999 -3009 -62423 -211409 -125388
$$ [...]
##END NTUPLES=NMR SPECTRUM
##END=
