##TITLE=1H_EC-3248x
 DMSO,8 sc, 
 10.03.2021
##JCAMPDX= 6.0         $$ Bruker NMR JCAMP-DX V2.0
##DATA TYPE= NMR SPECTRUM
##DATA CLASS= NTUPLES
##ORIGIN= UXNMR, Bruker Analytische Messtechnik GmbH
##OWNER= root
$$ XWIN-NMR		Version 3.5
$$ Wed Mar 10 10:50:43 2021 Russian Standard Time (UT+4h)  she@DPX200
##.OBSERVE FREQUENCY= 200.131506
##.OBSERVE NUCLEUS= ^1H
##.ACQUISITION MODE= SIMULTANEOUS
##.ACQUISITION SCHEME= undefined
##.AVERAGES= 8
##.DIGITISER RES= 18
##SPECTROMETER/DATA SYSTEM= spect
##.PULSE SEQUENCE= zg30
##.SOLVENT NAME= DMSO
##.SHIFT REFERENCE= (INTERNAL, DMSO, 0, 15.9958)
##AUDIT TRAIL= $$ (NUMBER, WHEN, WHO, WHERE, WHAT)
$$ ##TITLE= Audit trail, XWIN-NMR		Version 3.5
$$ ##JCAMPDX= 5.01
$$ ##ORIGIN= Bruker BioSpin GmbH
$$ ##OWNER= she
$$ F:/spectra/data/she/nmr/H-F/1/pdata/1/auditp.txt
$$ ##AUDIT TRAIL=  $$ (NUMBER, WHEN, WHO, WHERE, WHAT)
(   1,<2021-03-10 10:49:35.32 +0400>,<she>,<DPX200>,
      <created by zg, POWCHK disabled, PULCHK disabled
       configuration hash MD5:
       00 E9 B6 7A A2 85 ED C7 34 08 36 98 17 FE 4E 26
       data hash MD5: 16K
       16 BE 55 47 FD C9 83 25 95 F0 E5 43 AF DA 96 4D>)
(   2,<2021-03-10 10:49:40.17 +0400>,<she>,<DPX200>,
      <Start of raw data processing
       efp BC_mod = 2 LB = 0.24 FT_mod = 6 PKNL = 1 PHC0 = -11119.62 PHC1 = 9.800941 SI = 16K 
       data hash MD5: 16K
       7C 51 78 E0 7A E6 D5 4A 87 B4 EE C3 2B 17 E7 17>)
(   3,<2021-03-10 10:49:59.85 +0400>,<she>,<DPX200>,
      <pk PHC0 = 0.05981904 PHC1 = -0.4000005 
       data hash MD5: 16K
       72 78 D1 87 45 31 E3 A4 E6 8B 70 68 C5 9D 97 14>)
(   4,<2021-03-10 10:50:02.84 +0400>,<she>,<DPX200>,
      <abs ABSG = 5 
       data hash MD5: 16K
       99 9E EC E9 66 1B DC D6 49 A0 B3 21 B0 78 DB BA>)
$$ ##END=
$$ 
$$ hash MD5
$$ F6 F0 8F 88 39 4A A4 05 0C 17 77 35 0E B1 B4 5A
##$RELAX= 
##$RELAX= 
##$RELAX= 
##$RELAX= 
##$RELAX= 
##$RELAX= 
$$ Bruker specific parameters
$$ --------------------------
##$DU= <F:/spectra>
##$EXPNO= 1
##$NAME= <H-F>
##$PROCNO= 1
##$TYPE= <nmr>
##$USER= <she>
##$AMP= (0..31)
100 100 100 100 100 100 100 100 100 100 100 100 100 100 100 100 100 100 
100 100 100 100 100 100 100 100 100 100 100 100 100 100 
##$AQSEQ= 0
##$AQ_mod= 1
##$AUNM= <au_zg>
##$AUTOPOS= <>
##$BF1= 200.13
##$BF2= 200.13
##$BF3= 200.13
##$BF4= 200.13
##$BF5= 200.13
##$BF6= 200.13
##$BF7= 200.13
##$BF8= 200.13
##$BYTORDA= 1
##$CFDGTYP= 0
##$CFRGTYP= 5
##$CHEMSTR= <none>
##$CNST= (0..31)
1 1 145 1 1 1 1 1 1 1 1 1 1 1 1 1 1 1 1 1 1 1 1 1 1 1 1 1 1 1 1 1 
##$CPDPRG= <>
##$CPDPRG1= <>
##$CPDPRG2= <>
##$CPDPRG3= <>
##$CPDPRG4= <mlev>
##$CPDPRG5= <mlev>
##$CPDPRG6= <mlev>
##$CPDPRG7= <mlev>
##$CPDPRG8= <mlev>
##$CPDPRGB= <>
##$CPDPRGT= <>
##$D= (0..31)
0 1.2 0 0 0 0 0 0 0 0.06 0 0.03 0 0 0 0 0.0002 0 0 0 0 0 0 0 0 0 0 0 0 
0 0 0 
##$DATE= 1615358974
##$DBL= (0..7)
120 120 120 120 120 120 120 120 
##$DBP= (0..7)
150 150 150 150 150 150 150 150 
##$DBP07= 0
##$DBPNAM0= <>
##$DBPNAM1= <>
##$DBPNAM2= <>
##$DBPNAM3= <>
##$DBPNAM4= <>
$$ [...]
##$SUBNAM3= <"">
##$SUBNAM4= <"">
##$SUBNAM5= <"">
##$SUBNAM6= <"">
##$SUBNAM7= <"">
##$SUBNAM8= <"">
##$SUBNAM9= <"">
##$SW= 16.9725357007746
##$SWIBOX= (0..15)
0 0 2 0 0 0 0 0 0 0 0 0 0 0 0 0 
##$SW_h= 3396.73913043478
##$TD= 16384
##$TD0= 1
##$TE= 0
##$TE2= 300
##$TE3= 300
##$TEG= 300
##$TL= (0..7)
0 120 120 120 120 120 120 120 
##$TP= (0..7)
150 150 150 150 150 150 150 150 
##$TP07= 0
##$TPNAME0= <>
##$TPNAME1= <>
##$TPNAME2= <>
##$TPNAME3= <>
##$TPNAME4= <>
##$TPNAME5= <>
##$TPNAME6= <>
##$TPNAME7= <>
##$TPOAL= (0..7)
0.5 0.5 0.5 0.5 0.5 0.5 0.5 0.5 
##$TPOFFS= (0..7)
0 0 0 0 0 0 0 0 
##$TUNHIN= 0
##$TUNHOUT= 0
##$TUNXOUT= 0
##$USERA1= <user>
##$USERA2= <user>
##$USERA3= <user>
##$USERA4= <user>
##$USERA5= <user>
##$V9= 5
##$VALIST= <valist>
##$VCLIST= <CCCCCCCCCCCCCCC>
##$VD= 0
##$VDLIST= <DDDDDDDDDDDDDDD>
##$VPLIST= <PPPPPPPPPPPPPPP>
##$VTLIST= <TTTTTTTTTTTTTTT>
##$WBST= 1024
##$WBSW= 4
##$XGAIN= (0..3)
0 0 0 0 
##$XL= 0
##$YL= 0
##$YMAX_a= 176194
##$YMIN_a= -180832
##$ZGOPTNS= <>
##$ZL1= 120
##$ZL2= 120
##$ZL3= 120
##$ZL4= 120
##$ABSF1= 15.99578
##$ABSF2= -0.9768839
##$ABSG= 5
##$ABSL= 3
##$ALPHA= 0
##$AQORDER= 0
##$ASSFAC= 0
##$ASSFACI= 0
##$ASSFACX= 0
##$ASSWID= 0
##$AUNMP= <proc_1d>
##$AZFE= 0.1
##$AZFW= 0.1
##$BCFW= 0
##$BC_mod= 2
##$BYTORDP= 0
##$COROFFS= 0
##$CY= -3
##$DATMOD= 1
##$DC= 0
##$DFILT= <>
##$DTYPP= 0
##$F1P= 0
##$F2P= 0
##$FCOR= 1
##$FTSIZE= 16384
##$FT_mod= 6
##$GAMMA= 0
##$GB= 0
##$INTBC= 1
##$INTSCL= 2.992141e-10
##$ISEN= 128
##$LB= 0.24
##$LEV0= 0
##$LPBIN= 0
##$MAXI= 10000
##$MC2= 0
##$MEAN= 0
##$ME_mod= 0
##$MI= 1.114404
##$NCOEF= 0
##$NC_proc= -8
##$NLEV= 6
##$NOISF1= 3.799351
##$NOISF2= 2.8
##$NSP= 0
##$NTH_PI= 0
##$NZP= 0
##$OFFSET= 15.99578
##$PC= 1
##$PHC0= -11119.56
##$PHC1= 9.400941
##$PH_mod= 1
##$PKNL= yes
##$PPARMOD= 0
##$PSCAL= 0
##$PSIGN= 0
##$REVERSE= no
##$SF= 200.130003134212
##$SI= 16384
##$SIGF1= 3
##$SIGF2= 2
##$SINO= 5.538805
##$SIOLD= 16384
##$SREGLST= <1H.CDCl3>
##$SSB= 0
##$STSI= 16384
##$STSR= 0
##$SW_p= 3396.73913043479
##$SYMM= 0
##$S_DEV= 0
##$TDeff= 16384
##$TDoff= 0
##$TI= <>
##$TILT= no
##$TM1= 0
##$TM2= 0
##$TOPLEV= 0
##$USERP1= <user>
##$USERP2= <user>
##$USERP3= <user>
##$USERP4= <user>
##$USERP5= <user>
##$WDW= 1
##$XDIM= 16384
##$YMAX_p= 417437570
##$YMIN_p= -1253111
$$ End of Bruker specific parameters
$$ ---------------------------------
##NTUPLES= NMR SPECTRUM
##VAR_NAME=  FREQUENCY,     SPECTRUM/REAL,   SPECTRUM/IMAG
##SYMBOL=    X,             R,               I
##VAR_TYPE=  INDEPENDENT,   DEPENDENT,       DEPENDENT
##VAR_FORM=  AFFN,          ASDF,            ASDF
##VAR_DIM=   16384,         16384,           16384
##UNITS=     HZ,            ARBITRARY UNITS, ARBITRARY UNITS
##FACTOR=    0.207333158178282, 1,           1
##FIRST=     3201.235499763, 0,              0
##LAST=      -195.503630671794, 0,           0
##MIN=       -195.503630671794, -1253111,    0
##MAX=       3201.235499763, 417437570,      0
$$ Real data points
##PAGE= N=1
##DATA TABLE= (X++(R..R)), XYDATA
$$ [...]
5455B079483j47395J20840j62073n4301K34791k4940j70583K63978L68537j77941
5445B330396k68649k1163K60719m8030M33683M10814J6312j42043o7010m99430
5435B405599P5020L92702L68726j74753n87241k24617K87171j32956P7394K92364
5425B779409J17617Q8377J34929N07374L28667k19955j75614j82831k6923N98448
5415C949498J03245n80617K06649P380j73174r8798J55846K48316J03784K09538
5405D131667J49514k53803K07235J35635L51801K00910j61393K30593K35686J11763
5395E339608j3815J33737K34167j11124J00474M44607L60657j73086J2595L43136
5385F670956J21174L89832l85824N67559L34561P0835L08391L19909K87193j48795
$$ y = [2079483, 1932088, 2052928, 1890855, 1836554, 2071345, 2046405, 1875822, 2139800, 2508337, 2330396, 2061747, 2040584, 2301303, 2253273, 2686956, 3097770, 3114082, 2972039, 2905029, 2405599, 2480619, 2873321, 3242047, 3067294, 2480053, 2255436, 2542607, 2409651, 2487045, 2779409, 2897026, 2985403, 3120332, 3627706, 3956373, 3736418, 3560804, 3377973, 3351050, 3949498, 4052743, 3472126, 3678775, 3686155, 3512981, 3414183, 3570029, 3818345, 3922129, 4131667, 4281181, 4027378, 4234613, 4370248, 4722049, 4922959, 4761566, 4992159, 5227845, 5339608, 5325793, 5459530, 5693697, 5582573, 5683047, 6127654, 6488311, 6315225, 6327820, 6670956, 6792130, 7181962, 6796138, 7363697, 7698258, 7769093, 8077484, 8397393, 8684586, 8535791]
5375H535791M58317M19070M73676N37259J07863O2178P67863J47013R35236P60138
5365A3204404O47308M71985K96091P58337O08912J112582O38244P68542M90916
5356A8997321Q08571P11933O58779N96748K04575O63148K86337K91864N51615
5347B3770891J96551O00955M93917j22837m300m33017m44759k18981O9118J59729
5337B4067267k25778j42268M075m90387l22335O8399k41075r56838l70350n83591
5327B0807119r71582l96846q86991p16132k59594m14675n46749q66044L2020n48518
5317A5232008k95374K59723l51906K7032J47096J99229l7031J9298k25100j95588
5307A4779387O63202K65371M92942J31572L73824N22132M13695Q5548J14835R13847
$$ y = [8535791, 8994108, 9413178, 9886854, 10424113, 10531976, 10594154, 11362017, 11509030, 12444266, 13204404, 13851712, 14323697, 14619788, 15378125, 15987037, 17099619, 17737863, 18506405, 18997321, 19805892, 20517825, 21176604, 21773352, 21977927, 22641075, 22927412, 23219276, 23770891, 23967442, 24568397, 25062314, 24939477, 24935177, 24502160, 24057401, 23838420, 23907538, 24067267, 23841489, 23699221, 23703296, 23212909, 22890574, 22958973, 22717898, 21761060, 21390710, 20807119, 19835537, 19438691, 18551700, 17835568, 17575974, 17161299, 16614550, 15748506, 15780526, 15232008, 14936634, 15196357, 14844451, 14871483, 15018579, 15217808, 15180777, 15200075, 14974975, 14779387, 15442589, 15707960, 16200902, 16332474, 16706298, 17228430, 17642125, 17727673, 17842508, 18756355]
5297A8756355R63272R90298P03165N94817J183149J463756M78746P84193R94355
5288B6912106J093312J261351J350524Q70295J072896N70203R25805O49659R03884
5279C5610035N5641k94472q0641M32666r8429m3305o61763l68096l66372o65474
5269C3519790l76346m91196j73398k01686j030365j044187p25709j098448p63442
5260B7615013n42131j332993j096465o75337j037978j159151j138682q74598q53427
5251A8904251j091189j178423n35583m17886p65069j037746k00814k67835q93390
5242A2516316m25017n7593l60960q07732m12077r0456l86771l68702M22639n73087
5232I456560m34498k27762k29659j76993m70046M0294m36118j5064k25399j29543
$$ y = [18756355, 19719627, 20709925, 21413090, 22007907, 23191056, 24654812, 25133558, 25917751, 26912106, 28005418, 29266769, 30617293, 31487588, 32560484, 33130687, 34056492, 34706151, 35610035, 35665676, 35371204, 35290563, 35723229, 35624800, 35581495, 34919732, 34551636, 34185264, 33519790, 33143444, 32652248, 32478850, 32277164, 31246799, 30202612, 29476903, 28378455, 27615013, 27072882, 25739889, 24643424, 23968087, 22930109, 21770958, 20632276, 19757678, 18904251, 17813062, 16634639, 16099056, 15681170, 14916101, 13878355, 13677541, 13409706, 12516316, 12091299, 12033706, 11672746, 10865014, 10452937, 10362481, 9975710, 9607008, 10029647, 9456560, 9022062, 8794300, 8564641, 8387648, 7917602, 7957896, 7521778, 7506714, 7281315, 7151772]
5222G151772k43261j98156J94918P0954l45347M33239n20334k21921k37919p6716
5212F007229N84207L08735p65604J38857M25206k28392k22317J42682j04929N5896
5202F341570l89634k94293J59275K5797r2532K78141j08544r8947K7927k25688
5192E623072m33926N35902m26237l79344j875K9844N85660j08914p8472J88965
5182E534675n3355r6914O44886k77792L9071K05492k93783L64K56878M09166l8330
5171F330358j97717K35145L4777q1798l90385K44770M11552L07169j70557J01439
5161F824753n45339M93702J36644q2474j3469J02770J79328o9013P1429j2464
5151G085867n1731J27115L66521L30567P7947j35815J73851Q06861n30495K28338
$$ y = [7151772, 6908511, 6710355, 6905273, 6976227, 6630880, 7064119, 6543785, 6321864, 6083945, 6007229, 6591436, 6900171, 6134567, 6273424, 6698630, 6470238, 6247921, 6390603, 6285674, 6341570, 5951936, 5657643, 5816918, 5842715, 5750183, 6028324, 5919780, 5820833, 5848760, 5623072, 5189146, 5725048, 5298811, 4919467, 4917592, 4947436, 5533096, 5424182, 5345710, 5534675, 5481320, 5384406, 6029292, 5751500, 5790571, 5996063, 5702280, 5702644, 5959522, 6368688, 6330358, 6132641, 6367786, 6402563, 6320765, 5930380, 6175150, 6586702, 6893871, 6723314, 6824753, 6279414, 6773116, 6909760, 6827286, 6813817, 6916587, 7095915, 7026902, 7098331, 7085867, 7034136, 7161251, 7527772, 7858339, 7936286, 7800471, 7974322, 8781183, 8250688, 8479026]
5141H479026P68395K37852j01881m20054L26285K56419Q79912J6191N4599K58640
5131A0755384K3586k09336j1233M55542K38455k10818J6504K30440N67462m244
5121A1851742O04964N10454L79492M76217K9501N15487K53428K81635N12875O15595
5111A6031390l473N81448O21474J16306Q63798K46293R380N38843Q76155M25649
5101B0307263R58878L01137N21420R66600P24313N65000M93511J361650R50362
5092B7150134J136695Q20364N88680J288897J763746R45436J314888J634779J675763
5083C8319382J429841J633245K070539J359924J504684J916243K015066J595267
5075E1844191J862761K529817J779463J992660J462172J334104J617129J448763
$$ y = [8479026, 9247421, 9485273, 9383392, 8963338, 9289623, 9546042, 10425954, 10442145, 10496744, 10755384, 10778970, 10569634, 10558401, 11013943, 11252398, 11041580, 11058084, 11288524, 11855986, 11851742, 12456706, 12967160, 13346652, 13822869, 13852370, 14367857, 14621285, 14902920, 15415795, 16031390, 16027917, 16609365, 17230839, 17347145, 18210943, 18457236, 18466616, 19005459, 19881614, 20307263, 21266141, 21567278, 22088698, 23055298, 23779611, 24344611, 24838122, 26199772, 27150134, 28286829, 29107193, 29695873, 30984770, 32748516, 33693952, 35008840, 36643619, 38319382, 39749223, 41382468, 43453007, 44812931, 46317615, 48233858, 50248924, 51844191, 53706952, 56236769, 58016232, 60008892, 61471064, 62805168, 64422297, 65871060]
5067F5871060O27891J138370R12495R31447M24957K86970K4953k66120M53830
5058G0405853J59564O15964q4980n9085O37706M14581Q7114P898R27331J040775
5048G4152721Q63345J408677J473539J348550J139133J916423K072026J641356
5040H6015770J258653K224252J791621J195847J531859J368969Q46139J123076
5032I7356186J39975K7511k79469q60285j566259j693951j563532k464150k610307
5023H6485719j916855k146527k633946k059648j658553j636963j560768j356109
5015G1516350j352239j117993k41068m09534m13110k00927j25560m1280j29861
5006F7484778k74875M41184j2745q9326k83698m26646o95174q12130n86141n44252
$$ y = [65871060, 66498951, 67637321, 68549816, 69481263, 69906220, 70193190, 70218143, 69952023, 70405853, 70565417, 71181381, 71096401, 71037316, 71675022, 72089603, 72176717, 72184615, 73111946, 74152721, 75016066, 76424743, 77898282, 79246832, 80385965, 82302388, 84374414, 86015770, 87274423, 89498675, 91290296, 92486143, 94018002, 95386971, 96233110, 97356186, 97496161, 97523672, 97244203, 96383918, 94817659, 93123708, 91560176, 89096026, 86485719, 84568864, 82422337, 79788391, 77728743, 76070190, 74433227, 72872459, 71516350, 70164111, 69046118, 68805050, 68395516, 67982406, 67781479, 67655919, 67614639, 67484778, 67209903, 67651087, 67638342, 67549016, 67265318, 66838672, 66143498, 65331368, 64745227, 64200975]
4996F4200975r88198k241151j315823j611348j386228j819087j777506j906324
4988E1155310j730330k102733j049779j790517j267356r93565j222771r94647
4980D0003612r83078q90746r25443n09852p08510m67500q93127p12604n48356
4971C3364396m53641o85541j250712r35093r43865n96564m99552p25985p52958
4962B6520485r38209q79460j550572j109247k77124n59951j230001n46639n64647
4953A8864635o98823k2178q14440j090236n20004m96681m34216l74931k84587
4944A4128539l58627m48371q83516j62322k60534j61609l37234k21814n19170
4935A0775342l095q6033n36371m65237n37646L4821L65886p98722n53977l58936
$$ y = [64200975, 63212777, 60971626, 59655803, 58044455, 56658227, 54839140, 53061634, 51155310, 49424980, 47322247, 46272468, 44481951, 43214595, 42221030, 40998259, 40003612, 39020534, 38129788, 37204345, 36694493, 35985983, 35518483, 34625356, 33912752, 33364396, 32910755, 32225214, 30974502, 30039409, 29095544, 28498980, 27999428, 27273443, 26520485, 25582276, 24702816, 23152244, 22042997, 21765873, 21205922, 19975921, 19429282, 18864635, 18165812, 18143634, 17329194, 16238958, 15718954, 15222273, 14788057, 14413126, 14128539, 13769912, 13321541, 12438025, 12275703, 12015169, 11853560, 11516326, 11294512, 10775342, 10772247, 10686214, 10149843, 9684606, 9146960, 9181781, 9547667, 8748945, 8194968, 7836032]
4925G836032j88285K84259l3118k38942q3343K52867P3198m42573k25548j73478
4915G061069j65142j10736k65116k33916j61787j78831j8784L23747k73734j29764
4905E847006J79730l99332K0335J33634m76307j18403j06176P5534K01376J00527
4895E457924n43221j48040l74713k74404L1822J33055K86769Q2132j24536k57807
4885D268981j6176L03379L2954K7370n04851r2122K98085J82630Q0763k54729
4875D326284m13843J12096J8936m10943J26336k08572K83490L12862l28869m52929
4865C364848J30025J86241N7306J8942k57004J52939l87253P1900j01942l012
4855C232990J35438l6586O5691K77928m93873K32063m4859Q4476l41026K48493
$$ y = [7836032, 7647747, 7932006, 7898888, 7659946, 7576603, 7829470, 7902668, 7460095, 7234547, 7061069, 6895927, 6785191, 6520075, 6286159, 6124372, 5945541, 5926757, 6250504, 5976770, 5847006, 6026736, 5627404, 5647739, 5781373, 5305066, 5186663, 5080487, 5156021, 5357397, 5457924, 4914703, 4766663, 4391950, 4117546, 4149368, 4282423, 4569192, 4651324, 4526788, 4268981, 4252805, 4556184, 4589138, 4616508, 4111657, 4019535, 4317620, 4500250, 4581013, 4326284, 3912441, 4024537, 4043473, 3632530, 3758866, 3550294, 3833784, 4146646, 3817777, 3364848, 3494873, 3681114, 3738420, 3757362, 3500358, 3653297, 3266044, 3337944, 3236002, 3232990, 3368428, 3331842, 3397533, 3675461, 3181588, 3413651, 3368792, 3453268, 3112242, 3360735]
4845C360735j39664l84611J99893m1999j21616k12558m05720O7522N09033J14423
4835B945438J77071j78605j93995j0999P9022L33507l21353n78389N0069k50614
4825B051152N03416j3753K7059k90149j02958K01561j61677L07054J77829j05948
4815B593586j39863n5720N74654k49117m30926K35407M68270j22399K86528k05133
4805B955287l77486p55618k59022J82871L21957P9200J28967J72490j32243n6560
4795B259843k29901J48015o3003n03811J51396J45814J12466J45231j93473k10109
4785A762468L74610j12083J51068j26751j34778K259P7613N0417K51612j12463
4775B183972J8773R9367J06935k64798K60950j40623Q6536L01925l63969Q876
$$ y = [3360735, 3221071, 2836460, 3036353, 2994354, 2872738, 2660180, 2254460, 2321982, 2831015, 2945438, 3122509, 2943904, 2749909, 2738910, 2817932, 3151439, 2830086, 2251697, 2301766, 2051152, 2554568, 2540815, 2567874, 2277725, 2174767, 2376328, 2214651, 2521705, 2699534, 2593586, 2453723, 2398003, 2972657, 2723540, 2292614, 2528021, 2996291, 2873892, 3160420, 2955287, 2577801, 1822183, 1563161, 1746032, 2067989, 2147189, 2276156, 2448646, 2316403, 2259843, 2029942, 2177957, 2114954, 1611143, 1762539, 1908353, 2020819, 2166050, 1972577, 1762468, 2137078, 2024995, 2176063, 2049312, 1914534, 1916793, 1994406, 2044823, 2296435, 2183972, 2202745, 2302112, 2409047, 2144249, 2405199, 2264576, 2351112, 2653037, 2289068, 2297944]
4765B297944m03854k08077K29161j56736J32277J96401m24753J6480L81646j5615
4755B044874k6385K57027k05758l47011N3131R9004j32640L53208K06099J17523
4745B419072r03839m2204M86483M13574j63579k01050O303M40386k14443j22791
4735B117912k09568J08512K90411K90114N5138n17073l94027O78834k11230M3153
4725B252176p5525J27847l17031m05802M70531M97317M89432n17071m71891j36654
4715A913329j15320M24920J0186J89899m084J54764m2373K2546M03079k68464
4705B688482N4002J58510R7255J77574m13145J31292M19715m00706j97559l22864
4695B392556K0777K52062O4663k73969M41069J03700p7135J95k51423j96455K7743
$$ y = [2297944, 1894090, 1686013, 1915174, 1758438, 1890715, 2087116, 1662363, 1678843, 2060489, 2044874, 2018489, 2275516, 2069758, 1722747, 1775878, 1874882, 1742242, 2095450, 2301549, 2419072, 1515233, 1473029, 1959512, 2373086, 2209507, 2008457, 2014760, 2455146, 2240703, 2117912, 1908344, 2016856, 2307267, 2597381, 2652519, 2135446, 1741419, 2420253, 2209023, 2252176, 2176651, 2304498, 1987467, 1581665, 2052196, 2549513, 3038945, 2521874, 2049983, 1913329, 1798009, 2222929, 2233115, 2423014, 2418930, 2573694, 2531321, 2553867, 2956946, 2688482, 2742484, 2900994, 2998249, 3175823, 2762678, 2893970, 3313685, 2912979, 2715420, 2392556, 2413333, 2665395, 2730058, 2456089, 2897158, 3000858, 2923723, 2923918, 2672495, 2476040, 2503783]
4684B503783M58727J79789k08280J16132L496K703P5824o24237l16829M49801
4674B640909M89864j9941R4854O51481j41504o8758K2224K1515q5953k32849J22819
4663C494661k71635q4393N54402J81867M0175q1232j29199k26984J19916L77124
4653C974702k11416M1112R9155j60758M23209k6402M15185k12724k1930M1840
4643D361973J62358p0905O1307K66677J66965j2305K61625k86945j60347j38643
4633D611760k57547K19972M27922L17014k08870J44534J14551N74845R510Q8419
4623F042110K24438q9575k11890O89794K67346n49555J91575M29954J70208J08240
4613G272645J12590M20325R665k5897K04468P26324L19059k27233Q95417K99914
$$ y = [2503783, 2962510, 3142299, 2934019, 3050151, 3053647, 3056350, 3132174, 2507937, 2191108, 2640909, 3130773, 3110832, 3205686, 3857167, 3715663, 3646905, 3669129, 3690644, 3604691, 3371842, 3494661, 3223026, 3138633, 3693035, 3874902, 3915077, 3833845, 3704646, 3477662, 3597578, 3974702, 3763286, 3804398, 3903553, 3742795, 4166004, 4139602, 4554787, 4342063, 4320133, 4361973, 4524331, 4453426, 4514733, 4781410, 4948375, 4936070, 5197695, 4910750, 4750403, 4611760, 4354213, 4574185, 5002107, 5319121, 5110251, 5254785, 5369336, 5944181, 5953691, 6042110, 6266548, 6176973, 5965083, 6654877, 6922223, 6372668, 6564243, 6994197, 7164405, 7272645, 7385235, 7805560, 7815225, 7789328, 7993796, 8720120, 9039179, 8811946, 9707363, 10007277]
4603A0007277l19945L71290N25537P4931M26226K04892N15628O74993j32098J14589
4593A2463320K20976N68191O57383O26078j51009P0925O52042L56724K21567j17796
4583A5568401M29201L47509M86141P14026M54065R1242n1780M44350O20310L75360
4573A9478825M17355Q12647j35425J89296J62978O66412L91821J84508L29146
4564B2497563R8814j16937o4017q2382Q0864K80515k97036k39706j7748p0957
4554B2068973j49270O06522j19249m90005l74699k30157Q04103L86615J31230
4545B2634063j84807r0550M70948q0715K34553K01548O22872J52861J41060N82335
4535B4684168l63509R4359M68651l88851J12746O67849J27486j02571N21054P0382
$$ y = [10007277, 9687332, 10058622, 10584159, 10659090, 11085316, 11290208, 11805836, 12480829, 12348731, 12463320, 12684296, 13252487, 13909870, 14535948, 14384939, 14455864, 15107906, 15464630, 15686197, 15568401, 15997602, 16345111, 16831252, 17545278, 17999343, 18090585, 18038805, 18483155, 19103465, 19478825, 19896180, 20708827, 20573402, 20762698, 20925676, 21592088, 21983909, 22168417, 22497563, 22596377, 22479440, 22415423, 22333041, 22413905, 22694420, 22397384, 22157678, 22139930, 22068973, 21919703, 22526225, 22406976, 21916971, 21542272, 21312115, 22116218, 22502833, 22634063, 22449256, 22358706, 22829654, 22748939, 22983492, 23185040, 23807912, 23960773, 24101833, 24684168, 24320659, 24415018, 24883669, 24494818, 24607564, 25275413, 25402899, 25300328, 25821382, 25891764]
4525B5891764j61620m26546K53476J41790j90744J28832M22933J36345J190L67071
4515B6564491N89874O80550M62063K77777l6141K15898K64094j73565l15479K68618
4505B8798180m31408J16495k60261m23868n27640o40807m03211o52668p02098
4496B4872714j87277o66778j59654m13052n65438o31098l98847n57502o08010
4487B0685058m89535M2119k48195p01879n57449k75371q3725n96082q38708p80559
4477A6155674o70254n72813n77699m57862j89315p47896m58412l40036k73332
4468A1868055l03662k40710n44386k74183n33451j23915l18531m27220n39200
4459H562797r0745k5598k45266m73889m44332k51575O0239m20332L6889K20103
$$ y = [25891764, 25730144, 25303598, 25557074, 25698864, 25508120, 25636952, 26059885, 26196230, 26197420, 26564491, 27154365, 27834915, 28296978, 28574755, 28538614, 28754512, 29018606, 28845041, 28529562, 28798180, 28366772, 28483267, 28223006, 27799138, 27271498, 26630691, 26227480, 25574812, 24872714, 24685437, 24018659, 23859005, 23445953, 22880515, 22249417, 21850570, 21293068, 20685058, 20195523, 20237642, 19989447, 19287568, 18730119, 18454748, 18371023, 17774941, 16936233, 16155674, 15485420, 14912607, 14334908, 13877046, 13687731, 12939835, 12481423, 12141387, 11868055, 11564393, 11323683, 10779297, 10505114, 9971663, 9847748, 9529217, 9101997, 8562797, 8472052, 8446454, 8201188, 7727299, 7282967, 7031392, 7091631, 6671299, 6708188, 6928291]
4449F928291J6019n77446j59278J11153j01400j12153k48524k75269l15485O313
4439E272221P1180l03246k85809K56084o1250O88566m5529r18884l56430P440
4429D324343k43917K47345J80044O06m2455P936m56655L31080K0839L18070K34621
4418D921857p20717j68912M86292Q1021o073m16182M7593L25423j88207L28821
4408D690916k76204R8591k77042L05291j26023Q9646K00194o3773m36399m5928
4398D159269l09149L39924K53905J27626j2092k77791M4877m4884Q7707p4706
4388D294686j22232j6906J2899J24227m3496j83022O27652J28300p8707j90722
4378D552679j06978P3025K27061k5881J73106m03615N2338L01282q4776J04054
$$ y = [6928291, 6944310, 6366864, 6207586, 6318739, 6217339, 6105186, 5856662, 5581393, 5265908, 5272221, 5343401, 5040155, 4754346, 5010430, 4949180, 5637746, 5592217, 4673333, 4316903, 4324343, 4080426, 4327771, 4507815, 4508421, 4465966, 4473902, 4017247, 4348327, 4369166, 4687236, 4921857, 4201140, 4032228, 4518520, 4599541, 4593468, 4177286, 4224879, 4550302, 4362095, 4690916, 4414712, 4513303, 4236261, 4541552, 4415529, 4505175, 4705369, 4641596, 4205197, 4159269, 3850120, 4190044, 4443949, 4571575, 4559483, 4281692, 4326569, 4281685, 4369392, 4294686, 4172454, 4155548, 4168447, 4292674, 4249178, 4066156, 4693808, 4822108, 4743401, 4552679, 4445701, 4518726, 4745787, 4719906, 4893012, 4489397, 4541735, 4843017, 4758241, 4862295]
4368D862295L52825r8411l2803J39241J66604J87107J44673K17148k9765J36453
4358F045367J70742J20720j91366L02363L06424L36717J30312k23753Q27970K30531
4348H056027l56668l86729N21414P43376M47659j07310L56087K0671J54324J19336
4338I568187M12099M76288l56027L08247L51679m36905L32136M03096R30P36427
4328A1796157l74839k61638J94791M02017m018L98144J21647J27988O33996N6770
4318A3091015K18936M90515J27842O26799P24848L42270M03468N07612N16191
4309A7049496L04699O03859N09337N48427L12521J34296N78789M06957L52293
4300B0800674M22170J99819m7611l11125k29652M38942k6644J65580L6246l2535
$$ y = [4862295, 5215120, 5116709, 5083906, 5223147, 5389751, 5576858, 5721531, 5938679, 5908914, 6045367, 6216109, 6336829, 6145463, 6447826, 6754250, 7090967, 7221279, 6997526, 7825496, 8056027, 7699359, 7312630, 7834044, 8577420, 9025079, 8917769, 9273856, 9294527, 9448851, 9568187, 9980286, 10456574, 10100547, 10408794, 10760473, 10323568, 10655704, 11058800, 11059730, 11796157, 11421318, 11159680, 11354471, 11756488, 11752470, 12150614, 12272261, 12400249, 13034245, 13091015, 13309951, 13800466, 13928308, 14555107, 15279955, 15622225, 16025693, 16533305, 17049496, 17354195, 17958054, 18467391, 19015818, 19328339, 19462635, 20041424, 20448381, 20800674, 21222844, 21422663, 21375052, 21063927, 20834275, 21273217, 21246573, 21412153, 21448399, 21415864]
4290B1415864l13924k5183k17011l50047K90305J66806J81064J68468J4353L44685
4280B1675380O49317J42861n6486K49674N40430K39658J63348L30545P51723N65637
4270B5252087J38535P59094M06491k10806K79995l16066K21310J77531m55886
4261B6252285P9647k55936m50749n25961J16368o519o10739l48012k8493J24833
4251B4346724l05310j13150k81044o1561M14920J10970j12631K56046j33486k79315
4241B3842163K71881M0841j05998p6575j51540l53281m71917L48279L3140k15484
4231B3161509j81322m53608J12322k92245l05608n0506l56870l76026j34559l5906
4221B1087181p12743K59925p7595l2197p4816m28918L76667q6712m03339K23163
$$ y = [21415864, 21101940, 21076757, 20859746, 20509699, 20800004, 20966810, 21147874, 21316342, 21330695, 21675380, 22324697, 22467558, 22411072, 22660746, 23201176, 23440834, 23604182, 23934727, 24686450, 25252087, 25390622, 26149716, 26556207, 26345401, 26625396, 26309330, 26530640, 26708171, 26252285, 26331932, 26075996, 25625247, 25099286, 25215654, 25209135, 24598396, 24250384, 24221891, 24346724, 24041414, 23928264, 23647220, 23585659, 24000579, 24111549, 23998918, 24254964, 24121478, 23842163, 24114044, 24154885, 24048887, 23972312, 23820772, 23467491, 22995574, 23343853, 23376993, 23161509, 22980187, 22526579, 22638901, 22346656, 22041048, 21990542, 21633672, 21257646, 21123087, 21087181, 20374438, 20634363, 20556768, 20524571, 20449755, 20020837, 20397504, 20310792, 19907453, 20130616]
4211B0130616j18936j9458k13686M32494k48095p79092J17287J30804J78986o40602
4201A8970318o94239m38646k31118k53175N2628l93022m83417k24975j41122l83118
4191A5780114l82378k31375J18406p45240o3796K91884l9283k48858o74780j55463
4181A3649231J92140l53723J68279J99180l27430K92523j92735l66640O73343
4172A3934168k17153m52206K57958J25145k54964m78250k85854n04129J19852
4163A2244567Q6211k39028J82721n4198k21990l13808j78782q0885j65423K29687
4153A1489072J23174j09583j82697J99319K85516J08067N9227p9880M77374Q1431
4143A2451020M9592J45578k48798M01084k04744k94727K16625M51375K94598r7732
$$ y = [20130616, 20011680, 19992222, 19778536, 20211030, 19962935, 19183843, 19301130, 19431934, 19610920, 18970318, 18276079, 17837433, 17606315, 17353140, 17405768, 17012746, 16529329, 16304354, 16163232, 15780114, 15397736, 15166361, 15284767, 14539527, 14475731, 14767615, 14728332, 14479474, 13804694, 13649231, 13841371, 13487648, 13655927, 13855107, 13527677, 13820200, 13627465, 13260825, 13934168, 13717015, 13264809, 13522767, 13647912, 13392948, 12914698, 12628844, 12124715, 12244567, 12330778, 12091750, 12274471, 12220273, 11998283, 11684475, 11505693, 11424808, 11259385, 11489072, 11612246, 11502663, 11319966, 11519285, 11804801, 11912868, 11972095, 11892215, 12369589, 12451020, 12500612, 12646190, 12397392, 12798476, 12593732, 12299005, 12515630, 12967005, 13261603, 13163871]
4133A3163871J33175K54191N82611K31828o35145k26437L2488r4873L95757L79618
4123A4217084K97978k79434M3146k60879M62768L66970m55762j06068L02547M91837
4113A5080187O9935k435N86185K47695l3653N56731J30740Q7991J18849l13257
4103A6528968L53864L54118l01329J17075R110N52732O79349L51369R1594N03629
4093A9240479K1876j38322J41805L53733k9776K94099J33093L41582M81310N91252
4083B1431131O88576J77120J79420P65562O38602M84914P67481L98004P58001
4074B6288811K69249N26449J327102J022292Q04194M27743O52440J292040J489309
4065C4099629J170431O44645Q67226J154929J505653J357671J216306J825249
$$ y = [13163871, 13297046, 13551237, 14133848, 14365676, 13730531, 13504094, 13536582, 13441709, 13837466, 14217084, 14515062, 14235628, 14278774, 14017895, 14480663, 14847633, 14391871, 14285803, 14588350, 15080187, 15150122, 15147687, 15733872, 15981567, 15947914, 16504645, 16635385, 16723376, 16842225, 16528968, 16882832, 17236950, 16935621, 17052696, 17061806, 17614538, 18293887, 18645256, 18736850, 19240479, 19262355, 19124033, 19265838, 19619571, 19589795, 19883894, 20016987, 20358569, 20839879, 21431131, 22119707, 22296827, 22476247, 23241809, 23880411, 24365325, 25132806, 25530810, 26288811, 26558060, 27084509, 28411611, 29433903, 30238097, 30665840, 31318280, 32610320, 34099629, 35270060, 35914705, 36781931, 37936860, 39442513, 40800184, 42016490, 43841739]
4057D3841739J308028R78242J256949J956216J549245J956103J407512J421961
4049E5675995J808779J755843J980318J563563J913539J865925J362393K274255
4041G0200610J811077J578706K048212J768794J965840J748752J492590J578489
4033H4193070J787399J371349J269420Q00195J311425J101700O74420J051447
4025I3560425J221737R28422J239876J257733J527909J472403J285296J042173
4017A03535974Q65012J069144J504617J154519J194116O84907J000079Q79719
4009A11888087Q80627J52465p8850m56994p69845j16830r39610l62955p17383
4000A09478712p51392r99877j085522j092488l22277k76380r48498r21278j139245
$$ y = [43841739, 45149767, 46128009, 47384958, 49341174, 50890419, 52846522, 54254034, 55675995, 57484774, 59240617, 61220935, 62784498, 64698037, 66563962, 67926355, 70200610, 72011687, 73590393, 75638605, 77407399, 79373239, 81121991, 82614581, 84193070, 85980469, 87351818, 88621238, 89421433, 90732858, 91834558, 92508978, 93560425, 94782162, 95710584, 96950460, 98208193, 99736102, 101208505, 102493801, 103535974, 104400986, 105470130, 106974747, 108129266, 109323382, 110008289, 111008368, 111888087, 112768714, 112921179, 112842329, 112385335, 111615490, 111498660, 110559050, 110196095, 109478712, 108727320, 107727443, 106641921, 105549433, 105227156, 104950776, 104002278, 103081000, 101941755]
3991A01941755q45196l21567n45206j091507r32335n99225n39236o88785n03879
3982I5874819j179391j203804r88750j031471j251479j191807j252451j109122
3974H6666544j969943j882715j014917j010912j116710j397252j960511r37641
3966G5375943m15230j024968p89150o69734q62932p00253n94128r76306m82902
3957F8860340p43057j246919q57805o81209j446915j559699j117658j443017j859332
3948E7904729j873572j654104j450378j710631q44900n43678j225483q96883q64603
3939D6840497o97739p69820m72797q24137o47186k52395q03942j069512k10425
3930D1092544p47837o88964p62915r77684j064821j756636q65550o96149j882898
$$ y = [101941755, 101096559, 100774992, 100229786, 99138279, 98205944, 97606719, 97067483, 96378698, 95874819, 94695428, 93491624, 92502874, 91471403, 90219924, 89028117, 87775666, 86666544, 84696601, 82813886, 81798969, 80788057, 79671347, 78274095, 76313584, 75375943, 74960713, 73935745, 73146595, 72476861, 71613929, 70913676, 70319548, 69343242, 68860340, 68117283, 66870364, 66012559, 65331350, 63884435, 62324736, 61207078, 59764061, 57904729, 56031157, 54377053, 52926675, 51216044, 50371144, 49827466, 48601983, 47705100, 46840497, 46142758, 45372938, 44900141, 44076004, 43428818, 43176423, 42372481, 41302969, 41092544, 40344707, 39655743, 38892828, 37915144, 36850323, 35093687, 34228137, 33531988, 31649090]
3921C1649090j514936q50970o92585j141826j702902n87699n67304o13619r54384
3912B3022865m35963m08608q40286j110474n42675p49155n29205l25979l89122
3903A7691398n62134n98138k03057L6100k82576p10474q95172J10013n04658l48341
3893A3732961Q0557j69745m86566R033o80978o17275K4292k67468l5120k08277
3883A1381414n77441l55305j87565o8344k43204J05791J05376k11026q6453k42469
3873I620774K39915k97143k75705j75041o3028m17875k77339J46758m23820R1742
3863H169238j26570l15637J97763j39380m83074j26433n18943K57180j56973m1060
3853F716111k29633j57944K86562n27810j62366K09699R7059p01267K36715j97920
$$ y = [31649090, 30134154, 29283184, 28590599, 27448773, 25745871, 25158172, 24590868, 23977249, 23022865, 22586902, 22178294, 21338008, 20227534, 19684859, 18935704, 18406499, 18080520, 17691398, 17129264, 16531126, 16328069, 16364169, 16081593, 15371119, 14475947, 14585960, 14081302, 13732961, 13813518, 13643773, 13157207, 13166240, 12485262, 11867987, 11892279, 11624811, 11589691, 11381414, 10803973, 10448668, 10261103, 10192759, 9949555, 10055346, 10160722, 9949696, 9863243, 9620774, 9860689, 9563546, 9287841, 9112800, 9049772, 8631897, 8354558, 8501316, 8077496, 8169238, 8042668, 7727031, 7924794, 7785414, 7302340, 7175907, 6656964, 6914144, 6757171, 6716111, 6486478, 6328534, 6615096, 6087286, 5924920, 6134619, 6231678, 5530411, 5767126, 5569206]
3843E569206J9934M83630k08356m02712M1331l31918K82740R9723j77244n60220
3833D816114K12250l3570n15586P7541L54482j29963L51605q0358k89332j24734
3823D638449k8318o6282L67223O2709j84297j38206K31109K40660o91094p9031
3813D352922N0959m79770K1847N46997m28743J3420O17581l12954l28309J25516
3803D179466k34002j14869P3486J21104N1902l25010r3178N5207Q4802j07315
3793C691593J25606j14427l26506Q1307j67307N19961K18570k72978n859O9565
3783C819525p0243j95076l85109k26485M69463N24336l40947l3475L86734k44756
3773C703967o6216k26542j00417R7667J37482l69299L18157k35343j59307j12562
$$ y = [5569206, 5589140, 6072770, 5864414, 5461702, 5503033, 5171115, 5453855, 5553578, 5376334, 4816114, 5028364, 4994794, 4479208, 4556749, 4911231, 4781268, 5132873, 5052515, 4763183, 4638449, 4610131, 4543849, 4911072, 4973781, 4789484, 4651278, 4882387, 5123047, 4431953, 4352922, 4403881, 3924111, 3945958, 4492955, 4064212, 4077632, 4695213, 4382259, 4053950, 4179466, 3945464, 3830595, 3904081, 4025185, 4077087, 3752077, 3658899, 3714106, 3798908, 3691593, 3817199, 3702772, 3376266, 3457573, 3290266, 3810227, 4028797, 3755819, 3749960, 3819525, 3749282, 3554206, 3169097, 2942612, 3412075, 3936411, 3595464, 3561989, 3948723, 3703967, 3637751, 3411209, 3310792, 3408459, 3545941, 3176642, 3494799, 3259456, 3100149, 2987587]
3763B987587l5455N59713k84297M01816k05805l0821n7028K87945j82610k96466
3753C144579J77898j5412J87681l05939L01268L44536j63241M60028m83621k79455
3743C368322K79787L76811M01744p7585Q6510j16265J92007O31125L34604M15769
3733E892829K25782R7247N4324m68672o79079k62588n69511J21127j25358j62245
3723D123856j57241m48854K85699J53983J40627l06771j94842k92944L8700L58406
3713C700619l16906J92155J91072l07296j39208N08471n8209K16923j88095O4891
3703C864417l48353O6196K04436K5337R5356J77366l65940k16017L84473K4492
3693C911763j299K98277N8304l86674J78736Q6122n71124J28239J43568j82422
$$ y = [2987587, 2952132, 3511845, 3227548, 3629364, 3423559, 3392738, 3335710, 3623655, 3441045, 3144579, 3322477, 3307065, 3494746, 3188807, 3490075, 3834611, 3671370, 4131398, 3647777, 3368322, 3648109, 4024920, 4426664, 4349079, 4435589, 4319324, 4511331, 5142456, 5477060, 5892829, 6118611, 6215858, 6270182, 5801510, 5122431, 4859843, 4290332, 4411459, 4286101, 4123856, 3966615, 3517761, 3803460, 3957443, 4098070, 3791299, 3596457, 3303513, 3342213, 3700619, 3383713, 3575868, 3766940, 3459644, 3320436, 3828907, 3770698, 3987621, 3799526, 3864417, 3516064, 3582260, 3786696, 3812033, 3907389, 4084755, 3718815, 3502798, 3887271, 3911763, 3910464, 4208741, 4267045, 3880371, 4059107, 4145229, 3574105, 3702344, 3845912, 3663490]
3683C663490N49121Q3046P8541l52449n35368j33196M71118l60219L03197j21324
3673C645957r2482J51997R1236Q1718k54545L6508m0536L72442P1583p90466k35845
3662C037567j17765L00128K57752k64214n6559Q9835o7108m784N44686K12161
3652C931699j15708j69925l59480K48302L56636Q5751m18963O5724j15467k42154
3642C266415L41552m84542j57203J70538J02271p8222j77957l42813J90140N77711
3632C407890O4151L93038L47092m47660p38364K58181N0911q081O2845K34713
3622C624716J02480O4850l5567j06737l29448J12992r5535J74770N53089k3091
3612D042519J514j95390k57649j75538K90051M99099k76621L2745M80786k34915
$$ y = [3663490, 4212611, 4295657, 4374198, 4021749, 3486381, 3353185, 3824303, 3464084, 3767281, 3645957, 3553475, 3705472, 3796708, 3878426, 3623881, 3660389, 3619853, 3992295, 4063878, 3273412, 3037567, 2919802, 3219930, 3477682, 3213468, 3156909, 3246744, 3179636, 3174852, 3719538, 3931699, 3815991, 3646066, 3286586, 3534888, 3891524, 3977275, 3558312, 3624036, 3508569, 3266415, 3607967, 3123425, 2966222, 3136760, 3239031, 3160809, 2982852, 2640039, 2830179, 3407890, 3472041, 3865079, 4212171, 3764511, 3026147, 3284328, 3335239, 3327158, 3390003, 3624716, 3727196, 3792046, 3756479, 3649742, 3320294, 3433286, 3337751, 3512521, 4065610, 4042519, 4044033, 3848643, 3590994, 3415456, 3705507, 4204606, 3927985, 3960730, 4441516, 4206601]
3602D206601n22416O173j10585K53738J58537j71264j64209p2243K70937J92704
3592D047973P8938K31451k15795M83079J54061L00020j20663k8980J10811J14542
3582E155437N87877K72798J60502L29563K67867m64632j41400O6353k54891m84363
3572E495111J59298n82207l36027k10646q4440j69441L11405K89632J42384j39097
3562D875972j13515l52965M80103j88075J10870r9795J12831K6844J63279K49505
3552E265054M1045j63523K84687J45655l51159J62535M90145o3068j1056K50084
3542F050399k87324J16650K17380K39132L54773n11350j22446M64258L8509L5866
3532F595847j77778Q9751q5619n00173M95033j36233l38993L52546q8335j85300
$$ y = [4206601, 3684185, 3690358, 3579773, 3833511, 3992048, 3820784, 3656575, 3584332, 3855269, 4047973, 4126911, 4358362, 4142567, 4625646, 4779707, 5079727, 4959064, 4930084, 5040895, 5155437, 5743314, 6016112, 6176614, 6506177, 6774044, 6309412, 6168012, 6234365, 5979474, 5495111, 5654409, 5072202, 4736175, 4525529, 4441089, 4271648, 4583053, 4872685, 5015069, 4875972, 4762457, 4409492, 4889595, 4701520, 4812390, 4712595, 4825426, 4852270, 5015549, 5265054, 5306099, 5142576, 5427263, 5572918, 5221759, 5384294, 5874439, 5811371, 5800315, 6050399, 5763075, 5879725, 6097105, 6336237, 6691010, 6179660, 6057214, 6521472, 6559981, 6595847, 6418069, 6507820, 6422201, 5922028, 6417061, 6280828, 5941835, 6294381, 6206046, 6020746]
3522F020746K81124P8124l74711M76985O1303J67246J70659Q7416n5242n19891
3512F393759j96663J99759K48349l8811l6190L12074j68372J1504K40127J37378
3502G102914M06021j34038j06540J031M6039Q1040m65818k51600J60314O13845
3492G453208M94045j31002N1358J0420L20728r4930j20294M19593j9438L25971
3482H709659J39518K01397n2319L12139j9878L38976k00624j06431n5991K52714
3472I519160L75045K39841O8447L53262K6064m21810j1506N14975J68719L30326
3462A1162523L62850L73287L50249O30373K45047l72123L43399M71827K45282
3453A3812714l58190Q9189N84744N30578J4006O10006O67625n3636Q5232J134
$$ y = [6020746, 6301870, 6379994, 6005283, 6482268, 6543571, 6710817, 6881476, 6968892, 6913650, 6393759, 6197096, 6396855, 6645204, 6606393, 6570203, 6882277, 6713905, 6725409, 6965536, 7102914, 7508935, 7374897, 7268357, 7269388, 7315427, 7396467, 6930649, 6679049, 6839363, 7453208, 7947253, 7816251, 7867609, 7878029, 8198757, 8103827, 7983533, 8403126, 8383688, 8709659, 8849177, 9050574, 8998255, 9310394, 9290516, 9629492, 9428868, 9322437, 9266446, 9519160, 9894205, 10134046, 10202493, 10555755, 10581819, 10160009, 10148503, 10663478, 10832197, 11162523, 11525373, 11898660, 12248909, 12879282, 13124329, 12752206, 13095605, 13567432, 13812714, 13454524, 13543713, 14128457, 14659035, 14673041, 15283047, 15950672, 15897036, 15982268, 15983402]
3443A5983402L79869R10006Q0327O65664N47504L58409M5063j26645M97899P05492
3433B0046990K70502J23297O87208P99093Q56766K15528M60490J83861M84191
3424B4127926N89078M70930O48515P62555j70715O00528R24140L53126N14341
3415B8820424P60217Q05697R24453Q35212P81952Q15276J259729R95471J262660
3406C7261091J226187J130182J756757P80712J277644J450193J875111K300023
3398D9057900K309863J860673K166133J945555K252663K374198K187944L084812
3390F7239741L406417L873200M366250M221596N299746N930974O876635P084905
3382A08299464P645929P400079O867296O739431N834761O720106P015620P563352
$$ y = [15983402, 16363271, 17273277, 17353604, 18019268, 18566772, 18925181, 18970244, 18843599, 19341498, 20046990, 20317492, 20440789, 21127997, 21927090, 22783856, 22999384, 23459874, 23643735, 24127926, 24717004, 25187934, 25836449, 26599004, 26428289, 27028817, 27952957, 28306083, 28820424, 29580641, 30386338, 31310791, 32146003, 32927955, 33743231, 35002960, 35998431, 37261091, 38487278, 39617460, 41374217, 42154929, 43432573, 44882766, 46757877, 49057900, 51367763, 53228436, 55394569, 57340124, 59592787, 61966985, 64154929, 67239741, 70646158, 74519358, 78885608, 83107204, 88406950, 94337924, 101214559, 108299464, 115945393, 123345472, 130212768, 136952199, 142786960, 149507066, 156522686, 164086038]
3374A64086038Q688221Q264597Q471096O902741N383041M097871L209738L490358
3366B12593701M891421M753979M745759M255005K131989r54491m117536n209741
3358B23090086n993099n204147l734262l638890l631262m377760o355372p744157
3350A82411137q729976q555796p555644o331387n474290n071820m914464n374403
3342A30403357n544969n909388n287194m614836m064849k999595k053202j279844
3334I8649480j323301j321642l89187k61136r0963k02125J07430k06244q7120
3325I4875192m12052o84037j39740j008180j664193j660606j124944j528098j606123
3316H5047219j365177q66980r14849p71356m04515m03744k96154N67092K94510
$$ y = [164086038, 172774259, 181038856, 189509952, 196412693, 201795734, 205893605, 209103343, 212593701, 217485122, 222239101, 226984860, 231239865, 233371854, 232417363, 228299827, 223090086, 217096987, 211892840, 208158578, 204519688, 200888426, 196510666, 190155294, 182411137, 173681161, 165125365, 157569721, 151238334, 145764044, 140692224, 135777760, 130403357, 124858388, 118949000, 113661806, 109046970, 104982121, 101982526, 99929324, 98649480, 97326179, 96004537, 95615350, 95354214, 95263251, 95061126, 95168556, 94962312, 94875192, 94463140, 93779103, 93639363, 92631183, 90966990, 89306384, 88181440, 86653342, 85047219, 83682042, 82815062, 81900213, 81128857, 80724342, 80320598, 80024444, 80591536, 80886046]
3307H0886046N32250N31113M83995P31051O33178K56016K23874M44594j81760
3298H4540357k74824j41333j115407j311093j346548j158097j084167j304038
3290G6804850j333625j393644j150505q75368j153392p44863p50080p41608k27451
3281F8434314l90024n13518M64695K66962J17604J02299J20719L08794P36799
3272F9648644Q41043Q54105J144123P43070L33678J436066R92539Q98941J522031
3263G8414240R80896J100381J408025J155919J849055K528497K008516K714526
3255I2160055L381468L217417M034989N088724N355567N764296O769996P946034
3247A33718546Q597451R352806J0645582J1751688J2667218J4152358J5042247
$$ y = [80886046, 81418296, 81949409, 82433404, 83164455, 83797633, 84053649, 84277523, 84722117, 84540357, 84265533, 84124200, 83008793, 81697700, 80351152, 79193055, 78108888, 76804850, 75471225, 74077581, 72927076, 72051708, 70898316, 70153453, 69403373, 68661765, 68434314, 68044290, 67530772, 67995467, 68262429, 68380033, 68482332, 68603051, 68911845, 69648644, 70489687, 71343792, 72487915, 73230985, 73564663, 75000729, 75993268, 76892209, 78414240, 79395136, 80495517, 81903542, 83059461, 84908516, 87437013, 89445529, 92160055, 95541523, 98758940, 102793929, 107882653, 113238220, 119002516, 125772512, 133718546, 142315997, 151668803, 162314385, 174066073, 186733291, 200885649, 215927896]
3240B15927896J5656270J5688232J4107066J1757610Q445615L476930q68243o049857
3232B78141519j0762515j4239153j7128160j8347019j7531480j7295959j6201103
3225A66636130j3987754j1851938j1090472r932469p984949p458909o655964n835439
3217I1838236n840356m762236m608881m136333l967479l801302k757442k705362
3209E9258845k471505k601356k111433k459579j693892j206676j855894j903597
3201D2954913j575426j252826j143150j317050j776908j307121j143386j132830
3193C2306216j231309q78017o20504p94079j029859j059638p52466p76358o10307
3184B4553679m62887q10001j38871k07322r37048m07748p71582p49680k96436
$$ y = [215927896, 231584166, 247272398, 261379464, 273137074, 281582689, 285059619, 284191376, 278141519, 267379004, 253139851, 236011691, 217664672, 200133192, 182837233, 166636130, 152648376, 140796438, 129705966, 119773497, 111788548, 104329639, 97673675, 91838236, 85997880, 81235644, 76626763, 72490430, 68522951, 64721649, 61964207, 59258845, 56787340, 54185984, 52074551, 49614972, 47921080, 46714404, 44858510, 42954913, 41379487, 40126661, 38983511, 37666461, 35889553, 34582432, 33439046, 32306216, 31074907, 30196890, 29576386, 28782307, 27752448, 26692810, 25940344, 25163986, 24553679, 24090792, 23280791, 23141920, 22934598, 21997550, 21589802, 20818220, 20068540, 19772104]
3175A9772104j64192l82961o34094o73621p25171j869M05224q86692o01347J836
3165A6109217o99735J34170m47590j89201K45964m90746J2453k27342j56064R6768
3155A4387894n28952o04470r731k31927n49660o382n34131J15908N0156m80272
3145A1608433J3658q7869l7504p46435j91093O8290k72554K14394l50599k4584
3135A0194137L177j25741j81097j58563j76763J86602n06656k8764l5768m20313
3125H750251J0643L01118l55009P3158J54229j92816j05348m85095N3808n30405
3115G674534L97877Q0434k80309p650M96487o17357K2538K28798k36375K07005
3105G965982m05030k2511K62822R4941K96951n14924l30692k78564K57330j80077
$$ y = [19772104, 19607912, 19224951, 18590857, 17917236, 17192065, 17190196, 17595420, 16708728, 16107381, 16109217, 15409482, 15543652, 15096062, 14906861, 15152825, 14662079, 14674532, 14447190, 14291126, 14387894, 13858942, 13254472, 13244741, 13012814, 12463154, 12456772, 11922641, 12038549, 12088705, 11608433, 11622091, 11534222, 11496718, 10750283, 10559190, 10627480, 10354926, 10569320, 10218721, 10194137, 10197314, 10071573, 9890476, 9731913, 9555150, 9741752, 9235096, 9206332, 9170564, 8750251, 8760894, 9062012, 8707003, 8780161, 8934390, 8741574, 8636226, 8151131, 8204939, 7674534, 8072411, 8152845, 7872536, 7864886, 8361373, 7744016, 7766554, 7995352, 7758977, 7965982, 7560952, 7538441, 7801263, 7896204, 8193155, 7678231, 7347539, 7068975, 7326305, 7146228]
3095G146228o3419K14334l60335N6642K36574K12297k75071n40252K664p5947
3085F553715o244K16745k91546l61514q793L22547m7580n2173k24611m06066O22764
3074F317244O9588l53267O8054P7583L9947m9643K97371J41547K76716r2105j82298
3063F610737j20214K56715j20580L2103m05901n6931L89083M21452l1859O607
3053F981212L12335R5732p2793m63858m03029P7489M15054K87398L22426j36086
3043G415880j22211J65671L77840J94987N5498l84346m231n2335N7756O1719o7399
3032G698829J0701N19064J79533K13166K03128k36042j38449k5914N89465J27430
3022I140911k75394J84539J55731l26644j95272K43991J63791m8680p73884j86907
$$ y = [7146228, 7082809, 7297143, 6936808, 6993450, 7230024, 7442321, 7167250, 6626998, 6629662, 6553715, 6547471, 6764216, 6472670, 6111156, 6102363, 6424910, 6377330, 6325157, 6100546, 5694480, 6317244, 6386832, 6033565, 6101619, 6179202, 6219149, 6169506, 6466877, 6608424, 6885140, 6793035, 6610737, 6490523, 6747238, 6626658, 6658761, 6252860, 6195929, 6585012, 7006464, 6974605, 6981212, 7293547, 7389279, 7316486, 6852628, 6449599, 6527088, 6942142, 7229540, 7551966, 7415880, 7293669, 7459340, 7837180, 8032167, 8087665, 7703319, 7699088, 7646753, 7704509, 7766228, 7698829, 7709530, 8228594, 8408127, 8621293, 8824421, 8588379, 8449930, 8424016, 9013481, 9140911, 8865517, 9050056, 9205787, 8879143, 8683871, 8927862, 9091653, 9042973, 8269089, 8082182]
3012H082182M99228K15691k95018m66069M36268l7270J97020N295J61034K20489
3002I018850j66591m48021j55610N54592j17588j7267K58521n49075K14954J42714
2992H735479M14929K06459l03243J32700j74663L19809j409k90754M6425J71680
2982I257412l13465L61902J00596J57168K99949L09719O38945j29237L23398L45030
2972A1351417O31385k32001O14622M61675L12709J37318K25134L48853K98518
2963A4149630M72047R83830P09796Q87501Q85610L48189K07524k71960m30952
2954A7941215j231218j342701j110752k71678q7072m72471j28736j23889j34260
2945A3038438N65037l5229l70373J87848J14604l48281K04574M14069M53168Q1866
$$ y = [8082182, 8581410, 8797101, 8502083, 8036014, 8472282, 8435012, 8632032, 8637327, 8798361, 9018850, 8852259, 8404238, 8248628, 8803220, 8685632, 8668365, 8926886, 8377811, 8592765, 8735479, 9150408, 9356867, 9053624, 9186324, 9011661, 9331470, 9330061, 9039307, 9085732, 9257412, 8943947, 9305849, 9406445, 9563613, 9863562, 10173281, 10812226, 10682989, 11006387, 11351417, 11982802, 11750801, 12365423, 12827098, 13139807, 13277125, 13502259, 13851112, 14149630, 14621677, 15605507, 16315303, 17202804, 18088414, 18436603, 18644127, 18372167, 17941215, 16709997, 15367296, 14256544, 13984866, 13897794, 13425323, 13296587, 13172698, 13038438, 13603475, 13568246, 13197873, 13385721, 13500325, 13152044, 13356618, 13770687, 14223855, 14305721]
2935A4305721J88003J12054L52422K05536J30758O9171K92327m3042Q95907k79560
2925A6229297Q9982L15829K41309P1258p3585M48011L67674K85914q7415K64100
2915A8152374L89404L20844J47449L00230K6639M90633j8602N61152J99772L07082
2905B0876977O06777K41463J19901N32901q970K92864Q06161Q87424J097185J04313
2895B5556996O65939P09572J181684L27656Q66997P98251O16694J045736R19187
2886C2688712J151931J238093Q09379J079633J583707J380374J410671J163761
2878D2506261J815878J616070J452418J496707J800529K167524K182458K500873
2870E7538718K384392K371273K272045K770593K607424L011418L213542K571132
$$ y = [14305721, 14493724, 14605778, 14958200, 15163736, 15294494, 15363665, 15655992, 15612950, 16508857, 16229297, 16319279, 16635108, 16876417, 16947675, 16874090, 17322101, 17689775, 17975689, 17888274, 18152374, 18541778, 18862622, 19010071, 19310301, 19336940, 19827573, 19808971, 20370123, 20569895, 20876977, 21483754, 21725217, 21845118, 22378019, 22369049, 22661913, 23468074, 24355498, 25452683, 25556996, 26222935, 26932507, 28114191, 28441847, 29308844, 30107095, 30723789, 31769525, 32688712, 33840643, 35078736, 35888115, 36967748, 38551455, 39931829, 41342500, 42506261, 44322139, 45938209, 47390627, 48887334, 50687863, 52855387, 55037845, 57538718, 59923110, 62294383, 64566428, 67337021, 69944445, 72955863, 76169405, 78740537]
2862G8740537L066292K553318L236144L717811L183643L116917L460408L625472
2854A04700542L364608L335912L322627L178311L544092L828394L273855K712041
2846A31260382K946731K691465K907934K447156K550469K556007K318766K154145
2838A51833055J947165J469134J527281J114240J220777N71461L82728N15736
2830A60581577n34299j025551m59466o58661j142831j524740j729758j459943
2822A52046328j305288j955522k014379j804615k477804k916148k500257k409758
2814A34662557k460433k451731k395968k438480k432193k583950j806176j508322
2806A16585304j889379k230493j879307r46838j449568k110973j909248p23176
$$ y = [78740537, 81806829, 84360147, 87596291, 91314102, 94497745, 97614662, 101075070, 104700542, 108065150, 111401062, 114723689, 117902000, 121446092, 125274486, 128548341, 131260382, 134207113, 136898578, 139806512, 142253668, 144804137, 147360144, 149678910, 151833055, 153780220, 155249354, 156776635, 157890875, 159111652, 159683113, 160065841, 160581577, 160047278, 159021727, 158562261, 157903600, 156760769, 155236029, 153506271, 152046328, 150741040, 148785518, 146771139, 144966524, 142488720, 139572572, 137072315, 134662557, 132202124, 129750393, 127354425, 124915945, 122483752, 119899802, 118093626, 116585304, 114695925, 112465432, 110586125, 109639287, 108189719, 106078746, 104169498, 103446322]
2798A03446322j183251j362654j503490j096311j112340j821480o97314j146918
2790I3522564j007882m26705j811942j025724q66742p94371o89045p63225n29242
2781H5607686L13622m46081J04305Q49125O20276L25686N75492N12140R27594
2772H9389845M07411J545676J090378O92177J162012J384961J893775J674281
2764I9240516J445591Q88130J417829J245803K051219J355406J394924J454168
2756A10493586J074080P79692J030388J498598J158855Q42127J512269J336796
2748A19726391J671740J622179K044719K633915K307098K861350L116627L210098
2740A39194117L258461M058920L784166M318873N252331N570381N770752O944627
$$ y = [103446322, 102263071, 100900417, 99396927, 98300616, 97188276, 95366796, 94669482, 93522564, 92514682, 92087977, 90276035, 89250311, 88383569, 87589198, 86900153, 86136928, 85607686, 85921308, 85475227, 85579532, 86428657, 87048933, 87374619, 87950111, 88462251, 89389845, 89797256, 91342932, 92433310, 93125487, 94287499, 95672460, 97566235, 99240516, 100686107, 101574237, 102992066, 104237869, 106289088, 107644494, 109039418, 110493586, 111567666, 112347358, 113377746, 114876344, 116035199, 116877326, 118389595, 119726391, 121398131, 123020310, 125065029, 127698944, 130006042, 132867392, 135984019, 139194117, 142452578, 146511498, 150295664, 154614537, 159866868, 165437249, 171208001, 178152628]
2732A78152628P576498P641728Q725375R405814R896892J1156953J1941939J2791822
2724B57289649J4172979J4717887J5687713J6139172J6199965J6291572J5612355
2717C66111292J4050606J2640466J0366341P573413M613944K026247N5261j543000
2709D15894570l721952m227377m675200n217164n188561o377920o511415p174048
2701C72800933p988027r243914j1056742j1956445j2956356j4544936j5276851
2694B89777662j5506880j4962464j5273235j3962900j2980293j2169104j1338832
2687A93583954j0495642r495688q658651p989604p075568o316338o295487n758995
2679A31497981n258511n390747n136781m249066m928010m066866m085705m309376
$$ y = [178152628, 185729126, 193370854, 202096229, 211502043, 221398935, 232555888, 244497827, 257289649, 271462628, 286180515, 301868228, 318007400, 334207365, 350498937, 366111292, 380161898, 392802364, 403168705, 410742118, 415356062, 417382309, 417437570, 415894570, 412172618, 407945241, 403270041, 398052877, 392864316, 386486396, 379974981, 372800933, 364812906, 355568992, 344512250, 332555805, 319599449, 305054513, 289777662, 274270782, 259308318, 244035083, 230072183, 217091890, 204922786, 193583954, 183088312, 173592624, 164933973, 156944369, 149868801, 143552463, 137256976, 131497981, 126239470, 120848723, 115711942, 111462876, 106534866, 102468000, 98382295, 94072919]
2671I4072919l141340l373718l660426l295359k987871j834572k523168k320237
2663G0936228k496729k010355j298415j718733j881816j810025j932696j429858
2655E6357601r04229j278670j204828j056756j219228n61668j008997j188348
2647D7934877j271521j382390k0041q99856r85577p80119j144692r67611o71604
2638C9811466r72825j419398j240709n17984j134194r10139m47585o29086l15351
2629C2224195p56799l20766o73909m00304o16667p04183k28741o83147m27099
2620B7412580m62838l96673n17594o09581J55127m33948m28494n98648j20712
2611B3999219m4420k15368J7005k03405o78882l03325m34932j75029L38096o81848
$$ y = [94072919, 90931579, 87557861, 83897435, 80602076, 77614205, 75779633, 73256465, 70936228, 68439499, 66429144, 65130729, 63411996, 61530180, 59720155, 57787459, 56357601, 55453372, 54174702, 52969874, 51913118, 50693890, 50132222, 49123225, 47934877, 46663356, 45280966, 45260925, 44361069, 43375492, 42595373, 41450681, 40483070, 39811466, 38838641, 37419243, 36178534, 35660550, 34526356, 33616217, 33168632, 32539546, 32224195, 31467396, 31146630, 30472721, 30072417, 29455750, 28751567, 28522826, 27839679, 27412580, 26949742, 26553069, 26035475, 25425894, 25581021, 25147073, 24718579, 24119931, 23999219, 23954799, 23739431, 23756436, 23553031, 22874149, 22570824, 22135892, 21960863, 22298959, 21617111]
2601B1617111k96559n8130j04762K39782Q4826m75086l866k66237q11979K14220
2591B0139320N8666j16428K78055n4601j1163k25870k1579k50618P2537K24025
2581B0092344J67511m06918L5698n114M07065L5996L18745O15764o481K62768
2571B1517378J52459l44328j9997N69849K5125J23021M23468K2319L39728M79691
2561B3288713M97310M60533N10690r589K61430J65795Q6561N91792M33886J154984
2551B7442105L82290N81192O97839L60754O12232P86070Q24782M98298M43989
2542C2629551J241114R78051L17795P03054P51752J088624J024266M29863N85211
2533C9749281J021690O20479O80399J064295J187884R62812L70816Q66546M20513
$$ y = [21617111, 21320552, 21262422, 21157660, 21397442, 21482268, 21007182, 21003316, 20737079, 19925100, 20139320, 20197986, 20081558, 20359613, 20305012, 20293849, 20067979, 20046400, 19795782, 19868319, 20092344, 20259855, 19852937, 19888635, 19883521, 20290586, 20326582, 20645327, 21261091, 21254610, 21517378, 21669837, 21325509, 21305512, 21875361, 21900486, 22023507, 22446975, 22469294, 22809022, 23288713, 23786023, 24246556, 24757246, 24747657, 25009087, 25174882, 25261443, 25853235, 26287121, 27442105, 27824395, 28405587, 29103426, 29464180, 30076412, 30862482, 31687264, 32185562, 32629551, 33870665, 34848716, 35166511, 35869565, 36621317, 37709941, 38734207, 39164070, 39749281, 40770971, 41391450, 42071849, 43136144, 44324028, 45286840, 45657656, 46524202, 46944715]
2524D6944715R02394Q60613O01606J309929J209093J042238M88135O63830J457247
2515E5479800J017028J263087J199010J448736J755645J512585J419571J860859
2507F6956321K017229K272571K064878K300534K359254K988478L106603K909054
2499H6974922L934082L993032M129310M404717N099213N224493N625049N521650
2491A24906468O533292P262894Q326412Q329367Q889222R406909R511377R265925
2483A92431866J0008191J0049121J0188101R802318R873868R100745Q197058P869007
2475B67520275P638542P068249O477481O665587O379988N547883N003024N092929
2467C17393958M002400L198641J282201K23962q47158k511253l497903n400796
$$ y = [46944715, 47847109, 48707722, 49309328, 50619257, 51828350, 52870588, 53358723, 54022553, 55479800, 56496828, 57759915, 58958925, 60407661, 62163306, 63675891, 65095462, 66956321, 68973550, 71246121, 73310999, 75611533, 77970787, 80959265, 84065868, 86974922, 90909004, 94902036, 99031346, 103436063, 108535276, 113759769, 119384818, 124906468, 131439760, 138702654, 147029066, 155358433, 164247655, 173654564, 183165941, 192431866, 202440057, 212489178, 222677279, 232479597, 242353465, 251454210, 259651268, 267520275, 275158817, 282227066, 288704547, 295370134, 301750122, 307298005, 312301029, 317393958, 321396358, 324594999, 325877200, 326101162, 325254004, 322742751, 319244848, 313844052]
2459C13844052o399437o931492q287140p799900q556923q887257q453780q246840
2451B50281283q866213q954454q773548q931368r664105r391813r527694r809660
2443A76362428r377678r336730q822664q113851q167808p732174p018413o394374
2435A11398736o558108n783577n016721m427436m502789m001193l589791l431526
2427G4087595k976848k437449k397595k564929k203773j929273k478383j847753
2419E5251592j446794j538102j590756j776760r63879j169439j060994j041785
2411D4663083j026665o67788r70348j088108n77724q57868n48359n74361j065068
2402C7286794o71002p34988r83156q60055j174881m30832m13232o21886j106029
$$ y = [313844052, 307444615, 300513123, 292225983, 284426083, 275869160, 266981903, 258528123, 250281283, 241415070, 232460616, 223687068, 214755700, 205091595, 195699782, 186172088, 176362428, 166984750, 157648020, 148825356, 140711505, 132543697, 124811523, 117793110, 111398736, 104840628, 99057051, 94040330, 89612894, 85110105, 81108912, 77519121, 74087595, 71110747, 68673298, 66275703, 63710774, 61507001, 59577728, 57099345, 55251592, 53804798, 52266696, 50675940, 48899180, 47935301, 46765862, 45704868, 44663083, 43636418, 42968630, 41998282, 40910174, 40332450, 39474582, 38926223, 38351862, 37286794, 36615792, 35880804, 34897648, 34037593, 32862712, 32431880, 32018648, 31396762, 30290733]
2393C0290733r26775r99959o58763n50760q64234m62730l69434q01031q0240j110092
2383B3466715n66132m00439j044888n14765o99344l65807o30874o17218l89789
2374A8237459J98168m62897p06460r24328l79866j56988q66206l38015q4920m45275
2364A4070672p27340m61092k8360o5788l96948j58855k34366J34102M46510p12820
2354A1865715o14883l58743l93345l45924P1531M83098l80363q92360l6126J34625
2344I533225q7132l72167J3653k68905n82330k02712k72023r9106Q1910r7409
2334G647004k34407j23654k12831Q194K75273l40375j36156l8113n6753k53293
2324F534889q7320J44088Q3581K07118n74435m3983j39313k74020n3499l15794
$$ y = [30290733, 29363958, 28363999, 27705236, 27154476, 26290242, 25827512, 25458078, 24657047, 24576807, 23466715, 22900583, 22500144, 21455256, 20940491, 20241147, 19875340, 19244466, 18627248, 18237459, 18435627, 17972730, 17266270, 16341942, 15962076, 15805088, 14938882, 14600867, 14515947, 14070672, 13343332, 12882240, 12853880, 12788092, 12391144, 12232289, 11997923, 12132025, 12578535, 11865715, 11250832, 10892089, 10498744, 10152820, 10224351, 10707449, 10327086, 9434726, 9398600, 9533225, 9446093, 9073926, 9087579, 8818674, 8236344, 8033632, 7761609, 7662503, 7744413, 7647004, 7412597, 7288943, 7076112, 7084306, 7359579, 7019204, 6883048, 6844935, 6788182, 6534889, 6447569, 6591657, 6675238, 6882356, 6307921, 6263938, 6124625, 5850605, 5797106, 5481312]
2314E481312j0701J82964q7682m00816J88417L85721k79626j8865j25816j59812
2304E155096J25529r489m97851K49807K30958m1480j3767Q309Q9464l61927o0493
2293D874156m16387o65906J54041M9391J42324K6303Q0350l145q5619o3063M1413
2282D133858N4299k80224K6098l1473k45149P436j15995L09796K7605K31186j02793
2271D014644k54522l50251L09245J55246k65305J44517l25690J40375L03171j79580
2261C691850l99538J78741J76767j569j45652l26866j42193Q9168k51576J19255
2251B988387J24121j07545M56236R7827m82836j08204k85257k5261L09619m3163
2241B923924K4084j76118k28502j32134n7591N60714k0772L48391K11584m55439
$$ y = [5481312, 5470611, 5653575, 5565893, 5165077, 5353494, 5739215, 5459589, 5440724, 5314908, 5155096, 5280625, 5271136, 4773285, 5023092, 5254050, 5212570, 5198803, 5207112, 5296576, 4934649, 4874156, 4457769, 3791863, 3945904, 3995295, 4137619, 4163922, 4244272, 4241127, 4155508, 4092445, 4133858, 4188157, 3907933, 3934031, 3902558, 3657409, 3664845, 3548850, 3858646, 3886251, 4117437, 4014644, 3760122, 3409871, 3719116, 3874362, 3609057, 3753574, 3427884, 3568259, 3871430, 3691850, 3292312, 3471053, 3647820, 3646251, 3500599, 3173733, 3031540, 3120708, 2869132, 2988387, 3112508, 3004963, 3461199, 3559026, 3076190, 2967986, 2682729, 2657468, 2967087, 2923924, 2948008, 2771890, 2543388, 2411254, 2353663, 2914377, 2893605, 3241996, 3453580, 2998141]
2231B998141k16837J56819l21903k05308J62580L35949M73216m19697k48814r0316
2221B623830p0197L19498K30557m61820K69131K06638k79134N8290q3044k3888
2211B789861n86865o6119l31228N46375j54097k32421O24884P500l42933J73077
2201B428034O8114M22861Q0997j68934m2848k9873j93461J07406J31311q1167
2191B722440J70889l61213J40062L39778j05857k43050K86721j6995j60295L77572
2181C150052J31075M69385P9718j31888J01752o278J28322j98289m74921k65874
2171B983054N53284N5929m160o56909l83605Q00574M56080k68132J06214K28854
2161C871183m37050j38469L83543q6751K78571M29469j93586l43830J60470M15884
$$ y = [2998141, 2781304, 2938123, 2616220, 2410912, 2573492, 2909441, 3382657, 2962960, 2714146, 2623830, 2553633, 2873131, 3103688, 2641868, 2910999, 3117637, 2838503, 2896793, 2813749, 2789861, 2202996, 2136877, 1805649, 2352024, 2197927, 1965506, 2590390, 2597890, 2254957, 2428034, 2496148, 2919009, 3000006, 2831072, 2788224, 2758351, 2564890, 2672296, 2803607, 2722440, 2893329, 2532116, 2672178, 3011956, 2906099, 2663049, 2949770, 2932775, 2772480, 3150052, 3281127, 3750512, 3830230, 3698342, 3800094, 3793816, 3922138, 3723849, 3248928, 2983054, 3536338, 3592267, 3588107, 2931198, 2547593, 3348167, 3804247, 3536115, 3642329, 3871183, 3434133, 3295664, 3679207, 3592456, 3871027, 4300496, 4106910, 3763080, 3923550, 4339434]
2151D339434J02989j40628q7516k95194n26370k4801k53376M3850M41846n4244
2141C545990O7971j29496j05200K26972K93681j05227j89517k91079j03466K28344
2131C438973k49786k57798m8243m45918L00604J0621j86298L43925l4196j11412
2121B760472N78829k47013p20087j69386J78740K71691o1766j44224k05655L7712
2111B279313K3502j39736R045J11506L62600L14639l22708k02125m5361k56309
2101B134366J35818j23960k69310l90535j83903O28164J47172l27324m48958q2639
2091A218891K56269M32206J4385K6530K21792n3716j54820j07487K02543J39357
2081B195950j03973J04818q5791j13971J69503J40821j61589m66812P3669j33335
$$ y = [4339434, 4442423, 4301795, 4214279, 3919085, 3392715, 3367914, 3114538, 3158388, 3600234, 3545990, 3613961, 3484465, 3379265, 3606237, 3899918, 3794691, 3605174, 3314095, 3210629, 3438973, 3189187, 2931389, 2883146, 2437228, 2737832, 2748453, 2562155, 2906080, 2871884, 2760472, 3339301, 3092288, 2372201, 2202815, 2381555, 2653246, 2591480, 2447256, 2241601, 2279313, 2302815, 2163079, 2172124, 2283630, 2646230, 2960869, 2638161, 2436036, 2390675, 2134366, 2270184, 2146224, 1876914, 1486379, 1302476, 1930640, 2077812, 1750488, 1301530, 1218891, 1475160, 1907366, 1921751, 1948281, 2170073, 2116357, 1961537, 1854050, 2056593, 2195950, 2091977, 2196795, 2111004, 1997033, 2166536, 2307357, 2145768, 1678956, 1752625, 1619290]
2071A619290K08701n1708K66183N1775m18858r948L51876N7238M04963j73341
2061B306171l95898k08750k830L17211M7009M55356j11864j53961J47169j85770
2051B213843k26072K86592p1304K39061M31287j4974M48572J6878m27096k76832
2041B619955m10317J51801L73896J00214J48824K25061n5699j08349j3213J37913
2031C170086o04131m00799k59466J53330J05659J65653K48921J64952J8781k7159
2021B735827r3364J81913Q9948k40707k73720k06857M69587n7723J5810J92454
2011B813168M7084n8300j94593K41788M23996K20759j90219K45451k03642q6877
2001C258615K8148k50086K95050K04075K4345J41839l39837K83074L2866j31197
$$ y = [1619290, 1827991, 1776283, 2042466, 2094241, 1675383, 1665435, 2017311, 2074549, 2479512, 2306171, 1910273, 1701523, 1698693, 2015904, 2062913, 2518269, 2406405, 2252444, 2399613, 2213843, 1987771, 2274363, 2203059, 2442120, 2873407, 2858433, 3307005, 3323883, 2896787, 2619955, 2209638, 2361439, 2735335, 2835549, 2984373, 3209434, 3153735, 3045386, 3032173, 3170086, 2565955, 2165156, 1905690, 2059020, 2164679, 2330332, 2579253, 2744205, 2762986, 2735827, 2642463, 2824376, 2914324, 2673617, 2399897, 2193040, 2662627, 2604904, 2620714, 2813168, 2860252, 2801952, 2607359, 2849147, 3273143, 3493902, 3303683, 3549134, 3345492, 3258615, 3286763, 3036677, 3331727, 3535802, 3560147, 3701986, 3362149, 3645223, 3678089, 3546892]
1991C546892k18194J41071N91981J10797r4249K56557J63411k77593l17844l8501
1981C864328M31549k8212R7884K79294N811L166l14582J4862L10015J81709K37739
1970E083563O7898K43421O7344L0295q4494J6328Q53640P0637K413N49413j06054
1959F794404n35995K58510J23937k7892O1989J57324K03709K65912J92810m42300
1949G052408N20986L19036L78101j04893J38903O8064j01690O24105M70106N23621
1939I888747K90201k8806j34723k82297K03874N24943O04803M1682q9913R6773
1929A1115284N11596O33687K73357K88695M92360P72889M13281J82250J114710
1920A5798109Q9493K36333O24766M52873N42854N04573O31470P86694N75236J198855
$$ y = [3546892, 3328698, 3469769, 4061750, 4172547, 4078298, 4334855, 4498266, 4220673, 3902829, 3864328, 4295877, 4267665, 4365549, 4644843, 4650654, 4653820, 4339238, 4354100, 4664115, 4845824, 5083563, 5151461, 5394882, 5462226, 5492521, 5408027, 5424355, 6277995, 6348632, 6351045, 6900458, 6794404, 6258409, 6516919, 6640856, 6612964, 6674953, 6832277, 7035986, 7301898, 7494708, 7052408, 7573394, 7892430, 8270531, 8165638, 8304541, 8372605, 8270915, 8895020, 9365126, 9888747, 10178948, 10150142, 10015419, 9733122, 9936996, 10461939, 11066742, 11108424, 11018511, 11115284, 11626880, 12260567, 12533924, 12822619, 13314979, 14087868, 14501149, 14683399, 15798109, 15887602, 16123935, 16748701, 17201574, 17744428, 18249001, 18880471, 19667165, 20242401, 21441256]
1910B1441256R04166P47938P72855Q08581R20883J011274Q34258J276762J746321
1901C0464294J511003J383254J916712J895133K052891K179151K375122K694772
1893D6472332K684299L156192L204366L793887L832655M517177L937866L958692
1885G5557466M465199M136435K758587K196667P88573J96879j262204k124603
1877H6712999l056467k920106k436263k525961j594505k137349j573967r20921
1869F9547460q80435R6951K29267N37614R38722J059560J790203J893894K565401
1860G7778637L309870L381822M014110M829083N281071N210182N827131P099758
1852A16731664O869099P449594P836509O886612N028923K943728K23767k755641
$$ y = [21441256, 22345422, 23093360, 23866215, 24674796, 25595679, 26606953, 27441211, 28717973, 30464294, 31975297, 33358551, 35275263, 37170396, 39223287, 41402438, 43777560, 46472332, 49156631, 52312823, 55517189, 59311076, 63143731, 67660908, 71598774, 75557466, 80022665, 84159100, 86917687, 89114354, 89902927, 90099806, 88837602, 86712999, 83656532, 80736426, 78300163, 75774202, 74179697, 72042348, 70468381, 69547460, 68667025, 68763976, 68993243, 69530857, 70469579, 71529139, 73319342, 75213236, 77778637, 81088507, 84470329, 88484439, 93313522, 98594593, 103804775, 109631906, 116731664, 123600763, 131050357, 138886866, 145773478, 150802401, 153746129, 153969896, 151214255]
1844A51214255n272652p550697r153450r432649q639735p570767o422787n896794
1836I1274724n393656m389096m362069l753228k285136k045733j853501j476505
1828F5715800j062059p61756p55209k17194m2324J9397J5589Q27249J093423J412033
1818F6244949J805796J477061K067109J803961J480618J141613J051232K44468
1810G7316807j490039k176503l003060l333088m158038m696776m061563l530742
1802E0866998l607856l415055l381016k548277k064439k117253j512490j990749
1794C0229863j804022j233303j371996q93000j108450j173097n17905n54285q91860
1785B0681945j010773m34528l75156q20609p33489p89826r87967o65912n26773
$$ y = [151214255, 145941603, 138390906, 129237456, 119804807, 111165072, 103594305, 97171518, 91274724, 85881068, 81491972, 77129903, 73376675, 71091539, 69045806, 67192305, 65715800, 64653741, 63891985, 63136776, 62919582, 62877258, 62896655, 62912244, 63739493, 64832916, 66244949, 68050745, 69527806, 71594915, 73398876, 74879494, 76021107, 77072339, 77316807, 75826768, 73650265, 70647205, 67314117, 63156079, 58459303, 54397740, 50866998, 47259142, 43844087, 40463071, 37914794, 35850355, 33733102, 32220612, 30229863, 28425841, 27192538, 25820542, 24927542, 23819092, 22645995, 22128090, 21573805, 20681945, 19671172, 19236644, 18861488, 18040879, 17307390, 16517564, 15529597, 14863685, 14336912]
1776A4336912k1047l20690j65322k56556n33800n31159p75416n48845P8244k81685
1766A0980636k39049j63025M0106k46278o86573m62893k21908k61547K04813k83434
1756H660848j63003l09129J56736J44722n90275j68558k60342l83604K7680Q6304
1746G201379P8651k83104p7928l59548k34948J98228K2560o1114l63191k33762
1736E887223k03229Q5697k22133R6133J2551k42183M3921k56069l98585q8036
1726D715290j97360J92592l03457m39751K32754k60210j76940q6936L11192j32362
1716C854812J67805L25584m32619p05268j80750M95788k6458J83390l19403p6426
1706C286455k67552K00708l6697j37493l95901j843O6011K22294r2128J39407
$$ y = [14336912, 14315865, 13995175, 13829853, 13573297, 13039497, 12508338, 11732922, 11184077, 11262321, 10980636, 10741587, 10578562, 10618668, 10372390, 9685817, 9222924, 9001016, 8739469, 8944282, 8660848, 8497845, 8188716, 8345452, 8490174, 7899899, 7731341, 7470999, 7087395, 7115075, 7201379, 7280030, 6996926, 6918998, 6559450, 6324502, 6522730, 6545290, 6484176, 6120985, 5887223, 5683994, 5769691, 5547558, 5643691, 5656242, 5414059, 5457980, 5201911, 4803326, 4715290, 4517930, 4710522, 4407065, 3967314, 4200068, 3939858, 3762918, 3675982, 3987174, 3854812, 4022617, 4348201, 3915582, 3210314, 3029564, 3525352, 3498894, 3682284, 3362881, 3286455, 3018903, 3219611, 3182914, 3045421, 2649520, 2647677, 2713688, 2935982, 2843854, 2983261]
1696B983261m9224k21933l3853j51516j23052l04808P5590K28743q7861j56078
1686B159269M6551l18863M4414J90202O8500L96251l16593N9648k13010m0860
1676B075509K21370q9890p46830P5038K14872q1020L39403j58353N1019J56086
1666B057204k07691J34312L26398l38351n43809n3388J68210j04489P789O2822
1656A509007o02004J1108P32115j212r0837l52950P3627J13424l8571k29188J11943
1645A236462M0795k36788m3188K63875M8693j96093l53131L88265l9397J10482
1635A219975j78461J31932r1741p7300N1779J72019K54928j26977k48673j76028
1625I31453j95315N9582L19938K65569j39647j10636m9280m7942k17523k81477
$$ y = [2983261, 2934037, 2712104, 2678251, 2526735, 2403683, 2098875, 2174465, 2403208, 2315347, 2159269, 2205820, 1886957, 1931371, 2121573, 2190073, 2586324, 2269731, 2329379, 2116369, 2075509, 2296879, 2206989, 1460159, 1535197, 1750069, 1669049, 2008452, 1850099, 1901118, 2057204, 1849513, 1983825, 2310223, 1971872, 1428063, 1374675, 1542885, 1438396, 1446185, 1509007, 907003, 918111, 1650226, 1649014, 1558177, 1205227, 1278854, 1392278, 1353707, 1124519, 1236462, 1277257, 1040469, 997281, 1261156, 1309849, 1113756, 760625, 1148890, 1109493, 1219975, 1041514, 1173446, 1081705, 1004405, 1056184, 1228203, 1483131, 1356154, 1107481, 931453, 736138, 795720, 1115658, 1381227, 1241580, 1130944, 1081664, 1033722, 816199, 534722]
1615E34722M23891j21020m4776r2626j22926K01006K67612l61316j31688j26443
1605D26436J43839O82425j31117k05740k60651k2589l66473K0486J64203L3519
1595D84338O16251j34035m84387N26325O0234j10524l35532q0828K15986k92413
1585D65415K18651L10149J76196N502L73143n4839l71554j20518M29065n27050
1575I04160J32282M69064l68407r6007j7905J85873o3883m52955K37328K81356
1565A210906j9598n6403j6700k01763K77416p1162k43402j12793l96383P07739
1555A077857K06245k86886j80110K4474k30088J65943J30304n53999L0858L76346
1545G60944R8910Q9703P6792K80363p9757j98627m9682k25361J2949k67706j86960
$$ y = [534722, 958613, 837593, 792817, 700191, 577265, 778271, 1045883, 684567, 552879, 426436, 570275, 1252700, 1121583, 915843, 655192, 632603, 266130, 286616, 450819, 484338, 1100589, 966554, 482167, 1008492, 1068726, 958202, 622670, 541842, 757828, 465415, 684066, 994215, 1170411, 1175913, 1549056, 1494217, 1122663, 1002145, 1431210, 904160, 1036442, 1505506, 1137099, 1041092, 1023187, 1209060, 1145177, 692222, 929550, 1210906, 1191308, 1134905, 1118205, 916442, 1193858, 1122696, 879294, 766501, 370118, 1077857, 1284102, 997216, 817106, 841580, 611492, 777435, 907739, 353740, 384598, 760944, 859854, 949557, 1026349, 1306712, 1226955, 1028328, 978646, 753285, 766234, 498528, 311568]
1534C11568M23284k34346J23196J79755L2458K60j85982k31085m26486k10805
1524b18183J68257R7279j78621O10417K655l72408O33782K33736p7690k3604j83675
1513F91945l94265L89680r0157j98799k772N5202J06980j78287q5723M38879J65443
1502H98126o80029k07972J18172J87215N2396Q5151m15129K29225K05339k1618
1492D50876l07121K42106r0874R5106j65535J12483q4552j28097N2839K99623
1482D76854j272k59554j17881J33269j12239j52907j03112J91706j54934J03400
1472C330J91960j35541o09937N98285R0608J15456M01236l92425j936k81929k00127
1461b21020N9314r0019k12850l086L03379L86177J36993K38811K5458j88567l73065
$$ y = [311568, 734852, 500506, 623702, 803457, 835915, 836175, 650193, 419108, -7378, -218183, -49926, 47353, -131268, 479149, 481804, 109396, 743178, 976914, 899224, 875620, 691945, 297680, 687360, 597203, 398404, 395632, 450834, 557814, 379527, 293804, 732683, 898126, 218097, 10125, 128297, 315512, 367908, 453059, 37930, 267155, 472494, 450876, 143755, 385861, 294987, 390093, 224558, 337041, 252489, 124392, 177231, 476854, 475582, 216028, 98147, 231416, 119177, -33730, -136842, 54864, -100070, 3330, 195290, 59749, -550188, 48097, 138705, 254161, 655397, 262972, 261036, -20893, -221020, -161706, -251725, -464575, -467661, -164282, 221895, 358888, 597699, 623157, 434590, 61525]
1450F1525K21310j77754K53901m524J05656m54659J60686l05311J39243k12450
1440b12377m6201m3069K68378J77521k1235N76034l45825m09072L35850N1580
1430C31584j14606l070k23969K19584k57219N34506j7127j24553k32982j56361
1420d4213j02691m02079K98741J26696L28060j53746O8946L63870j95693r4685
1410A93206M2149j39141M15439m24058K33536l29565M1809N07275M36851k58650
1400G18851o61438L5003K81151K08571n4905p5382R9879l08027l43495l88501
1390d88293K08636L81084J39730L99700L56751L5954m35683l99995k82807L21673
1380B36750k17385j72557K97798r0784k02032p4643J92138J13025J84440P8399
$$ y = [61525, 282835, 105081, 358982, 354458, 460114, 5455, 166141, -139170, 73, -212377, -258578, -301647, -33269, 144252, 123017, 699051, 353226, -55846, 280004, 331584, 216978, 213908, -10061, 209523, -47696, 486810, 469683, 345130, 112148, -44213, -146904, -548983, -250242, -123546, 204514, 50768, 119714, 483584, 287891, 193206, 235355, 96214, 511653, 87595, 321131, -8434, 33375, 540650, 977501, 718851, 57413, 92416, 373567, 582138, 527233, 451851, 551730, 243703, -99792, -488293, -279657, 101427, 241157, 640857, 997608, 1033562, 597879, 197884, -84923, 236750, 19365, -153192, 144606, 53822, -148210, -222853, -30715, 82310, 266750, 345149]
1370C45149J7258j21142K31434k95811l93900P20835q5331j60214J35795k77245
1360A16828m3358P8216k32260M70762j43465k88118L30490K07067K3116K03227
1350G22505o53177j54873k76619L35020p5281L18933j49q2841M85509j45072n07188
1339c3233Q7708L20635J98505K847R2831r4117k22479k90524j36349J87162q0696
1328C2290n0464k09542k12617L25502M53867Q0092L3317N37550l18540n55186
1318A16269l18163J50972K50433K69181k18708p58809k5436N89104L14155m20275
1308e1277m00414R3583O9084k74952L07026J83219J15877J3876j69824k10082
1298c23884k90128J38510L05848L2280j23395L1729M21310P6239J3143J07980
$$ y = [345149, 362407, 241265, 472699, 176888, -217012, 503823, 418492, 258278, 394073, 116828, 73470, 151686, -80574, 390188, 246723, -41395, 289095, 496162, 519278, 722505, 69328, -85545, -362164, -27144, -102425, 216508, 216359, 133518, 619027, 473955, -33233, 54475, 375110, 573615, 576462, 669293, 575176, 352697, 62173, -74176, 112986, 32290, -18174, -227716, -440333, -114831, 339036, 419128, 452445, 989995, 671455, 116269, -201894, -50922, 199511, 468692, 249984, -508825, -534261, 54843, 368998, -51277, -451691, -358108, -289024, -563976, -256950, -73731, 42146, 56022, -113802, -323884, -614012, -475502, -169654, -137374, -260769, -229040, 192270, 268509, 281652, 389632]
1288C89632k35742j17729K51176j41039j56401q8689n9894M40643L8540l81316
1278f0819n6291K43241O6374m14086M92195M07754p8190l72474j29938J74045
1268B71811j67178k56617k4679K23282J15296J03754l99555j4670K93461N6744
1258B01649j74020L28688n2730q36460K10269M29749m98864K49626M27915l57974
1248g2152K38864O10382l08969n45922M8715J32920P0921p27154j00109L51483
1238c01021M07587j97587k27223K7311J60098K8680P0803J21343k0625J14886
1228A84252j39201J51753K91269k76035M85917l84660J43684K20416j8960n05376
1218A53059J9193N03513J27338j88656k05890J65039k13122o46723K89244M09530
$$ y = [389632, 153890, 36161, 287337, 146298, -10103, -98792, -158686, 281957, 320497, -60819, -117110, 126131, 192505, -221581, 270614, 678368, 600178, 227704, 97766, 271811, 104633, -151984, -176663, 46619, 161915, 265669, -133886, -148556, 144905, 201649, 27629, 356317, 303587, -532873, -322604, 107145, -391719, -142093, 285822, -72152, 166712, 777094, 468125, -77797, -29082, 103838, 174759, -552395, -652504, -301021, 106566, -91021, -318244, -290933, -130835, -102155, -31352, 89991, 69366, 184252, 45051, 196804, 488073, 212038, 697955, 313295, 456979, 677395, 658435, 153059, 172252, 675765, 803103, 614447, 408557, 573596, 360474, -286249, 2995, 412525]
1208D12525o7532j08985J92984l80990L7016L89613Q5573j12471J46938o8514
1198E26157q8952k14556k80353k03657j12173K15132L50684K66394p2049l37363
1188D9264l94019J79912K09954K43018j34925l82852M13423n7670j86136j32440
1178a92471J89229Q8246m1734l33983j11047N43000n05545N67568j55669j59857
1168a12263k73392p0420L20033L0128J04011k9663j10330J67254m31147L60295
1158d5494j17106O4189J85964J91465k83175l35516j48633M44634J68634K92727
1148D17689j6822O9576j10102m41146l57807L81426K44986L3920N1009n0411j88810
1137C3508j32574m18401M08340k67271L15284j32052l5842O1700N10884j00352
$$ y = [412525, 344993, 236008, 428992, 48002, 85018, 474631, 560204, 447733, 594671, 526157, 437205, 222649, -57704, -261361, -373534, -158402, 192282, 458676, 386627, 49264, -344755, -164843, 45111, 288129, 153204, -229648, 183775, 126105, -60031, -192471, -3242, 85004, 43270, -290713, -401760, 141240, -364305, 203263, 47594, -112263, -385655, -456075, -136042, -105914, -1903, -31566, -141896, 25358, -405789, -45494, -162600, -98411, 87553, 279018, -4157, -339673, -488306, -43672, 124962, 417689, 400867, 470443, 360341, -80805, -438612, -57186, 187800, 221720, 272729, 222318, 33508, -99066, -517467, -109127, -376398, -61114, -193166, -229008, -167308, 343576, 243224]
1127B43224R8949L77424j94239P3347j84611k72372l34492L03215k60480N04004
1117C53969j42209j97038M43267k1224m67237P4317k2491K18833J92169l14883
1107A17473j38787L06622J32971j32233m21767Q90N14183M92999m52849p7343
1097C42159J08600K20710j5599m06138J51089k80190l3913N9760l06703P7530
1087h2695O80396L34925p3648r5034j16669k3656k89137L67099j00951N8324k94655
1076C64299m38786J33939O25601k45040j00505L22082N8423k32649j98918N327
1066B93773O30671K16502k52283l30563p5961L06293K84464q92800L90892K73263
1056H44251m03170l92701L89866N27316P000R890J33595l4709R5602L48390L24705
$$ y = [243224, 342173, 719597, 525358, 598705, 414094, 141722, -192770, 110445, -150035, 353969, 211760, 14722, 457989, 436765, -30472, 43845, 21354, 240187, 432356, 117473, -21314, 285308, 418279, 286046, -135721, -134831, 379352, 872351, 419502, 342159, 450759, 671469, 655870, 249732, 400821, 120631, 86718, 146478, -160225, -82695, 597701, 932626, 858978, 763944, 647275, 623619, 334482, 701581, 600630, 658954, 364299, -74487, 59452, 685053, 440013, 339508, 661590, 720013, 487364, 288446, 293773, 924444, 1140946, 888663, 558100, 482139, 788432, 1072896, 180096, 570988, 844251, 441081, 48380, 438246, 965562, 972562, 982452, 1116047, 1081338, 1176940, 1525330, 1850035]
1045A850035j77398k93235n4618J41230k67345j6948K08184J38613k9565K4211
1035A523164l00896M9078N11503O4135J50807r25666O455J023971j93227l7229
1025A872095J16341j96204J55031K96182Q7370l3985j07545j79834k7902L0060
1015B011609L53867J65287L14158Q7848l19130P5733J83279o21513K91038j88795
1005B353381j70675K87085L32833L15152K42541l0979J36085k0985j09136K92705
995C628007M54361J18617N1483o2191n6072L76769K50106r6201P9349O12094j69559
984E186763j68922Q67726l6124K40940P26399J37290j83427M59203N14355L38973
974H083176Q1145L20649M79408L28518L54528L59986J090442Q77039Q60549P30619
$$ y = [1850035, 1672637, 1379402, 1324784, 1466014, 1198669, 1181721, 1389905, 1528518, 1498953, 1523164, 1222268, 1271346, 1782849, 1846984, 1997791, 1072125, 1078580, 2102551, 1909324, 1872095, 1988436, 1792232, 1947263, 2243445, 2330815, 2296830, 2189285, 2009451, 1981549, 2011609, 2365476, 2530763, 2844921, 2932769, 2613639, 2689372, 2872651, 2251138, 2542176, 2353381, 2182706, 2469791, 2802624, 3117776, 3360317, 3329338, 3465423, 3444438, 3335302, 3628007, 4082368, 4200985, 4252468, 4190277, 4134205, 4510974, 4761080, 4664879, 4744228, 5356322, 5186763, 5017841, 5885567, 5849443, 6090383, 6816782, 6954072, 6770645, 7229848, 7744203, 8083176, 8164321, 8484970, 8964378, 9292896, 9647424, 10007410, 11097852, 11974891, 12835440, 13566059]
964A3566059Q23513R29255P84822J603664J322857J732270J408383J587306J627530
955B5385659K019108K160378K542474L587705M649264N178803O561963P829617
947E9914971Q262741Q974500Q808287O597009K063416l616159p817828j1436521
939G1750416j3115118j0019895p766729n702988m272530l233012l146453k136539
931B2357152j599966j317468j201207p44085j011443j336222q91919j135785o09135
922A2509922j311687r27158n80617j43129n01787j85804j449154R7403O8773p96217
912F780545n837n60425K33132q497l10039m93259o95554l33732J79075j01107
902D684302j32807j70026p24992j22950P7243k01740L0472l01801j13180J9376
$$ y = [13566059, 14389572, 15318827, 16103649, 17707313, 19030170, 20762440, 22170823, 23758129, 25385659, 27404767, 29565145, 32107619, 35695324, 40344588, 45523391, 52085354, 59914971, 68177712, 77152212, 85960499, 92557508, 94620924, 91004765, 83186937, 71750416, 58635298, 48615403, 40848674, 35145686, 30873156, 27640144, 24493691, 22357152, 20757186, 19439718, 18238511, 17494426, 16482983, 15146761, 14254842, 13119057, 12509922, 11198235, 10271077, 9690460, 9547331, 9045544, 8859740, 7410586, 7507989, 7576762, 6780545, 6774708, 6214283, 6447415, 6438918, 6128879, 5635620, 4940066, 4606334, 4785409, 4684302, 4551495, 4381469, 3656477, 3533527, 3610770, 3409030, 3439502, 3137701, 3024521, 3043897]
892C043897m8654j69014J25035L34499m98687n47801M47546K25852j51712m55730
882B305231m00199L73033J92757n80996K67259j2182q4739k04026l11538Q3684
872A628284K72651j98354n15374n9656P2965m50418N05792N20545j24279p6205
862A575951m5661k15572k9335j67902j45089M1654L5309k22568P4929M98774j19763
851A280727l01613Q3396j1367K99600n85610m67355L25703j19293Q997K23284
841G36469O2126j9149k07161P106j17142O0210L9131j55821k02636K58652J64207
830F25992j45643m05514J01817L39953l62782N4409k76609M2027J2276N47026
820E32952K23523n96279q4227M9202j37031p1327N16126J01093m4370L63274j94039
$$ y = [3043897, 2995243, 2826229, 2951264, 3285763, 2787076, 2239275, 2686821, 2912673, 2760961, 2305231, 1905032, 2278065, 2470822, 1889826, 2157085, 2144903, 2060164, 1856138, 1544600, 1628284, 1900935, 1702581, 1187207, 1127551, 1200516, 750098, 1255890, 1776435, 1652156, 1575951, 1530290, 1314718, 1285383, 1117481, 972392, 1014046, 1049355, 826787, 901716, 1400490, 1280727, 979114, 1062510, 1051143, 1350743, 765133, 297778, 623481, 504188, 513185, 736469, 798595, 779446, 572285, 579391, 462249, 522459, 561590, 405769, 203133, 461785, 625992, 480349, 74835, 176652, 516605, 153823, 208232, -68377, -26350, -14074, 532952, 756475, 160196, 75969, 125171, -11860, -83187, 432939, 534032, 489662, 852936, 658897]
809F58897j25982M14709k06306k20037M994l85142j8406J71629J53823L69712
799H17891j44292l69912k55472k6694J14164m1092j08972L532O654N371L91576
788C92754K7326m06268J85916M04967l6258R8474m76221m34461K89456K49872
778B95557j22930l90641k76365L0884K92992J93222J58792K53022l2761j70121
768B31651l98045P7025J42314L7426l40858k4137J73106j01206M24058K99364
758E20698q72151k25362O79167L39682m9760P0014J22085j90140m02368K00391
748A92256k41304k73706M80324k0095m36253J55852N49803R4043m80740k58038
738b37858Q2843M17341k3652J82412k37936j92477K97085k53274J0465k07158
$$ y = [658897, 532915, 947624, 741318, 521281, 526275, 141133, 122727, 294356, 448179, 817891, 673599, 303687, 48215, 21521, 135685, 94593, -14379, -10847, -4193, 1178, 392754, 420080, 13812, 199728, 604695, 568437, 666911, 190690, -243771, 45685, 295557, 172627, -218014, -494379, -463495, -170503, 22719, 181511, 434533, 401772, 231651, -166394, -89369, 52945, 90371, -250487, -274624, -101518, -202724, 221334, 520698, -351453, -576815, 102352, 442034, 392274, 462288, 584373, 394233, -8135, 192256, -49048, -322754, 157570, 137475, -298778, -142926, 406877, 500920, 20180, -237858, -155015, 262326, 238674, 421086, 183150, -9327, 287758, 34484, 44949, -162209]
728a62209q4541j6929j14521L41414J43655n23474J66854J30837O1926r2586L46600
717A97026m25505j35754q7147O8311L54036r7896O70951k82158m91975K28791
707a320M21962o07299K01074J47610o4781n7096q781M7699J78677p0888k18844
696c1987j22507L08404j71916K18387l58450n09352L52354l34728N48229K82963
686A81397j57331j98118P6692l8896J01321L15429O9599j78766l78560n33147
676g40380L32162L66069R422l09927J53869K88352q4529L9389L82874K3042n02066
665d1723j74851K4212K06562K93055N13513l08767K6963P8045j12822k47643k30270
654B6274K53974L8140m00529j16123r5267l61183L53077J14706K80793J13621
$$ y = [-162209, -246750, -263679, -378200, -36786, 106869, -416605, -249751, -118914, -56988, -149574, 197026, -228479, -364233, -451380, -383069, -29033, -126929, 544022, 261864, -230111, -1320, 420642, -186657, 14417, 162027, 97246, 40150, 31369, 79068, 257745, 186857, -31987, -154494, 153910, -18006, 200381, -158069, -667421, -315067, -649795, -101566, 181397, 24066, -174052, -97360, -136256, -34935, 280494, 350093, 171327, -207233, -740380, -408218, -42149, -32727, -342654, -188785, 99567, 15038, 54427, 437301, 460343, -41723, -216574, -192362, 14200, 307255, 820768, 512001, 538964, 617009, 504187, 256544, 26274, 280248, 318388, -82141, -198264, -293531, -654714, -301637, -186931, 93862, 207483]
644B07483m53881K03444k08591K30578L38826l60013J63721J81521j27734l09185
634a33831Q2868J41635k01935l64426K19651N28586J9211K6711K98943n73343
624D4070k27995L01213j83968J07009m714R3700m03715j55481K90220l86440j87736
613g13837L16590O02279o71242k8639r3411j11899J96750L05657l95635K08932
603c84455K3732k12051R2819j04718J37698j75068J43818L52080k83792J19715
593b90222l35631L41901m6737k3725l41952j26043m4206M09979L08335l14858
583d63159L99850j15066J35632p1280l38330k38592j4298O4004M33233k89828
573d97834J44349j78919K33010J83354n28702k67529O39503K22430k60745j82776
$$ y = [207483, -246398, -42954, -251545, -20967, 317859, -42154, 121567, 303088, 175354, -133831, -50963, 90672, -111263, -475689, -256038, 272548, 291759, 318470, 617413, 44070, -183925, 117288, -66680, 40329, 35615, 129315, -274400, -429881, -139661, -526101, -713837, -397247, 205032, -466210, -494849, -588260, -700159, -503409, -197752, -593387, -384455, -360723, -572774, -479955, -584673, -446975, -622043, -478225, -126145, -409937, -290222, -625853, -283952, -330689, -354414, -696366, -822409, -866615, -456636, -148301, -463159, -63309, -178375, -42743, -114023, -452353, -690945, -705243, -641239, -208006, -497834, -353485, -532404, -299394, -116040, -644742, -912271, -272768, -50338, -311083, -493859]
563d93859k35182J06643L76150K00142k088l24006R7724k3635k47281O5067Q1061
552c99264j0659m2952J81000K73626m73586J05726K91642j78231m33828n20408
542a206934O6314M67287M48119o9505j7734J81824K36541k61348K24059n40168
532d71545m72828j72402K48153N19202n1344J42467K01137M71322l91854l95465
522c73157l61251K6497J62432K46562N49591l19655l81827M26859q6377k98624
512d08950J2631K44876j31864R3306O897K88565n08368r7697j12797J72143L90482
501e0776l89018M18910j62996j69502m4135p0878r7082k16138O09077J89844n2068
490c4762k07040M71700R9712k29517j69672R0119R4067M13316J90481l55951l10780
$$ y = [-493859, -729041, -622398, -246248, -46106, -48194, -372200, -274476, -298111, -545392, -480325, -399264, -409923, -452875, -271875, 1751, -471835, -366109, -74467, -252698, -686526, -1206934, -1140620, -673333, -225214, -294719, -312453, -130629, 105912, -155436, 68623, -471545, -944373, -1116775, -868622, -349420, -400764, -258297, -57160, 414162, 22308, -373157, -734408, -707911, -545479, -298917, 250674, -68981, -450808, -23949, -110326, -408950, -396319, -151443, -283307, -190001, -183104, 105461, -402907, -500604, -613401, -441258, -50776, -439794, -20884, -183880, -353382, -397517, -468395, -565477, -781615, -172538, 17306, -34762, -241802, 229898, 329610, 100093, -69579, 20540, 114607, 527923, 718404, 362453, 51673]
479E1673k07767P9353k86549K61729k10815M7415j52396k47379P10037l56525
469c11224k21893l76772O0628J7296L31173K26818J41470j61218K00466N0444
459d2812m27943M10484k88889R022j0857K69336J79973m04822k85053M06816K15071
448C0326J79308J00675j2829k80680K38633j64870m61494r0734N47700K04638
438B90673K65236l62293Q369j0150j49392l58401m2269k3281K46871k5295j87874
427c47806k44954j10965K52729l15888k7805l2861L53843L30527n10961L4593
417f19548K07836K05990P7558J84830J39074k28441J1379l12445K18839k51497
407c66425l56531K93862J5806L84639k07719K38205L44038k62438l03943n19879
$$ y = [51673, -156094, -76741, -363290, -101561, -312376, -264961, -417357, -664736, 45301, -311224, -533117, -909889, -849261, -831965, -500792, -273974, -132504, -293722, -93256, -42812, -470755, -60271, -349160, -340138, -350995, -81659, 98314, -306508, -591561, -184745, 30326, 209634, 310309, 297480, 16800, 255433, 90563, -370931, -461665, 86035, 290673, 555909, 193616, 201985, 191835, 42443, -315958, -358227, -381508, -134637, -159932, -347806, -592760, -703725, -450996, -766884, -794689, -827550, -473707, -143180, -654141, -619548, -411712, -205722, -128164, 56666, 195740, -32701, -21322, -333767, -114928, -366425, -722956, -429094, -413288, -28649, -236368, 1837, 345875, 83437, -220506, -740385]
397g40385K24140K63648l85226K50638l82404M41355o1213l05172K64575M58422
387B8378J96838k24206k9237m4787j74784K462P7103k88823O11338j39627M9561
376F4216r1596M3024o30377J70646P76509k12217j48360m24492J77223J87982
366h7442m8849J64379j37291m4679l2570j097323L0566O33598j4079J12388j50851
355f72153L1395K21353O4639j73861J4967K55083K71961q2928r4794J26280R5502
344E7444m96460J87734R8489P7387Q4515n7221j45908N7829k53560M31712j26669
333h4708m89058k6565j2737M5261n41696j89701N18975j61725P1988N99056Q5126
322a85784k8008J54422L073R1637J34762n16912k35256o5368r4287K34209J75013
$$ y = [-740385, -516245, -252597, -637823, -387185, -769589, -328234, -389447, -694619, -430044, 28378, 225216, 1010, -28227, -73014, -247798, -245336, -168233, -457056, 154282, 14655, 64216, -27380, 15644, -614733, -444087, 332422, 120205, -28155, -452647, -275424, -87442, -136291, 28088, -109203, -153882, -186452, -1283775, -1253209, -619611, -633690, -521302, -672153, -640758, -419405, -354766, -528627, -513660, -258577, 13384, -69544, -164338, -38058, 57444, -439016, -251282, -152793, -75406, 9109, -48112, -194020, -136191, -389751, 41961, -84708, -573766, -600331, -613068, -567807, -1109503, -1299204, -780229, -941954, -869966, -270910, -185784, -213792, -59370, -56297, 35340, 170102, -346810, -582066, -647434, -741721, -507512, -332499]
311c32499p0626L46738p9742j93007q6298k16404K89614j85257J7972k10637R3194
300f26952K90935K36488k86232Q9075M99208n32013r1717J50191K87506M5150
290F1639k80974j96308K60881R6546l51481l35696K16757N55623O2032m15284
280c26265M8058L05970l34034q7051L18834k73048l70959p6561p5120J07100J10792
269f52284l8139k63041K67020M06093m264j99001o2593J35342R404k97756J2835
258f86384L42141j46012l7593q4068j43646J00385K05139J59120m03151j25903
248h19972J71650K63513L46949J74485j76569m06101K80475j0020j95683J05708
238b65565L5541J28067j48004J7538k47520o4115k8762l01581j74308L51881J55954
$$ y = [-332499, -403125, -56387, -136129, -329136, -415434, -631838, -342224, -527481, -509509, -720146, -626952, -336017, -99529, -385761, -296686, 202522, -329491, -421208, -271017, 16489, 61639, -219335, -415643, -154762, -58216, -409697, -745393, -528636, 26987, 89019, -326265, -278207, 27763, -306271, -393322, -74488, -347536, -718495, -795056, -870176, -763076, -652284, -690423, -953464, -686444, -280351, -284615, -483616, -546209, -410867, -401463, -699219, -686384, -344243, -490255, -527848, -611916, -755562, -655177, -450038, -290918, -694069, -819972, -648322, -384809, -37860, 136625, -39944, -446045, -165570, -175590, -371273, -265565, -230024, -101957, -249961, -232423, -479943, -544058, -572820, -874401, -1048709, -696828, -540874]
227e40874n0561P08772m48513p6135M45327J23415j66204M1309J77389m34235
217b20310l0481j99940m56985R4756K57138J25084l5890K75810n4418j28431M10710
206C7043k02447k18476r3946k27140J76195k41506L41643J6458j30605k53554
196g96335K68919j89579J94133O0116l82184j26606N2544M30454J93406K15087
186h0045l78034j22056J5494L20252l32706j16449M0522K89049M25077j82921
176a21817j43371J9862q7815L4841K06867m34928R3184J18443Q7830j66966l41357
165g35227J72448O5273k6866k81601j28265M92168Q5608J74961k50761r6103k35031
154g63396K68316O5861l1485j6464k17035L5873J17516k84592k31531L52911l13111
$$ y = [-540874, -591435, 117337, -331176, -407311, 38016, 161431, -4773, 36536, 213925, -220310, -250791, -450731, -907716, -812960, -555822, -430738, -466628, -190818, -245236, -373667, 37043, -165404, -383880, -477826, -704966, -528771, -770277, -428634, -412176, -542781, -796335, -527416, -716995, -522862, -462746, -844930, -971536, -918992, -488538, -295132, -80045, -458079, -580135, -564641, -244389, -577095, -693544, -653022, -363973, 61104, -121817, -265188, -245326, -333141, -298300, -91433, -526361, -433177, -314734, -226904, -393870, -735227, -562779, -497506, -524372, -805973, -934238, -442070, -356462, -181501, -432262, -528365, -763396, -495080, -429219, -460704, -477168, -694203, -658330, -540814, -825406, -1056937, -704026, -1017137]
143a017137l488R6621N1342l32775N99886K38008p7437m86259J29926L63519j69733
132f07527N8704j91097o3587L88749l532m4687K82124j41712l16041k16989j45001
121a000596P1554J36364r5626J43039M5943j0561J35953K05265O3109M31567l42592
110b16581j72841P2281o605J58515Q8950J46702n75268j9619l5227J71044l36379
99g25028J20036K44010n4830J66088j73355m43504j0302M57576l00452j12703
89h32464J84156k43646j93563L62604R2251j75077J99633q5610L16423J27241
79b48052M9012j63496j67790J5815m5257J03736O2653P2948k80681j82817k24786
68a008715J69084Q708m27291J11131K20351J55380K69012l25j87583L00091l8908
$$ y = [-1017137, -1020625, -924004, -872662, -1205437, -605551, -367543, -444980, -931239, -801313, -437794, -607527, -548823, -739920, -803507, -414758, -418290, -462977, -180853, -322565, -638606, -855595, -1000596, -929042, -792678, -888304, -745265, -699322, -709883, -573930, -368665, -305556, 126011, -216581, -389422, -317141, -323746, -165231, -76281, 70421, -504847, -524466, -559693, -388649, -725028, -604992, -360982, -415812, -249724, -423079, -866583, -876885, -419309, -719761, -832464, -648308, -891954, -1085517, -722913, -630662, -805739, -606106, -691716, -375293, -248052, -199040, -362536, -530326, -514511, -559768, -456032, -393379, -320431, -601112, -783929, -1008715, -839631, -830923, -1258214, -1147083, -926732, -771352, -502340, -502665, -690248, -390157, -429065]
57d29065j73778k13527J17817J68661l6866J2004L51599k57610j00627M2643m224
46e22973l17901j14070M31322R4481P2900L40018j72832j36598J20814m34940
36f39779p5483q9403R9423k57156K47058J55685l28746k12032k9887J27571J29753
25h72996r4084K85748j07262n5624K03760J9523l9886m5789Q535J76637j87336
14g08774j48367J49550J33059j20510R6105K01563k04291j40546J75207l5232
4f02236j55497k9537K06610n2739
0f33399
$$ y = [-429065, -602843, -816370, -698553, -529892, -566758, -554754, -203155, -460765, -561392, -518749, -522973, -840874, -954944, -523622, -429141, -356241, -16223, -189055, -325653, -204839, -639779, -715262, -804665, -705242, -962398, -715340, -559655, -888401, -1100433, -1130320, -1002749, -872996, -967080, -681332, -788594, -844218, -640458, -620935, -660821, -706610, -698075, -521438, -708774, -857141, -707591, -574532, -695042, -598937, -397374, -601665, -742211, -567004, -602236, -757733, -787270, -580660, -633399]
$$ Imaginary data points
##PAGE= N=2
##DATA TABLE= (X++(I..I)), XYDATA
16383e936301j03815l3761R0665J39218L51446m2759K20781K5330l9677J62734
16373e166139J65959L39308j68497O021L79469J88494N7964j80246j85373J8708
16363d544332Q7739J08192p9814L86147K78096j10256J78481J30220J07632j77256
16353c635151J1265k08655K32101K4002j29077L28241K65485N422M8949O5539
16343b991879K67111j74577j97135K81597L4565K25114N2426j55350K78740K29575
16333b149813k68501J958R4854k3566K80534K74587k99695l7895l6462L48252
16323a815747J25065O7775l06436J71173K27787L7154r7381K10307m579k37728
16313a622610j9883R1617J81179j39607O3224J57849K93164L14069Q6783n6035
$$ y = [-5936301, -6040116, -6073877, -5983212, -5843994, -5492548, -5535307, -5314526, -5289196, -5328873, -5166139, -5000180, -4660872, -4829369, -4823348, -4443879, -4255385, -4197421, -4377667, -4563040, -4544332, -4456593, -4348401, -4428215, -4042068, -3763972, -3874228, -3695747, -3565527, -3457895, -3635151, -3623886, -3832541, -3600440, -3576438, -3705515, -3377274, -3111789, -3106367, -3057418, -2991879, -2724768, -2899345, -3096480, -2814883, -2780318, -2555204, -2502778, -2658128, -2379388, -2149813, -2418314, -2416356, -2321502, -2345068, -2064534, -1789947, -2089642, -2127537, -2163999, -1815747, -1690682, -1622907, -1929343, -1758170, -1530383, -1493229, -1590610, -1380303, -1384882, -1622610, -1642493, -1550876, -1369697, -1509304, -1446080, -1288231, -995067, -680998, -594215, -650250]
16303f50250n4893k19854L48805L52461j95115k04032j37609N83019M1667J91575
16293E5774p1360j01317L87236J34935k55478l30308K46033L01715j22288k75631
16283c0689n8588l55970M92647J55358r5372J77265L0110o2691L32892J44452
16273G29414k27898J69619K28003J85778J70095J06683J09609q3717n07490j58564
16263G21532R9885m5878N87937j08903q1057M98387q171J98928l40256k57728
$$ y = [-650250, -705143, -924997, -576192, -223731, -418846, -622878, -760487, -177468, -135801, 55774, -15586, -116903, 270333, 405268, 149790, -180518, 65515, 367230, 244942, -30689, -89277, -445247, 47400, 202758, 107386, 284651, 314761, 252070, 584962, 729414, 501516, 671135, 899138, 1084916, 1255011, 1361694, 1471303, 1387586, 880096, 721532, 821417, 775539, 1363476, 1254573, 1173516, 1671903, 1663732, 1862660, 1522404, 1264676]
$$ [...]
##END NTUPLES=NMR SPECTRUM
##END=
