##TITLE=1H_EC-3248
 CDCl3,72 sc, 
 3.03.2021
##JCAMPDX= 6.0         $$ Bruker NMR JCAMP-DX V2.0
##DATA TYPE= NMR SPECTRUM
##DATA CLASS= NTUPLES
##ORIGIN= UXNMR, Bruker Analytische Messtechnik GmbH
##OWNER= root
$$ XWIN-NMR		Version 3.5
$$ Wed Mar  3 09:47:41 2021 Russian Standard Time (UT+4h)  she@DPX200
##.OBSERVE FREQUENCY= 200.1315066352
##.OBSERVE NUCLEUS= ^1H
##.ACQUISITION MODE= SIMULTANEOUS
##.ACQUISITION SCHEME= undefined
##.AVERAGES= 8
##.DIGITISER RES= 18
##SPECTROMETER/DATA SYSTEM= spect
##.PULSE SEQUENCE= zg30
##.SOLVENT NAME= CDCl3
##.SHIFT REFERENCE= (INTERNAL, CDCl3, 0, 15.9761)
##AUDIT TRAIL= $$ (NUMBER, WHEN, WHO, WHERE, WHAT)
$$ ##TITLE= Audit trail, XWIN-NMR		Version 3.5
$$ ##JCAMPDX= 5.01
$$ ##ORIGIN= Bruker BioSpin GmbH
$$ ##OWNER= she
$$ F:/spectra/data/she/nmr/H-F/1/pdata/1/auditp.txt
$$ ##AUDIT TRAIL=  $$ (NUMBER, WHEN, WHO, WHERE, WHAT)
(   1,<2021-03-03 09:46:27.45 +0400>,<she>,<DPX200>,
      <created by zg, POWCHK disabled, PULCHK disabled
       configuration hash MD5:
       00 E9 B6 7A A2 85 ED C7 34 08 36 98 17 FE 4E 26
       data hash MD5: 16K
       89 66 2B 3C 4F 67 EB 70 4B 9F D1 36 F4 60 2D 55>)
(   2,<2021-03-03 09:46:48.76 +0400>,<she>,<DPX200>,
      <Start of raw data processing
       efp BC_mod = 2 LB = 0.24 FT_mod = 6 PKNL = 1 PHC0 = -10756.63 PHC1 = 10.60094 SI = 16K 
       data hash MD5: 16K
       8E C0 AC 48 AA 6C 5F 83 BE B3 15 29 BC 2C C4 95>)
(   3,<2021-03-03 09:47:03.07 +0400>,<she>,<DPX200>,
      <pk PHC0 = 1.011341 PHC1 = -1.8 
       data hash MD5: 16K
       16 5A 70 14 3F 58 A3 D3 D9 41 D8 AE 53 59 C1 DC>)
(   4,<2021-03-03 09:47:05.85 +0400>,<she>,<DPX200>,
      <abs ABSG = 5 
       data hash MD5: 16K
       92 3C 47 01 1B 08 99 33 A0 4C EC 66 1B C1 50 F5>)
$$ ##END=
$$ 
$$ hash MD5
$$ 68 9A 60 8E F2 D9 D6 87 32 CE 59 EC B8 24 D2 0E
##$RELAX= 
##$RELAX= 
##$RELAX= 
##$RELAX= 
##$RELAX= 
##$RELAX= 
$$ Bruker specific parameters
$$ --------------------------
##$DU= <F:/spectra>
##$EXPNO= 1
##$NAME= <H-F>
##$PROCNO= 1
##$TYPE= <nmr>
##$USER= <she>
##$AMP= (0..31)
100 100 100 100 100 100 100 100 100 100 100 100 100 100 100 100 100 100 
100 100 100 100 100 100 100 100 100 100 100 100 100 100 
##$AQSEQ= 0
##$AQ_mod= 1
##$AUNM= <au_zg>
##$AUTOPOS= <>
##$BF1= 200.13
##$BF2= 200.13
##$BF3= 200.13
##$BF4= 200.13
##$BF5= 200.13
##$BF6= 200.13
##$BF7= 200.13
##$BF8= 200.13
##$BYTORDA= 1
##$CFDGTYP= 0
##$CFRGTYP= 5
##$CHEMSTR= <none>
##$CNST= (0..31)
1 1 145 1 1 1 1 1 1 1 1 1 1 1 1 1 1 1 1 1 1 1 1 1 1 1 1 1 1 1 1 1 
##$CPDPRG= <>
##$CPDPRG1= <>
##$CPDPRG2= <>
##$CPDPRG3= <>
##$CPDPRG4= <mlev>
##$CPDPRG5= <mlev>
##$CPDPRG6= <mlev>
##$CPDPRG7= <mlev>
##$CPDPRG8= <mlev>
##$CPDPRGB= <>
##$CPDPRGT= <>
##$D= (0..31)
0 1.2 0 0 0 0 0 0 0 0.06 0 0.03 0 0 0 0 0.0002 0 0 0 0 0 0 0 0 0 0 0 0 
0 0 0 
##$DATE= 1614750386
##$DBL= (0..7)
120 120 120 120 120 120 120 120 
##$DBP= (0..7)
150 150 150 150 150 150 150 150 
##$DBP07= 0
##$DBPNAM0= <>
##$DBPNAM1= <>
##$DBPNAM2= <>
##$DBPNAM3= <>
##$DBPNAM4= <>
$$ [...]
##$SUBNAM3= <"">
##$SUBNAM4= <"">
##$SUBNAM5= <"">
##$SUBNAM6= <"">
##$SUBNAM7= <"">
##$SUBNAM8= <"">
##$SUBNAM9= <"">
##$SW= 16.9725356469052
##$SWIBOX= (0..15)
0 0 2 0 0 0 0 0 0 0 0 0 0 0 0 0 
##$SW_h= 3396.73913043478
##$TD= 16384
##$TD0= 1
##$TE= 0
##$TE2= 300
##$TE3= 300
##$TEG= 300
##$TL= (0..7)
0 120 120 120 120 120 120 120 
##$TP= (0..7)
150 150 150 150 150 150 150 150 
##$TP07= 0
##$TPNAME0= <>
##$TPNAME1= <>
##$TPNAME2= <>
##$TPNAME3= <>
##$TPNAME4= <>
##$TPNAME5= <>
##$TPNAME6= <>
##$TPNAME7= <>
##$TPOAL= (0..7)
0.5 0.5 0.5 0.5 0.5 0.5 0.5 0.5 
##$TPOFFS= (0..7)
0 0 0 0 0 0 0 0 
##$TUNHIN= 0
##$TUNHOUT= 0
##$TUNXOUT= 0
##$USERA1= <user>
##$USERA2= <user>
##$USERA3= <user>
##$USERA4= <user>
##$USERA5= <user>
##$V9= 5
##$VALIST= <valist>
##$VCLIST= <CCCCCCCCCCCCCCC>
##$VD= 0
##$VDLIST= <DDDDDDDDDDDDDDD>
##$VPLIST= <PPPPPPPPPPPPPPP>
##$VTLIST= <TTTTTTTTTTTTTTT>
##$WBST= 1024
##$WBSW= 4
##$XGAIN= (0..3)
0 0 0 0 
##$XL= 0
##$YL= 0
##$YMAX_a= 379890
##$YMIN_a= -398810
##$ZGOPTNS= <>
##$ZL1= 120
##$ZL2= 120
##$ZL3= 120
##$ZL4= 120
##$ABSF1= 15.98542
##$ABSF2= -0.9872417
##$ABSG= 5
##$ABSL= 3
##$ALPHA= 0
##$AQORDER= 0
##$ASSFAC= 0
##$ASSFACI= 0
##$ASSFACX= 0
##$ASSWID= 0
##$AUNMP= <proc_1d>
##$AZFE= 0.1
##$AZFW= 0.1
##$BCFW= 0
##$BC_mod= 2
##$BYTORDP= 0
##$COROFFS= 0
##$CY= -3
##$DATMOD= 1
##$DC= 0
##$DFILT= <>
##$DTYPP= 0
##$F1P= 0
##$F2P= 0
##$FCOR= 1
##$FTSIZE= 16384
##$FT_mod= 6
##$GAMMA= 0
##$GB= 0
##$INTBC= 1
##$INTSCL= 2.992141e-10
##$ISEN= 128
##$LB= 0.24
##$LEV0= 0
##$LPBIN= 0
##$MAXI= 10000
##$MC2= 0
##$MEAN= 0
##$ME_mod= 0
##$MI= 1.114404
##$NCOEF= 0
##$NC_proc= -7
##$NLEV= 6
##$NOISF1= 3.799351
##$NOISF2= 2.8
##$NSP= 0
##$NTH_PI= 0
##$NZP= 0
##$OFFSET= 15.9761
##$PC= 1
##$PHC0= -10755.62
##$PHC1= 8.80094
##$PH_mod= 1
##$PKNL= yes
##$PPARMOD= 0
##$PSCAL= 0
##$PSIGN= 0
##$REVERSE= no
##$SF= 200.130007707794
##$SI= 16384
##$SIGF1= 3
##$SIGF2= 2
##$SINO= 5.538805
##$SIOLD= 16384
##$SREGLST= <1H.CDCl3>
##$SSB= 0
##$STSI= 16384
##$STSR= 0
##$SW_p= 3396.73913043478
##$SYMM= 0
##$S_DEV= 0
##$TDeff= 16384
##$TDoff= 0
##$TI= <>
##$TILT= no
##$TM1= 0
##$TM2= 0
##$TOPLEV= 0
##$USERP1= <user>
##$USERP2= <user>
##$USERP3= <user>
##$USERP4= <user>
##$USERP5= <user>
##$WDW= 1
##$XDIM= 16384
##$YMAX_p= 385592816
##$YMIN_p= -638541
$$ End of Bruker specific parameters
$$ ---------------------------------
##NTUPLES= NMR SPECTRUM
##VAR_NAME=  FREQUENCY,     SPECTRUM/REAL,   SPECTRUM/IMAG
##SYMBOL=    X,             R,               I
##VAR_TYPE=  INDEPENDENT,   DEPENDENT,       DEPENDENT
##VAR_FORM=  AFFN,          ASDF,            ASDF
##VAR_DIM=   16384,         16384,           16384
##UNITS=     HZ,            ARBITRARY UNITS, ARBITRARY UNITS
##FACTOR=    0.207333158178281, 1,           1
##FIRST=     3197.29700972763, 0,            0
##LAST=      -199.44212070715, 0,            0
##MIN=       -199.44212070715, -638541,      0
##MAX=       3197.29700972763, 385592816,    0
$$ Real data points
##PAGE= N=1
##DATA TABLE= (X++(R..R)), XYDATA
$$ [...]
5478H54090n7412J29759m7988q9757q312j8049p0718J13284j61493j07584K18006
5467G53826K0078j02334R1612J67510J39589k79902l7608J48628J54882l92203
5457F64078L5776M0354P5983Q8538N569j8298J06951k02721j25116L2595J04144
5446H07853J24495N7152j5857L0142k39574n6044n8832M9076K86331j23907q0847
5435G79988q3789j41509J65347J1681J25374q983r5874Q5957j56401k29275j70010
5424B82506L50237n453j94950k05833M7035K90601K58591r7647r2090n463L27806
5413I55340n1040m8809L5276n5407K0042j98902K39128J70665j25569k46678p9607
5402F14439J02867L10549Q2816j89712j51240k75477J14698L9487n1683r8101
$$ plain form
5478 854090 796678 926437 878449 788692 780380 762331 691613 804897 643404 535820 753826
5467 753826 773904 671570 763182 930692 1070281 790379 752771 901399 1056281 664078
5457 664078 699854 740208 816191 904729 910298 892000 998951 796230 671114 703709 807853
5446 807853 932348 989500 973643 1003785 764211 708167 649335 698411 984742 860835 779988
5435 779988 696199 554690 720037 731718 857092 848109 752235 838192 681791 452516 282506
5424 282506 632743 627290 432340 226507 273542 564143 822734 725087 632997 627534 955340
5413 955340 904300 855491 890767 835360 855402 656500 895628 1066293 940724 694046 614439
5402 614439 717306 1027855 1110671 920959 769719 494242 608940 648427 596744 498643
5392D98643J5223K12932r2022l10247P0343L6945j03607J29581K62865Q590J19320
5381H48566o2859n7671J61900j06083p9345o6951P232J49255l06781p4979J76796
5370E89080L8040O134L5559P7332j37670L1895M22508N0766p8078J2055J54119
5359A201740Q0461J6643N8051J33139J5921K3998N5570j46108J30229O8824k59992
5348A378476N2448n9868j01208o0610q971q1956j12370l1034K7089J5035K3205
5337A040236l4284n0524N4189j09085q7036M4197J41657K30720J78501n4358K54188
5326A608401J41748J9414j20232J75814M993j09988J54492K99242K6605j70381
5316B030108j11766o6151M6717k47185M475L0664m6788j62657n1323N7605N7968
$$ plain form
5392 498643 513866 726798 634776 324529 394872 431817 328210 457791 720656 729246 848566
5381 848566 785707 728036 889936 783853 704508 637557 644789 794044 487263 412284 589080
5370 589080 627120 633254 668813 746145 608475 640370 1062878 1113644 1035566 1047621 1201740
5359 1201740 1282201 1298844 1356895 1490034 1505955 1529953 1585523 1439415 1569644 1638468 1378476
5348 1378476 1430924 1371056 1269848 1209238 1200267 1118311 1005941 974907 1001996 1017031 1040236
5337 1040236 1005952 955428 1009617 900532 813496 857693 999350 1230070 1408571 1354213 1608401
5326 1608401 1750149 1769563 1649331 1825145 1830138 1720150 1874642 2173884 2200489 2030108
5316 2030108 1918342 1852191 1898908 1651723 1656198 1686862 1640074 1477417 1426094 1483699 1541667
5305A541667J30340j12591j01652j29257j084L390J01891K256q4924l6229j15403
5294A198404J37639L7395J00296R2262N048R7239J78133J82821k47609Q3470J83077
5283B048175K02320k556j01609k481j25760j3061k10436l7741p6313O1143K65101
5272B006782k65684j30745R0893J64680J98051j65219K9248J55287J0722j44817
5262A949198J31544n9477j79577R4132J76556K48191j29899j31731p6563J95984
5252B218358r6980m4558L39623K6361r6964J94851O6785j17852j28916J8578J21382
5241B500668N7834q0664L65848J8209n2761J10194M3513J79588M6698q558J94580
5230C375149N9335j35137K41406K53769N265N0988l6377Q4627P2597j08605j2075
$$ plain form
5305 1541667 1672007 1559416 1457764 1328507 1327423 1330813 1432704 1434960 1350036 1313807 1198404
5294 1198404 1336043 1373438 1473734 1565996 1571044 1668283 1846416 2029237 1781628 1865098 2048175
5283 2048175 2250495 2247939 2146330 2143849 2018089 2005028 1794592 1756851 1680538 1741681 2006782
5272 2006782 1741098 1610353 1701246 1865926 2063977 1898758 1928006 2083293 2094015 1949198
5262 1949198 2080742 2021265 1841688 1935820 2112376 2360567 2230668 2098937 2022374 2218358
5252 2218358 2121378 2076820 2416443 2442804 2345840 2540691 2607476 2489624 2360708 2379286 2500668
5241 2500668 2558502 2477838 2843686 2861895 2809134 2919328 2962841 3142429 3189127 3180569 3375149
5230 3375149 3434484 3299347 3540753 3794522 3799787 3850775 3814398 3899025 3971622 3863017 3850942
5219C850942n6861J80852J1341L27671Q4491j73643k8553O7566N7455Q6316J99651
5208D607228K42579k15228l084l8872k09347q7309K52035J74669J56999r7584
5198D782086o7184J79957J68652L56883Q4566Q7441Q2565K61585L32985J08468
5188F378004j35407K89185J08079J25289M01958k20K06195J76455K85469K9810
5178G864817J03568M55172J8370K34786J36797K34056L82589K94425K8879J93482
5168I946941L52167L36483L34361L52288L28771L38114K62968M39748N94085O21654
5158A3907580O40770N96447P25524O47313Q85251J266882J122740J205158J459826
5149B2457491J727605J668100K017449K312911K379971K615411K819012L078480
$$ plain form
5219 3850942 3794081 3974933 3986274 4313945 4398436 4224793 4196240 4263806 4321261 4407577 4607228
5208 4607228 4849807 4634579 4631495 4592623 4383276 4295967 4548002 4722671 4879670 4782086
5198 4782086 4714902 4894859 5063511 5420394 5504960 5592401 5674966 5936551 6269536 6378004
5188 6378004 6242597 6531782 6639861 6765150 7167108 7166888 7373083 7549538 7835007 7864817
5178 7864817 7968385 8423557 8441927 8676713 8813510 9047566 9430155 9724580 9753459 9946941
5168 9946941 10299108 10635591 10969952 11322240 11651011 11989125 12252093 12691841 13285926 13907580
5158 13907580 14548350 15144797 15870321 16517634 17402885 18669767 19792507 20997665 22457491
5149 22457491 24185096 25853196 27870645 30183556 32563527 35178938 37997950 41076430
5141D1076430L277441L269159L085814K462644J449732K65696l92288j389211
5133E3105417k115975k638182k807848k480455j983396j397724j170067p11081
5125C7800689m98309K6342J84071N74607P70990J021058J484693J859981K141757
5116D5365879K772104L129787L411346M025089M625683M822216N448170O273211
5108G9873485O493096O434528N352471L972156J694488r35164l881316o192631
5100I2811113p897905q269491p083253o584199n358632m388798l504204l068151
5092D6656480k419554j845888j445917j272108q01252p49482k60903K21346K86546
5083C8369268N44855J278543J005555J112141J577653J984437K068668K480600
$$ plain form
5141 41076430 44353871 47623030 50708844 53171488 54621220 54886916 54494628 53105417
5133 53105417 50989442 48351260 45543412 43062957 41079561 39681837 38511770 37800689
5125 37800689 37302380 37328722 37512793 38087400 38858390 39879448 41364141 43224122 45365879
5116 45365879 48137983 51267770 54679116 58704205 63329888 68152104 73600274 79873485
5108 79873485 86366581 92801109 98153580 102125736 103820224 102885060 99003744 92811113
5100 92811113 84913208 76643717 69560464 62976265 57617633 53228835 49724631 46656480
5092 46656480 44236926 42391038 40945121 39673013 38871761 38122279 37861376 38082722 38369268
5083 38369268 38914123 40192666 41198221 42310362 43888015 45872452 47941120 50421720
5075E0421720K279104J830114J414710O30507p18589j776336k730441l772802
5067D7577987l902775l918021l858287l257761k819162k469524j925796j854269
5059B3572392j636362j441828j387446j151321r10607p75225o88112p33125q10837
5050A4037529o85853k70578m34372m38228p36575l54143m37026k51203n09194
5041I920357k60424l10982k96633l40472m32552k20283j12475m2259l87354k25851
5031G291072k04735l35987k42816k62628p69l63051j64516p8846k01735j35205
5021E300784J4804j25958R197M3912K835l61415l40967o1216J38074l05545N0405
5010D364910J4256j40701j25928m5868j59945k01087j40429j47055K2010l6671
$$ plain form
5075 50421720 52700824 54530938 55945648 56576155 55857566 54081230 51350789 47577987
5067 47577987 43675212 39757191 35898904 32641143 29821981 27352457 25426661 23572392
5059 23572392 21936030 20494202 19106756 17955435 17044828 16269603 15581491 14848366 14037529
5050 14037529 13351676 13081098 12646726 12208498 11471923 11117780 10680754 10429551 9920357
5041 9920357 9659933 9348951 9052318 8711846 8279294 8059011 7946536 7904277 7516923 7291072
5031 7291072 7086337 6750350 6507534 6244906 6244137 5881086 5716570 5637724 5435989 5300784
5021 5300784 5315588 5189630 5198827 5242739 5245574 4884159 4543192 4481976 4620050 4314505 4364910
5010 4364910 4379166 4238465 4112537 4066669 3906724 3705637 3565208 3418153 3440163 3403492
5000C403492q3360k92009r5090P8421j2143J6993q8917M9726K32420l18459m68305
4989B422769J62641K17202j14907l54905j18882J03538j23807k25142R6380K85233
4979B350120p4593m70n0013p5353k22780m4331J85000o9848l21937R9909K93522
4968B069226j9381l20968J09453R0089j00496J4151J11468P8188j24423p2299
4958A835008R575j45143J33197r7724l7450j43592r8839M0434J3826K8774K55976
4947A794042n1572k17075j51881L138O4484N178k4241o3510j46439q6214M31210
4936A557120R3162J3321J6847j31255l2497N9344j68374Q7259O3444J5140J6100
4925A589611k66751J03305p9707J41290p6561j49207L5027M2122p0922J648j36305
$$ plain form
5000 3403492 3320132 3028123 2933033 3011454 2999311 3016304 2927387 2977113 3209533 2891074 2422769
4989 2422769 2585410 2802612 2687705 2332800 2213918 2317456 2193649 1968507 2064887 2350120
4979 2350120 2275527 2275057 2225044 2149691 1926911 1882580 2067580 1997732 1675795 1775704 2069226
4968 2069226 2049845 1728877 1838330 1928419 1827923 1842074 1953542 2031730 1907307 1835008
4958 1835008 1844583 1699440 1832637 1734913 1697463 1553871 1455032 1495466 1509292 1538066 1794042
4947 1794042 1742470 1525395 1373514 1376652 1441136 1446314 1422073 1358563 1212124 1125910 1557120
4936 1557120 1650282 1663603 1680450 1549195 1516698 1576042 1407668 1494927 1558371 1573511 1589611
4925 1589611 1322860 1426165 1346458 1487748 1411187 1261980 1297007 1339129 1268207 1269855 1133550
4914A133550Q5816M5862J08684Q5829j37568j13879J83986q0008R843j91513k57157
4903H73445J54204K535r6719j73773o5273J36555J97558p1178l39014L4085M8890
4892G01315J44676L6575J51909J95825j15239r0486N1152O535j23441j10440j56054
4881F92327J34364j30637r3305J50247J7173J12113P2727o7210n1754r0618j5771
4870G29656R8455k6561j33768M1126k8965J32658O9305J77160J73920j34384J12402
4859A211004R4715j17956M3621j24685L9141j13633N0872N8384j0831k22122q6262
4848H22248K8990J9308K31443K4460k4982q5234q497K23604l241K2231n0657J43942
4836A343615k5742l8837K31552J19770P677J60903R4692M3520k65650K7116k6410
$$ plain form
4914 1133550 1219366 1265228 1373912 1459741 1322173 1208294 1392280 1312272 1322115 1130602 873445
4903 873445 1027649 1030184 933465 759692 694419 830974 1028532 957354 618340 652425 701315
4892 701315 845991 882566 1034475 1230300 1115061 1024575 1075727 1082262 958821 848381 692327
4881 692327 826691 696054 602749 752996 770169 882282 955009 887799 836045 745427 729656
4870 729656 828111 801550 667782 708908 679943 812601 881906 1059066 1232986 1098602 1211004
4859 1211004 1305719 1187763 1231384 1106699 1145840 1032207 1083079 1141463 1130632 908510 822248
4848 822248 851238 870546 1101989 1126449 1101467 1016233 1007736 1231340 1228099 1250330 1199673 1343615
4836 1343615 1317873 1279036 1510588 1630358 1638035 1798938 1893630 1937150 1671500 1698616 1672206
4825A672206r6416j45876J05222j48200k00665J27149J51905J4136R7451j59992
4815A416920q0901p9092n0041j89804L8497J93460k03076K86359O9304j07483
4805A294143j30507J30730J40925k1180o661J074n0187J21176k0010m1982J6286
4794A433807J62811K22700j26430j64856k75164L7227k6521o8248L4168K13177
4784A442671m6928J7174J983n2693K07217k04303O2348j49333j2430J852o900
4773A260658j55349O8756K22362M1120r6874r3549L6339L45685J1851k6464K22855
4762A837390j00188m1155M1757k2731o4085j63323J23549L548O6972j91295r4658
4751A395781K32240q5843L4817k03378l1015j23935j29249J86068J08848J33668
$$ plain form
4825 1672206 1575790 1429914 1535136 1386936 1186271 1313420 1465325 1479461 1576912 1416920
4815 1416920 1336019 1256927 1206886 1017082 1055579 1249039 1045963 1332322 1401626 1294143
4805 1294143 1163636 1294366 1435291 1414111 1407450 1408524 1358337 1479513 1459503 1417521 1433807
4794 1433807 1596618 1819318 1692888 1528032 1252868 1290095 1263574 1195326 1229494 1442671
4784 1442671 1395743 1412917 1414900 1362207 1569424 1365121 1427469 1278136 1265706 1267558 1260658
4773 1260658 1105309 1174065 1396427 1437547 1340673 1247124 1283463 1629148 1640999 1614535 1837390
4762 1837390 1737202 1696047 1737804 1715073 1650988 1487665 1611214 1614762 1681734 1490439 1395781
4751 1395781 1628021 1542178 1576995 1373617 1342602 1218667 1089418 1275486 1384334 1518002
4741A518002j32143L3339j5495R5444m0458j2543N4222l2083J6604m0844J75779
4730A619824p1291L54931M4748m60102J09174p0447N0390m4341K6337L4179j70773
4719A422629J57071L09040p4889n5306j75886O0407J21259j72071j20450q852
4709A462952J06161K907j28350N1932J29500j58542j64233o575J88311j05663
4699A378400n5316j31602J2275K3320J49277P2325q242J88163J7261n0112j69165
4688A426584L9743K15402o1358J23361J00971Q3178M1815j7052o9520m5102j43701
4677A694321j79477l057N8646J02374k99001J03454J69945R2088j6566K90957
4667B013684m6301j1302Q0445P2488j59698O5635J09347K02735J37273k79409
$$ plain form
4741 1518002 1385859 1419198 1403703 1499147 1458689 1446146 1500368 1468285 1484889 1444045 1619824
4730 1619824 1548533 1903464 1948212 1488110 1597284 1526837 1577227 1532886 1559223 1593402 1422629
4719 1422629 1579700 1888740 1813851 1758545 1582659 1643066 1764325 1592254 1471804 1462952
4709 1462952 1569113 1572020 1443670 1495602 1625102 1466560 1302327 1295752 1484063 1378400
4699 1378400 1323084 1191482 1203757 1227077 1376354 1448679 1440437 1628600 1645861 1595749 1426584
4688 1426584 1466327 1681729 1620371 1743732 1844703 1927881 1969696 1952644 1883124 1838022 1694321
4677 1694321 1514844 1511787 1570433 1672807 1373806 1477260 1647205 1739293 1722727 2013684
4667 2013684 1967383 1956081 2036526 2109014 1949316 2014951 2124298 2327033 2464306 2184897
4657B184897K5041K21960m8897O9403P4659l36731K84595J31101K866P6819j1293
4646B674420O4611J58060K07789L24337l7328K6565m9289K60194J97817K1693
4636C848869J5945k9676R8293R3952K27349J37512j20622O7228m7248K6362K36847
4625D554811j5371K4117L08673j8101J78037j6051j6041N0431J4608J4898J6786
4614E096797O1744j54651L2616m6149j9614K23039N4158p3790k06574J05145J76177
4603E248898J16523l6889p6473J38797J05589K00394k2089J36550L64818m79K13035
4592F388674K23528j30369J66941N7797O4218j899K56710J51584j40044J10479
4582G147619J26036M8771K27863L9709R5913J94648K14550J43471L19934K08052
$$ plain form
4657 2184897 2209938 2431898 2383001 2452404 2527063 2190332 2474927 2606028 2608894 2685713 2674420
4646 2674420 2739031 2897091 3104880 3429217 3391889 3418454 3369165 3629359 3827176 3848869
4636 3848869 3864814 3835138 3933431 4027383 4254732 4392244 4271622 4338850 4291602 4317964 4554811
4625 4554811 4539440 4563557 4872230 4854129 5032166 5016115 5000074 5050505 5065113 5080011 5096797
4614 5096797 5158541 5003890 5036506 4990357 4970743 5193782 5247940 5174150 4967576 5072721 5248898
4603 5248898 5365421 5328532 5252059 5390856 5496445 5696839 5674750 5811300 6176118 6175639 6388674
4592 6388674 6612202 6481833 6648774 6706571 6770789 6768890 7025600 7177184 7037140 7147619
4582 7147619 7273655 7322426 7550289 7589998 7685911 7880559 8095109 8238580 8558514 8766566
4572H766566K5111K51788J7529J20920M25238L19242K14956L92977J56821K95962
4562A0987110N18954O45321J58325K49558M64339M01146M17428O30711M14468
4553A4887360N09327O18321K56763N39797N58434N34031O34219O67902P01835
4544A9907989R41994Q77798R01905P83516J105678J218835R87548J145014J167430
4535B9037707J524799J487546J523699J875977K186280K436678K499286K709476
4527D5281448L190803L893274M123340M515848N338206N638895N835284O731128
4519H4548226P456907P508913Q110159Q636265Q519247Q397497Q015592P487874
4511A48680680O691106N914692M289801K250838K03888k188747m685451p090839
$$ plain form
4572 8766566 8791677 9043465 9060994 9181914 9607152 9926394 10141350 10534327 10691148 10987110
4562 10987110 11506064 12151385 12309710 12559268 13023607 13424753 13842181 14472892 14887360
4553 14887360 15396687 16015008 16271771 16811568 17370002 17904033 18538252 19206154 19907989
4544 19907989 20849983 21727781 22629686 23413202 24518880 25737715 26725263 27870277 29037707
4535 29037707 30562506 32050052 33573751 35449728 37636008 40072686 42571972 45281448
4527 45281448 48472251 52365525 56488865 61004713 66342919 71981814 77817098 84548226
4519 84548226 92005133 99514046 107624205 116260470 124779717 133177214 141192806 148680680
4511 148680680 155371786 161286478 165576279 167827117 168031005 165842258 161156807 154065968
4503A54065968q415911r329671r943442r940331r695878r039533q352393p864266
4495H1484543o922320o248794n462250m420858m209572l834167l450810l004362
4487D3931410k683784k332577k388339k225437j969875j866743j622647j473380
4479B7368628j505613j205204j215727r87533r74238q59731p07204q04734m56561
4470A8652083o57568p58073m24137m89523n48537o91400n01441o33824m21380
4461A3526200n59540k58227j06942k51887j56330j93783m54733m13766j66316
4452A0964676l85317l70221n57407j90992j90322j65939k11589l59641n8503k02538
4442H272207j64764l35881j19916p0484j25454p5223j79428l40380m4422k62238
$$ plain form
4503 154065968 145650057 136320386 126376944 116436613 106740735 97701202 89348809 81484543
4495 81484543 74562223 68313429 62851179 58430321 54220749 50386582 46935772 43931410
4487 43931410 41247626 38915049 36526710 34301273 32331398 30464655 28842008 27368628
4479 27368628 25863015 24657811 23442084 22454551 21480313 20620582 19913378 19108644 18652083
4470 18652083 17994515 17236442 16812305 16322782 15774245 15082845 14581404 13947580 13526200
4461 13526200 12966660 12708433 12601491 12349604 12193274 11999491 11544758 11130992 10964676
4452 10964676 10579359 10209138 9651731 9460739 9270417 9104478 8892889 8533248 8474745 8272207
4442 8272207 8107443 7771562 7651646 7581162 7455708 7380485 7201057 6860677 6816255 6554017
4432F554017k57646J15439J88296L803k06332k82173j56400J06523o0196j87151
4422E818180k34523J3174L8433j80114q2367O2327j55275K0905m4667M4598l78664
4411D922007L6152j13195O7129k22485j7852j71584j34635J11149j79636l19537
4401C977513j26585j01948j42294j79075l15L1037j15921k32459j93927j20265
4391B795761J61983J6684j67342q4506j13077K0889Q6910R1965q3176l9163O3018
4380B749946J97790O8779j05556q2612J439M9169J09443J88960Q8256n0795k57663
4369B957156J03114K58646j59234j51595R0340N3815n0255j51652K3400J14201
4359C087936k39626J24811j61056k32641R6618J89804j97205j31995p2209l96205
$$ plain form
4432 6554017 6296371 6411810 6600106 6603909 6397577 6115404 5959004 6065527 6005331 5818180
4422 5818180 5583657 5596831 5635264 5455150 5372783 5435110 5279835 5300740 5256073 5300671 4922007
4411 4922007 4958159 4844964 4912093 4689608 4671756 4500172 4365537 4476686 4297050 3977513
4401 3977513 3850928 3748980 3606686 3427611 3427296 3458333 3342412 3109953 2916026 2795761
4391 2795761 2957744 2974428 2807086 2722580 2609503 2630392 2717302 2809267 2726091 2686928 2749946
4380 2749946 2947736 3016515 2910959 2828347 2829786 2878955 2988398 3177358 3265614 3214819 2957156
4369 2957156 3060270 3318916 3159682 3008087 3098427 3152242 3101987 2950335 2973735 3087936
4359 3087936 2848310 2973121 2812065 2579424 2676042 2865846 2668641 2536646 2464437 2068232
4349B068232j44391J27006K85071L1671j03240Q1925n6948J51470J10643j44989
4339B406450J26903L6991J84381r8119k13360K76275L6733j31152j75900n2089
4329B397113l7174q64j9236r8376P4733k27300k22241J55337n1591K1109l3731
4318A957779j19947K82777p749l34193N5958K5766R386r8563k6801K84696j33471
4307A895638j46011j2345N2912r5245j07972L16009J28506L7769n7320j4058n2439
4296A945444J1401q493m2437R942J7054J8345O1806j5775r4829J7821J01740Q4144
4284B106163K18591L2040K59882N1359J00942j7268L969N7249l8745j32803P2224
4273B713603K61253j12687K75530J15939N4966K25363J3168R2468L94162N31527
$$ plain form
4349 2068232 1923841 2050847 2335918 2367589 2264349 2346274 2289326 2440796 2551439 2406450
4339 2406450 2533353 2570344 2754725 2656606 2443246 2719521 2756254 2625102 2449202 2397113
4329 2397113 2359939 2359075 2339839 2241463 2316196 2088896 1866655 2021992 1970401 1991510 1957779
4318 1957779 1837832 2120609 2112860 1778667 1834625 1860391 1869777 1771214 1744413 2029109 1895638
4307 1895638 1749627 1737282 1790194 1694949 1586977 1902986 2031492 2069261 2011941 1997883 1945444
4296 1945444 1956845 1948352 1905915 1915857 1932911 1951256 2013062 1997287 1902458 1920279 2022019 2106163
4284 2106163 2324754 2356794 2616676 2668035 2768977 2751709 2755678 2812927 2774182 2641379 2713603
4273 2713603 2974856 2862169 3137699 3253638 3308604 3533967 3547135 3639603 4033765 4565292
4263D565292K76183M13161N56870L75680N27039R66717R89302J262547J292687
4254A1225478J470526K098954K007207J360612R58833O34404o23338k634537l106116
4245A3392023k487397j951487j323292q50703p84891o06532n49855q2273j11094
4236D644499n16294j30663j02505k17918k65910j90112k45090J53389l7397j02025
4226B989974k81951M410j60290j02740j35548j74836K84184o4206J7638l4149
4216B342486p5741j44627n02J86718j72921k56791o4197J26513J22872J05928
4206B169738l37721j83799Q5934j28409N513R7631K50729J41177N3520l10244
4196A844069J9890m1502O5302J67298j3474o9835M5347j44963q2346N6082J03147
$$ plain form
4263 4565292 4841475 5254636 5811506 6187186 6714225 7680942 8670244 9932791 11225478
4254 11225478 12696004 14794958 16802165 18162777 19121610 19756014 19132676 16498139 13392023
4245 13392023 10904626 8953139 7629847 6779144 5994253 5387721 4837866 4755593 4644499
4236 4644499 4128205 3997542 3895037 3677119 3411209 3221097 2976007 3129396 3091999 2989974
4226 2989974 2708023 2712433 2552143 2449403 2313855 2139019 2423203 2358997 2376635 2342486
4216 2342486 2266745 2122118 2121616 2308334 2135413 1878622 1814425 1940938 2063810 2169738
4206 2169738 1832017 1648218 1734152 1605743 1611256 1708887 1959616 2100793 2154313 1844069
4196 1844069 1863959 1822457 1887759 2055057 2041583 1971748 2017095 1872132 1789786 1845868 1949015
4185A949015K16937J49315r0475q7621q1342j12222L06089j40485o0365j36978
4175A911868J5707j97615J07524M041j71417l5927J1519j35845M5365N1040P679
4164A613939j48152J44064j4303o011k22967J53391P8023K0190j5551k31009j04407
4153A267207J97307K5921r9863l8683j81848J28054R3249r9115j66740N9435N4948
4142A239872r0962J63553J4087P5928j27025r0566L51464L06054J30108o4725
4132A907788J3269P9729Q4018J19725J43776j62171J31893K142m9596j69617o3032
4121B037924j83495n039l5374Q8036M6577k19219P5254P9954j16968Q2980R6309
4110A946939m2378O9494R0601p7468j21540J62513N5924J4809k57J32131l9861
$$ plain form
4185 1949015 2165952 2315267 2224792 2137171 2055829 1943607 2249696 2109211 2048846 1911868
4175 1911868 1927575 1729960 1837484 1841525 1670108 1634181 1645700 1509855 1555220 1606260 1613939
4164 1613939 1465787 1609851 1595548 1589537 1366570 1519961 1597984 1618174 1602623 1371614 1267207
4153 1267207 1464514 1490435 1390572 1351889 1170041 1298095 1391344 1292229 1125489 1184924 1239872
4142 1239872 1148910 1312463 1326550 1402478 1275453 1184887 1536351 1842405 1972513 1907788
4132 1907788 1921057 2000786 2084804 2204529 2348305 2186134 2318027 2320169 2270573 2100956 2037924
4121 2037924 1854429 1849390 1814016 1902052 1948629 1729410 1804664 1884618 1767650 1850630 1946939
4110 1946939 1904561 1974055 2064656 1987188 1865648 2028161 2084085 2098894 2098637 2230768 2190907
4099B190907j71830K07846J01395r8457j75965K94614o074J49618p4181n5657
4089B362216q2358J19651O5960J75996K89547M4248j41282l0750j01422n4188
4079B647618J69990J88510k31382J97799J52947j74731j16687J86132Q416j09022
4069B919590j30807m9782L25015J6729L57139N7087O9115n2819J6806J78428O7845
4058C774346N8471r9732j54261j79897K18434J11506k05618m7991J8591L7557
4048C531406K3446l8822M2666O3381j5840j93184m2915q9165L6715q6377j40710
4037C090601K69627J4175k56323M0076J42859p096Q2851j46189K63939J29469
4027C623989j50676M106K87305j69962p7416P5010J16778j27506j03073o7369
$$ plain form
4099 2190907 2019077 2226923 2328318 2229861 2053896 2348510 2342436 2492054 2417873 2362216
4089 2362216 2279858 2399509 2465469 2641465 2931012 2975260 2833978 2803228 2701806 2647618
4079 2647618 2817608 3006118 2774736 2972535 3125482 2950751 2834064 3020196 3028612 2919590
4069 2919590 2788783 2739001 3064016 3080745 3437884 3494971 3564086 3511267 3528073 3706501 3774346
4058 3774346 3832817 3733085 3578824 3398927 3617361 3728867 3523249 3475258 3493849 3531406
4048 3531406 3554852 3516030 3558696 3622077 3606237 3413053 3370138 3280973 3317688 3231311 3090601
4037 3090601 3360228 3374403 3118080 3158156 3301015 3293919 3376770 3230581 3494520 3623989
4027 3623989 3473313 3477419 3764724 3594762 3517346 3592356 3709134 3581628 3478555 3411186
4017C411186r9407J55798K0492J14795K4881k420l2847J19367j34539j63397q740
4006C405169K57893J825k40599j6278J25479J6313k58113J90081N8975L2868J40685
3995C714298k22366k86183L404m473J48686J46863L8841j1913Q2908n8523n1418
3984C500124N3300P9227j13011j27285j85490Q8405L6435r1375L1511J18178J31374
3973C521393m2576j12017P7428K9690J7903n8352j30799K64551j63998k241P1193
3962C472175k2902L59997k26611k3469J40769n5103o556n8354j2254J90240J7334
3951C775266J59J60767L4650J16119j31128j81479Q5784J36856M3346L2140j9692
3940D052788J52421J03592P0383J73949Q7227J08937j13442J74525K63974q1672
$$ plain form
4017 3411186 3311779 3467577 3488069 3602864 3627745 3625325 3592478 3711845 3577306 3413909 3405169
4006 3405169 3663062 3664887 3424288 3408010 3533489 3549802 3291689 3481770 3540745 3573613 3714298
3995 3714298 3491932 3205749 3209153 3204680 3353366 3500229 3539070 3527157 3610065 3551542 3500124
3984 3500124 3553424 3632651 3519640 3392355 3206865 3295270 3331705 3240330 3271841 3390019 3521393
3973 3521393 3478817 3366800 3444228 3473918 3491821 3433469 3302670 3567221 3403223 3400982 3472175
3962 3472175 3449273 3809270 3582659 3559190 3699959 3644856 3638300 3579946 3567692 3757932 3775266
3951 3775266 3775425 3936192 3970842 4086961 3955833 3774354 3860138 3996994 4040340 4072480 4052788
3940 4052788 4205209 4308801 4379184 4553133 4640360 4749297 4635855 4810380 5074354 4992682
3930D992682K50989J84009j13630o0407j1039J71519O6229N6442J01165L8010
3920E675969K7331J7199m4220M7132J21134P7789Q1949J63959k24041R877J17656
3909F071734J12712r627r764K38646j47788O6398l0845l2934K16336O0604k58604
3898F276868j93807J2332K12189j24136J8624J50754J26418M6347J11576K19199
3888F856364K15067J4322K4153J87791K63822J38208Q6434l9435Q2920l8506L6434
3877G827574L5803M22456K01694k378K31157L32394K23958K57679K50023N432
3867I785792r1078L30684L71195J12498q4818K23692L19997K950J65639L20744
3857A1457295L15427J66619R6064J28643N20191K63422R1379L89701L49070L69016
$$ plain form
3930 4992682 5243671 5427680 5314050 5253643 5242604 5414123 5480352 5536794 5637959 5675969
3920 5675969 5703300 5720499 5676279 5723411 5844545 5922334 6004283 6168242 5944201 5954078 6071734
3909 6071734 6184446 6174819 6165055 6403701 6255913 6322311 6291466 6258532 6474868 6535472 6276868
3898 6276868 6083061 6095393 6307582 6183446 6202070 6352824 6479242 6525589 6637165 6856364
3888 6856364 7071431 7085753 7109906 7297697 7561519 7699727 7786161 7746726 7829646 7791140 7827574
3877 7827574 7863377 8285833 8487527 8485149 8716306 9048700 9272658 9530337 9780360 9785792
3867 9785792 9694714 10025398 10396593 10509091 10424273 10647965 10967962 10970912 11136551 11457295
3857 11457295 11772722 11939341 12035405 12164048 12684239 12947661 13039040 13428741 13777811 14146827
3847A4146827N52249M82364L09962L88157M30068L69008M40453L45131K15730
3838A7679949K72641K39005J24223L68580N05514M56370L52248L94947O30442
3829B1023919L21168L45764K56122K82262O37385N73583N96285O39171O47697
3820B5323356O87119Q92333Q18551O64362J025592J121954J521212J984206K070351
3811C6109036K478987K731104L128311L640369M476052M834904N616188O881652
3803F9896603Q819115J0707525J1452985J1514041J0847974P852901L447550l190070
3795A31348624r091196j3738997j5813738j3901263j0320514p237658n234408
3788E6010850l805760k777599j947513j341991j227474q14585o99044p04619k63041
$$ plain form
3847 14146827 14699076 15181440 15491402 15879559 16309627 16678635 17119088 17464219 17679949
3838 17679949 17952590 18191595 18315818 18684398 19189912 19646282 19998530 20393477 21023919
3829 21023919 21345087 21690851 21946973 22229235 22866620 23440203 24036488 24675659 25323356
3820 25323356 26010475 26902808 27721359 28385721 29411313 30533267 32054479 34038685 36109036
3811 36109036 38588023 41319127 44447438 48087807 52563859 57398763 63014951 69896603
3803 69896603 78715718 89423243 100876228 112390269 123238243 131091144 134538694 131348624
3795 131348624 122257428 108518431 92704693 78803430 68482916 61245258 56010850
3788 56010850 52205090 49427491 47479978 46137987 44910513 44095928 43396884 42692265 42429224
3779D2429224j31270J40925J03P923J28725K06686L11445O19897M71352L68015
3769D4553025N45017P20607P19195Q01350R49993J086896J398339J202700J175083
3760E3152205J493344J868297J417000J822175J852733J433890J914400J921613
3752F6875657J979663K366902K438155K548982K997644L548431M164967M602700
3744I1523101N133976N974037O697654P310858Q464727R800239J1192252J2938798
3736A59035642J5260216J7986584J9590398J9509859K0176084J9708793J5746475
3729B87014051Q550051K937067K46945k800859m971675l917351q73279J114631
3721B87299581J487378Q73211r36870l529603o104390q206161j0283778j1569301
$$ plain form
3779 42429224 42297954 42438879 42438982 42446905 42575630 42782316 43093761 43713658 44185010 44553025
3769 44553025 45098042 45818649 46537844 47339194 48289187 49376083 50774422 51977122 53152205
3760 53152205 54645549 56513846 57930846 59753021 61605754 63039644 64954044 66875657
3752 66875657 68855320 71222222 73660377 76209359 79207003 82755434 86920401 91523101
3744 91523101 96657077 102631114 109328768 116639626 125104353 134904592 146096844 159035642
3736 159035642 174295858 192282442 211872840 231382699 251558783 271267576 287014051
3729 287014051 295564102 298501169 298748114 295947255 290975580 287058229 286184950 287299581
3721 287299581 288786959 289660170 288723300 285193697 279089307 270883146 260599368 249030067
3713B49030067j2424018j2498570j2152050j1383428j0756836j0117363r392561
3706A70305241q814617p934331p396802o911416o533018n997908n919701o029713
3698A14767735n548540n221471m643693m416874m216747l727432l097522k597634
3690H1297822k273173k015576j752777j860264j427730j584454j981351j728307
3682F6674190j844377j822027j740895j652942j480623j569219j526271j450747
3674E3587089j367572j465906j309745j235320j339392r68162j092446j258369
3666D3550177j201205j069243j049318q59991j005744r91422p60802r28082r92172
3657C4692198p21704q33421q36533r30893o54021p41556p86890q51219q00183
$$ plain form
3713 249030067 236606049 224107479 211955429 200572001 189815165 179697802 170305241
3706 170305241 161490624 153556293 146159491 139248075 132715057 126717149 120797448 114767735
3698 114767735 109219195 103997724 99354031 94937157 90720410 86992978 83895456 81297822
3690 81297822 79024649 77009073 75256296 73396032 71968302 70383848 68402497 66674190
3682 66674190 64829813 63007786 61266891 59613949 58133326 56564107 55037836 53587089
3674 53587089 52219517 50753611 49443866 48208546 46869154 45900992 44808546 43550177
3666 43550177 42348972 41279729 40230411 39370420 38364676 37373254 36612452 35684370 34692198
3657 34692198 33970494 33137073 32300540 31369647 30715626 29974070 29187180 28335961 27535778
3648B7535778p77400p71851o15531n96998m95585m33647k89541m29555k48585
3639B2877085m89349k73076j00077j10440k72623l55463k45997l54199j02993
3630B0572868l84352l25633m23226l83418m84539k97991l67886k64663k09528
3621A7431632j58132l07544l14855k19706n40k7363l11788j65751n728p4185l99487
3610A5446553k22820k75269k1141p3306j16935n22435m00325J8186m25790l98028
3600A3008690J11654k6017j89716j22233k05698k00041Q1704j80016j29153P4593
3590A2223767J27043J36473R43l08316o8142N2792j94070K20636m5763r5430j79449
3579A1870484j03955J12013J70742n785j94124p8325J21037J04457q6702K7177
$$ plain form
3648 27535778 26758378 25986527 25370996 24773998 24278413 23844766 23555225 23125670 22877085
3639 22877085 22387736 22114660 22014583 21904143 21631520 21276057 21030060 20675861 20572868
3630 20572868 20188516 19862883 19439657 19056239 18571700 18273709 17905823 17641160 17431632
3621 17431632 17273500 16965956 16651101 16431395 16430855 16403492 16091704 15925953 15920225 15846040 15446553
3610 15446553 15223733 14948464 14927323 14854017 14737082 14214647 13814322 13832508 13406718 13008690
3600 13008690 13120344 13094327 12904611 12782378 12576680 12376639 12458343 12278327 12149174 12223767
3590 12223767 12350810 12487283 12488226 12179910 12111768 12164560 11970490 12191126 12145363 12049933 11870484
3579 11870484 11766529 11878542 12049284 12043499 11849375 11771050 11892087 11996544 11909842 11937019
3569A1937019j75427Q9235k0776N4945K91418j78548Q1387j08804j55704J20229
3559A1934974k0101j62463O6766J77781o3996K16345j6776p1317L7543J21795
3549A2220551M5395k5636K6745P4987R0530m8346J73132l760O596j38592K18210
3538A2639812j15546r6724M2206o6769K70434J72435J78220p8715J64848k9096
3528A3081105K10447J13377K16084K43639o3308L94405M00967l6818N2966L02917
3518A4915781J78187J41900K571N18948L11058J68589K33401J24708K31682K87139
3508A7113964L53517N24671K99163K74971L28980M29480L84649P10315P93995
3499B1213705M78322N35095P86497Q84637J082370J101937J238785J483046J346406
$$ plain form
3569 11937019 11761592 11850827 11830051 11884996 12176414 11997866 12079253 11970449 11814745 11934974
3559 11934974 11914873 11752410 11819176 11996957 11932961 12149306 12132530 12061213 12098756 12220551
3549 12220551 12265946 12240310 12267055 12342042 12432572 12384226 12557358 12553598 12560194 12421602 12639812
3538 12639812 12524266 12427542 12469748 12402979 12673413 12845848 13024068 12945353 13110201 13081105
3528 13081105 13291552 13404929 13621013 13864652 13801344 14195749 14596716 14559898 14612864 14915781
3518 14915781 15093968 15235868 15238439 15757387 16068445 16237034 16470435 16595143 16826825 17113964
3508 17113964 17467481 17992152 18291315 18566286 18895266 19324746 19709395 20419710 21213705
3499 21213705 21692027 22227122 23013619 23898256 24980626 26082563 27321348 28804394 30150800
3490C0150800J901309J830315K331221K437723K773221K921768L389673L535016
3482E1271046L413982L551612L527921K815692K051995J019748l17966j858484
3474F5475546l038150l761702l610835k882904k467189j978086j256114o71990
3466D5808576l00457O0996K96521N16091R99622J078790J362640J898967J987626
3457E3709372K174912K860447L130283K942676L198374K788656K357984K158339
3449G5321043K525946K599542K267191K179162J979823J710326J485113J094747
3441I1162893O15605k31456j265532k547380k659597k717883k424071k041249
3433G7891330j123835r38712n42759p38113p57534j146884k177630k242562k261284
$$ plain form
3490 30150800 32052109 33882424 36213645 38651368 41424589 44346357 47736030 51271046
3482 51271046 54685028 58236640 61764561 64580253 66632248 67651996 67334030 65475546
3474 65475546 62437396 58675694 55064859 52181955 49714766 47736680 46480566 45808576
3466 45808576 45508119 45569115 45865636 46381727 47381349 48460139 49822779 51721746 53709372
3457 53709372 55884284 58744731 61875014 64817690 68016064 70804720 73162704 75321043
3449 75321043 77846989 80446531 82713722 84892884 86872707 88583033 90068146 91162893
3441 91162893 91778498 91547042 90281510 87734130 85074533 82356650 79932579 77891330
3433 77891330 76767495 75828783 75286024 74547911 73790377 72643493 70465863 68223301 65962017
3424F5962017k138232j706920j722358j449826j447268j029324k80322K03700
3416E6391467K26914N70278J228665J392281J873924K391195K671477K834690
3408F9580891L495000L465309L057144K730601K007280P72637n26627k519106
3400H2063129l785542m900389n121933m914129l959127l365336k731677k219441
3392E1065555j857845j476742j117460r33102j129252p00336l23502l55733k8940
3383D3142643k04917l8535J0349j89685R8237N2667K71405O59320O81545M53577
3373D4936606P96286Q50115Q72345J246656J383703J796870J869210K094201K577139
3364E8423131K691325L204730L563074L991414M032451M217764M091780L439000
$$ plain form
3424 65962017 63823785 62116865 60394507 58944681 57497413 56468089 56187767 56391467
3416 56391467 56618381 57188659 58417324 59809605 61683529 64074724 66746201 69580891
3408 69580891 73075891 76541200 79598344 82328945 84336225 85108862 84582235 82063129
3400 82063129 78277587 73377198 68255265 63341136 59382009 56016673 53284996 51065555
3392 51065555 49207710 47730968 46613508 45680406 44551154 43850818 43527316 43171583 43142643
3383 43142643 42937726 42899191 42909540 42719855 42818092 42870759 43142164 43801484 44483029 44936606
3373 44936606 45732892 46583007 47455352 48702008 50085711 51882581 53751791 55845992 58423131
3364 58423131 61114456 64319186 67882260 71873674 75906125 80123889 84215669 87654669
3356H7654669K765531J526659K51189r03369j953771k564341k474487k326936
3348H1975144j868493q14568p75752n3151N60264P97400J018441J624904K069941
3339H4534130K165668K777022L452251L699495M095792M689587N278683O117499
3331A16810127P053127Q003681Q920677R964796J1056443J1574311J1338443J0634099
3323A95355704Q562877O825617M261693K803322K711380M449137P728504J1654925
3315B44353159J5634752J8809519K1306423K2408016K2161394J7759165J0637283
3308C73069711J972668o355094j4928666k2859051k7998974k9358578k7631347
3301B45910669k3345121j7906860j3482529r503439o707028m548620l619192l371811
$$ plain form
3356 87654669 90420200 91946859 92198048 91294679 89340908 86776567 84302080 81975144
3348 81975144 80106651 79292083 78516331 78463180 79023444 79820844 80839285 82464189 84534130
3339 84534130 86699798 89476820 92929071 96628566 100724358 105413945 110692628 116810127
3331 116810127 123863254 131866935 140787612 150752408 161808851 173383162 184721605 195355704
3323 195355704 203918581 210744198 215005891 217809213 220520593 224969730 232698234 244353159
3315 244353159 259987911 278797430 300103853 322511869 344673263 362432428 373069711
3308 373069711 375042379 368687285 353758619 330899568 302900594 273542016 245910669
3301 245910669 222565548 204658688 191176159 181672720 174965692 170417072 166797880 163426069
3293A63426069l772839m766436n845904p048334q062404q677294r355808q790823
3285A07106227q323300p393466o429079n190843m814727m142306l679684l272728
3277F3860094k825397k837838k367244k199492k051657k031363j879485j529844
3269D6137774j218709j712568j466494j152803j118107j152875j142026q95569
3261C6278623j013341r90343p77700r28972p72487p61177o34174o94395q09227
3252B8896807q63681o70948n25848m94617m60613n56427n54331o06526p15303
3243B3448513l29810m43177n24881j02962k27225k62578k71369l09403k97350
3234B0679758l90726l01632k26630k9840j98626l39559j56318J23826l60835k66218
$$ plain form
3293 163426069 159653230 154886794 149040890 141992556 133930152 125252858 115897050 107106227
3285 107106227 98782927 91389461 84960382 79769539 74954812 70812506 67132822 63860094
3277 63860094 61034697 58196859 55829615 53630123 51578466 49547103 47667618 46137774
3269 46137774 44919065 43206497 41740003 40587200 39469093 38316218 37174192 36278623
3261 36278623 35265282 34274939 33497239 32568267 31795780 31034603 30400429 29706034 28896807
3252 28896807 28033126 27362178 26836330 26341713 25881100 25324673 24770342 24163816 23448513
3243 23448513 23118703 22675526 22150645 22047683 21820458 21557880 21286511 20977108 20679758
3234 20679758 20289032 19987400 19760770 19730930 19532304 19192745 19036427 19160253 18799418 18533200
3224A8533200l33034l69984k78658q0779j94159j60799l0700l70775k29735J1570
3214A6496147k35949l32783q8862p1537l3061m96537l56537k04377l59627k81754
3204A4035123k52194k87159l94269m17634k54107M7120j51372j73364j71640j88408
3194A1792096j52916k52571j98733k19590J37546K4000p6631M5102o1490k36308
3184A0800505p7306K27186K9162j68786k51767J9865L6700K97509K1974j00854
3174A0834188N7356L3471J77975K31852K67621J72465K87494K35995K71283K39950
3164A2809650L601K839K17215J51894N1437j05021m62939k83348J23791l11205
3154A2197914O810M3107J14791J28370m5023K19629N20603M2121K38858L13905
$$ plain form
3224 18533200 18200166 17830182 17551524 17470745 17276586 17115787 17085087 16714312 16484577 16496147
3214 16496147 16260198 15927415 15838553 15767016 15733955 15237418 14880881 14676504 14316877 14035123
3204 14035123 13782929 13495770 13101501 12683867 12429760 12476880 12325508 12152144 11980504 11792096
3194 11792096 11639180 11386609 11187876 10968286 11105832 11129832 11053201 11098303 11036813 10800505
3184 10800505 10723199 10950385 10979547 10810761 10558994 10578859 10615559 10913068 10935042 10834188
3174 10834188 10891544 10925015 11102990 11334842 11602463 11774928 12062422 12298417 12569700 12809650
3164 12809650 12813251 12816090 13033305 13185199 13236636 13131615 12668676 12385328 12509119 12197914
3154 12197914 12204724 12247831 12362622 12490992 12445969 12665598 13186201 13228322 13467180 13781085
3144A3781085K75731M09598O32763N52815K02584K44873j43017r0968k16019o1843
3134A5587602l21357l02410k84955k26811n1113l41677L95443M18493M81053N37832
3124A5892100N60355Q38924R66250Q98466Q22994M95642N7770l57573j068897
3115A9106031j503655j316509j106604q99968m86934n97504l56897l66098m47728
3106A2024134j87506j61883l89027m53989k57416j04048j83068k44213J2984L1511
3096A0087479j19735j07158l0617j6346j33278l9046J57288o8855j01619R0066
3086I718179K08651J06883K63k52828J18968J5035j19863N2924P2471O9326j62686
3075I827323l7308K6329j75716j80830L6860N5540J99289l6150n375J1360M6787
$$ plain form
3144 13781085 14056816 14466414 15099177 15651992 15854576 16099449 15956432 15865464 15649445 15587602
3134 15587602 15266245 14963835 14678880 14452069 14400956 14059279 14454722 14873215 15354268 15892100
3124 15892100 16452455 17291379 18257629 19156095 19979089 20474731 20532501 20174928 19106031
3115 19106031 17602376 16285867 15179263 14279295 13792361 13194857 12837960 12471862 12024134
3106 12024134 11836628 11674745 11285718 10831729 10574313 10470265 10287197 10042984 10055968 10087479
3096 10087479 9967744 9860586 9829969 9813623 9680345 9641299 9798587 9729732 9628113 9718179
3086 9718179 9926830 10033713 10033976 9781148 9900116 9915151 9795288 9848212 9920683 9990009 9827323
3075 9827323 9790015 9816344 9640628 9459798 9496658 9552198 9751487 9715337 9709962 9721322 9768109
3064I768109k7246L41741K20281j24596K04011M53554J1808L80640L09963L6953
3054A1575218K39314K92349N83358K78019K73525J51802j0833m27687n08340j07590
3044A2339135J8115p0869P7596J78065k3229M3874j03607m3022J18582J91691
3034A2726331K18255J20833J60048L95002J53046j6653Q5742J79854J6686n0600
3024A3988544L60198J48438m9105L83187M58078P2375O2940J50838N11698K08768
3014A6295959J80694L62329K11937l0204Q5414K47841L46209M09357J47118N5454
3004A8312108N6597J72632P8296L75870L3796l4192n9991L5583J80567K33100
2994A9384366J61482M83006j18248K10933O07552J49738J53010K60399M42961
$$ plain form
3064 9768109 9740863 10082604 10302885 10178289 10382300 10835854 10847662 11228302 11538265 11575218
3054 11575218 11814532 12106881 12690239 12968258 13241783 13393585 13382752 12955065 12446725 12339135
3044 12339135 12357250 12286381 12363977 12542042 12518813 12562687 12459080 12416058 12534640 12726331
3034 12726331 12944586 13065419 13225467 13620469 13773515 13756862 13842604 14022458 14039144 13988544
3024 13988544 14348742 14497180 14448075 14831262 15289340 15361715 15424655 15575493 16087191 16295959
3014 16295959 16476653 16838982 17050919 17020715 17106129 17353970 17700179 18109536 18256654 18312108
3004 18312108 18368705 18541337 18619633 18995503 19029299 18995107 18935116 18970699 19151266 19384366
2994 19384366 19545848 20028854 19910606 20121539 20729091 20878829 21031839 21292238 21735199
2985B1735199N37016L22766J98776M64307K57756K32498O39944K93652K27213
2976B4909127M47866M50871L85193L80839N17657L92957N36596M37403L76180
2967B8834689M74822L06404O07048O95860O95448N66158O70869O52621P62016
2958C4265935P65665N50227P35567Q64699Q06510Q38971J155618P78508J151975
2949D1913675J096656J258729J201754J580104J573432J543808J832642J913759
2941E3914559K162243K043599K069754K457707K524662L046076K760160K699674
2933G3678434K649096K853634K866963K414964K399859K632287K302621K259260
2925I4057118K513174K432214K487286K597745K736395K526693K930001K821730
$$ plain form
2985 21735199 22272215 22594981 22793757 23258064 23515820 23748318 24388262 24681914 24909127
2976 24909127 25356993 25807864 26193057 26573896 27091553 27484510 28021106 28458509 28834689
2967 28834689 29309511 29615915 30222963 30918823 31614271 32180429 32851298 33503919 34265935
2958 34265935 35031600 35581827 36317394 37182093 37988603 38827574 39983192 40761700 41913675
2949 41913675 43010331 44269060 45470814 47050918 48624350 50168158 52000800 53914559
2941 53914559 56076802 58120401 60190155 62647862 65172524 68218600 70978760 73678434
2933 73678434 76327530 79181164 82048127 84463091 86862950 89495237 91797858 94057118
2925 94057118 96570292 99002506 101489792 104087537 106823932 109350625 112280626 115102356
2917A15102356K542468K510532K471062K442274J802170J759084J577791J559463
2909A31767200J313174J622509J641863J534587J470622J157506J271987Q78650
2901A42658098R75280O59087J75044j11563m25905o10750q34866r56040j207743
2892A40320642j198354j239821j205122j402208j388395j032293j547009j471665
2884A29835775j546342k066316k073135k207833k202046k365455k401966k244299
2876A12728383k527324k550544k421681k372392k618164k769101l020958k597330
2868I1850889k902508k841734k894972k724159k725348k624165k483355k291382
2860G0363266k075076k358685k531232j998334k190818k044410j621954j715804
$$ plain form
2917 115102356 117644824 120155356 122626418 125068692 126870862 128629946 130207737 131767200
2909 131767200 133080374 134702883 136344746 137879333 139349955 140507461 141779448 142658098
2901 142658098 143633378 144292465 144467509 144355946 143930041 143319291 142484425 141528385 140320642
2892 140320642 139122288 137882467 136677345 135275137 133886742 132854449 131307440 129835775
2884 129835775 128289433 126223117 124149982 121942149 119740103 117374648 114972682 112728383
2876 112728383 110201059 107650515 105228834 102856442 100238278 97469177 94448219 91850889
2868 91850889 88948381 86106647 83211675 80487516 77762168 75138003 72654648 70363266
2860 70363266 68288190 65929505 63398273 61399939 59209121 57164711 55542757 53826953
2852E3826953j671323j905911j332718j649653j011319j058863j453022j107658
2844D2636486p91532p01997p65242o63235p64833l43281n64146m34689k97348
2835C7310183m31425l44415n10664m48730k61935n92268l15891j86028j86342
2826C4032485l51000k17140k99936k72095k43696k84732l95781l45391j1012j91005
2816C1420697l60249j89625J07704j49540l24319J8937K13491k51087m19202N4127
2806C0120934k52406k54389N1905K6040P3125q1140J86585L54978L3208K594K17861
2795C0479295o2338K55442K76202Q9909L21307L34579J48265L27550L72683L19178
2785C2862072J32617M17820M42714M09928K58291M70314M51124N11815O80812
$$ plain form
2852 53826953 52155630 50249719 48917001 47267348 46256029 45197166 43744144 42636486
2844 42636486 41844954 41142957 40377715 39714480 38949647 38606366 38042220 37607531 37310183
2835 37310183 36878758 36534343 36023679 35574949 35313014 34720746 34404855 34218827 34032485
2826 34032485 33681485 33464345 33164409 32892314 32648618 32363886 31968105 31622714 31611702 31420697
2816 31420697 31060448 30870823 30978527 30828987 30504668 30523605 30737096 30486009 30066807 30120934
2806 30120934 29868528 29614139 29666044 29692084 29765209 29684069 29870654 30225632 30258840 30261434 30479295
2795 30479295 30416957 30672399 30948601 31038510 31359817 31694396 31842661 32170211 32542894 32862072
2785 32862072 32994689 33412509 33855223 34265151 34523442 34993756 35444880 35956695 36637507
2776C6637507N69908N73588O12814N64408O73922P49669Q10066J060231P42813
2767D2994926P55606J438136J114925R96571J302143J322885J593801J748675
2759E3267668J740221J508647J560995J914191K149637K079130K294006K320528
2751F8835023K433252K689648K920740L243587L473318L428426M073594M554998
2743I5652586M881792N296238O020160O769837P876242Q742551R505891J0854649
2735A55599946J2036823J3289387J5088846J6895842J8426220K0252553K1467335
2728B73056952K1932619K1691781K0431982J7984480J4281554R763742N149915
2721C84293025J299791j830720m091324m916164m798640m185153l270148k463929
$$ plain form
2776 36637507 37207415 37781003 38393817 38958225 39632147 40381816 41191882 42252113 42994926
2767 42994926 43750532 45188668 46303593 47300164 48602307 49925192 51518993 53267668
2759 53267668 55007889 56516536 58077531 59991722 62141359 64220489 66514495 68835023
2751 68835023 71268275 73957923 76878663 80122250 83595568 87023994 91097588 95652586
2743 95652586 100534378 105830616 111850776 118620613 126496855 135239406 144745297 155599946
2735 155599946 167636769 180926156 196015002 212910844 231337064 251589617 273056952
2728 273056952 294989571 316681352 337113334 355097814 369379368 379143110 384293025
2721 384293025 385592816 383762096 379670772 374754608 369955968 365770815 362500667 360036738
2713C60036738j792504j628246k346285l749594n887622q831606j1718081j4851973
2705C09230827j7890086j9991671k1044169k0692770j9839069j8105995j6273763
2698A75393304j4045964j2066827j0624171r470153q112927p010782o349455n697373
2690A02015652n163065m658163m118220l667834l226446l293067l025159k859741
2682G2003957k585319k248951k061932j651134k108712j627736j466460j278483
2674E6975230j088508j117991j000515j138229o85390o91057o84330m21995o18350
2665D9528865m55753l28374m37030p6324o0934p1043l01686R7574K95253j5692
2655D8174856K14761K10354L31133K05351J08246J03658J66772M3683l48591q16933
$$ plain form
2713 360036738 358244234 356615988 354269703 350520109 344632487 335800881 324082800 309230827
2705 309230827 291340741 271349070 250304901 229612131 209773062 191667067 175393304
2698 175393304 161347340 149280513 138656342 129186189 121073262 114062480 107713025 102015652
2690 102015652 96852587 92194424 88076204 84408370 81181924 77888857 74863698 72003957
2682 72003957 69418638 67169687 65107755 63456621 61347909 59720173 58253713 56975230
2674 56975230 55886722 54768731 53768216 52629987 51944597 51253540 50569210 50147215 49528865
2665 49528865 49073112 48744738 48307708 48231384 48170450 48099407 47797721 47895295 48190548 48174856
2655 48174856 48389617 48599971 48931104 49136455 49244701 49348359 49515131 49558814 49210223 48393290
2645D8393290l87597k57027k56551r7359q4406q5021q7934J28218j83473J12373
2635D7194513N00015M63660N58550K31299M25954O81820R45054J076643Q86130
2626E2963638R67005Q56670J283923J435215J641378J554633J477385J846130
2618F4025977J776656K061494K067249J594005J387906Q11339K76834k13285p92354
2609G2995821p74874p66361p19129r1441O3305L13660M00215O40195Q00920Q32806
2599G3695117J427271J412939J529533K165960K157685K501171K470326K641383
2591I0001385K873022K798861K745502K417462K617179K540849K655594K958098
2583A11607952K657154K912086L226296K615954K751779K442437J505724R10897
$$ plain form
2645 48393290 48005693 47748666 47492115 47394756 47310350 47225329 47137395 47265613 47082140 47194513
2635 47194513 47694528 48158188 48716738 48948037 49373991 50055811 51000865 52077508 52963638
2626 52963638 53930643 54787313 56071236 57506451 59147829 60702462 62179847 64025977
2618 64025977 65802633 67864127 69931376 71525381 72913287 73724626 74001460 73788175 72995821
2609 72995821 72220947 71454586 70735457 70644016 70707321 71020981 71421196 72061391 72862311 73695117
2599 73695117 75122388 76535327 78064860 80230820 82388505 84889676 87360002 90001385
2591 90001385 92874407 95673268 98418770 100836232 103453411 105994260 108649854 111607952
2583 111607952 114265106 117177192 120403488 123019442 125771221 128213658 129719382 130630279
2575A30630279p715r87349j179061j885472j760146j775615j394276r02000o10546
2566A20128099k07975Q7998K22061M41887J111931J088933J388302K067442K296417
2557A28625095K723826L115973L849153M222993M910917N315425N963891O316634
2549A65043907P713119Q390938Q974481J0242972J1169995J2288381J3045217
2542B36869010J3538066J3828002J3427399J2730602J0976269Q684543O656440
2535C16710331M691028L236880K469685K524021L242623M491709N479805P105236
2527C49951318P976802P981653P380212O515623L964400J222111j731923m994527
2519C78265669p974324j0215329j1562903j2212585j1969827j0904275r924543
$$ plain form
2575 130630279 130622564 129635215 128456154 126570682 124810536 123034921 121640645 120738645 120128099
2566 120128099 119920124 120008122 120230183 120672070 121784001 122872934 124261236 126328678 128625095
2557 128625095 131348921 134464894 138314047 142537040 147447957 152763382 158727273 165043907
2549 165043907 172757026 181147964 190122445 200365417 211535412 223823793 236869010
2542 236869010 250407076 264235078 277662477 290393079 301369348 310053891 316710331
2535 316710331 321401359 324638239 327107924 329631945 332874568 337366277 342846082 349951318
2527 349951318 357928120 365909773 373289985 379805608 383770008 384992119 383260196 378265669
2519 378265669 370291345 360076016 348513113 336300528 324330701 313426426 303501883
2512C03501883q323674p447149o638807n944204o208585p099584p954801r287223
2504B44597856j0749052j2536042j3718626j4345587j3951017j3610555j2661794
2497A53025183j1075192r531720q574075p577927o858775o179444n287771n014114
2489I2926165m509413l963222l478512l439792k963172k560727k374260k335544
2481F7301523k267817j767287j834873j557474j294544j350523j312711j140446
2473E4775848p44747j045403j031342j088584j093635j025606r44988j372737
2465D6428806j536261j373396j283567j219687j228694j238321j021269j230757
2457C6296854j248435o93005p21480p44647m82581p25615n38628o27901p03658
$$ plain form
2512 303501883 295178209 287731060 281092253 275148049 268939464 261839880 253885079 244597856
2504 244597856 233848804 221312762 207594136 193248549 179297532 165686977 153025183
2497 153025183 141949991 132418271 123844196 116266269 109407494 103228050 97940279 92926165
2489 92926165 88416752 84453530 80975018 77535226 74572054 72011327 69637067 67301523
2481 67301523 65033706 63266419 61431546 59874072 58579528 57229005 55916294 54775848
2473 54775848 54031101 52985698 51954356 50865772 49772137 48746531 47801543 46428806
2465 46428806 44892545 43519149 42235582 41015895 39787201 38548880 37527611 36296854
2457 36296854 35048419 34355414 33633934 32889287 32406706 31681091 31142463 30514562 29810904
2448B9810904k73416l59997m96869m37047m84183l54061l79546l03908o58715
2439B6063162o90644l20605n11970p60206l68967m10111o32073l72383l42439
2430B1653764k91978n51042m35971l56376j22118k72720k37804m64189m30839
2421A8490727l55760k28710j53198r9565p2337l61044j52699l12753k7728j00078
2411A6626855l45492n0219j06644l81246k40102k34204J05039j72240l84355l72000
2401A4445392l39353j60004j90311k95808k40971k29929j99319j57894j10148
2392A2521655j84985k73365j63435l43410l18127J16023k84019k40467J15129
2383A0944999R7512k4265j28890M9355k9209j78542j35779n0232J98447K5799
$$ plain form
2448 29810904 29537488 29177491 28680622 28243575 27759392 27405331 27025785 26721877 26063162
2439 26063162 25372518 25051913 24539943 23779737 23410770 23000659 22368586 21996203 21653764
2430 21653764 21361786 20810744 20374773 20018397 19896279 19623559 19385755 18921566 18490727
2421 18490727 18134967 17906257 17753059 17653494 17581157 17220113 17067414 16754661 16726933 16626855
2411 16626855 16281363 16231144 16124500 15743254 15503152 15268948 15373987 15201747 14817392 14445392
2401 14445392 14106039 13946035 13755724 13459916 13218945 12989016 12789697 12631803 12521655
2392 12521655 12336670 12063305 11899870 11556460 11238333 11354356 11070337 10829870 10944999
2383 10944999 11042511 11018246 10889356 10938711 10909502 10730960 10595181 10544949 10743396 10769195
2373A0769195k59173j79834l0299J90959k08872k06502j40607l31441m6755O7651
2363I624322o4912J63l31506j52953L138k88721J4078r1914p8201r2566k57558
2352H283370k07100j9084O700K3637p2286K9157j76731j1300P6523r076j99353
2341G724457n6025k24018j31108J36377J25480j13333j47458O6628j20810j44819
2331G115371N9246M805r4431J91780j88201l93881j05240K11864j71092j15615
2321F514606j56814j71446J80750J11563k0099j03193l01100o8713L7189J84822
2311F207565n4121K0841m645r2888j2450J15094k13085k06479P7385j98936J5143
2300E653424J47848j06235K97778N7960M0470l2000j83332J9945J15142j5693
$$ plain form
2373 10769195 10510022 10330188 10299889 10490848 10281976 10075474 9934867 9603426 9556671 9624322
2363 9624322 9559410 9559573 9228067 9075114 9078252 8789531 8803609 8711695 8633494 8540928 8283370
2352 8283370 8076270 8057186 8063886 8087523 8015237 8044394 7867663 7856363 7932886 7923810 7724457
2341 7724457 7668432 7444414 7313306 7449683 7575163 7461830 7314372 7381000 7260190 7115371
2331 7115371 7174617 7179422 7084991 7276771 7088570 6694689 6589449 6801313 6630221 6514606
2321 6514606 6357792 6186346 6367096 6478659 6458560 6355367 6054267 5985554 6022743 6207565
2311 6207565 6153444 6174285 6169640 6076752 6064302 6179396 5966311 5759832 5837217 5638281 5653424
2300 5653424 5801272 5695037 5992815 6050775 6091245 6059245 5875913 5895858 6011000 5995307
2290E995307Q7169l950l45122K7927J79785q0132M1801j59117r7756P7026k35142
2279E487796J442L46505L2777J750K46556o8558m2818j14387j23633J45751j2586
2268E900595Q4493n8806k47854k7497N5630k1921m7391J01004j25336P8491L19534
2257F010942j86704L2470j44276Q136J06978M7054J12036n2631o9846Q1400L9296
2246E984855J8368j10926Q6096R5115O5921J67352J7457Q1338J4462K53950Q8606
2235F762594O2308n640K76380J08649O7884j27046K00058J28573N120J04165K29221
2224G812266K33579J11019K5509o9040j41474M62976R7345R110M4297k18758P1784
2213H438613l8737o5321j19891Q694K4431K04873J94888q3235p9460K37583J14972
$$ plain form
2290 5995307 6082476 6078526 5733404 5761331 5941116 5860984 5902785 5743668 5645912 5722938 5487796
2279 5487796 5489238 5835743 5868520 5870270 6116826 6048268 6005450 5891063 5767430 5913181 5900595
2268 5900595 5985088 5926282 5678428 5650931 5706561 5684640 5637249 5738253 5612917 5691408 6010942
2257 6010942 5824238 5856708 5712432 5720568 5827546 5874600 5986636 5934005 5864159 5945559 5984855
2246 5984855 6003223 5892297 5978393 6073508 6139429 6306781 6324238 6405576 6420038 6673988 6762594
2235 6762594 6824902 6819262 7095642 7204291 7272175 7145129 7345187 7473760 7478880 7583045 7812266
2224 7812266 8045845 8156864 8182373 8113333 7971859 8434835 8532180 8541290 8585587 8366829 8438613
2213 8438613 8399876 8334555 8214664 8223358 8247789 8452662 8647550 8564315 8484855 8722438 8837410
2202H837410J03886m7453Q4301K87588K10065J85579Q3991J79828R0681Q6623
2192A0102499K70554K56654J73179L71660L41460M83531K29039M46140K36679
2183A2911395J44127L58898M82020J66954L74873N02972J61942k7842j45331M5684
2173A4975692j39420j33680n12781l42137l60397l05236l20714k50312k32980
2164A2378035q9517K2815m76832l83311l43352l63554l52700j94627k95859l64178
2154I536920k2066n0123l80847j39364k16340j03727M0796P7305q9958j80188
2144H472408o1954j75408K75332j16242o3283k56928K26715J96464J1993K17949
2134H727046N7605O7807M39013K41899R2214J80363j84580n33393n10379m29031
$$ plain form
2202 8837410 8941296 8893843 8978144 9265732 9475797 9661376 9745367 9925195 10015876 10102499
2192 10102499 10373053 10629707 10802886 11174546 11516006 11999537 12228576 12674716 12911395
2183 12911395 13055522 13414420 13896440 14063394 14438267 14941239 15103181 15075339 14930008 14975692
2173 14975692 14836272 14702592 14189811 13847674 13487277 13182041 12861327 12611015 12378035
2164 12378035 12288518 12311333 11834501 11451190 11107838 10744284 10391584 10196957 9901098 9536920
2154 9536920 9514854 9464731 9083884 8944520 8728180 8624453 8665249 8742554 8652596 8472408
2144 8472408 8410454 8235046 8510378 8394136 8330853 8073925 8300640 8497104 8509097 8727046
2134 8727046 8784651 8852458 9291471 9533370 9625584 9805947 9621367 9087974 8577595 8148564
2124H148564k55531n86474k43204J22290k1190j95180j41480J0033n8671j34871
2114F644286j86155M1618j73898q6929K4021M8564K33165j7610o4600j06105L7293
2103F393650O4772k18278J17912R1999L10697J00663J1692o9345J60857J0898
2093F975517j41858j46161k93041k34298n0950j90620K5026K92512k4295k05720
2083F006112q0439q8964j51413l3720J10581j03993J1906j66976o1818r6699r6216
2072E248361J56770p2820M409j63684M9744M0303q4143j7922K37252J57808J80860
2061E736938Q5163r4453o6286J86709K21360O3267J41599n2208j77695q6345K764
2050E960813N2796J30788j03545M2288l1086j30670R7193K89436M7071j94122
$$ plain form
2124 8148564 7893033 7306559 7063355 7185645 7164455 6969275 6827795 6837828 6779157 6644286
2114 6644286 6458131 6499749 6325851 6238922 6262943 6311507 6544672 6527062 6462462 6356357 6393650
2103 6393650 6458422 6240144 6358056 6450055 6760752 6861415 6873107 6803762 6964619 6975517
2093 6975517 6833659 6687498 6394457 6160159 6109209 5918589 5943615 6236127 6211832 6006112
2083 6006112 5925673 5836709 5685296 5651576 5762157 5658164 5670070 5503094 5441276 5344577 5248361
2072 5248361 5405131 5332311 5336720 5173036 5222780 5263083 5178940 5161018 5398270 5556078 5736938
2061 5736938 5822101 5727648 5661362 5848071 6069431 6132698 6274297 6222089 6044394 5958049 5960813
2050 5960813 6013609 6144397 6040852 6083140 6052054 5921384 6018577 6308013 6355084 6160962
2040F160962K48637Q2427M4860J1365L5183n1810J32537k1376K20845J9160j22553
2029F760237J63776K2672J65503J98254P0349l6796R5614j9098J76267M448O5932
2018G667158J57113J23930J67614O9888K33480J12381R183Q971P0693J03690J33446
2007H857547k00220K63085M65350n63o7593L25387K95129l739K06422n337o0556
1996A0074912J23014R7048o3428J08712L2980j1113K03894k0802n3747J56620
1986A0648090J24422J63252k8145N9400J48971L97859K94655j16959K04100K25408
1976A2121053L33719L88448L07703M48613L59128M7364L07272L25136K89137M80563
1966A5408136M46434K66697L18723L84512M59985L92480N40289K89276L67142
$$ plain form
2040 6160962 6409599 6492026 6536886 6548251 6583434 6531624 6664161 6642785 6863630 6882790 6760237
2029 6760237 6924013 6946685 7112188 7310442 7380791 7343995 7439609 7420511 7596778 7601226 7667158
2018 7667158 7824271 7948201 8115815 8185703 8419183 8531564 8540747 8549718 8620411 8724101 8857547
2007 8857547 8657327 8920412 9385762 9385199 9317606 9642993 9938122 9934383 10140805 10135468 10074912
1996 10074912 10197926 10294974 10231546 10340258 10373238 10362125 10566019 10545217 10491470 10648090
1986 10648090 10772512 10935764 10907619 10967019 11115990 11513849 11808504 11691545 11895645 12121053
1976 12121053 12454772 12843220 13150923 13599536 13958664 14006028 14313300 14638436 14927573 15408136
1966 15408136 15854570 16121267 16439990 16824502 17284487 17676967 18217256 18506532 18873674
1957A8873674N93432K73037N58592M23496N99887N98607N20810P68376P99735
1948B4009646O65543Q14423R42146R83609J220013J434488J420291J575583J900272
1939C4966014K145664K120548K815302K953008L339442L834014M268506N025900
1931F1468398N857535N805722P276370Q220611Q059129Q325977P562530N578639
1923A18154911L771874P50157k738011n775604q217492q473994q095102o536758
1915H2839981n147023l904141k769078j990931j635740o19454l9818k00864L95481
1906F6928413P41906R77393J615343K252194K843871L520860M258175M758497
1898H7896652N805109O941600Q552185R858279J1454621J2822035J4487919J5758679
$$ plain form
1957 18873674 19467106 19740143 20298735 20722231 21322118 21920725 22441535 23209911 24009646
1948 24009646 24675189 25489612 26431758 27415367 28635380 30069868 31490159 33065742 34966014
1939 34966014 37111678 39232226 42047528 45000536 48339978 52173992 56442498 61468398
1931 61468398 67325933 73131655 80408025 88628636 96687765 105013742 112576272 118154911
1923 118154911 121926785 122676942 119938931 114163327 105945835 97471841 89376739 82839981
1915 82839981 77692958 73788817 71019739 69028808 67393068 66773614 66733796 66532932 66928413
1906 66928413 67670319 68647712 70263055 72515249 75359120 78879980 83138155 87896652
1898 87896652 93701761 100643361 109195546 119053825 130508446 143330481 157818400 173577079
1890A73577079J4353694J1405726P482827K745440l942332j2224866j7415200
1883A75982368j8798639j6880494j3905160j1241567r145471p337779n461895
1876I3211363m749812m045913l594331k934501k572690k261833j755431j574901
1868F9721951j420500r87058p13503q902L06015R31947J845765K323951K922162
1859G4921828L468724M171944M722147N058631M768395M379482L387253J012162
1851A05890566j021234l231044n722208p264190p788501p090536o248765n302311
1843F2221777m202818l567483l155930k693950k472480k156168j938320j676430
1835D0358198j943463j597074j524685j337226j231910j369869j329107j215897
$$ plain form
1890 173577079 187930773 199336499 206819326 209564766 205622434 193397568 175982368
1883 175982368 157183729 140303235 126398075 115156508 106011037 98673258 93211363
1876 93211363 88461551 84415638 80821307 77886806 75314116 73052283 71296852 69721951
1868 69721951 68301451 67314393 66600890 66591988 66898003 67829950 69675715 71999666 74921828
1859 74921828 78390552 82562496 87284643 92343274 97111669 101491151 104878404 105890566
1851 105890566 104869332 101638288 95916080 88651890 80863389 73772853 67524088 62221777
1843 62221777 58018959 54451476 51295546 48601596 46129116 43972948 42034628 40358198
1835 40358198 38414735 36817661 35292976 33955750 32723840 31353971 30024864 28808967
1827B8808967j012413r55288r89212r44523q72128o71070n78929l43697o15916
1818B1825791n93552l44393m81322k77803k95863j81843n04979m16236l33856
1809A8395944l70680l79058l95593n70518n92412m71737m40788l26103k69476
1800A4579579k85074k0451k38261r0960k28840k08449O074j92129k35824o3470
1790A3022195k41803j92786p3747n7538k53231k80024j45746l01993j21133j20770
1780A1233424k76388l01549j70450k04302j23484k13247j80284j05348k21914
1771I436458k59739m7610j37383l24072j24886J7790J48137l17742j23769K97752
1761H564936n7300m5650l10450l95853j15098J08527j734j74815l27122O7291
$$ plain form
1827 28808967 27796554 26841266 25852054 24907531 24035403 23364333 22785404 22441707 21825791
1818 21825791 21232239 20887846 20406524 20128721 19832858 19651015 19146036 18729800 18395944
1809 18395944 18025264 17646206 17250613 16680095 16087683 15615946 15175158 14849055 14579579
1800 14579579 14294505 14274054 14035793 13944833 13715993 13507544 13513618 13321489 13085665 13022195
1790 13022195 12780392 12587606 12513859 12456321 12203090 11923066 11777320 11475327 11354194 11233424
1780 11233424 10957036 10655487 10485037 10280735 10157251 9944004 9763720 9658372 9436458
1771 9436458 9176719 9129109 8991726 8667654 8542768 8560558 8708695 8390953 8267184 8564936
1761 8564936 8507636 8461986 8151536 7755683 7640585 7749112 7747378 7572563 7245441 7312732
1751G312732l15375k19656N3221N3799k82078j28905j07446M1439j26822j93596
1741F087313O1441l6519m5402k70967j34220j31537j8358n6643J1525j95273l40184
1730D931176j98649K44600M5461j41903j50662p6841k61284p156l964J79963j20847
1719D439894k21445J9847m4771k7440K69619p2101K937l7605M3675p9961p8744
1708D213905O0059L1074k86282L1363M5703J6350r6154j64499J8101k08699j325
1697C659596J75142p7719j61199J1389j68270R0133m4306l2883j75632o6459P8082
1686C287874J72917J41116j49834l84815j02882J18310J01019L2401L0475j26939
1676C119642Q9464J4677k21051j41938N1634m0436P4700j49520O8706K26k74512
$$ plain form
1751 7312732 6997357 6777701 6830922 6884721 6602643 6473738 6366292 6407731 6280909 6087313
1741 6087313 6148754 6112235 6066833 5795866 5661646 5530109 5511751 5455108 5466633 5271360 4931176
1730 4931176 4732527 4977127 5022588 4880685 4730023 4653182 4391898 4384742 4380778 4560741 4439894
1719 4439894 4218449 4238296 4193525 4166085 4435704 4363603 4366540 4328935 4372610 4292649 4213905
1708 4213905 4273964 4305038 4018756 4050119 4095822 4112172 4016018 3851519 3869620 3660921 3659596
1697 3659596 3834738 3757019 3595820 3607209 3438939 3529072 3484766 3451883 3276251 3209792 3287874
1686 3287874 3460791 3601907 3452073 3067258 2964376 3082686 3183705 3216106 3246581 3119642
1676 3119642 3209106 3223783 3002732 2860794 2912428 2871992 2946692 2797172 2865878 2866104 2591592
1665B591592P3786K02157j58202p6785J9236n4374J46651K34806Q9393J73753
1655C242013j86725j33299k66601p6957M7759p9330m166J25819K00120N6803m1461
1644B883975n1853p2808k5312L4890k90857o0797n177J36024k76543N5278K05404
1633B532224N8138Q340K03439n9738J00844M8909k72879M1949J58557j34090j76930
1622B508763K25254L0630R1296K79542n4800J8928o1965j29260Q380j62097k65146
1611B489525k02330O2734j74478J72292J07990J58971J71329Q7254j8652j40520
1601B714115l05775L3715J34711o8131J9396j20760k01620L118K88269K58004
1591B755042q2257j3700J23423J7893P6216K08495J26059J55045r3782j76354
$$ plain form
1665 2591592 2665378 2867535 2709333 2632548 2651784 2597410 2744061 2978867 3068260 3242013
1655 3242013 3055288 2921989 2655388 2578431 2626190 2546860 2542694 2668513 2868633 2925436 2883975
1644 2883975 2832122 2759314 2734002 2768892 2478035 2417238 2412061 2548085 2271542 2326820 2532224
1633 2532224 2590362 2598702 2802141 2742403 2843247 2892156 2619277 2661226 2819783 2685693 2508763
1622 2508763 2734017 2764647 2855943 3135485 3080685 3099613 3037648 2908388 2916768 2754671 2489525
1611 2489525 2287195 2349929 2175451 2347743 2455733 2614704 2786033 2873287 2854635 2714115
1601 2714115 2408340 2442055 2576766 2508635 2528031 2407271 2205651 2208769 2497038 2755042
1591 2755042 2672785 2659085 2782508 2800401 2876617 3085112 3211171 3366216 3272434 3096080
1581C096080N9533j49777k69024O2576J06399k4322k66815o559K39914j55448
1571B692557j19920J52070j9147J0067P1216j0443k1971J1816P456j11401J71929
1560B834229p550O5266L2163J7171K525R6259j10954J10584J85774L80785Q698
1549C614950p5849J51192M3012K94871J0029k968J35461j85802P7635Q4835J96778
1538D344144m5707l03441j469Q0253o8452J14599P4547p2587J90863P9153l47808
1527D044095K33686M2825J39060K66154p494K06350j5830L3625K60548K15673
1517E418692K23182J17042J58812n8360N560k8701R7776L15206K7092p9160q6058
1506F111083J36701K9214J07064M0209J8999n2627j17687o2566N4112j10823j1509
$$ plain form
1581 3096080 3155613 3005836 2736812 2799388 2905787 2881465 2614650 2608091 2848005 2692557
1571 2692557 2572637 2724707 2705560 2715627 2786843 2776400 2754429 2766245 2773701 2662300 2834229
1560 2834229 2826679 2891945 2924108 2941279 2943804 3040063 2929109 3039693 3225467 3606252 3614950
1549 3614950 3539101 3690293 3733305 4028176 4038205 4035237 4170698 3984896 4062531 4147366 4344144
1538 4344144 4298437 3994996 3993527 4073780 4005328 4119927 4194474 4121887 4312750 4391903 4044095
1527 4044095 4277781 4320606 4459666 4725820 4718326 4924676 4908846 4942471 5203019 5418692
1517 5418692 5641874 5758916 5917728 5859368 5864928 5836227 5934003 6249209 6276301 6197141 6111083
1506 6111083 6247784 6276998 6384062 6424271 6443270 6390643 6272956 6210390 6264502 6153679 6142170
1495F142170j89450J77145j01094J58047N7877o5361J11209J06957Q7212L36592
1485F821304J77732J93004K07627R7114P2312K67796J79274R2144J79083j87979
1475H099411j73064j42100k13345k48756j47851P5819j24557k33241J0671k38471
1465F664516m12475P3877M7762j99163j40114n1755J50074N1103J94167R477l41804
1454F045665l15619j18034L0268k6240J18466J77873j42146n5644J20840M6991
1444E882420J83746L2560k0895L38119n9913j33601j0292j56546m94764j83942
1434E376892j75606k19420k70472l51744O7871j6912j70678n9837j89709M0577
1424D030962j10401k69391k8956j36935n2420J03425j81917j01573r5971p0842
$$ plain form
1495 6142170 5952720 6129865 6028771 6186818 6244695 6179334 6290543 6397500 6484712 6821304
1485 6821304 6999036 7192040 7399667 7496781 7569093 7836889 8016163 8108307 8287390 8099411
1475 8099411 7926347 7784247 7570902 7322146 7174295 7250114 7125557 6892316 6902987 6664516
1465 6664516 6252041 6325918 6373680 6174517 6034403 5982648 6132722 6183825 6377992 6387469 6045665
1454 6045665 5730046 5612012 5642280 5616040 5734506 5912379 5770233 5714589 5835429 5882420
1444 5882420 6066166 6098726 6077831 6415950 6356037 6222436 6212144 6055598 5560834 5376892
1434 5376892 5201286 4981866 4711394 4359650 4427521 4410609 4239931 4180094 3990385 4030962
1424 4030962 3920561 3651170 3622214 3485279 3432859 3536284 3354367 3252794 3156823 3085981
1414C085981j2384J05504k57072K6385j21909M394Q7789j25112M6476j25525J24411
1403B838938R4347k16449k4886k24267j80372K0930p3125L08167k49754k05619
1393B087910J39402k56092j63382N2900j62142k40635P2380J50786j9615l5722
1383A625790l36195K89558l6709q4464Q0933j64379L6601o908r1491K616j61115
1372A154237R3686l595q5993k131q6042K28592l2868k14964j54387K69811j08287
1361A058059k10424K19220K9980P4827q515j10691j6904P8661L5123j60553k04642
1350G84141J14111J6689O160k1701L38658O8781k05309p1860m0787L04472k37352
1339A056003k89744K06224J0261M6401o7218r9003l2823k73544j411K28701J60924
$$ plain form
1414 3085981 3073597 3179101 2922029 2948414 2826505 2830899 2918688 2793576 2840052 2714527 2838938
1403 2838938 2933285 2716836 2691950 2467683 2287311 2308241 2235116 2543283 2293529 2087910
1393 2087910 2227312 1971220 1807838 1860738 1698596 1457961 1530341 1681127 1661512 1625790
1383 1625790 1289595 1579153 1542444 1457980 1538913 1374534 1411135 1404227 1312736 1315352 1154237
1372 1154237 1247923 1244328 1158335 1156204 1070162 1298754 1265886 1050922 896535 1166346 1058059
1361 1058059 847635 1066855 1096835 1171662 1163147 1052456 1035552 1114213 1149336 988783 784141
1350 784141 898252 914941 921101 899400 1238058 1306839 1101530 1029670 988883 1293355 1056003
1339 1056003 766259 972483 982744 1029145 961927 862924 830101 556557 555146 783847 944771
1328I44771j45091q1772N8480m3091j3698m6812m056j00262o0496J25166J85164
1317H18303n3746j56056Q9319K39292j86284k19950K2672Q4475M1275k9269m6073
1306F03958J51592M494k33037R6348J02384J23746J65J78768l3955j63405q3227
1295G47831n0723O9239r2062J70555M0084k62506J2412O017j53199O5714m6775
1284E06587N175J71798R0616Q5811j29113j9935j03102J72950r428Q2616j32295
1273G21680j23944N5699R6759m1167q0905J08204m8103l7393j4728Q6842L4938
1262G57882j23767k01133L10275J52587k1286Q4728J27869R3214q971L410K7698
1251A202506j53611j48098K46381J98190r0762j48658o2214J37248j33048m9390
$$ plain form
1328 944771 799680 717908 776388 733297 719599 672787 668731 568469 507973 633139 818303
1317 818303 764557 608501 697820 937112 750828 530878 553550 638025 679300 650031 603958
1306 603958 755550 760044 527007 623355 725739 849485 849650 1028418 994463 831058 747831
1295 747831 697108 766347 674285 844840 884924 622418 634830 640847 487648 553362 506587
1284 506587 511762 683560 774176 859987 730874 710939 607837 780787 771359 853975 721680
1273 721680 597736 653435 750194 709027 628122 736326 688223 650830 636102 722944 757882
1262 757882 634115 432982 743257 895844 874558 959286 1087155 1180369 1171398 1174808 1202506
1251 1202506 1048895 900797 1147178 1345368 1254606 1105948 1043734 1180982 1047934 998544
1241I98544J21066K2748j52167p5196k7809j43694J3871R6257J11503l45210o2048
1230E57865K47289P0859n5213Q629m5603J73873j30713R3757j62320p8274m063
1219F76086j10247M9003l3549J47911k8832N8912j3826k34350q0574J87691L28118
1208I46343M0024p1920o2907j76221k6616k1588m6765j2433J9837K48796J0570
1197H47120k51932N568J67265L46176j29647j73532j43985j77018J03854r0257
1187E03612K7039k637k15180J62648J81797O5226R2027J21795p5997j68198j36792
1176E55340J37616Q9641L3341K3586J46061n9405o7897J9625j43602r8525n893
1165F29888q6Q3989k00846J05422L06216k0560k88316J28626p091j9820N7426
$$ plain form
1241 998544 1119610 1142358 990191 914995 887186 743492 757363 853620 965123 619913 557865
1230 557865 805154 876013 820800 829429 783826 957699 826986 920743 758423 680149 676086
1219 676086 565839 614842 581293 729204 700372 759284 745458 511108 430534 618225 946343
1208 946343 986367 914447 851540 675319 648703 627115 580350 567917 587754 836550 847120
1197 847120 595188 600756 768021 1114197 984550 811018 667033 490015 593869 503612
1187 503612 530651 528014 312834 475482 657279 722505 814532 936327 860330 692132 555340
1176 555340 692956 782597 815938 839524 985585 926180 858283 877908 734306 635781 629888
1165 629888 629802 713791 512945 618367 924583 904023 615707 744333 737242 717422 774848
1154G74848j35876J19505J2442j1182j15052j03471J23086N1943P6503k09866
1144E82880l6961j72128K69341K36986j27163P1504j01780R8537j42584j76649
1134E01983j61984J86550J02065j45707m6434J03001l4827J22346O7724n5101
1124F39616L6886Q5681k852J75968K06180o9321l09950j23861K35804k8206m0477
1113H05468J14745O8140J7800M8535k49484o9816J19602r2137K84279J00925k95545
1102H52512Q0713l5283k742K21524J81971O1352N4941p8444J25313j8159k44710
1091A198988J41282l0291K0556L21130o0126p3075L4556N5317J2864J24577m8401
1080A697377J1840J21256m1970j40330j48583J47591q1052K975R98Q6727o5269
$$ plain form
1154 774848 638972 758477 770919 759737 644685 541214 664300 716243 792746 582880
1144 582880 545919 373791 643132 880118 752955 824459 722679 821216 678632 501983
1134 501983 339999 526549 628614 482907 436473 539474 504647 626993 694717 639616
1124 639616 676502 762183 759331 935299 1141479 1072158 762208 638347 874151 845945 805468
1113 805468 920213 988353 1006153 1054688 805204 735388 854990 762853 1047132 1148057 852512
1102 852512 933225 897942 895200 1116724 1298695 1360047 1414988 1336544 1461857 1443698 1198988
1091 1198988 1340270 1309979 1330535 1651665 1591539 1518464 1553020 1608337 1621201 1745778 1697377
1080 1697377 1709217 1830473 1788503 1648173 1499590 1647181 1566129 1569104 1570102 1656829 1591560
1069A591560K08673N7064k54868j06877K16506j25156K61927j26484J84536l8703
1059A868178n2509j10337M2567l2519l11221P2974J07172p7007J37555J73000
1049A817853o2594j39266J34311J91359j63785K13763o8073m724K3195J02988
1039B045027p2832k3266k8621J68614L8737m5646q1155J62725K24898p7719j83784
1028B126978j27227J62618J29266j73101k571K92855K87296j89227J38844N2272
1018B698003Q9724L11290k8262j4998K51905l3783O7831J59389K70841K12664
1008C984604k9107J77659J40765j7478K10545K90142Q2842J42241K32356L35988
998E550557K94800K51544K01740L13837L27612J00824L10685N16506L76780O63927
$$ plain form
1069 1591560 1800233 1857297 1602429 1495552 1712058 1586902 1848829 1722345 1906881 1868178
1059 1868178 1815669 1705332 1747899 1715380 1404159 1477133 1584305 1507298 1644853 1817853
1049 1817853 1755259 1615993 1750304 1941663 1777878 1991641 1923568 1918844 1942039 2045027
1039 2045027 1972195 1948929 1920308 2088922 2127659 2082013 2000858 2163583 2388481 2310762 2126978
1028 2126978 1999751 2162369 2291635 2118534 2115963 2408818 2696114 2506887 2645731 2698003
1018 2698003 2787727 3099017 3070755 3055757 3307662 3273879 3341710 3501099 3771940 3984604
1008 3984604 3955497 4133156 4273921 4256443 4466988 4757130 4839972 4982213 5214569 5550557
998 5550557 5845357 6096901 6298641 6612478 6940090 7040914 7351599 7868105 8244885 8908812
988H908812K59283N03300L59398L99106O53524P29555P69061Q38492J038200J201172
978A5659903J392481J513125J240424J844328K170714K422901L626526M344299
970C4214701M499556N827257P613151J0282411Q619311N948341M883347L674751
962H5562826j963163j2574920j5218550j2007875q070691n914199l960262l143369
954B2709797k349572k103856j480007r60394q79896q63379n02261l28589o55115
945A2586728r05631p54188q18117q84770o91534l77134m16375m62380m24869l24458
935F527272k21978k77836k98529m18044L6598N4880l42439l96222l27626k40231
925D095845P7683j4867j59553J3037j08635k76518k00700J9487J8496j57219p1484
$$ plain form
988 8908812 9168095 9671395 10030793 10429899 11083423 11812978 12582039 13420531 14458731 15659903
978 15659903 17052384 18565509 19805933 21650261 23820975 26243876 29870402 34214701
970 34214701 38714257 44541514 52154665 62437076 71056387 77004728 81888075 85562826
962 85562826 83599663 71024743 55806193 43798318 35727627 29813428 25853166 22709797
954 22709797 20360225 18256369 16776362 15815968 14936072 14072693 13570432 13241843 12586728
945 12586728 11681097 10926909 10108792 9224022 8532488 8155354 7738979 7276599 6851730 6527272
935 6527272 6305294 6027458 5728929 5310885 5347483 5402363 5059924 4663702 4336076 4095845
925 4095845 4173528 4158661 3999108 4012145 3903510 3626992 3426292 3445779 3464275 3307056 3235572
914C235572k24748n1852j27066M4833J13780l17998J55873m6717p3514J74759
904B882922l84775p9164Q0304k44089k94070o7207K24576P0275L4597k11887k39033
893A772449q7501O0095J25584o4455j31664j23587J03485N4619j50044J22165
883A681146J43457l28765J50855j50721N8080J42116o1616k25866j60806q5407
873A162473j01082K04141N0437k448O0969n1715K9630j30298j37230M2726J75205
862A302808j69792M4272k8234j69547J800P5566j05111o2905j0264k3109j99361
851F56123n390j7189N2368P7051Q347j66961n4463p5099J74770O647k76047K02674
839E82831P0793N3241M6710p6337j1672l9593j49715Q9875K8124j7489k6233l1534
$$ plain form
914 3235572 3010824 2958972 2831906 2876739 2990519 2672521 2828394 2781677 2708163 2882922
904 2882922 2498147 2418983 2499287 2255198 1961128 1893921 2118497 2188772 2223369 2011482 1772449
893 1772449 1684948 1745043 1870627 1806172 1674508 1550921 1654406 1709025 1558981 1681146
883 1681146 1824603 1495838 1646693 1495972 1554052 1696168 1634552 1408686 1247880 1162473
873 1162473 1061391 1265532 1315969 1313521 1374490 1322775 1352405 1222107 1084877 1127603 1302808
862 1302808 1133016 1177288 1149054 979507 981307 1056873 951762 888857 878593 855484 656123
851 656123 650733 633544 685912 762963 771310 604349 549886 474787 649557 656204 380157 582831
839 582831 653624 706865 753575 677238 665566 625973 476258 566133 594257 576768 550535 519001
827E19001r6849K68699j796J22681j76351Q4507J11719l03186K29199l5051j4348
816G08225O3769k19011K1636m6987J14404J10061J4608m1980j61902J5156k26263
805C51716o4332L02345J68586r102J0392j33576k7823r3960R4267M4255k01582
794D41186l8851j22829r2762Q8522Q8974O6121P754l7632j2506R340J03530n5028
782D45819J48499k7089m7910q5886j30026r0246Q4423p2508j50195K034K80888
771C57803k2946K03621R8485j56437r9304o0386J08826j72559L67342O9430k83807
760D10068q5501O2847o2426j19648o3505k9121J19715j70303J57783N4571l8048
749B36432Q1920J75172l5862Q4354j11294q4378O2465j52890R4241j84023R980
$$ plain form
827 519001 422152 690851 689055 811736 635385 719892 831611 528425 757624 722573 708225
816 708225 771994 552983 574619 527632 642036 752097 766705 724725 562823 577979 351716
805 351716 287384 589729 758315 749213 759605 626029 598206 504246 598513 642768 441186
794 441186 402335 279506 186744 275266 364240 430361 438115 400483 387977 397317 500847 445819
782 445819 594318 567229 519319 433433 303407 213161 297584 225076 74881 76915 357803
771 357803 334857 538478 636963 480526 381222 320836 429662 257103 624445 693875 410068
760 410068 324567 387414 324988 205340 141835 112714 232429 62126 219909 274480 236432
749 236432 318352 493524 457662 542016 430722 346344 408809 255919 350160 166137 176117
738A76117J96692k15093N552K16265j60824J02547j769r3204P9121k62445K067
727D5026m3000J10972j39798j31133K95439J05334j6596Q1845K9362k59022M8347
716A26776J1168J1700j7048J41807K24993L1940k73624j49283j53965K12435K45267
705D12166O1566k64958j60794m1284J38065K22805j73262m9702J0563r5500J11635
694A71300P9641J3029L593j19214J3728q0719K17877q1971J304O1144j05564K05199
682C79347r7437j17715L8860K56700m2825l919r7817J68489M44559j44130k02128
671E81984j83224k57901R1592J69998o0578n2990K78193j71678N8316L6842l50912
660A39642q8292N5387Q1325j80089O059k32981M5373K06746j4520J8223J80848
$$ plain form
738 176117 372809 157716 163268 379533 218709 321256 319487 226283 305404 42959 45026
727 45026 2026 112998 -26800 -157933 137506 242840 226244 308089 337451 78429 126776
716 126776 137944 149644 132596 274403 499396 531336 257712 108429 -45536 166899 412166
705 412166 473732 208774 47980 6696 144761 367566 194304 144602 155165 59665 171300
694 171300 250941 263970 267563 148349 162077 81358 299235 217264 218568 279712 174148 379347
682 379347 281910 164195 203055 459755 416930 413011 315194 483683 928242 784112 581984
671 581984 398760 140859 232451 402449 341871 288881 567074 395396 453712 490554 139642
660 139642 51350 106737 188062 7973 14032 -218949 -173576 33170 18650 36873 217721
649B17721o5192l438L4616m9299J6187J51279M6846j74539j0230N357m9485J7145
637A36968q6661j41619O1349K34354q8704m1559r6599J1809P6156P0242J1444
626A47180k1545j13400K1695P5278j16351j35001R4354L6747J74801j68711o8601
615g3554j22277l2844L8070Q3876K01175j88887K12108O2331j25355l26158K65742
604e773l2837o1936Q9825K51401k40478j51584M6830J13195R0334P4422o0492
593A12907N1470J23794r6842j81604o5809J44610m0757p0977j20572J99459J43408
582A99087m5656j3243j58064p1752r4037K3306K04232O3091k20556k30899Q623
571c35868K41358J65575M6001Q4628n9040L7839j1046j20996j15746j25620J03972
$$ plain form
649 217721 152529 149091 183707 134408 150595 301874 348720 174181 163951 169308 119823 136968
637 136968 50307 -91312 -29963 204391 115687 74128 -22471 -10662 65494 135736 147180
626 147180 125635 12235 33930 109208 -7143 -142144 -47790 -11043 163758 -4953 -73554
615 -73554 -195831 -228675 -190605 -106729 94446 -94441 117667 179998 54643 -271515 -5773
604 -5773 -38610 -100546 -10721 240680 202 -151382 -104552 8643 98977 173399 112907
593 112907 164377 288171 191329 9725 -56084 88526 47769 -23208 -143780 55679 199087
582 199087 153431 140188 -17876 -89628 -183665 -160359 43873 106964 -113592 -344491 -335868
571 -335868 -94510 71065 117066 201694 142654 180493 169447 48451 -67295 -192915 -88943
560h8943M9855J24108m4674L3774m454j91507O4229R618O5415K5660L4222J5727
548I3030R215l9906k58951N6815J09561j18698J69604O7215J17816j68877M8560
537H5384R7209P3489p8287l29603m870j0954r4777K94743R3059q3209k17187J16670
525e8333p3170o1774j40320L35812R5832k06915r7041n2044J87917L5038j06813
514a41811o9899n2034r7090J25021J734O4099j5285M957L9514J66368j17549L7977
502e3998M5561M5404P5058r8493l57202j9167J21701J55846o8821Q9902M1963
491b2246k59319J72103j81146P1002J79487J20386m589J85002o3835j67200J41847
480A71492k4864k25833j23855l3918L0483p3249J08147N4612Q7249j36430m5407
$$ plain form
560 -88943 -39088 85020 40346 74120 69666 -121841 -57612 -47994 17421 43081 77303 93030
548 93030 102245 62339 -196612 -139797 -30236 -148934 20670 87885 205701 36824 85384
537 85384 182593 256082 177795 -151808 -156678 -167632 -262409 32334 125393 42184 -175003 -58333
525 -58333 -131503 -193277 -333597 2215 98047 -108868 -205909 -257953 -70036 -34998 -141811
514 -141811 -211710 -263744 -360834 -235813 -234079 -169980 -185265 -180308 -140794 25574 -91975 -53998
502 -53998 -8437 36967 112025 13532 -343670 -362837 -241136 -85290 -154111 -64209 -22246
491 -22246 -281565 -109462 -290608 -219606 -40119 80267 75678 260680 196845 29645 171492
480 171492 146628 -79205 -203060 -236978 -206495 -279744 -171597 -116985 -29736 -166166 -211573
469b11573K70688j28222p2411p8146P3069k0656J9046J41589J62541M2480j16994
458H1411j89880P874q0665k8467k0286K0886J13990k5835n2514J72474p0824Q7970
446A6134o1695N125k52979k01851J23016L50206J77936k68764j33388J36204K42918
435A32862j42823P0362J9415p1882n6580J28247O1029J75992m01577j33259J39632
424g8582j75953P8391q645K85202l1212p9381j10296J96634l14908j50491K15558
413a73683j07564L1478j16083J36784J85483j14652P7913M1705k11274Q443J91363
402e0087j01611m0744L9562K32091M1105j80015k8729K5900q121Q8174J07841
391A25366p0998j67111j64601J30294k2189j23314m1472J17695J93756l1817j4167
$$ plain form
469 -211573 59115 -69107 -141518 -219664 -146595 -167251 -148205 -6616 155925 198405 81411
458 81411 -108469 -100595 -181260 -209727 -230013 -209127 -95137 -120972 -173486 -1012 -71836 16134
446 16134 -45561 -40436 -293415 -495266 -372250 -22044 155892 -112872 -246260 -110056 132862
435 132862 -9961 60401 79816 7934 -48646 79601 140630 316622 -84955 -218214 -78582
424 -78582 -254535 -176144 -184789 100413 69201 -10180 -120476 76158 -238750 -389241 -173683
413 -173683 -281247 -249769 -365852 -229068 -43585 -158237 -80324 -38619 -249893 -241450 -50087
402 -50087 -151698 -192442 -152880 79211 120316 -59699 -88428 -62528 -70649 17525 125366
391 125366 54368 -112743 -277344 -147050 -169239 -292553 -334025 -216330 -22574 -54391 -68558
380f8558Q6427j31577p9840o03J87917j19269j26093q4600j3087J10748k2877
369b61412J13208K51138l153K7187Q7817j82892k13104n4940O1697Q6947j48491
358b35998K6862Q489K04298o8638j12075J335q8649j5625o4385n8979L48844J86726
346A32205l74545j1645J00800n4785r4743J81882p9390L9108j8252L516N1505
335a24344K27587j98710k7907J19546j77610j7144P0180J59564J20706j95870
325d4002l00470K15397J41264k34464k33554P8225L6958O3287Q4752m0665J15757
314a17515R6444j9983n7009j02729n975K5811J42257r1499Q2787n610N3775J60131
302A60885j03469j68049J09556k59219k11066O0743J42305J87056j40148l04253
$$ plain form
380 -68558 17869 -113708 -193548 -194151 -6234 -125503 -251596 -336196 -349283 -238535 -261412
369 -261412 -148204 102934 99781 126968 214785 31893 -181211 -236151 -174454 -87507 -235998
358 -235998 -209136 -200647 3651 -64987 -177062 -175727 -264376 -280001 -344386 -403365 -54521 132205
346 132205 -242340 -253985 -153185 -207970 -302713 -120831 -200221 -161113 -179365 -175849 -124344
335 -124344 103243 -95467 -123374 -3828 -181438 -198582 -128402 31162 151868 -44002
325 -44002 -344472 -129075 12189 -222275 -455829 -377604 -340646 -277359 -192607 -233272 -117515
314 -117515 -21071 -41054 -98063 -200792 -206767 -180956 -38699 -130198 -47411 -53021 754 160885
302 160885 57416 -110633 -1077 -260296 -471362 -410619 -268314 -81258 -221406 -525659
292e25659R2070J32509q268J45983j0410j97399P7457J43819m894j75584K7591
281c02785J06542o0628K10797O1718k326j52700j1527R2863m0068P7669j03055
270a23500j4468j27278j0541J90670j18434J81813k0528q1369L8313O7494k1343
259c9171M0559M9139r8522K9964j84793j25923J40550J65848k668o8828n528O912
247i2461m2600j13837J47419K12348j47341p022J186k44431k19464M1293L24978
236a39932n1167q0764j99347R8071J32966q9169J658J2601J31438J4810k71693
225d40528K25170R6212k36986j07820J97535j74Q9167N5492j17677p7652l5642
214c52903K54773j0991j17049J17648j88210n8151Q8445M5530M4002j13775J40747
$$ plain form
292 -525659 -433589 -301080 -309348 -163365 -173775 -371174 -293717 -149898 -154792 -330376 -302785
281 -302785 -196243 -256871 -46074 15644 13318 -139382 -150909 -58046 -98114 -20445 -123500
270 -123500 -137968 -265246 -275787 -85117 -203551 -21738 -42266 -123635 -85322 -17828 -39171
259 -39171 1388 50527 -47995 -18031 -202824 -328747 -188197 -22349 -25017 -93845 -99373 -92461
247 -92461 -135061 -248898 -101479 110869 -36472 -43494 -42308 -286739 -506203 -464910 -139932
236 -139932 -191099 -271863 -471210 -373139 -240173 -329342 -327684 -315083 -183645 -168835 -440528
225 -440528 -215358 -119146 -356132 -463952 -266417 -266591 -177424 -121932 -239609 -317261 -352903
214 -352903 -98130 -109121 -226170 -108522 -296732 -354883 -266438 -220908 -176906 -290681 -149934
203a49934k24751J38334J736P2215R9394k35140j19749L6583o3557J37216L98987
192I1334j41648j40387J46309j87846j35809K13677m6848J0433L4671j24835r207
181b90156L4058n5011N4424J00896Q0166L0746k4386j44895p4374J09171j12038
170b91399m2919Q1477n0853k96264P4388J46520P4200q4446J85208P316m6724
159b43496n0244n5882R5065r9969P5098M4454P5983q7718O5765m0430J81127j38763
147a79010n6463K00569j06211n5334L7340j15195J13454j35852j7121K23736j01208
136a91295p9845Q3788j12950q9156J7425M0842K1761N9599J11349k4488k15191
125c78161j27122n961m6308L05039R2995j2849j17356J997l4382K9767J1389k7028
$$ plain form
203 -149934 -374685 -236351 -234615 -162400 -63006 -298146 -417895 -381312 -444869 -307653 91334
192 91334 -50314 -190701 -44392 -232238 -368047 -154370 -201218 -190785 -156114 -280949 -290156
181 -290156 -256098 -311109 -256685 -155789 -75623 -44877 -69263 -214158 -288532 -179361 -291399
170 -291399 -334318 -252841 -303694 -599958 -525570 -379050 -304850 -389296 -204088 -196772 -243496
159 -243496 -293740 -349622 -254557 -354526 -279428 -234974 -158991 -246709 -180944 -221374 -40247 -179010
147 -179010 -235473 -34904 -141115 -196449 -159109 -274304 -160850 -296702 -313823 -90087 -191295
136 -191295 -271140 -187352 -300302 -389458 -372033 -331191 -309430 -249831 -138482 -162970 -378161
125 -378161 -505283 -511244 -557552 -252513 -159518 -172367 -289723 -287726 -322108 -292341 -280952 -307980
113c07980j2482n436k314l0788P4411L2458O3806J87352o3404k23305O1602J43934
101h2146j23353r792k26542j56576J76221J42099n8210K20773J20396j91440L2899
90a55671M6032j00217K6222j77759K4306O5318j2313j17028p0965J86698J02942
79a82435P347p3088p9357n539R6154K6143j25758M2182J94077j27106j1790j04137
67c43307j6667m1520J16286P3205j4764R0131K7758q2282j18394j7977m0477N4882
55c13126j11884N0302l1856J10459J237p7775P2331j16428N1999J98436m5015
44b11320k44860L7238j19285L8751J63735J51778j05862j66352J83681J28335
34a44161o9761Q3020j09751j02012l9225l2732J01592j12775L6716O5946l336
$$ plain form
113 -307980 -320462 -325898 -328212 -359000 -284589 -252131 -188325 -973 -64377 -287682 -226080 -82146
101 -82146 -205499 -215291 -441833 -598409 -422188 -280089 -338299 -117526 2870 -188570 -155671
90 -155671 -109639 -209856 -183634 -361393 -337087 -271769 -284082 -401110 -472075 -285377 -182435
79 -182435 -175088 -248176 -327533 -333072 -236918 -210775 -336533 -294351 -100274 -227380 -239170 -343307
67 -343307 -359974 -401494 -285208 -212003 -226767 -136636 -108878 -191160 -309554 -327531 -368008 -313126
55 -313126 -425010 -374708 -406564 -296105 -294868 -372643 -300312 -416740 -364741 -166305 -211320
44 -211320 -456180 -418942 -538227 -499476 -335741 -183963 -289825 -456177 -272496 -144161
34 -144161 -213922 -130902 -240653 -342665 -381890 -414622 -313030 -425805 -389089 -323143 -326479
23c26479k6736k5138R0133J8917q4540r7826J56629L5025j63950j4373Q8727Q2964
11b66647J25274j46311m2592n9622j43089K9123J91054Q8398k1545N1986j0995
0b04966
$$ plain form
23 -326479 -353215 -378353 -288220 -269303 -353843 -451669 -295040 -260015 -423965 -438338 -349611 -266647
11 -266647 -141373 -287684 -330276 -389898 -532987 -503864 -312810 -224412 -245957 -193971 -204966
0 -204966
$$ Imaginary data points
##PAGE= N=2
##DATA TABLE= (X++(I..I)), XYDATA
16383f196009L04936L4120o905M4465J12629J12076Q3233K7475Q32n8220M9940
16372e491428J83401Q9905J04780R3897j4201J37598K1704M3587K00109Q78P0084
16361d559686J034P6656R8217J91098J71281l7034l845J61533Q3935j15345j2812
16350c944968J57986j30450k7290J50590k2602J63649K46560J52441j45640P1847
16340c327877N8658R128O3495J57284o6458J14387J21361O9626n1014J74019J44771
16329b532620J59180O1843N7270L522M2908J5374j25075J6817Q8183R4686J56853
16318a961059M9760j02502Q6088K00801J90826k9525o1049J17792K52482r9129
16308a355515R3637L2418k46318M2123K05871R0471k1962J93565K47237j33254
$$ plain form
16383 -6196009 -5891073 -5856953 -5863858 -5819393 -5706764 -5594688 -5511455 -5483980 -5483148 -5541368 -5491428
16372 -5491428 -5308027 -5218122 -5113342 -5019445 -5033646 -4896048 -4874344 -4830757 -4630648 -4629770 -4559686
16361 -4559686 -4558652 -4481996 -4383779 -4192681 -4021400 -4058434 -4062279 -3900746 -3816811 -3932156 -3944968
16350 -3944968 -3786982 -3917432 -3944722 -3794132 -3816734 -3653085 -3406525 -3254084 -3399724 -3327877
16340 -3327877 -3269219 -3260091 -3196596 -3039312 -3105770 -2991383 -2870022 -2800396 -2851410 -2677391 -2532620
16329 -2532620 -2373440 -2311597 -2254327 -2250805 -2207897 -2192523 -2317598 -2300781 -2212598 -2117912 -1961059
16318 -1961059 -1911299 -2013801 -1927713 -1726912 -1536086 -1565611 -1626660 -1508868 -1256386 -1355515
16308 -1355515 -1261878 -1229460 -1475778 -1433655 -1227784 -1137313 -1159275 -965710 -718473 -851727
16298h51727j91951J16227K78527N9359J38537n1788K4406n5887K34363J23254
16288a76680j31274O615p9216J97971P5381L1262J79949j77441N3791J59728q6133
16277E3953J04458Q1722J6456K43410L6082q3960o3693N2759P1788j8789j2949
16266D81237K55426J42159K0850q6060j05255J32239R4384K65801L1047N1244
16256A283072l6667r6389m5990Q5965j0281n8078J83442N009o37J85044k00497
16245A293993j50338K46293J69959J98569M9539J7265j17847Q0888N0887R5351
16235A934559p340j58510k617R9043o8392J22779o5350J39070R227o787K78251
16224B273933J17435K5418n72R4029Q0693O089j45014N556Q1721q0119n4508k2938
$$ plain form
16298 -851727 -1043678 -927451 -648924 -589565 -451028 -502816 -478410 -534297 -299934 -176680
16288 -176680 -307954 -301339 -380555 -182584 -107203 -75941 104008 -73433 -19642 140086 53953
16277 53953 158411 240133 256589 499999 536081 452121 388428 441187 512975 494186 481237
16266 481237 736663 878822 899672 813612 708357 840596 934980 1200781 1231828 1283072
16256 1283072 1246405 1150016 1104026 1189991 1179710 1121632 1305074 1310083 1309446 1494490 1293993
16245 1293993 1143655 1389948 1559907 1758476 1808015 1825280 1707433 1788321 1839208 1934559
16235 1934559 1927219 1768709 1766092 1865135 1796743 1919522 1854172 1993242 2002469 1995682 2273933
16224 2273933 2391368 2416786 2416214 2510243 2590936 2597025 2452011 2457567 2539288 2459169 2404661 2381723
16212B381723J57453L0521N1343P0919j64224M6040J16809K8489L0491r2750J33223
$$ plain form
16212 2381723 2539176 2569697 2621040 2691959 2527735 2573775 2690584 2719073 2749564 2656814 2790037
$$ [...]
##END NTUPLES=NMR SPECTRUM
##END=
