##TITLE=1H_EC-3247x
 DMSO,8 sc, 
 10.03.2021
##JCAMPDX= 6.0         $$ Bruker NMR JCAMP-DX V2.0
##DATA TYPE= NMR SPECTRUM
##DATA CLASS= NTUPLES
##ORIGIN= UXNMR, Bruker Analytische Messtechnik GmbH
##OWNER= root
$$ XWIN-NMR		Version 3.5
$$ Wed Mar 10 10:56:34 2021 Russian Standard Time (UT+4h)  she@DPX200
##.OBSERVE FREQUENCY= 200.131506
##.OBSERVE NUCLEUS= ^1H
##.ACQUISITION MODE= SIMULTANEOUS
##.ACQUISITION SCHEME= undefined
##.AVERAGES= 8
##.DIGITISER RES= 18
##SPECTROMETER/DATA SYSTEM= spect
##.PULSE SEQUENCE= zg30
##.SOLVENT NAME= DMSO
##.SHIFT REFERENCE= (INTERNAL, DMSO, 0, 15.9927)
##AUDIT TRAIL= $$ (NUMBER, WHEN, WHO, WHERE, WHAT)
$$ ##TITLE= Audit trail, XWIN-NMR		Version 3.5
$$ ##JCAMPDX= 5.01
$$ ##ORIGIN= Bruker BioSpin GmbH
$$ ##OWNER= she
$$ F:/spectra/data/she/nmr/H-F/1/pdata/1/auditp.txt
$$ ##AUDIT TRAIL=  $$ (NUMBER, WHEN, WHO, WHERE, WHAT)
(   1,<2021-03-10 10:55:25.07 +0400>,<she>,<DPX200>,
      <created by zg, POWCHK disabled, PULCHK disabled
       configuration hash MD5:
       00 E9 B6 7A A2 85 ED C7 34 08 36 98 17 FE 4E 26
       data hash MD5: 16K
       CC ED 6F 7B 5E FA BF F6 54 60 B2 35 41 74 FA 24>)
(   2,<2021-03-10 10:55:27.39 +0400>,<she>,<DPX200>,
      <Start of raw data processing
       efp BC_mod = 2 LB = 0.24 FT_mod = 6 PKNL = 1 PHC0 = -11119.56 PHC1 = 9.400941 SI = 16K 
       data hash MD5: 16K
       BC 91 BC A4 B9 8B A5 8D AA 48 34 84 CD 86 19 A9>)
(   3,<2021-03-10 10:55:42.60 +0400>,<she>,<DPX200>,
      <pk PHC0 = 2.131253 PHC1 = -2.8 
       data hash MD5: 16K
       71 83 76 12 81 7C 65 11 73 D1 16 27 A2 E4 B3 76>)
(   4,<2021-03-10 10:55:45.75 +0400>,<she>,<DPX200>,
      <abs ABSG = 5 
       data hash MD5: 16K
       0F F9 97 98 64 12 53 C0 7F 5D D7 76 63 98 73 D7>)
$$ ##END=
$$ 
$$ hash MD5
$$ FF E9 FB 03 78 B6 89 F1 D4 5A 29 7C 47 CB 85 4C
##$RELAX= 
##$RELAX= 
##$RELAX= 
##$RELAX= 
##$RELAX= 
##$RELAX= 
$$ Bruker specific parameters
$$ --------------------------
##$DU= <F:/spectra>
##$EXPNO= 1
##$NAME= <H-F>
##$PROCNO= 1
##$TYPE= <nmr>
##$USER= <she>
##$AMP= (0..31)
100 100 100 100 100 100 100 100 100 100 100 100 100 100 100 100 100 100 
100 100 100 100 100 100 100 100 100 100 100 100 100 100 
##$AQSEQ= 0
##$AQ_mod= 1
##$AUNM= <au_zg>
##$AUTOPOS= <>
##$BF1= 200.13
##$BF2= 200.13
##$BF3= 200.13
##$BF4= 200.13
##$BF5= 200.13
##$BF6= 200.13
##$BF7= 200.13
##$BF8= 200.13
##$BYTORDA= 1
##$CFDGTYP= 0
##$CFRGTYP= 5
##$CHEMSTR= <none>
##$CNST= (0..31)
1 1 145 1 1 1 1 1 1 1 1 1 1 1 1 1 1 1 1 1 1 1 1 1 1 1 1 1 1 1 1 1 
##$CPDPRG= <>
##$CPDPRG1= <>
##$CPDPRG2= <>
##$CPDPRG3= <>
##$CPDPRG4= <mlev>
##$CPDPRG5= <mlev>
##$CPDPRG6= <mlev>
##$CPDPRG7= <mlev>
##$CPDPRG8= <mlev>
##$CPDPRGB= <>
##$CPDPRGT= <>
##$D= (0..31)
0 1.2 0 0 0 0 0 0 0 0.06 0 0.03 0 0 0 0 0.0002 0 0 0 0 0 0 0 0 0 0 0 0 
0 0 0 
##$DATE= 1615359324
##$DBL= (0..7)
120 120 120 120 120 120 120 120 
##$DBP= (0..7)
150 150 150 150 150 150 150 150 
##$DBP07= 0
##$DBPNAM0= <>
##$DBPNAM1= <>
##$DBPNAM2= <>
##$DBPNAM3= <>
##$DBPNAM4= <>
##$DBPNAM5= <>
$$ [...]
##$SUBNAM3= <"">
##$SUBNAM4= <"">
##$SUBNAM5= <"">
##$SUBNAM6= <"">
##$SUBNAM7= <"">
##$SUBNAM8= <"">
##$SUBNAM9= <"">
##$SW= 16.9725357007746
##$SWIBOX= (0..15)
0 0 2 0 0 0 0 0 0 0 0 0 0 0 0 0 
##$SW_h= 3396.73913043478
##$TD= 16384
##$TD0= 1
##$TE= 0
##$TE2= 300
##$TE3= 300
##$TEG= 300
##$TL= (0..7)
0 120 120 120 120 120 120 120 
##$TP= (0..7)
150 150 150 150 150 150 150 150 
##$TP07= 0
##$TPNAME0= <>
##$TPNAME1= <>
##$TPNAME2= <>
##$TPNAME3= <>
##$TPNAME4= <>
##$TPNAME5= <>
##$TPNAME6= <>
##$TPNAME7= <>
##$TPOAL= (0..7)
0.5 0.5 0.5 0.5 0.5 0.5 0.5 0.5 
##$TPOFFS= (0..7)
0 0 0 0 0 0 0 0 
##$TUNHIN= 0
##$TUNHOUT= 0
##$TUNXOUT= 0
##$USERA1= <user>
##$USERA2= <user>
##$USERA3= <user>
##$USERA4= <user>
##$USERA5= <user>
##$V9= 5
##$VALIST= <valist>
##$VCLIST= <CCCCCCCCCCCCCCC>
##$VD= 0
##$VDLIST= <DDDDDDDDDDDDDDD>
##$VPLIST= <PPPPPPPPPPPPPPP>
##$VTLIST= <TTTTTTTTTTTTTTT>
##$WBST= 1024
##$WBSW= 4
##$XGAIN= (0..3)
0 0 0 0 
##$XL= 0
##$YL= 0
##$YMAX_a= 122263
##$YMIN_a= -129488
##$ZGOPTNS= <>
##$ZL1= 120
##$ZL2= 120
##$ZL3= 120
##$ZL4= 120
##$ABSF1= 15.99578
##$ABSF2= -0.9768839
##$ABSG= 5
##$ABSL= 3
##$ALPHA= 0
##$AQORDER= 0
##$ASSFAC= 0
##$ASSFACI= 0
##$ASSFACX= 0
##$ASSWID= 0
##$AUNMP= <proc_1d>
##$AZFE= 0.1
##$AZFW= 0.1
##$BCFW= 0
##$BC_mod= 2
##$BYTORDP= 0
##$COROFFS= 0
##$CY= -3
##$DATMOD= 1
##$DC= 0
##$DFILT= <>
##$DTYPP= 0
##$F1P= 0
##$F2P= 0
##$FCOR= 1
##$FTSIZE= 16384
##$FT_mod= 6
##$GAMMA= 0
##$GB= 0
##$INTBC= 1
##$INTSCL= 2.992141e-10
##$ISEN= 128
##$LB= 0.24
##$LEV0= 0
##$LPBIN= 0
##$MAXI= 10000
##$MC2= 0
##$MEAN= 0
##$ME_mod= 0
##$MI= 1.114404
##$NCOEF= 0
##$NC_proc= -8
##$NLEV= 6
##$NOISF1= 3.799351
##$NOISF2= 2.8
##$NSP= 0
##$NTH_PI= 0
##$NZP= 0
##$OFFSET= 15.99267
##$PC= 1
##$PHC0= -11117.43
##$PHC1= 6.600941
##$PH_mod= 1
##$PKNL= yes
##$PPARMOD= 0
##$PSCAL= 0
##$PSIGN= 0
##$REVERSE= no
##$SF= 200.130003755778
##$SI= 16384
##$SIGF1= 3
##$SIGF2= 2
##$SINO= 5.538805
##$SIOLD= 16384
##$SREGLST= <1H.CDCl3>
##$SSB= 0
##$STSI= 16384
##$STSR= 0
##$SW_p= 3396.73913043479
##$SYMM= 0
##$S_DEV= 0
##$TDeff= 16384
##$TDoff= 0
##$TI= <>
##$TILT= no
##$TM1= 0
##$TM2= 0
##$TOPLEV= 0
##$USERP1= <user>
##$USERP2= <user>
##$USERP3= <user>
##$USERP4= <user>
##$USERP5= <user>
##$WDW= 1
##$XDIM= 16384
##$YMAX_p= 421030246
##$YMIN_p= -1422191
$$ End of Bruker specific parameters
$$ ---------------------------------
##NTUPLES= NMR SPECTRUM
##VAR_NAME=  FREQUENCY,     SPECTRUM/REAL,   SPECTRUM/IMAG
##SYMBOL=    X,             R,               I
##VAR_TYPE=  INDEPENDENT,   DEPENDENT,       DEPENDENT
##VAR_FORM=  AFFN,          ASDF,            ASDF
##VAR_DIM=   16384,         16384,           16384
##UNITS=     HZ,            ARBITRARY UNITS, ARBITRARY UNITS
##FACTOR=    0.207333158178282, 1,           1
##FIRST=     3200.61311901344, 0,            0
##LAST=      -196.126011421355, 0,           0
##MIN=       -196.126011421355, -1422191,    0
##MAX=       3200.61311901344, 421030246,    0
$$ Real data points
##PAGE= N=1
##DATA TABLE= (X++(R..R)), XYDATA
$$ [...]
7141a11190N14458L98082q64011o68214L72162K97314p2800j95310L43482j22699
$$ -111190 403268 801350 -62661 -730875 -358713 -61399 -134199 -329509 13973 -108726
7131a08726r5255K79684k15944k2547P2715K48903J04273K49051m10997l42639
$$ -108726 -203981 75703 -140241 -162788 -90073 158830 263103 512154 101157 -241482
7121b41482J98918k1537k12727M60283m3342k13569q9339J13984K23447K964k02906
$$ -241482 -42564 -64101 -276828 183455 140113 -73456 -162795 -48811 174636 177600 -25306
7110b5306k79900m62614J97717K83128M14939j64889j05949k03566J955j97600
$$ -25306 -305206 -767820 -570103 -286975 127964 -36925 -142874 -346440 -344485 -542085
7100e42085n1361L72845J22681j69089j57797j40865m46150K73328L32035r0847
$$ -542085 -593446 -220601 -97920 -267009 -424806 -565671 -1011821 -738493 -406458 -497305
7090d97305j44961M11582L49002J90325k32551J0787L3331J16335J63973O6148
$$ -497305 -642266 -230684 118318 308643 76092 86879 120210 236545 400518 466666
7080D66666k95408L52598j70346o9946m0415l35497J44653N07937m22302m7637
$$ 466666 171258 523856 353510 283564 243149 -92348 52305 560242 137940 90303
7070I0303L06558n49121M0268K69376j236K51513r1478m2575J3218J16230M2451
$$ 90303 396861 -152260 -111992 157384 156148 407661 316183 273608 286826 403056 445507
7059D45507J70405K2302k96070k6663l70152J64413l46879k613j07260R3554L29608
$$ 445507 615912 638214 342144 315481 -54671 109742 -237137 -239750 -347010 -253456 76152
7048G6152J94630k06240N7046k97731J41003L20250L9109l281l38634k17827j74655
$$ 76152 270782 64542 121588 -176143 -35140 285110 324219 320938 -17696 -235523 -410178
7037d10178M47498R4524p2418n565O3939k38602j13036J44312J61162L03440n579
$$ -410178 37320 131844 59426 53861 117800 -120802 -233838 -89526 71636 375076 369497
7026C69497l28101Q5983k18103O3025j72526J21751K321j80690j20366K32570
$$ 369497 41396 127379 -90724 -27699 -200225 -78474 -76153 -256843 -377209 -144639
7016a44639J3598K18476p7431N5705J1053m6736l13257m20249m24733O5905M61650
$$ -144639 -131041 87435 10004 65709 76762 30026 -283231 -703480 -1128213 -1062308 -600658
7005f00658K43902J26798J53543L71439o87755J33562J7730j82231M67822K15668
$$ -600658 -356756 -229958 -76415 295024 -392731 -259169 -241439 -423670 44152 259820
6995B59820j01339k4426l4251k24921J07511l77125j12751M34333L21088J08087
$$ 259820 158481 134055 99804 -125117 -17606 -394731 -507482 -73149 247939 356026
6985C56026j80443n5611j67223o4685j62115l2212N79204n4374k8283P7674r7250
$$ 356026 175583 119972 -47251 -111936 -274051 -306263 272941 218567 190284 267958 170708
6974A70708q8595j25707L5859j24473m1814j13773R2378O1909Q0326j73832N8777
$$ 170708 82113 -43594 -7735 -132208 -174022 -287795 -195417 -133508 -53182 -227014 -168237
6963a68237P7697j06973K19725R7041j27400K42924o07476k45784P96881J42234
$$ -168237 -90540 -197513 22212 119253 -8147 234777 -372699 -618483 178398 320632
6953C20632o12663m01977L83908M88870n65267J89102O0278l837K00315Q1014
$$ 320632 -292031 -694008 -310100 178770 -386497 -197395 -137117 -140954 59361 140375
6943A40375j90398L3513m4401k43917L51897M97771j76869p01723k01290N83333
$$ 140375 -50023 -16510 -60911 -304828 47069 544840 367971 -333752 -535042 48291
6933D8291j6457l61875m32069O06152M13291l49883l70127L70415M23614Q4712
$$ 48291 31834 -330041 -762110 -155958 257333 -92550 -462677 -92262 331352 416064
6923D16064j63300j35861K82739o353k17160l57716O85408o14981l19490j39434
$$ 416064 252764 116903 399642 393289 176129 -181587 503821 -111160 -430650 -570084
6913e70084q0934k61492L37485K57230k03095m5461M3259K35923M12853p263k50213
$$ -570084 -651018 -912510 -575025 -317795 -520890 -566351 -523092 -287169 125684 118421 -131792
6902a31792J4953M60986k00781m90626J58949N40432j09330k24699L18400j44403
$$ -131792 -116839 344147 143366 -347260 -188311 352121 242791 18092 336492 192089
6892A92089n36249r8749J02434M7946q1186J07745L10838k67985J95739k96547
$$ 192089 -344160 -442909 -340475 -292529 -373715 -265970 44868 -223117 -27378 -323925
6882c23925J0487K41977K57854j60934k72895L20259N6517p0986J79997j46834
$$ -323925 -313438 -71461 186393 25459 -247436 72823 129340 58354 238351 91517
6872I1517j80572k04553j79499k6072N6268K0229n2591L90176p156L4092M85648
$$ 91517 -89055 -293608 -473107 -499179 -442911 -422682 -475273 -85097 -92253 -58161 427487
6861D27487m42791J39474k63550k08258J03037j00329j05934M71973M92844m64951
$$ 427487 -15304 124170 -139380 -347638 -244601 -344930 -450864 21109 513953 49002
6851D9002K25753j86201p7331l9006p0467J17471L14531n40071o3610N68266J99982
$$ 49002 274755 88554 11223 -27783 -98250 19221 333752 -206319 -269929 298337 498319
6840D98319o2342j15364m37387K29114M10360j41534m08783p0560J34187j45841
$$ 498319 435977 320613 -116774 112340 522700 381166 -27617 -98177 36010 -109831
6830a09831o0092l56057j35629N87610K79848j28098N8106p6972l79740k02260
$$ -109831 -169923 -525980 -661609 -73999 205849 77751 135857 58885 -320855 -523115
6820e23115l8416J21426K62039L91005l44083J33785K14375p1067J75787l34072
$$ -523115 -561531 -440105 -178066 212939 -131144 2641 217016 145949 321736 -12336
6810a2336M49573r3820n81116m23752K57851q8118L54174Q4269j6456N47032k84543
$$ -12336 437237 343417 -237699 -661451 -403600 -491718 -137544 -53275 -69731 477301 192758
6799A92758J33602O0908m13582J30679O4442o089j77332r7355N6275N8409J57483
$$ 192758 326360 387268 -26314 104365 168807 162718 -14614 -111969 -55694 2715 160198
6788A60198k76348k47482J21236L90377k5843o08177Q7896M14654l0316L3493
$$ 160198 -116150 -363632 -242396 147981 122138 -486039 -398143 16511 -13805 19688
6778A9688k53584j79168N65755l79101m47753K72229R6959J93928n6999K44921
$$ 19688 -233896 -413064 152691 -226410 -674163 -401934 -304975 -111047 -168046 76875
6768G6875J35954j82486j15167n16232L00127K32242J72568J26697k87481r4879
$$ 76875 212829 30343 -84824 -601056 -300929 -68687 103881 230578 -56903 -151782
6758a51782j92127J88895j66902J76286J16924m74268J3586N79353L68744j74115
$$ -151782 -343909 -155014 -321916 -145630 -28706 -502974 -489388 89965 458709 284594
6748B84594o7942n73862k50645O4550M80202l31960M5318K32092l48630J37857
$$ 284594 216652 -357210 -607855 -543305 -63103 -395063 -349745 -117653 -466283 -328426
6738c28426L47233J61725n41048P9295K69584o14815J99309M00800n28340P3985
$$ -328426 18807 180532 -360516 -281221 -11637 -626452 -427143 -26343 -554683 -480698
6728d80698M77230L50615k23523k93572J30983j66705j06894J20490N5353m04785
$$ -480698 -3468 347147 123624 -169948 -38965 -205670 -312564 -192074 -136721 -541506
6718e41506N9518K20433q8908N1341L2642j60076k73299l37301J90564L79123
$$ -541506 -481988 -261555 -350463 -299122 -266480 -426556 -699855 -1037156 -846592 -467469
6708d67469P6134l7278k20679l5261j04025P9832K56090K44535j80891j79209
$$ -467469 -391335 -428613 -649292 -684553 -788578 -708746 -452656 -208121 -389012 -568221
6698e68221o0989J60868K59404k7409j57779L55522k22590J32462K12239J84614
$$ -568221 -629210 -468342 -208938 -236347 -394126 -38604 -261194 -128732 83507 268121
6688B68121j07110L88509l89385j68778N43969k94850m43394j19303L87964l28599
$$ 268121 161011 549520 160135 -8643 535326 240476 -202918 -322221 65743 -262856
6678b62856k17686L63798l07130M4838L75L48343J25067l3640k21837n5321j49706
$$ -262856 -480542 -116744 -423874 -379036 -378661 -30318 94749 61109 -160728 -216049 -365755
6667c65755L09579J47660j66721L01856j66449q2464P3945R9117j78734N25607
$$ -365755 -56176 91484 -75237 226619 60170 -22294 51651 150768 -27966 497641
6657D97641p4264o01955j1659j79330K22043O13676m64180r9582l54617k16430
$$ 497641 423377 -178578 -190237 -369567 -147524 466152 1972 -97610 -452227 -668657
6647f68657J84667M95653k62017l17491J29306j00604J80126R703M18767J92615
$$ -668657 -483990 11663 -250354 -567845 -438539 -539143 -359017 -349314 69453 262068
6637B62068n5532l58781k87076J36515N29011l26622j77009K07749k43494j2587
$$ 262068 206536 -152245 -439321 -302806 226205 -100417 -277426 -69677 -313171 -325758
6627c25758K3464M06249j55648K6801N74603m65475m32978r3873K40691M96310
$$ -325758 -302294 103955 -51693 -24892 549711 84236 -348742 -442615 -201924 294386
6617B94386j34409p4505l3724M97669K17730l13170j09141r562k16261J69242
$$ 294386 159977 85472 51748 549417 767147 453977 344836 335274 119013 288255
6607B88255R7022k42194K75156L94466m41011m78370r691J58956j81923K28909
$$ 288255 385277 143083 418239 812705 371694 -106676 -116367 42589 -139334 89575
6597H9575m0100L46584n37492m56861L92783L34157J68869k32613o91831L9367
$$ 89575 49475 396059 -141433 -598294 -205511 128646 297515 64902 -626929 -587562
6587e87562J49065K57948K7076l0222j02797n2538M29754R3601j58009k63793
$$ -587562 -438497 -180549 -153473 -183695 -286492 -339030 90724 184325 26316 -237477
6577b37477L5066K97932L47050k53960J35229l0053m00232k4413M82188m20826
$$ -237477 -202411 95521 442571 188611 323840 293787 -106445 -130858 351330 -69496
6567f9496j42068j76889O0190o2226k29428K31332l2178K80393N7291J13966k22125
$$ -69496 -211564 -388453 -328263 -390489 -619917 -388585 -420763 -140370 -83079 30887 -191238
6556a91238J59122M08181l06482n00864L09741Q9857K18562J02847j46137j10994
$$ -191238 -32116 376065 69583 -431281 -121540 -31683 186879 289726 143589 32595
6546C2595K49335J38664m99847k1511Q7285o4234L04333k76384j38198J99426
$$ 32595 281930 420594 -79253 -100764 -13479 -77713 226620 -49764 -187962 11464
6536A1464j58183J14682O8162M36181j80717n2701R520J50403j49029j72916K68317
$$ 11464 -146719 -32037 36125 472306 291589 238888 248408 398811 249782 76866 345183
6525C45183J7321m24574O4986j08929j71912m31417M11737J99960j14630k44292
$$ 345183 362504 -62070 2916 -106013 -277925 -709342 -297605 -97645 -212275 -456567
6515d56567j54741l2270K46845K93683L69279o3005K30682m0914l74413k85904
$$ -456567 -611308 -643578 -396733 -103050 266229 203224 433906 392992 18579 -267325
6505b67325j3635L44278k08033l51809M11722K63889K13392k33669l74801M70803
$$ -267325 -280960 63318 -144715 -496524 -84802 179087 392479 158810 -215991 254812
6495B54812J40569j70541r0468j41351L3918k10811m59049K96940K71209L71587
$$ 254812 395381 224840 134372 -6979 26939 -183872 -642921 -345981 -74772 296815
6485B96815M3107j12350p0907l34817K3156R4712J60535q6550m14172J88422L83963
$$ 296815 339922 227572 156665 -178152 -154996 -60284 100251 13701 -400471 -212049 171914
6474A71914K4692K5258L84085m27117l19786k8751K61871p9111L4158l88725J54865
$$ 171914 196606 221864 605949 178832 -140954 -169705 92166 13055 47213 -341512 -186647
6463a86647J22374K7020K91229o8246n4016J70379m8976j44858K66320l59904
$$ -186647 -64273 -37253 253976 185730 131714 302093 253117 108259 374579 14675
6453A4675l34195K00849k77898j97176N03158L60811J89964j486n53975j03672
$$ 14675 -319520 -118671 -396569 -593745 -90587 270224 460188 458702 -95273 -198945
6443a98945J54993n41387L0036O48228l3237K92963j37282l74669j06683m9191
$$ -198945 -43952 -585339 -555303 92925 59688 352651 215369 -159300 -265983 -315174
6433c15174j15389L17590Q323l53675L18954J93912K1306n03717J59080N79054
$$ -315174 -430563 -112973 -104650 -458325 -139371 54541 75847 -427870 -268790 310264
6423C10264o4758J996j41490m04096j16945J9465l09682M03190K33314K17361
$$ 310264 245506 247502 106012 -298084 -415029 -395564 -705246 -302056 -68742 148619
6413A48619K690l40025K66M64904M45954k51902j33501m1675o26080o54175j08692
$$ 148619 151309 -188716 -188450 276454 722408 470506 337005 295330 -330750 -984925 -1093617
6402a093617M71988L34655J841K96499J84155j05897l56590K58324N6561p8176
$$ -1093617 -621629 -286974 -285133 11366 195521 89624 -266966 -8642 47919 -30257
6392c0257j60232j38317j03819J93521P59094j38297p1332j86162L42383R4438
$$ -30257 -190489 -328806 -432625 -239104 519990 381693 310361 124199 466582 561020
6382E61020n62698K55623K32696l28386j0367m54649J29122J48660p6414M84643
$$ 561020 -1678 253945 486641 158255 147888 -306761 -177639 -28979 -105393 379250
6372C79250l83926k84996j05619m8161J98245J50524K9404P2095k66240J74418
$$ 379250 -4676 -289672 -395291 -443452 -245207 -94683 -65279 6816 -259424 -85006
6362h5006K15540J45697J43290k74115m62027K36579j91739L17753M8083n79086
$$ -85006 130534 276231 419521 145406 -316621 -80042 -271781 45972 94055 -485031
6352d85031k3553K31674K95052L61095p24019k96525M22610p7007P6661Q5219
$$ -485031 -508584 -276910 18142 379237 -344782 -641307 -218697 -295704 -219043 -133824
6342a33824k00951N99967J57898j01499M78298o2882l42719m31842J93677J54442
$$ -133824 -334775 265192 423090 321591 799889 737007 394288 -37554 156123 310565
6332C10565q0748N4867q1859k12965j63515M81083N09224j63348j98623k20886
$$ 310565 229817 284684 202825 -10140 -173655 307428 816652 653304 454681 233795
6322B33795n11793J28634K50220K23079p4784M1502m07855k93397L68726O0372
$$ 233795 -277998 -149364 100856 323935 249151 290653 -117202 -410599 -41873 18499
6312A8499J2868L65395k6670P2367j25055k43720N70748n2971k98793n66493J51004
$$ 18499 31367 396762 370092 442459 317404 73684 644432 591461 292668 -273825 -122821
6301a22821K02455Q7765J05312k20363j81312l17343J06654L9359K99506K4324
$$ -122821 79634 167399 272711 52348 -128964 -446307 -339653 -300294 -788 23536
6291B3536K4248K32708q15652M96055J55440l63349J76853J49225M7399j24615
$$ 23536 47784 280492 -535160 -39105 116335 -247014 -70161 79064 126463 1848
6281A848j42086K41379K5415J46911k77785n7509r369R8478l284k36484k72763
$$ 1848 -140238 101141 126556 273467 -4318 -61827 -71196 27282 23998 -212486 -485249
6270d85249J96709M61198l23020K00210M31194J75715K8833M2284m80358q7364
$$ -485249 -288540 172658 -150362 49848 481042 656757 685590 727874 247516 160152
6260A60152J07170R5534k04742j77330L03701k98649K28755K00228l22543q0517
$$ 160152 267322 362856 158114 -19216 284485 -14164 214591 414819 92276 11759
6250A1759j53917J22499K67550P9713j55715k62559J52932K1209R0338L3789J39788
$$ 11759 -142158 -19659 247891 327604 171889 -90670 62262 83471 173809 207598 347386
6239C47386J24698j91538l04627J20283O20843l94628j73822K35156m086k82898
$$ 347386 472084 280546 -24081 96202 717045 322417 148595 383751 379665 96767
6229I6767N5022L4890l19104q3822J95243l09148P8352k31212Q0995j51539K13647
$$ 96767 151789 186679 -132425 -216247 -21004 -330152 -251800 -483012 -402017 -553556 -339909
6218c39909K16853L00724J03682j28394K72003R6370J21472M2797l60366o06461
$$ -339909 -123056 177668 281350 152956 424959 521329 642801 685598 325232 -281229
6208b81229L68335q0541l0926m13997M23269L53116Q7069j34108J81054n27060
$$ -281229 87106 6565 -24361 -438358 -15089 338027 425096 290988 472042 -55018
6198e5018q1447K61627J10913m75176l6664K71423m4702j7922j59836J04030J72706
$$ -55018 -136465 125162 236075 -239101 -275765 -4342 -49044 -66966 -226802 -122772 49934
6187D9934j14442R4565K03004J98281J3637R5819l99379m68531O9560M36190k20553
$$ 49934 -64508 30057 233061 431342 444979 540798 141419 -327112 -257552 178638 -41915
6176d1915K4436K9281j15690L14007J5624r3886k03662l7246l24205J08442K7962
$$ -41915 -17479 11802 -103888 210119 225743 131857 -71805 -109051 -433256 -324814 -296852
6165b96852M71252k51089O9498J33275K00948m11j68434k72672J86394j60284
$$ -296852 174400 -76689 -7191 126084 327032 326621 158187 -114485 71909 -88375
6155h8375J14315N37993j55581l50267N30235K91677j62958o65847M783m78075
$$ -88375 25940 563933 408352 58085 588320 879997 717039 51192 55975 -422100
6145d22100k457K87929k37916M09933J16906k64773J7140p4248J99026j5411J21281
$$ -422100 -424557 -136628 -374544 35389 152295 -112478 -95338 -169586 29440 14029 135310
6134A35310n05095q340R0993N82778m98219L5699O58886k42793k17244J14175
$$ 135310 -369785 -378125 -287132 295646 -202573 -166874 492012 249219 31975 146150
6124A46150L65504n17786j22456J6537J40207j39147J26664K11387L52906l70357
$$ 146150 511654 -6132 -128588 -112051 28156 -110991 15673 227060 579966 209609
6114B09609j34884K05423m14726K9160J54432k8548L40349M36317k84075n85290
$$ 209609 74725 280148 -134578 -105418 49014 20466 360815 797132 513057 -72233
6104g2233K53844o442K39712n9818j31516j48088M46545k89025l04895j2044L01671
$$ -72233 181611 175169 414881 355063 223547 75459 522004 232979 -71916 -83960 217711
6093B17711O481l95217J77034K90170j73192n2602j17411J25816J44175J9559
$$ 217711 224192 -171025 6009 296179 122987 70385 -47026 78790 222965 242524
6083B42524N91112J18304o54467k74953M25120j94775L3280J9461K37466k04458
$$ 242524 833636 951940 297473 22520 447640 252865 286145 305606 543072 338614
6073C38614m13993N41785M531l93102k17967L23996k87686r1951l88458J66881
$$ 338614 -75379 466406 470937 77835 -140132 183864 -103822 -195773 -584231 -417350
6063d17350N63177L90191R4755j64190l37418J02747J86525k78921r6310M36534
$$ -417350 145827 536018 630773 466583 129165 231912 418437 139516 43206 479740
6053D79740j13298k766j51050l2243Q7256J00547N62285K2172o03624k5512O1462
$$ 479740 366442 363676 212626 180383 267639 368186 930471 952643 349019 323507 384969
6042C84969j86347j17964K16459k11168J81765J70587J8969M1540J75087P5352
$$ 384969 198622 80658 297117 85949 267714 438301 457270 498810 673897 749249
6032G49249k37541k00227J81279j3093o56171L6806J67779L29851J54684r8290
$$ 749249 511708 311481 492760 479667 -176504 -139698 28081 357932 512616 414326
6022D14326l17144J50020J32389M57533M6952R4828l30951l25788k86488K01316
$$ 414326 97182 247202 379591 837124 884076 978904 647953 322165 35677 236993
6012B36993k12653l7528k27215P9290L08477J44059q2227K27944l51966m58127
$$ 236993 24340 -13188 -240403 -161113 147364 291423 209196 437140 85174 -372953
6002c72953k29166L17693J85268R4544j13565J28062L35637P0941j07134j60565
$$ -372953 -602119 -284426 -99158 -4614 -118179 9883 345520 416461 309327 148762
5992A48762J02480J75458K2937n71816J21663J39026K34930K24104l13704l2087
$$ 148762 251242 426700 449637 -122179 -516 138510 373440 597544 283840 251753
5982B51753l20258J9846k93231J2517N07613j02751L18163j32604l23613M4925
$$ 251753 -68505 -48659 -341890 -329373 178240 75489 393652 261048 -62565 -17640
5972a7640j65495O49702j62830J52132J09154q74546Q4993K84316L28229k50403
$$ -17640 -183135 466567 303737 455869 565023 -309523 -224530 59786 388015 137612
5962A37612k41128J78521K76357m70951k72392K88709J23537K19323J14152m81627
$$ 137612 -103516 75005 351362 -119589 -391981 -103272 20265 239588 353740 -127887
5952a27887K93678K43983k29491R4706p251j4790J23352n57567j43474N73561
$$ -127887 165791 409774 180283 274989 267738 252948 376300 -181267 -324741 248820
5942B48820M31605J43931l57913m5192j82515o2755L7297J07746j1520J10923
$$ 248820 680425 824356 466443 421251 238736 175981 213278 321024 309504 420427
5932D20427L360k39177J86418l76793q4321l67758Q2806L17266n9819L4507j18951
$$ 420427 423787 184610 371028 -5765 -90086 -457844 -375038 -57772 -117591 -83084 -202035
5921b02035k27196Q4481J63641M34397L1078o03359O3193K16163n3310M6271L27826
$$ -202035 -429231 -344750 -181109 253288 284366 -318993 -255800 -39637 -92947 -46676 281150
5910B81150m9352O7070J17019K02286m93108m14326K41326M2446l7220j84330
$$ 281150 231798 298868 415887 618173 125065 -289261 -47935 -5489 -42709 -227039
5900b27039J50564m3871L38227J62222l13478N732J01936m695K16367k44525j1725
$$ -227039 -76475 -120346 217881 380103 66625 72357 174293 169598 385965 141440 129715
5889A29715j72198k60906R2816M38452p0311J72165K6467m21990K04776j65378
$$ 129715 -42483 -303389 -210573 227879 157568 329733 356200 -65790 138986 -26392
5879b6392O787M83302n79670k38046M21115n0913K24396l0015L02064L65353r74256
$$ -26392 -19605 463697 -115973 -354019 67096 16183 240579 210564 512628 877981 -96275
5868i6275n0313M62061P7204M48475k02671j59835j68217j79374J15134k44194
$$ -96275 -146588 315473 392677 841152 638481 478646 310429 131055 246189 1995
5858A995j86816L07552k80525J33377N81116K00556N6028n62804k4561j62902
$$ 1995 -184821 122731 -157794 -24417 556699 757255 813283 250479 225918 63016
5848F3016J79861J67009J59876K10217l00628o8250J78766J9203o37185l92819
$$ 63016 242877 409886 569762 779979 479351 411101 589867 609070 -28115 -420934
5838d20934K35407P42107j13215k27708l71683j74923M13714P0168k55478j99966
$$ -420934 -185527 556580 443365 215657 -156026 -330949 82765 152933 -102545 -302511
5828c02511M22692n8389L44472L12433J17809O6228n81222m27126j22632L18357
$$ -302511 120181 61792 406264 718697 836506 902734 321512 -105614 -228246 90111
5818I0111n393R3528j27267j57562n2294j73466K41316K68459k9333O9040l71519
$$ 90111 84718 178246 50979 -106583 -158877 -332343 -91027 177432 148099 217139 -154380
5807a54380N92902p7932L09377J36509n66626J14035k9335o107K13317l1465p60135
$$ -154380 438522 360590 669967 806476 239850 353885 324550 318443 531760 500295 -259840
5796b59840L10865M67717j96819o1817k27485J09797l1846k4575j40626n6484
$$ -259840 51025 518742 321923 260106 32621 142418 110572 85997 -54629 -111113
5786a11113L20723O4039j65185l73038l49938Q37886K53621o12486o0806J24302
$$ -111113 209610 273649 108464 -264574 -614512 223374 476995 -135491 -196297 -71995
5776g1995K00755j1219M33524r8485l82575L37356k21011R2612k63099L69550
$$ -71995 128760 117541 551065 452580 70005 407361 186350 278962 15863 385413
5766C85413n19600j51522j38714L32165P52764J03390k65164n66401K53191L4077
$$ 385413 -134187 -285709 -424423 -92258 660506 763896 498732 -67669 185522 219599
5756B19599J35760j13766K27617J39280O7350l23025M6663k40074R3638L16564
$$ 219599 355359 241593 469210 608490 675840 352815 399478 159404 253042 569606
5746E69606M54797k77456j22982j02353l6669k5683m26366p1354M01902N76311
$$ 569606 1024403 746947 623965 521612 484943 459260 32894 -38460 363442 939753
5736I39753k95484l65526K86657O436k24902k23048k53784J0255O72569R3394
$$ 939753 644269 278743 565400 571836 346934 123886 -129898 -119643 552926 646320
5726F46320p38j68277p1624J18942j02492j76294q2737j2538K69899K19769J5593
$$ 646320 645582 477305 405681 524623 422131 245837 163100 150562 420461 640230 655823
5715F55823J24115N3456k43218l1354k76232L21343j40230j08471N60020j48938
$$ 655823 779938 833394 590176 558822 282590 603933 463703 355232 915252 766314
5705G66314m98261j26120J33347J29563j72028k37305K30761J88299J23724j23378
$$ 766314 268053 141933 275280 404843 232815 -4490 226271 414570 538294 414916
5695D14916k35311P9631M07715j16205k05637K10126j9937J98933j6826n01134
$$ 414916 179605 259236 666951 550746 345109 555235 535298 734231 717405 216271
5685B16271P5041M15603m4466m57336J29035J55839R4138l70976J92595N0704
$$ 216271 291312 706915 662449 205113 334148 489987 584125 213149 405744 456448
5675D56448n1157k20044L4604J58058O2544q4284K70367l99474l37323J04068
$$ 456448 405291 185247 219851 377909 440453 356169 626536 227062 -110261 -6193
5665f193Q6250J20987j05578J81912L4678P1856l8765j48553J0525K82560k8008
$$ -6193 80057 201044 95466 277378 312056 383912 345147 196594 207119 489679 461671
5654D61671j80225J07447k0023J21199L6923l8893L05637K80028l35465R9572
$$ 461671 281446 388893 368870 490069 526992 488099 793736 1073764 738299 837871
5644H37871Q8604n07812K51421m72229k13822J35910J73898j30540k68321j94426
$$ 837871 926475 418663 670084 197855 -15967 119943 293841 163301 -105020 -299446
5634b99446K61181L93268k20337j64053j56064M39150Q5902j48683l90544J60875
$$ -299446 -38265 355003 134666 -29387 -185451 253699 339601 190918 -199626 -38751
5624c8751M34015p94L8488J69590k06973k20903L49435j06138n1755J35302k04377
$$ -38751 395264 394470 432958 602548 395575 174672 524107 417969 366214 501516 297139
5613B97139r0860J22271l8992P8354r4075M7151N14256k80332o9254j26105r4405
$$ 297139 206279 328550 289558 367912 273837 320988 835244 554912 485658 359553 265148
5602B65148K68750M30985m6386n86927L04102P2821n32747J62420L13078L89146
$$ 265148 533898 964883 918497 331570 635672 708493 175746 338166 651244 1040390
5592A040390m55682l88309K13710k3748J78937L88606N46867l39870p8871j26833
$$ 1040390 584708 196399 410109 386361 565298 953904 1500771 1160901 1082030 955197
5582I55197J51155m43933j49063N4804j72524l56144j06919P8658L85857j76028
$$ 955197 1106352 662419 513356 568160 395636 39492 -67427 11231 397088 221060
5572B21060J75395K73683M57578k09571K7554k31651J06108M73442n91520n08659
$$ 221060 396455 670138 1127716 918145 945699 714048 820156 1293598 702078 193419
5562A93419J11388M36599k9245J64555k05895K51261l12741P3100j21446K17420
$$ 193419 304807 741406 712161 876716 670821 922082 609341 682441 560995 778415
5552G78415K5983j93649L54217r294m57275J62952L81113J34707K4226l50520
$$ 778415 804398 610749 964966 955672 498397 661349 1042462 1177169 1201395 850875
5542H50875p0038K42061l60590n273l13297j07985J55411R5476j45499M20007
$$ 850875 780837 1022898 662308 657035 343738 235753 391164 486640 341141 761148
5532G61148k00404M01186p4144p9642K30286j62511J48747J07430k15803R5603
$$ 761148 560744 961930 887786 808144 1038430 875919 1024666 1132096 916293 1011896
5522A011896k15911k3534L24158n6211L20646m17121n10577j5102K58235J77129
$$ 1011896 795985 772451 1096609 1040398 1361044 943923 433346 418244 676479 853608
5512H53608K14384k18851j33728M25852J41094k05170j47735k86331Q8934J92123
$$ 853608 1067992 849141 715413 1141265 1282359 1077189 929454 643123 732057 924180
5502I24180L63796K04969K4890j46068J49712k93698n7211m0520P8092k57977
$$ 924180 1287976 1492945 1517835 1371767 1521479 1227781 1170570 1130050 1208142 950165
5492I50165K48168M5952L52115l44556k70840K23180j30955N3038K90416j27071
$$ 950165 1198333 1244285 1596400 1251844 981004 1204184 1073229 1126267 1416683 1289612
5482A289612M86817j32246o05079j12K67511l68449l38063K81385j12519L14300
$$ 1289612 1776429 1644183 1039104 1038992 1306503 938054 599991 881376 768857 1083157
5472A083157o2569j21217M82334J73265o37815Q71925J07850m75809J7651J0088
$$ 1083157 1020588 899371 1381705 1554970 917155 1789080 1896930 1421121 1438772 1448860
5462A448860k13803n59886K74559M52731K27205j89248l79196L57231M87701j87863
$$ 1448860 1235057 675171 949730 1402461 1629666 1440418 1061222 1418453 1906154 1718291
5452A718291j603Q0442L5220k76171p95J58894J42821J30788j01903P2258L7155
$$ 1718291 1716688 1797130 1832350 1556179 1555384 1714278 1857099 1987887 1885984 1958242 1995397
5441A995397K86515j84979r7182N68279K3435J11949K17426Q5012J67559p80708
$$ 1995397 2281912 2096933 1999751 2568030 2591465 2703414 2920840 3005852 3173411 2392703
5431B392703N6764K97695J99208L86545l6337l54751K28136j94374j36441l496
$$ 2392703 2449467 2747162 2946370 3332915 3296578 2941827 3169963 2975589 2839148 2835652
5421B835652J62331q8092N32455K7309J24396J31157L72481P8628m06846K90648
$$ 2835652 2997983 2909891 3442346 3469655 3594051 3725208 4097689 4176317 3769471 4060119
5411D060119n5815P54518K26280j54337r1382k23394J43727L23413L16926N48418
$$ 4060119 4004304 4758822 4985102 4830765 4739383 4515989 4659716 4983129 5300055 5848473
5401E848473K37824k34358q0917P63619J82697L30584M01354O3159L1515L03409
$$ 5848473 6086297 5851939 5771022 6534641 6717338 7047922 7449276 7512435 7543950 7847359
5391G847359P39327K41618N41990K04109M60106O73406L90241Q48326K35255M88192
$$ 7847359 8586686 8828304 9370294 9574403 10034509 10707915 11098156 11946482 12181737 12669929
5381A2669929J063928R0383N07589L34012k5927L07133N21025M97619p6301n3557
$$ 12669929 13733857 13824240 14331829 14665841 14639914 14947047 15468072 15965691 15889390 15835833
5371A5835833o1753j62871j4339N52747M39464l14245O631l8474l83243q8246
$$ 15835833 15774080 15611209 15596870 16149617 16589081 16274836 16281467 16242993 15859750 15771504
5361A5771504m70947p6780J93418j70635q70644J01366l71906j006282l56424
$$ 15771504 15300557 15223777 15417195 15246560 14375916 14477282 14105376 13099094 12742670
5352A2742670m01303p30011k23542l09432K1718J74349o31562n01863l72768m53974
$$ 12742670 12341367 11611356 11387814 11078382 11100100 11274449 10642887 10141024 9768256 9314282
5342I314282J41160j04979n7328n29365m47754M82241L32911P215L95540m19399
$$ 9314282 9455442 9350463 9293135 8763770 8316016 8798257 9131168 9138383 9533923 9114524
5332I114524j82912Q21129j23109j46026M74719O92510o8858L41028P60214P99123
$$ 9114524 8931612 9752741 9629632 9483606 9958325 10650835 10581977 10923005 11683219 12482342
5322A2482342J19052j13498O10541L19229L92112J120162R07131M02490N57707
$$ 12482342 12601394 12487896 13098437 13417666 13809778 14929940 15837071 16239561 16797268
5313A6797268P61025R75215R98151O74431Q10648O71288K18637k29259L73846
$$ 16797268 17558293 18533508 19531659 20206090 21016738 21688026 21906663 21677404 22051250
5304B2051250J62880J3252L77165K19823p94597j86977n9636m56600j88462R1688
$$ 22051250 22214130 22227382 22604547 22824370 22029773 21842796 21783160 21326560 21138098 21229786
5294B1229786K79985l86423k39384r83898q49398k68613q30463p37558o94569
$$ 21229786 21509771 21123348 20883964 19900066 19050668 18782055 17951592 17214034 16519465
5285A6519465m15507m44424p53931p82501q07725n79307o36177r02795p90365
$$ 16519465 16103958 15659534 14905603 14123102 13315377 12736070 12099893 11197098 10406733
5276A0406733o97342k04287J13685m24730k60679n29395o30925k97089o2855j71465
$$ 10406733 9709391 9505104 9618789 9194059 8933380 8403985 7773060 7475971 7413116 7241651
5266G241651n13194k20858p1347p0478p4071n43339q04289j83036k01700J19034
$$ 7241651 6728457 6507599 6436252 6365774 6291703 5748364 4944075 4761039 4559339 4678373
5256D678373K353j39211P59069J84521k15833l84881m90081j54168j39908k84416
$$ 4678373 4680726 4541515 5300584 5485105 5269272 4884391 4394310 4240142 4100234 3815818
5246C815818k12714L98173K03818j68370j6242j70595J10122k37154k28475j66973
$$ 3815818 3603104 4001277 4205095 4036725 4020483 3849888 3960010 3722856 3494381 3327408
5236C327408L9085m1735p6612k7614m1065M74418l02731n17544J95246J06641
$$ 3327408 3366493 3324758 3248146 3220532 3179467 3653885 3351154 2833610 3028856 3135497
5226C135497p0874K84215j59955j29812n2985K06700l8810K08598J2003k08144
$$ 3135497 3064623 3348838 3188883 3059071 3006086 3212786 3173976 3382574 3394577 3186433
5216C186433j2245j85736j66074j37215N5340K32171J63303K7737j12984L31709
$$ 3186433 3174188 2988452 2822378 2685163 2740503 2972674 3135977 3163714 3050730 3382439
5206C382439j83885j64906K4223N9631O4236k52963j91089l5615M97453m05384
$$ 3382439 3198554 3033648 3057871 3117502 3181738 2928775 2737686 2702071 3199524 2794140
5196B794140l16952j83299M4096O35713L8560l30956O3782m7155K77880l4390
$$ 2794140 2477188 2293889 2337985 2973698 3012258 2681302 2745084 2697929 2975809 2941419
5186B941419J92887L06257m69411J96998l4493m6547K02998j77441K91514q0416
$$ 2941419 3134306 3440563 2971152 3168150 3133657 3087110 3290108 3112667 3404181 3323765
5176C323765N9297j09150K5537j46940l72113L00402M16196K07080j8241J0022
$$ 3323765 3383062 3273912 3299449 3152509 2780396 3080798 3496994 3704074 3685833 3695855
5166C695855n3975k14030R8895o224J24593J26714l6354m0092J42174O7188J6467
$$ 3695855 3641880 3427850 3526745 3520521 3645114 3771828 3735474 3695382 3837556 3904744 3921211
5155C921211K0847l33810M36133J73556l97589J69024K47149P0076j76468K72939
$$ 3921211 3942058 3608248 4044381 4217937 3820348 3989372 4236521 4306597 4130129 4403068
5145D403068N34532j95697j49439J82853K49348k48118k80441K94861L98054L92737
$$ 4403068 4937600 4741903 4592464 4775317 5024665 4776547 4496106 4790967 5189021 5581758
5135E581758Q315l00106K04108K09092l93660M33096M55544j69525n3672q8712
$$ 5581758 5590073 5289967 5494075 5703167 5309507 5742603 6198147 6028622 5974950 5886238
5125E886238J55765L70441O0720L36128L60096K30832L01448k2778N3161K12552
$$ 5886238 6042003 6412444 6473164 6809292 7169388 7400220 7701668 7678890 7732051 7944603
5115G944603K75847m2707L23242K58315j643L06668M443K89694K91802L5232J02768
$$ 7944603 8220450 8177743 8500985 8759300 8757657 9064325 9068768 9358462 9650264 9685496 9788264
5104I788264M35649J9517L88511M79065L50280N62450M47704P33128k82066M81410
$$ 9788264 10223913 10243430 10631941 11111006 11461286 12023736 12471440 13204568 12922502 13403912
5094A3403912O91435N21024O3302L45085J048068P42757R85124P05895L93401
$$ 13403912 14095347 14616371 14679673 15024758 16072826 16815583 17800707 18506602 18900003
5085A8900003L47679Q19108N59222Q99707R78123J078206Q48460J102280Q57518
$$ 18900003 19247682 20066790 20626012 21525719 22503842 23582048 24430508 25532788 26390306
5076B6390306R91185J516175J064094J026739P77259J141832J018713M55335O66458
$$ 26390306 27381491 28897666 29961760 30988499 31765758 32907590 33926303 34381638 35048096
5067C5048096J268764L96262O36682M09688P40220L92014L79833J098031P88197
$$ 35048096 36316860 36713122 37349804 37759492 38499712 38891726 39271559 40369590 41157787
5058D1157787P5654O55705J197420Q28221J044073O58420P93314J627097J329225
$$ 41157787 41233441 41889146 43086566 43914787 44958860 45617280 46410594 48037691 49366916
5049D9366916J376415J465497J761296J675228J080305J172520J554811J054174
$$ 49366916 50743331 52208828 53970124 55645352 56725657 57898177 59452988 60507162
5041F0507162J064868Q14144R52056M12426p939O50724k2911r98278j044658j039409
$$ 60507162 61572030 62386174 63338230 63750656 63742717 64393441 64370530 63372252 62327594 61288185
5031F1288185j359414j307372j523368j421452j028241j413436j461173j131518
$$ 61288185 59928771 58621399 57098031 55676579 54648338 53234902 51773729 50642211
5023E0642211q36313l70985r50877p29677q15669k24634n35293l44767K35423
$$ 50642211 49805898 49434913 48484036 47754359 46938690 46714056 46178763 45833996 46069419
5014D6069419m69628J01523K73118K44855j1906k29232k39387k22127n36568k98112
$$ 46069419 45599791 45701314 45974432 46219287 46207381 45978149 45738762 45516635 44980067 44681955
5004D4681955m77895j135049p05595j090168j142350r20837j186329j164604j315493
$$ 44681955 44204060 43069011 42363416 41273248 40130898 39210061 38023732 36859128 35543635
4995C5543635j099831j296462j101392l92198r54366o77303j077672r63087r65589
$$ 35543635 34443804 33147342 32045950 31653752 30699386 30022083 28944411 27981324 27015735
4986B7015735o06814Q0874q3092r65850p68796o30956j2776l41244k65372o1369
$$ 27015735 26408921 26489795 26406703 25440853 24672057 24041101 24028325 23687081 23421709 23360340
4976B3360340m13465m37658J0684o83503q24270j074961l33944p0435l518m17230
$$ 23360340 22946875 22509217 22519901 21836398 21012128 19937167 19603223 19532788 19529270 19112040
4966A9112040q32309l69747j66292j95127n40055l75193k80341j19705k70473
$$ 19112040 18279731 17909984 17743692 17548565 17008510 16633317 16352976 16233271 15962798
4957A5962798k5056k63348k12068L0965m3923r8505O4846K5603j36419j06967
$$ 15962798 15937742 15674394 15462326 15493291 15449368 15350863 15415709 15441312 15304893 15197926
4947A5197926N64862k77177r2641k38728J10342o0781J07085l20749n68234l34505
$$ 15197926 15762788 15485611 15392970 15154242 15264584 15203803 15310888 14990139 14421905 14087400
4937A4087400j001426j09396k39872m62471o30426j3756k25579n79696m90128
$$ 14087400 13085974 12976578 12736706 12274235 11643809 11630053 11404474 10824778 10334650
4928A0334650k78604M2649o07228o96062n86077r71823j60588K40370m51861l12769
$$ 10334650 10056046 10098695 9491467 8795405 8209328 7237505 7076917 7317287 6865426 6552657
4918F552657k84900n05617M4132m46796r1571O62558p05267P3044l9479J43421
$$ 6552657 6267757 5762140 5806272 5359476 5267905 5930463 5225196 5298240 5258761 5402182
4908E402182K6403k58578k53019K3813k8815m56256k82325K69779L4221o5381
$$ 5402182 5428585 5170007 4916988 4940801 4911986 4455730 4173405 4443184 4477405 4412024
4898D412024l38669l71913j13165J22517l61531J81913K7186k77261J51157K53070
$$ 4412024 4073355 3701442 3588277 3710794 3349263 3531176 3558362 3281101 3432258 3685328
4888C685328l82559m84338K96769k67l113L61978j14862J30692p930m56781k05131
$$ 3685328 3302769 2818431 3115200 3114933 3111820 3473798 3358936 3489628 3481698 3024917 2819786
4877B819786l88874K87880o6969o3103J94692r0029o3996K31786n6496k49945
$$ 2819786 2430912 2718792 2651823 2588720 2783412 2693383 2629387 2861173 2804677 2554732
4867B554732q71p6019j69976L33944n2594j45253K9094j00544l1701k56028r3013
$$ 2554732 2553861 2477842 2307866 2641810 2589216 2443963 2473057 2372513 2340812 2084784 1991771
4856A991771k93932m2783K26017J74019j78351K23821M46583M22773l99174m33418
$$ 1991771 1697839 1655056 1881073 2055092 1876741 2100562 2547145 2969918 2570744 2137326
4846B137326L48571l73973j44672l43046m8630j5888M27649K13594J63119m69106
$$ 2137326 2485897 2111924 1967252 1624206 1575576 1559688 1987337 2200931 2364050 1894944
4836A894944j68715Q2292N6031k44442p5765P566L38354r7685P7747Q5279l65444
$$ 1894944 1726229 1808521 1864552 1620110 1544345 1551911 1890265 1792580 1870327 1955606 1590162
4825A590162j62827K8841R5240j20080K24831q6649M93540O949m18485l75247
$$ 1590162 1427335 1456176 1551416 1431336 1656167 1569518 2063058 2070007 1651522 1276275
4815A276275k10714J36746Q2933n10712m57037O56821L03760m02245K84727K47670
$$ 1276275 1065561 1202307 1285240 774528 317491 974312 1278072 875827 1160554 1408224
4805A408224l15971l41659M82453M95867j0813J31328l77873m9860L23992j64206
$$ 1408224 1092253 750594 1233047 1728914 1718101 1849429 1471556 1421696 1745688 1581482
4795A581482r9281q3088l23701L20041J88062j57541k6907l48476K64856Q39240
$$ 1581482 1482201 1399113 1075412 1395453 1583515 1425974 1399067 1050591 1315447 2154687
4785B154687k1287k40896j01199J79907Q5741j84829j40969k03475L33938L4941
$$ 2154687 2133400 1892504 1791305 1971212 2056953 1872124 1731155 1527680 1861618 1896559
4775A896559j47031j43373R109p2942K80383j35801r4926M9928K14200p9583k25766
$$ 1896559 1749528 1606155 1615264 1542322 1822705 1686904 1591978 1641906 1856106 1776523 1550757
4764A550757J00775o513j85417l42407O0996J5102K40159L09177j81515K65586
$$ 1550757 1651532 1645019 1459602 1117195 1178191 1193293 1433452 1742629 1561114 1826700
4754A826700K14106k98070n46955k15579o5293P44147M01742j78067k9465m56782
$$ 1826700 2040806 1742736 1195781 980202 914909 1659056 2060798 1882731 1853266 1396484
4744A396484M22195K06902n27135K93984l0050j62011K19045m6256K93781L63377
$$ 1396484 1818679 2025581 1498446 1792430 1762380 1600369 1819414 1773158 2066939 2430316
4734B430316k55338l20071Q4499M20737l04303k91726J15757L1999K88604J4069
$$ 2430316 2174978 1854907 1939406 2360143 2055840 1764114 1879871 1911870 2200474 2214543
4724B214543m1870k84581J88954j81910k55937j08246J15984K50503l4088J90609
$$ 2214543 2172673 1888092 2077046 1895136 1639199 1530953 1646937 1897440 1863352 2053961
4714B053961L61623n4397K93973n7426k51629p6591k92634M23648M6665j07665
$$ 2053961 2415584 2361187 2655160 2597734 2346105 2269514 1976880 2400528 2447193 2339528
4704B339528r6754o0345N7486L13839j73358k52703O1150P8060L49785K39607
$$ 2339528 2242774 2182429 2239915 2553754 2380396 2127693 2188843 2266903 2616688 2856295
4694B856295J09486N984k7086m81817L9517J91309L11113K48363k54226o0441
$$ 2856295 2965781 2971765 2944679 2462862 2502379 2693688 3004801 3253164 2998938 2938497
4684B938497J38386l31291Q689L02698j69379J14707k49070m7718N64672k88762
$$ 2938497 3076883 2745592 2754281 3056979 2887600 3002307 2753237 2705519 3270191 2981429
4674B981429K8183J3818N43748J99070L00378k56895j28240l9669l35339j36085
$$ 2981429 3009612 3023430 3567178 3766248 4066626 3809731 3681491 3641822 3306483 3170398
4664C170398M19334N24964l01102j86177M06367M2178n7412J32924M27343L00038
$$ 3170398 3589732 4114696 3813594 3627417 4033784 4075962 4018550 4151474 4578817 4878855
4654D878855k38994r8040Q3970k05711J90614P80477k58718k2541j8387N71391
$$ 4878855 4639861 4541821 4625791 4420080 4610694 5391171 5132453 5109912 5091525 5662916
4644E662916M23918k35078K27314N64536L18068M00667l97885j20438N67154O56030
$$ 5662916 6086834 5851756 6079070 6643606 6961674 7362341 6964456 6844018 7411172 8067202
4634H067202m37461N49299L09305J94688K13666p8271M55561K75885J23455K37998
$$ 8067202 7629741 8179040 8488345 8683033 8896699 8818428 9273989 9549874 9673329 9911327
4624I911327M18836M01835J39756k09317K31520O32153J08130L1850K07159L77506
$$ 9911327 10330163 10731998 10871754 10662437 10893957 11526110 11634240 11666090 11873249 12250755
4614A2250755O59657K99111M62794M98173k48223P01850K9450l98572J53923N74407
$$ 12250755 12910412 13209523 13672317 14170490 13922267 14624117 14653567 14254995 14408918 14983325
4604A4983325N47776m30590J09122O79888k14070o33274K79420P6620K9303J56059
$$ 14983325 15531101 15100511 15209633 15889521 15675451 15042177 15321597 15398217 15427520 15583579
4594A5583579K5428o502k65519q94600k61927L85842L36310J50251k62063k6098
$$ 15583579 15609007 15602505 15336986 14442386 14180459 14566301 14902611 15052862 14790799 14764701
4584A4764701M95506K6633J5027k3057K45897j45842k20260K04980J43565K13564
$$ 14764701 15260207 15286840 15301867 15278810 15524707 15378865 15158605 15363585 15507150 15720714
4574A5720714j63183j91200L48608K95053K98288J60851l0219j09742r2238O53077
$$ 15720714 15557531 15366331 15714939 16009992 16308280 16469131 16438912 16329170 16236932 16890009
4564A6890009o1305l75844p3769L63911N02638k91632N75500N24844L41349R0973
$$ 16890009 16828704 16452860 16379091 16743002 17245640 16954008 17529508 18054352 18395701 18486674
4554A8486674j46486k17547J53107M76316L35882k18384K18049P1873n50724k10967
$$ 18486674 18340188 18122641 18275748 18752064 19087946 18869562 19087611 19159484 18608760 18397793
4544A8397793J19795J62156J0152l40732k69743k47686l65027p2645r96968k99499
$$ 18397793 18517588 18679744 18689896 18349164 18079421 17831735 17466708 17394063 16397095 16097596
4534A6097596k33306L29369n71606o01418l21392o71197l84618m17097j75954
$$ 16097596 15864290 16193659 15622053 15020635 14699243 14028046 13643428 13226331 13050377
4525A3050377j34270n7817p12453J32575r1066o72606n45704j68025l35685n88982
$$ 13050377 12916107 12858290 12145837 12278412 12187346 11514740 10969036 10801011 10465326 9876344
4515I876344m03043n01712m57394n5987q7098k66929k03124n02664m2208k25552
$$ 9876344 9473301 8971589 8514195 8458208 8371110 8104181 7901057 7398393 7356185 7130633
4505G130633o33805N9068J68109K377k35598l44153l59288j27941r7863L36505
$$ 7130633 6496828 6555896 6724005 6726382 6490784 6146631 5787343 5659402 5561539 5898044
4495E898044n94216n26945o5405J4175k80174K59336l4134j00595K02436J09761
$$ 5898044 5303828 4776883 4711478 4725653 4445479 4704815 4670681 4570086 4772522 4882283
4485D882283K37401m52302k20694m40586J68245n5954k91114J91792j20545r0339
$$ 4882283 5119684 4667382 4446688 4006102 4174347 4118393 3827279 4019071 3898526 3808187
4475C808187N4311J17517l34670o4679l4769K41716K20871J56996O3861o23006
$$ 3808187 3862498 3980015 3645345 3580666 3545897 3787613 4008484 4165480 4229341 3606335
4465C606335l84914M18535M43341k28801K60363q5635r611J4477k00550l05337
$$ 3606335 3221421 3639956 4083297 3854496 4114859 4029224 4019613 4034090 3833540 3528203
4455C528203j4982J79041L17647O204l01278k84883K48546o268p0734l6624K19446
$$ 3528203 3513221 3692262 4009909 4016113 3714835 3429952 3678498 3672230 3601496 3564872 3784318
4444C784318l06322M18946N21953k97208j18419o18067J08464L12094j96910J67611
$$ 3784318 3477996 3896942 4418895 4121687 4003268 3385201 3493665 3805759 3608849 3776460
4434C776460N39298k86323k87605M14164l40421R6298J51562J86324j16768n6644
$$ 3776460 4315758 4029435 3741830 4155994 3815573 3911871 4063433 4249757 4132989 4076345
4424D076345J8680k79882J36641r0327k63080J13897J67411K2684l42635j31489
$$ 4076345 4095025 3815143 3951784 3861457 3598377 3712274 3879685 3902369 3559734 3428245
4414C428245P02957j79585l54288L13077L02641J68282r4394k64649o0118L7888
$$ 3428245 4131202 3951617 3597329 3910406 4213047 4381329 4286935 4022286 3962168 4000056
4404D000056l96943K64439p1943Q1239m5468n11409J61233P00127j04703k38226
$$ 4000056 3603113 3867552 3795609 3876848 3831380 3319971 3481204 4181331 4076628 3838402
4394C838402L46198N7297M96983k14572k71579k14800M05438M73769J24877K19304
$$ 3838402 4184600 4241897 4738880 4524308 4252729 4037929 4443367 4917136 5042013 5261317
4384E261317m91461j56234N39123j82918j31613K60192O3785O7964M55151l75254
$$ 5261317 4769856 4613622 5152745 4969827 4838214 5098406 5162191 5230155 5685306 5310052
4374E310052j57275N07688K47766L6703k94899p3669P2424M587O5551k83777Q9431
$$ 5310052 5152777 5660465 5908231 5944934 5650035 5576366 5648790 5653377 5718928 5435151 5524582
4363E524582K00113k32582K95087K27141J85384M18214k86803K05371J55809K6660
$$ 5524582 5724695 5492113 5787200 6014341 6199725 6617939 6331136 6536507 6692316 6718976
4353F718976m1532R3540k58425P3758m5124N19088N31776K74233N60037p00378
$$ 6718976 6677444 6770984 6512559 6586317 6541193 7060281 7592057 7866290 8426327 7725949
4343G725949p0090K7336o2612L36547K56124k04245L94762L33931l66056L30872
$$ 7725949 7655859 7683195 7620583 7957130 8213254 8009009 8403771 8737702 8371646 8702518
4333H702518J87571m4390M73646K79283k47579K22693L50202K37427J92333O3392
$$ 8702518 8890089 8845699 9319345 9598628 9351049 9573742 9923944 10161371 10353704 10417096
4323A0417096J77323K50886J69421J77155M9052M30515M83433M5468J77883k7215
$$ 10417096 10594419 10845305 11014726 11191881 11240933 11671448 12154881 12200349 12378232 12351017
4313A2351017M77040R8699L65414K57853m8401L24701K07838P69920J83215l4280
$$ 12351017 12828057 12926756 13292170 13550023 13501622 13826323 14034161 14804081 14987296 14953016
4303A4953016L30396M57303k5312N58127L00331K35698O87634J4092L97822N19189
$$ 14953016 15283412 15740715 15715403 16273530 16573861 16809559 17497193 17511285 17909107 18428296
4293A8428296R44870L53379O69678Q49494P71172K62440j5541R62026Q37928L53895
$$ 18428296 19373166 19726545 20396223 21245717 22016889 22279329 22263788 23225814 24063742 24417637
4283B4417637Q41368P70953J020652M68301P62936J235308N73875N78088L02681
$$ 24417637 25259005 26029958 27050610 27518911 28281847 29517155 30091030 30669118 30971799
4274C0971799N37866L37954J28506R01733N93354P85413J057655J8447L37164
$$ 30971799 31509665 31847619 31976125 32877858 33471212 34256625 35314280 35332727 35669891
4265C5669891J003409O95364O13487J213587P28352N27822J007267P69478R71145
$$ 35669891 36673300 37368664 37982151 39195738 39924090 40451912 41459179 42228657 43199802
4256D3199802J318818Q77300J502256J576343J364976J266415J729937J894130
$$ 43199802 44518620 45395920 46898176 48474519 49839495 51105910 52835847 54729977
4248E4729977K093796K315727K264482K491794K524339K705387K964284K791615
$$ 54729977 56823773 59139500 61403982 63895776 66420115 69125502 72089786 74881401
4240G4881401L202844L260530L212379L287660L723874M598521N559807O150808
$$ 74881401 78084245 81344775 84557154 87844814 91568688 96167209 101727016 107877824
4232A07877824O674079P958751Q972130J0133247J2248647J5011917J6924418
$$ 107877824 114551903 122510654 131482784 141616031 153864678 168876595 185801013
4225A85801013K0066864K2332536K4288288K4665904K6261263K8857909K9666074
$$ 185801013 205867877 228200413 252488701 277154605 303415868 332273777 361939851
4218C61939851K8764130K2972518P353747j4865760l2295445l8950273l8015716
$$ 361939851 390703981 413676499 421030246 406164486 373869041 334918768 296903052
4211B96903052l4884856l0012826k4707759k1483376j7798837j4895352j3085657
$$ 296903052 262018196 232005370 207297611 185814235 168015398 153120046 140034389
4204A40034389j1871886r797223q912348q340293p203055o438212n046278m062040
$$ 140034389 128162503 118365280 109452932 101112639 93909584 87471372 82425094 78363054
4196G8363054l471692l022383k686895k374052k197254k239903j556978j449692
$$ 78363054 74891362 71868979 69182084 66808032 64610778 62370875 60813897 59364205
4188E9364205j311126r62830r64720j190708j082810j200366m58055q04402j127081
$$ 59364205 58053079 57090249 56125529 54934821 53852011 52651645 52193590 51389188 50262107
4179E0262107p70635r91946j216925r38810n98327p64831j063006j61316m54792
$$ 50262107 49491472 48499526 47282601 46343791 45745464 44980633 43917627 43756311 43301519
4170D3301519j14922j62900o93895j09307o70929m20432l46105p45386j6876k57328
$$ 43301519 43186597 43023697 42329802 42220495 41549566 41129134 40783029 40037643 40020767 39763439
4160C9763439j01467o7244m24119J2618K33072J26883L04269L64303N96577O25135
$$ 39763439 39661972 39594728 39170609 39183227 39416299 39543182 39847451 40211754 40808331 41433466
4150D1433466o5844Q0817Q88151O83494M55628M33913Q85587N32932M52574L58857
$$ 41433466 41367622 41448439 42336590 43020084 43475712 43909625 44795212 45328144 45780718 46139575
4140D6139575l4406J75272M3980l00754j39223k96919r2292L0015k11617l53031
$$ 46139575 46105169 46280441 46324421 46023667 45884444 45587525 45495233 45525248 45313631 44960600
4130D4960600m17713q81500n8961j78002o21364L03249N6274j87460J19472r987
$$ 44960600 44542887 43661387 43602426 43424424 42803060 43106309 43162583 42975123 43094595 43084608
4120D3084608K60824P76303Q1925L10598M99876L19501N90666M72156l81660O98898
$$ 43084608 43345432 44121735 44203660 44514258 45014134 45333635 45924301 46396457 46014797 46713695
4110D6713695J86160J17067N25747N50456j62280m36798j91782o42120o51100
$$ 46713695 46899855 47016922 47542669 48093125 47930845 47494047 47302265 46660145 46009045
4101D6009045r15534j64250M4653l38094q71137o48333p75402r70637l13607m81696
$$ 46009045 45093511 44929261 44973914 44635820 43764683 43116350 42340948 41370311 41056704 40575008
4091D0575008m83969k56619r9310l63028M78962n52452M6823K56463j90164M1901
$$ 40575008 40091039 39834420 39735110 39372082 39851044 39298592 39345415 39601878 39411714 39453615
4081C9453615J42992L2034J66426l70466J62675K22048m38402k50385J63296K47087
$$ 39453615 39596607 39628641 39795067 39424601 39587276 39809324 39370922 39120537 39283833 39530920
4071C9530920o52021p75407m26223j98040p18132o02876p70192l49615j08195
$$ 39530920 38878899 38103492 37677269 37479229 36761097 36158221 35388029 35038414 34930219
4062C4930219j85760K99551L36880n9067q8688j31768J82273K78559N85109N47463
$$ 34930219 34744459 35044010 35380890 35321823 35233135 35101367 35283640 35562199 36147308 36694771
4052C6694771J07816P03621R45571J65705P20366K97285L77144O30954J120883
$$ 36694771 36802587 37506208 38451779 38617484 39337850 39635135 40012279 40643233 41764116
4043D1764116O11308J95501L51925K51148J10268K74792J90354O08675M37188
$$ 41764116 42375424 42570925 42922850 43173998 43284266 43559058 43749412 44358087 44795275
4034D4795275J9125o4844L6267O8924N97421L69588r0482L52949K86089j24810
$$ 44795275 44814400 44749556 44785823 44854747 45452168 45821756 45731274 46084223 46370312 46245502
4024D6245502K78286l00887J66146N82337L45909L01457j92276P38159m984k83867
$$ 46245502 46523788 46222901 46389047 46971384 47317293 47618750 47426474 48164633 48159649 47875782
4014D7875782J37952q5413K18993Q4607k51374l86669l53614n91905q00806m54259
$$ 47875782 48013734 47928321 48147314 48231921 47980547 47593878 47240264 46648359 45847553 45393294
4004D5393294o69035K45968p64107j025928m17690q34682r17091l86731j207291
$$ 45393294 44724259 44970227 44206120 43180192 42762502 41927820 41010729 40623998 39416707
3995C9416707o77924p14967k25775r87930o94019m34855j266053r70675o56208
$$ 39416707 38738783 38023816 37798041 36810111 36116092 35681237 34415184 33444509 32788301
3986C2788301l84661r24724o54466k86096o57846r39209j28955p82045m02770
$$ 32788301 32403640 31478916 30824450 30538354 29880508 28941299 28812344 28030299 27627529
3977B7627529p68022q19923q83512r33573o77082n41043j170654o95703k50728
$$ 27627529 26859507 26039584 25156072 24222499 23545417 23004374 21833720 21138017 20887289
3968B0887289j116353l75283o52424j360166q80245p2652m33783n21860p18470
$$ 20887289 19770936 19395653 18743229 17383063 16502818 16430166 15996383 15474523 14756053
3959A4756053r13257J24466l75783j48503R7752q72793o38526m23275k39413j23363
$$ 14756053 13842796 13967262 13591479 13442976 13540728 12667935 12029409 11606134 11366721 11243358
3949A1243358l14488l17350n17281m49746K58198j02934n91551m73137l87024
$$ 11243358 10928870 10611520 10094239 9644493 9902691 9799757 9208206 8735069 8348045
3940H348045k51957j03755L43347n58643l68199L40913p384j36321l11485K61696
$$ 8348045 8096088 7992333 8335680 7777037 7408838 7749751 7742367 7606046 7294561 7556257
3930G556257J39856l99344m54801k45129j0466L40762j13140o89807J41851Q9011
$$ 7556257 7696113 7296769 6841968 6596839 6586373 6927135 6813995 6124188 6266039 6355050
3920F355050K68208l39878o83792M6468O8974k43012j1969m00184m26317K2367
$$ 6355050 6623258 6283380 5599588 5646056 5715030 5472018 5460049 5059865 4633548 4655915
3910D655915R2938K78280M6386j74950j99782j08217j87526P8192p4061m10328
$$ 4655915 4748853 5027133 5073519 4898569 4698787 4590570 4403044 4481236 4407175 3996847
3900C996847Q3635K57965l63945j79381K39220j15047l27123q9420o3673j73207
$$ 3996847 4080482 4338447 3974502 3795121 4034341 3919294 3592171 3502751 3439078 3265871
3890C265871J34022J0972J15063K14976n16419l59878J22162P84248l42119k04457
$$ 3265871 3399893 3410865 3525928 3740904 3224485 2864607 2986769 3771017 3428898 3224441
3880C224441N3561k6721k46477m59475m5883K29054p6083j32629J7304M925M37345
$$ 3224441 3278002 3251281 3004804 2545329 2499446 2728500 2652417 2519788 2537092 2542017 2979362
3869B979362J15114j15983J37355N7427l86484R4576J2203j29713r1995Q3503
$$ 2979362 3094476 2978493 3115848 3173275 2786791 2881367 2893570 2763857 2671862 2755365
3859B755365k37082p78574O2902K71371k61333J99636L17944K44234K0593J68833
$$ 2755365 2518283 1739709 1802611 2073982 1812649 2012285 2330229 2574463 2595056 2763889
3849B763889m98723j01028Q5223J1887o1012l8035J96657J83928j84791L9857
$$ 2763889 2265166 2164138 2249361 2261248 2200236 2162201 2358858 2542786 2357995 2397852
3839B397852j87601l08197Q6273j46657N4675j0060K08223J42344m73297r4836
$$ 2397852 2210251 1902054 1988327 1841670 1896345 1886285 2094508 2236852 1763555 1668719
3829A668719k00346J63384L26928J40993p9383j6925M7505j62058k24788k47511
$$ 1668719 1468373 1631757 1958685 2099678 2020295 2003370 2050875 1888817 1664029 1416518
3819A416518L69538k50738k4993l1684M41414j36978q8493j25138N59501k37443
$$ 1416518 1786056 1535318 1510325 1478641 1920055 1783077 1694584 1569446 2128947 1891504
3809A891504r9468N47888m66705n60992K12048l1757L78100J43478j39577K31742
$$ 1891504 1792036 2339924 1873219 1312227 1524275 1492518 1870618 2014096 1874519 2106261
3799B106261m8865l35819J95599K94186m3734k37998l27338p3957J03759O49212
$$ 2106261 2057396 1721577 1917176 2211362 2167628 1929630 1602292 1528335 1632094 2281306
3789B281306J56245n15309k15855M91539m40447k82411N9023L6265m0030j32749
$$ 2281306 2437551 1922242 1706387 2197926 1757479 1475068 1534091 1570356 1530326 1397577
3779A397577L56710K3266k51941m73532J55601L12063o3760P62881k84033k55277
$$ 1397577 1754287 1777553 1525612 1052080 1207681 1519744 1455984 2218865 1934832 1679555
3769A679555J93445J50729q2121l31855j2497j04448J33805J34055k32469k05298
$$ 1679555 1873000 2023729 1941608 1609753 1597256 1492808 1626613 1760668 1528199 1322901
3759A322901j53595L22148j35708K07635K24941L78198l31120n37975J07449M15097
$$ 1322901 1169306 1491454 1355746 1563381 1788322 2166520 1835400 1297425 1404874 1819971
3749A819971k51592M259K24476J33394J26836m07211J22716l825l85074L31639
$$ 1819971 1568379 1572638 1797114 1930508 2057344 1650133 1772849 1769024 1383950 1715589
3739A715589J40214N3567J54400q60733J24185R3992N07012Q3297l86200j04321
$$ 1715589 1855803 1909370 2063770 1203037 1327222 1421214 1928226 2011523 1625323 1521002
3729A521002M5811K88081J04340O1793q5712M04800m40525k39156r7489L17636
$$ 1521002 1566813 1854894 1959234 2021027 1935315 2340115 1899590 1660434 1562945 1880581
3719A880581j7635l54663L29355j31996l52538K05644J39556L24188j18085k39216
$$ 1880581 1862946 1508283 1837638 1705642 1353104 1558748 1698304 2022492 1904407 1665191
3709A665191J35380M71755N3976k80216Q866J07049K10604J5605J7927M02550
$$ 1665191 1800571 2272326 2326302 2046086 2054952 2162001 2372605 2388210 2406137 2808687
3699B808687J4480j67422j02464l4380k57262j14268K41565L70953N19557m44522
$$ 2808687 2823167 2655745 2553281 2518901 2261639 2147371 2388936 2759889 3279446 2834924
3689B834924k49245j83767Q6054K99896l23713n56223M35047m33659o1544J69150
$$ 2834924 2585679 2401912 2487966 2787862 2464149 1907926 2342973 1909314 1847770 2016920
3679B016920J14951k15442K33319k923L4763k50310q4025N4251J5020O7215o55179
$$ 2016920 2131871 1916429 2149748 2146825 2181588 1931278 1847253 1901504 1916524 1983739 1328560
3668A328560M5175N01405j01456j57784K75896j01588j2318K37413r7592O4182
$$ 1328560 1373735 1875140 1773684 1615900 1891796 1790208 1777890 2015303 1917711 1981893
3658A981893j99792K93245o6986j88529K32412k05816n9614m8115j6859q9903
$$ 1981893 1782101 2075346 2008360 1819831 2052243 1846427 1786813 1738698 1721839 1631936
3648A631936L8462Q2348j29352L97303O70247m98801q03747L64443J033N7575
$$ 1631936 1670398 1752746 1623394 2020697 2690944 2192143 1388396 1752839 1753872 1811447
3638A811447r9501J19170j7859l31119O6270k55450Q3974M46189J54852m3697
$$ 1811447 1711946 1831116 1813257 1482138 1548408 1292958 1376932 1823121 1977973 1934276
3628A934276L27120j14402J89600l7994o3928L26007J10985j21688J63575k75817
$$ 1934276 2261396 2146994 2336594 2298600 2234672 2560679 2671664 2549976 2713551 2437734
3618B437734l73514N6876L39424J65831l86933k49496K11727k20940L84292r5184
$$ 2437734 2064220 2121096 2460520 2626351 2239418 1989922 2201649 1980709 2365001 2269817
3608B269817q2371j18258K66274L3393J65860j8825k19379m39183n7811L03697
$$ 2269817 2187446 2069188 2335462 2368855 2534715 2515890 2296511 1857328 1799517 2103214
3598B103214l3891J82790M73033m06250k47937K70398k25818k04999j7663J00827
$$ 2103214 2069323 2252113 2725146 2318896 2070959 2341357 2115539 1910540 1892877 1993704
3588A993704N91731N54675l25735k88730j77666K17369m9527j24194l09786K16808
$$ 1993704 2585435 3140110 2814375 2525645 2347979 2565348 2515821 2391627 2081841 2298649
3578B298649j70542L12365L54166j19463k30462K64494J70044j32698J20901j42061
$$ 2298649 2128107 2440472 2794638 2675175 2444713 2709207 2879251 2746553 2867454 2725393
3568B725393L1867k02159j12612K52963K73100J61028J22990j54103j73101J65159
$$ 2725393 2757260 2555101 2442489 2695452 2968552 3129580 3252570 3098467 2925366 3090525
3558C090525j48693L30236Q2009l00667j52504J06870N66991L37644l61939J65619
$$ 3090525 2941832 3272068 3354077 3053410 2900906 3007776 3574767 3912411 3550472 3716091
3548C716091l4211J50896K55088j87450k58611m9745M80220J25525l85108k62995
$$ 3716091 3681880 3832776 4087864 3900414 3641803 3592058 4072278 4197803 3812695 3549700
3538C549700O5324j52986K28223j40231j93405K28747M16983j46686l47342K782
$$ 3549700 3615024 3462038 3690261 3550030 3356625 3585372 4002355 3855669 3508327 3511109
3528C511109j11125Q1072K25660K82431l12316j09178R8761k73272r5286K68654
$$ 3511109 3399984 3481056 3706716 3989147 3676831 3567653 3666414 3393142 3297856 3566510
3518C566510L67758l01561L11750j61255K67699L80980k44525j29572k38095L411
$$ 3566510 3934268 3632707 3944457 3783202 4050901 4431881 4187356 4057784 3819689 3823100
3508C823100J95307P7851K00005J17136l36667j01995k3396K34420K43928j13506
$$ 3823100 4018407 4096258 4296263 4413399 4076732 3974737 3951341 4185761 4429689 4316183
3498D316183K33204J03945K55696K16716j3794k93581j90706L74253J16305K69751
$$ 4316183 4549387 4653332 4909028 5125744 5111950 4818369 4627663 5001916 5118221 5387972
3488E387972J62290j73751m16104L2301L42608K78059K07003J6019l08619N7611
$$ 5387972 5550262 5376511 4960407 4992708 5335316 5613375 5820378 5836397 5527778 5585389
3478E585389M56404K46625l98574l23691J60891M42258m5517K39433p9437l08599
$$ 5585389 6041793 6288418 5889844 5566153 5727044 6169302 6123785 6363218 6283781 5975182
3468E975182N01000J93482Q1091K19377J95161m67370j66484L24523M21707k2836
$$ 5975182 6476182 6669664 6750755 6970132 7165293 6697923 6531439 6855962 7277669 7254833
3458G254833j00676K39746M98637k0166j22571L7605M84307J83910l223M82798
$$ 7254833 7154157 7393903 7892540 7872374 7749803 7787408 8271715 8455625 8452402 8935200
3448H935200m9308L77284J41581K29651M03857J41624K14378N23605J90400K5854
$$ 8935200 8885892 9263176 9404757 9634408 10038265 10179889 10394267 10917872 11108272 11134126
3438A1134126n3172L70191N68392p2982Q3217K93011O08439L79086J48543M64316
$$ 11134126 11080954 11451145 12019537 11946555 12029772 12322783 12931222 13310308 13458851 13923167
3428A3923167N13169M80521Q08516M45677L01156l33449k56482O07582O02535
$$ 13923167 14436336 14916857 15725373 16171050 16472206 16138757 15882275 16489857 17092392
3419A7092392N11283L35973j3857K29296N97539P96717J244471P63648L51505
$$ 17092392 17603675 17939648 17925791 18155087 18752626 19549343 20793814 21557462 21908967
3410B1908967L57492M45402M81008O23098Q45291J015107J262901N47215L08171
$$ 21908967 22266459 22711861 23192869 23815967 24661258 25676365 26939266 27486481 27794652
3401B7794652J521975P95172J166217J240607J243287J493897J667535J792057
$$ 27794652 29316627 30111799 31278016 32518623 33761910 35255807 36923342 38715399
3393C8715399J647887K008334K506034K301454K478512K794572L413027L487305
$$ 38715399 40363286 42371620 44877654 47179108 49657620 52452192 55865219 59352524
3385E9352524L966103M457559M905927N127574M303892N102987M778944L950282
$$ 59352524 63318627 67776186 72682113 77809687 82113579 87216566 91995510 95945792
3377I5945792L658155M160815N467694N702939O502533N268687M503193K689189
$$ 95945792 99603947 103764762 109232456 114935395 121437928 126706615 131209808 133898997
3369A33898997J334534J584474K211180L521856L310255L356515K811700P87582
$$ 133898997 135233531 136818005 139029185 142551041 145861296 149217811 152029511 152817093
3361A52817093j971116l422796m477421k918807k924608k012040j338385k326481
$$ 152817093 150845977 147423181 142945760 140026953 137102345 135090305 133751920 131425439
3353A31425439l380149n171044o117579o073670n264117m335069l430509l020148
$$ 131425439 128045290 122874246 116756667 110682997 105418880 101083811 97653302 94633154
3345I4633154l584205m331780l818534l799927l943642m098564l002168k072720
$$ 94633154 91048949 86717169 82898635 79098708 75155066 71056502 68054334 65981614
3337F5981614j912662j428434r12291r53681p46097k25298k74743j15441l94356
$$ 65981614 64068952 62640518 61728227 60774546 60028449 59803151 59528408 59412967 59018611
3328E9018611p4028L1490K19612j19328J89881l75290l13726m71932k19938o63256
$$ 59018611 58944583 58976073 59195685 59076357 59266238 58890948 58577222 58105290 57885352 57222096
3318E7222096o15811j049244q29316p55820n97212n02096O5230J63466j39907
$$ 57222096 56606285 55557041 54727725 53971905 53374693 52872597 52937827 53101293 52961386
3309E2961386K59305Q77761L98291M30513N54912o977k0163K41048K72982m06558
$$ 52961386 53220691 54098452 54496743 54927256 55482168 55475191 55455028 55696076 55969058 55562500
3299E5562500n37628J32877k03366n96809j251111j094671l96542o72089m41116
$$ 55562500 55024872 55157749 54954383 54357574 53106463 52011792 51615250 50943161 50502045
3290E0502045q23694n0574k95466p26122l49206m5902l86203m27915m58660R0838
$$ 50502045 49678351 49627777 49332311 48606189 48256983 48211081 47824878 47396963 46938303 47029141
3280D7029141j29638K62565l9843O59076O14522R10502J097214L48517N93657
$$ 47029141 46899503 47162068 47122225 47781301 48395823 49306325 50403539 50752056 51345713
3271E1345713J195014N71148L75729Q30328J151330J297844J208860J412460K045718
$$ 51345713 52540727 53111875 53487604 54317932 55469262 56767106 57975966 59388426 61434144
3262F1434144J521439J695918J779564K989468L077659L499548L712042M747851
$$ 61434144 62955583 64651501 66431065 69420533 72498192 75997740 79709782 84457633
3254H4457633N095671M911903O876552P502386P932464R215220R373418R341627
$$ 84457633 89553304 94465207 101341759 108844145 116776609 125991829 135365247 144706874
3246A44706874R166463Q541504Q287707O183689L309034M62017k649284n683177
$$ 144706874 153873337 162414841 170702548 176886237 180195271 180657288 178008004 172324827
3238A72324827q065228r999555j0971413j1479443j1175563r858917r033902q322993
$$ 172324827 164259599 154260044 143288631 131809188 120633625 110774708 101740806 93417813
3230I3417813p102054o764304n660893n770039m841607m507909m088845l703630
$$ 93417813 86315759 79551455 73890562 68120523 63278916 58771007 54682162 50978532
3222E0978532l094674k850345k630068k429995k136751j837950j526003j675169
$$ 50978532 47883858 45033513 42403445 39973450 37836699 35998749 34472746 32797577
3214C2797577j605914r05413j115531q62837j357770j170338q07314q58777r01638
$$ 32797577 31191663 30286250 29170719 28307882 26950112 25779774 24972460 24113683 23212045
3205B3212045p12004o43182m17000m76471n29804j202856o75811J56914l34601
$$ 23212045 22500041 21856859 21439859 20963388 20433584 19230728 18554917 18711831 18377230
3196A8377230p56527n52182m54032j60058l32802o97419o93752j48650k89162
$$ 18377230 17620703 17068521 16614489 16454431 16121629 15424210 14730458 14581808 14292646
3187A4292646q53119m06190j9205l0351n84924j2121j93786q6327l20611o49342
$$ 14292646 13439527 13033337 13014132 12983781 12398857 12386736 12192950 12106623 11786012 11136670
3177A1136670l93847n05605j72724J69426l93074j62259j48118P5844r4863m74673
$$ 11136670 10742823 10237218 10064494 10233920 9840846 9678587 9530469 9606313 9511450 9036777
3167I036777k48167j89619M263k4470J88810k17937q4824o41670n52779J42328
$$ 9036777 8788610 8598991 8603254 8578784 8767594 8549657 8464833 7823163 7270384 7412712
3157G412712N75376j0682k06253j68126M5411n07974m73405k32950m58216J69215
$$ 7412712 7988088 7977406 7771153 7603027 7648438 7140464 6667059 6434109 5975893 6145108
3147F145108K96347k12656n40417K90286J96086k60805l94410m58212j16109K51406
$$ 6145108 6441455 6228799 5688382 5978668 6174754 5913949 5519539 5061327 4945218 5196624
3137E196624k8926J02625j140M4211k95848r475L6743K56809j50511k54108j87258
$$ 5196624 5167698 5270323 5269183 5313394 5017546 5008071 5044814 5301623 5151112 4897004 4709746
3126D709746k19397k03276q3740j3361k6053J55695j920J11114j89144m27540
$$ 4709746 4490349 4287073 4203333 4189972 4163919 4319614 4317694 4428808 4239664 3812124
3116C812124p1593r027Q9293J88648k23074p2757l85588J49942K30103K19547
$$ 3812124 3740531 3731504 3820797 4009445 3786371 3713614 3328026 3477968 3708071 3927618
3106C927618P2258j61027l00491P836J48338m91641M37098R7443m74876P4764
$$ 3927618 3999876 3838849 3538358 3546194 3694532 3202891 3639989 3737432 3262556 3337320
3096C337320J10199J46170j8079N4667j87011k95083l35782J10768O9494K62681
$$ 3337320 3447519 3593689 3575610 3630277 3443266 3148183 2812401 2923169 2992663 3255344
3086C255344j6071k69128p759j76392O16136m3514N4040K28867O4052n05365o464
$$ 3255344 3239273 2970145 2962386 2785994 3402130 3358616 3412656 3641523 3705575 3200210 3193746
3075C193746o8580j92341K22143K73828m01556L9042n024m44877N72000m7729
$$ 3193746 3125166 2932825 3154968 3428796 3027240 3066282 3061258 2616381 3188381 3140652
3065C140652J91819R6694l30392N1393O83913P1041k64947J11946K10299J1462
$$ 3140652 3332471 3429165 3098773 3150166 3834079 3905120 3640173 3752119 3962418 3973880
3055C973880j3156l33950o8900j48940M06423P9151n0642L52687P1532J46600
$$ 3973880 3960724 3626774 3557874 3408934 3815357 3894508 3843866 4196553 4268085 4414685
3045D414685k03812K52171p0274L59665P6501L41366l42953K45729j04728k28636
$$ 4414685 4210873 4463044 4392770 4752435 4828936 5170302 4827349 5073078 4968350 4739714
3035D739714M52267J02293M73564p5785j54748o4810l51310J11443k33551l41507
$$ 4739714 5191981 5294274 5767838 5692053 5537305 5472495 5121185 5232628 4999077 4657570
3025D657570O52218q579L237J17176j48404l01682J09203K06622J46582k1384
$$ 4657570 5309788 5301209 5304446 5421622 5273218 4971536 5080739 5287361 5433943 5412559
3015E412559K93367j63709m68001j74072M43074l57330m01095M8498J01482o05284
$$ 5412559 5705926 5542217 5074216 4900144 5343218 4985888 4584793 4633291 4734773 4129489
3005D129489K76228M63815n0429m82252N6194J70349K53215M06764p1986K36141
$$ 4129489 4405717 4869532 4819103 4336851 4393045 4563394 4816609 5223373 5151387 5387528
2995E387528j99356K99265l1629n18587O37900K03227l75270R9824k7027R9846
$$ 5387528 5188172 5487437 5455808 4937221 5575121 5778348 5403078 5502902 5475875 5575721
2985E575721K02570j28224n29270L06144L13296R28772n39357k0486L14875q0518
$$ 5575721 5778291 5650067 5120797 5426941 5740237 6669009 6129652 6109166 6424041 6343523
2975F343523M66781l7643J23548Q78613R74852L4246N73668J045015O50538O23777
$$ 6343523 6810304 6772661 6896209 7774822 8749674 8783920 9357588 10402603 11053141 11676918
2965A1676918J103059Q48785R90939Q29003Q65273j07492j252464j210639j572749
$$ 11676918 12779977 13628762 14619701 15448704 16313977 16206485 14954021 13743382 12170633
2956A2170633n35817n35671l31725m20466q51574k69259j72486m3542l97308j8064
$$ 12170633 11634816 11099145 10767420 10346954 9495380 9226121 9053635 9010093 8612785 8594721
2946H594721k65096K13755Q9466K01399j39701K36709M08583k57578q4727L31152
$$ 8594721 8329625 8543380 8632846 8834245 8694544 8931253 9339836 9082258 8997531 9328683
2936I328683K33766j12102J30593J58181n96494j98891r6155L64284M8154J25856
$$ 9328683 9562449 9450347 9580940 9739121 9142627 8943736 8847581 9211865 9260019 9385875
2926I385875M46979M5224L8131P4615L96839k11909M58132j74005M23735N49370
$$ 9385875 9832854 9878078 9916209 9990824 10387663 10175754 10633886 10459881 10883616 11432986
2916A1432986N470K47216J79075j39086L40324N15862J66109N8476M60205M21742
$$ 11432986 11438456 11685672 11864747 11725661 12065985 12581847 12747956 12806432 13266637 13688379
2906A3688379M42331L69084K98008M56106N20362L18526K50820N07231Q93783
$$ 13688379 14130710 14499794 14797802 15253908 15774270 16092796 16343616 16850847 17744630
2897A7744630N40033O04777M50557Q15079P93201O88081N30940P98128J125006
$$ 17744630 18284663 18889440 19339997 20155076 20948277 21636358 22167298 22965426 24090432
2888B4090432J181936R78800J119493P05232Q19550J362074J361709J148839J492502
$$ 24090432 25272368 26251168 27370661 28075893 28895443 30257517 31619226 32768065 34260567
2879C4260567J562577J691866J241634J404895J590784J505007K244261K101855
$$ 34260567 35823144 37515010 38756644 40161539 41752323 43257330 45501591 47603446
2871D7603446J651737K188114K024190J606386K136385J786745K317936K085468
$$ 47603446 49255183 51443297 53467487 55073873 57210258 58997003 61314939 63400407
2863F3400407J841199J634702K536560K280754J704086J927715K136328K113811
$$ 63400407 65241606 66876308 69412868 71693622 73397708 75325423 77461751 79575562
2855G9575562J218920J663026J821052J538129J054828J661619J303725R32861
$$ 79575562 80794482 82457508 84278560 85816689 86871517 88533136 89836861 90769722
2847I0769722R00336L92501P34360N92559J03108P4130k96164j36232j9331o61159
$$ 90769722 91670058 92062559 92796919 93389478 93492586 93566716 93270552 93134320 93114989 92453830
2837I2453830o80162p02606m99776j191224j362460j041355j102594j685379q07524
$$ 92453830 91773668 91071062 90571286 89380062 88017602 86976247 85873653 84188274 83380750
2828H3380750j807368j420611j966831k134617j814463k095008j847913k033582
$$ 83380750 81573382 80152771 78185940 76051323 74236860 72141852 70293939 68260357
2820F8260357k168252j643622j811523j684980j839374k099960j873039j626558
$$ 68260357 66092105 64448483 62636960 60951980 59112606 57012646 55139607 53513049
2812E3513049j498881j651023j970237j872060r56720j329089q04269j284650
$$ 53513049 52014168 50363145 48392908 46520848 45564128 44235039 43430770 42146120
2804D2146120j222915j221367j098252o84510j097376j219302n10902m5710j47142
$$ 42146120 40923205 39701838 38603586 37919076 36821700 35602398 35091496 35045786 34898644
2795C4898644o07586n66211n81256n43381M45962k06036k98598m58835J62438
$$ 34898644 34291058 33724847 33143591 32600210 33046172 32840136 32541538 32082703 32245141
2786C2245141K42561P5727R6604m53376L69169O59887m1339N14182L33029N06243
$$ 32245141 32487702 32563429 32660033 32206657 32575826 33235713 33194374 33708556 34041585 34547828
2776C4547828L66375K95110M28752K18778R75650O22665M01217K53301J421918
$$ 34547828 34914203 35209313 35638065 35856843 36832493 37455158 37856375 38109676 39531594
2767C9531594P89145J27538P54512J363100J043759Q29932R61622P90279R63893
$$ 39531594 40320739 40448277 41202789 42565889 43609648 44439580 45401202 46191481 47155374
2758D7155374J263067K147046J565963J192207J579465J884732K532727K655174
$$ 47155374 48418441 50565487 52131450 53323657 54903122 56787854 59320581 61975755
2750F1975755K461960K435044K930103L296947L494296L603156M168462M700336
$$ 61975755 64437715 66872759 69802862 73099809 76594105 80197261 84365723 89066059
2742H9066059N194766N492647N872591O754380P117861P841308Q142002R092513
$$ 89066059 94260825 99753472 105626063 112380443 119498304 127339612 135481614 144574127
2734A44574127R805458R812304J0606031J0411305J0345477R460531Q796114P945871
$$ 144574127 154379585 164191889 174797920 185209225 195554702 205015233 213811347 221757218
2726B21757218O346214N048180L096066J974999M73840n59370j622319j856830
$$ 221757218 228103432 233151612 236247678 238222677 238696517 238137147 236514828 234657998
2718B34657998k016957k613917l067033l479551l933096m103684n452518o014227
$$ 234657998 232641041 230027124 226960091 223480540 219547444 215443760 209991242 203977015
2710B03977015p033468p950639q328514r095322r469061r720666r540562r405998
$$ 203977015 196943547 188992908 180664394 171569072 162100011 152379345 142838783 133432785
2702A33432785q758978q620297p847702p273888o544748o314834n239908n346341
$$ 133432785 124673807 116053510 108205808 100931920 94387172 88072338 82832430 77486089
2694G7486089n016066l745388l673755l843162l081441k969862k769628k171086
$$ 77486089 72470023 68724635 65050880 61207718 58126277 55156415 52386787 50215701
2686E0215701k269533k431795j867388j634639j249086j806287r79591j171936
$$ 50215701 47946168 45514373 43646985 42012346 40763260 38956973 37977382 36805446
2678C6805446j294138p79007r70824r12223j434868r49927r29842o69571j017999
$$ 36805446 35511308 34732301 33761477 32849254 31414386 30464459 29534617 28865046 27847047
2669B7847047j040112l29395o06256m51200n38000q51989n83066o88970n42433
$$ 27847047 26806935 26477540 25871284 25420084 24882084 24030095 23447029 22758059 22215626
2660B2215626j73240n52416l74301k96512n82104k83303o17764J08894l4485o22798
$$ 22215626 22042386 21489970 21115669 20819157 20237053 19953750 19335986 19444880 19410395 18787597
2650A8787597k76256n47074n99665n93298n22737J04168q9030n69897N9097K29072
$$ 18787597 18511341 17964267 17364602 16771304 16248567 16352735 16263705 15693808 15752905 15981977
2640A5981977n98767k82016q1792k60109J63494n43495k43564l04507J67906n40882
$$ 15981977 15383210 15101194 15019402 14759293 14922787 14379292 14135728 13831221 13999127 13458245
2630A3458245o07444L48322M12392o85436l55732M3482K53033p21307n39380L91267
$$ 13458245 12850801 13199123 13611515 12926079 12570347 12613829 12866862 12145555 11606175 11997442
2620A1997442k81709J55775k90365l04211k50362J71830O2995J95762k73446j76050
$$ 11997442 11715733 11871508 11581143 11276932 11026570 11198400 11261395 11457157 11183711 11007661
2610A1007661j07566j83753k56935K00888J9344J57033k39179r7016J19072J33522
$$ 11007661 10900095 10716342 10459407 10660295 10679639 10836672 10597493 10500477 10619549 10753071
2600A0753071M18594l01076k67176O10201m7110Q1984k84670L8068l87608k2842
$$ 10753071 11171665 10870589 10603413 11213614 11166504 11248488 10963818 11001886 10614278 10591436
2590A0591436J90571J62340p9667l35252L15304J54779O8417K62323j34091J62640
$$ 10591436 10782007 10944347 10864680 10529428 10844732 10999511 11067928 11330251 11196160 11358800
2580A1358800N5407m1248K3661k45527J97435J98492J55963n9641q9489K26110
$$ 11358800 11414207 11372959 11396620 11151093 11348528 11547020 11702983 11643342 11553853 11779963
2570A1779963N94372K95827k05132L87649L25766O2149N04323K61255L8658J81056
$$ 11779963 12374335 12670162 12465030 12852679 13178445 13240594 13744917 14006172 14044830 14225886
2560A4225886M13537L30962O99123N28128J02439K46261N98313M37127Q08936
$$ 14225886 14639423 14970385 15669508 16197636 16300075 16546336 17144649 17581776 18390712
2551A8390712J74521q1045Q69529Q74067L37411N68071O92027L49571L51004M35807
$$ 18390712 18565233 18484188 19353717 20227784 20565195 21133266 21825293 22174864 22525868 22961675
2541B2961675N35203Q54587N18629M5362P39369R99764O37134K51578J16755L08913
$$ 22961675 23496878 24351465 24870094 24915456 25654825 26654589 27291723 27543301 27660056 27968969
2531B7968969L42211K00613J013157J261609M35415R21872J002582N73963J103951
$$ 27968969 28311180 28511793 29524950 30786559 31221974 32143846 33146428 33720391 34824342
2522C4824342P69259N83487J103438Q05833J224210P40537J297552J523232J426783
$$ 34824342 35593601 36177088 37280526 38086359 39310569 40051106 41348658 42871890 44298673
2513D4298673J319288J788455J946733J841631J752041K542542K818419K536487
$$ 44298673 45617961 47406416 49353149 51194780 52946821 55489363 58307782 60844269
2505F0844269K851317L170817L016539L157332M147783M024754M500813M671824
$$ 60844269 63695586 66866403 69882942 73040274 77188057 81212811 85713624 90385448
2497I0385448N177757N254058O161983O070187O198297O533515O780692O930146
$$ 90385448 95563205 100817263 106979246 113049433 119247730 125781245 132561937 139492083
2489A39492083O331143O322854N846611N829383N209202N050002M730443M450229
$$ 139492083 145823226 152146080 157992691 163822074 169031276 174081278 178811721 183261950
2481A83261950M001065L989575M206840L729519L340564L351570J660980J117648
$$ 183261950 187263015 191252590 195459430 199188949 202529513 205881083 207542063 208659711
2473B08659711K69518L2013j204778k523427k848783l831704m220250n020246
$$ 208659711 208929229 208961242 207756464 205233037 202384254 198552550 194332300 189312054
2465A89312054n067410m967545n605533n875666n459269n599550n879736o049183
$$ 189312054 184244644 179277099 173671566 167795900 162336631 156737081 150857345 144808162
2457A44808162o248339o188900o033476o340362o369884n781735o060009o068884
$$ 144808162 138559823 132370923 126337447 119997085 113627201 107845466 101785457 95716573
2449I5716573n827386n344043m761224m838272m955544l815612l787937l167702
$$ 95716573 89889187 84545144 79783920 74945648 69990104 66174492 62386555 59218853
2441E9218853k532613k932781k500945k123984j820427k431238k018781j572378
$$ 59218853 56686240 53753459 51252514 49128530 47308103 44876865 42858084 41285706
2433D1285706j321766j736880j482963r59048j177099o56934o31945q86426o19416
$$ 41285706 39963940 38227060 36744097 35785049 34607950 33951016 33319071 32432645 31813229
2424C1813229p49829r65456r97629l66706m48897n87134j189919p75248n38042
$$ 31813229 31063400 30097944 29100315 28733609 28284712 27697578 26507659 25732411 25194369
2415B5194369l1580m75772m82804l01843k06636o50756l68160r71600k72757j82846
$$ 25194369 25162789 24687017 24204213 23902370 23695734 23044978 22676818 21705218 21432461 21249615
2405B1249615l89929q20004j33061n36315m44062j84660n58652l29255j09290
$$ 21249615 20859686 20039682 19906621 19370306 18926244 18741584 18182932 17853677 17744387
2396A7744387l49407o63412n53382l64049k23991l91917j41927p01471k14048
$$ 17744387 17394980 16731568 16178186 15814137 15590146 15198229 15056302 14354831 14140783
2387A4140783l83609J3641j93916J13M1636o80167n12558K48492o41113l6507
$$ 14140783 13757174 13770815 13576899 13577012 13618648 12938481 12425923 12674415 12033302 11996795
2377A1996795m32160O7765J51480p5006n34250O543j01759p8349K65744r0839
$$ 11996795 11564635 11632400 11783880 11708874 11174624 11181167 11079408 11001059 11266803 11175964
2367A1175964K45576j44921j9987m54798l7165j33151N7332J90459n12089k34142
$$ 11175964 11421540 11276619 11256632 10801834 10764669 10631518 10688850 10879309 10367220 10133078
2357A0133078J73135N03608k31007m2178L9965l08229M79816O54212j40179K70692
$$ 10133078 10306213 10809821 10578814 10536636 10576601 10268372 10748188 11402400 11262221 11532913
2347A1532913P2561n19046K33594O89155k35697N7778O57603L07181j74225J59189
$$ 11532913 11605474 11086428 11320022 12009177 11773480 11831258 12488861 12796042 12621817 12781006
2337A2781006L38798M62342L10669M42016N32174P27609J96948k56017Q53271
$$ 12781006 13119804 13582146 13892815 14334831 14867005 15594614 15791562 15535545 16388816
2328A6388816Q03480L9399k9237N92654P93837Q74108P19809O28937J214936J283309
$$ 16388816 17192296 17231695 17202458 17795112 18588949 19463057 20182866 20811803 22026739 23310048
2318B3310048J014436R30129R08402J843632J459693K119976J835304K208699
$$ 23310048 24324484 25254613 26163015 28006647 29466340 31586316 33421620 35630319
2310C5630319K473309J802052K232572J759338K539576K771892K254560J770838
$$ 35630319 38103628 39905680 42138252 43897590 46437166 49209058 51463618 53234456
2302E3234456N92609Q26825M2713k08153q19731j774379j303473r09059r32763
$$ 53234456 53827065 54653890 54696603 54488450 53668719 51894340 50590867 49681808 48749045
2293D8749045j019022j141789o36100n88594l48581R6327m4050O21480J69377
$$ 48749045 47730023 46588234 45952134 45363540 45014959 45111286 45067236 45688716 45858093
2284D5858093Q27300J039456J234809J735005K023376K506427K435159L301560
$$ 45858093 46685393 47724849 48959658 50694663 52718039 55224466 57659625 60961185
2276F0961185L197715L600366L756304M527370M347531M117814M064274L095359
$$ 60961185 64158900 67759266 71515570 76042940 80390471 84508285 88572559 91667918
2268I1667918K929319J696764j92515k265584l829552m779365n073337m902644
$$ 91667918 94597237 96294001 96101486 93835902 90006350 85226985 80153648 75251004
2260G5251004m318527m084083m201320l466423l643208k694590k094010k730258
$$ 75251004 70932477 66848394 62647074 59180651 55537443 52842853 50748843 48018585
2252D8018585j964281j365834j214680j008234p78505l92193n34715l40286L25475
$$ 48018585 46054304 44688470 43473790 42465556 41687051 41294858 40760143 40419857 40745332
2243D0745332O34941M33754P38048Q57367P06810Q23336Q00924J275855K16339
$$ 40745332 41380273 41814027 42552075 43409442 44116252 44939588 45740512 47016367 47232706
2234D7232706M16165N24218l40745r59063j555152j346694k473692k827350k236902
$$ 47232706 47648871 48173089 47832344 46873281 45318129 43971435 41497743 38670393 36433491
2225C6433491k130887k564861k030740j528079j735222j911905k148438j211617
$$ 36433491 34302604 31737743 29707003 28178924 26443702 24531797 22383359 21171742
2217B1171742j468492r77246o62358q89566o69813j056376p35678o46916o67252
$$ 21171742 19703250 18726004 18063646 17174080 16504267 15447891 14712213 14065297 13398045
2208A3398045l53921n78947l21373q31065o61159l71348L03782n58866p65229
$$ 13398045 13044124 12465177 12143804 11312739 10651580 10280232 10584014 10025148 9259919
2199I259919m04791k23528o7871p5371m76291m00817k5278j50160m1974Q4853
$$ 9259919 8855128 8631600 8563729 8488358 8012067 7611250 7585972 7435812 7393838 7478691
2189G478691q7187j27149M9711p81749j31619N0978j17421j83183k95105j64792
$$ 7478691 7391504 7264355 7314066 6532317 6400698 6451676 6334255 6151072 5855967 5691175
2179E691175j37399j05645M19328l38897j76070N9577N6262j38003k74984J14730
$$ 5691175 5553776 5448131 5867459 5528562 5352492 5412069 5468331 5330328 5055344 5170074
2169E170074k18442J90513r1586m55474p17242k12309K08569l11229K61350J29974
$$ 5170074 4951632 5142145 5050559 4595085 3877843 3665534 3874103 3562874 3824224 3954198
2159C954198Q8422N13809m15109j77237N6976j34155R633m22929o11998l60603
$$ 3954198 4042620 4556429 4141320 3964083 4021059 3886904 3896537 3473608 2861610 2501007
2149B501007L00207K29237J15385J12034Q9424j84126j30121l39020j17754J84319
$$ 2501007 2801214 3030451 3145836 3257870 3347294 3163168 3033047 2694027 2576273 2760592
2139B760592o7255J33578k6252O5255K25474r210n79305k56309J28270P781n31046
$$ 2760592 2693337 2826915 2800663 2865918 3091392 3082182 2502877 2246568 2374838 2382619 1851573
2128A851573q8619J60628K77628j07484K4085J85828o6366m95866m209K88537
$$ 1851573 1762954 1923582 2201210 2093726 2117811 2303639 2237273 1741407 1737198 2025735
2118B025735n06450K09623J09910n86752l15038O97000M51688N0677l39160n06467
$$ 2025735 1519285 1728908 1838818 1252066 937028 1634028 2085716 2136393 1797233 1290766
2108A290766K45934K2267J485N5372m3236l86338P0483J21069j1940L48484l80037
$$ 1290766 1536700 1558967 1560452 1615824 1572588 1186250 1256733 1377802 1365862 1714346 1334309
2097A334309l70105Q3517J97956m2309o4003J33704P86736l42835m45251j38537
$$ 1334309 964204 1047721 1245677 1203368 1139365 1273069 2059805 1716970 1271719 1133182
2087A133182L47956k19283O5397N0453l31720L68953j72293m8151M41234k47738
$$ 1133182 1481138 1261855 1327252 1377705 1045985 1414938 1242645 1194494 1635728 1387990
2077A387990m6922J34125J05615j12080k59985L5162M60638L17575k64120j53439
$$ 1387990 1341068 1475193 1580808 1468728 1208743 1243905 1704543 2022118 1757998 1604559
2067A604559Q7009l79923J17747L33720K54732l58316j30419M69887J88101M0778
$$ 1604559 1691568 1311645 1429392 1763112 2017844 1659528 1529109 1998996 2187097 2227875
2057B227875l13841J51619k81413L2607j4926m0376K39416r5492J1434K24683
$$ 2227875 1914034 2065653 1784240 1816847 1801921 1761545 2000961 1905469 1916903 2141586
2047B141586j6751k98774m78343J39752l04660p9929m9340K1394Q8060j548k13820
$$ 2141586 2124835 1826061 1347718 1487470 1182810 1102881 1053541 1074935 1162995 1161447 947627
2036I47627j03411K94011o6009J69465n32l12747m1884M4799j83664L91231J46833
$$ 947627 844216 1138227 1072218 1241683 1241151 928404 886520 931319 747655 1138886 1285719
2025A285719n11761K97516L25987l37834l32876o1290N1749J66298J9232J96367
$$ 1285719 773958 1071474 1397461 1059627 726751 665461 717210 883508 902740 1099107
2015A099107l34752m31749J62508r3398K83204l03611k41804L27131L48628j56502
$$ 1099107 764355 332606 495114 401716 684920 381309 139505 466636 815264 658762
2005F58762j75505O5838j37373j27124K91597J16888L4454J53702o51777O9177
$$ 658762 483257 549095 411722 284598 576195 693083 727537 881239 229462 298639
1995B98639K03351K23846j33037O56177M6324m35475L4148q9398o1344Q6938R9187
$$ 298639 501990 725836 592799 1248976 1295300 859825 893973 804575 743231 830169 929356
1984I29356M0608l87313J61478j1298k08156J24680j16070l3293J23198J67054
$$ 929356 969964 582651 744129 732831 524675 649355 533285 499992 623190 790244
1974G90244k53567J31289Q760L41706J76621l40963n08899o4679L28692L87276
$$ 790244 536677 667966 676726 1018432 1195053 854090 345191 280512 609204 996480
1964I96480J03303n10894K43760j65925l62781K75142J76710k99686J5723q0760
$$ 996480 1099783 588889 832649 666724 303943 579085 755795 456109 471832 391072
1954C91072L58707J37816l52602m5869p4410J97491M8624j42418n22192O95313
$$ 391072 749779 887595 534993 489124 414714 612205 660829 518411 -3781 691532
1944F91532L30362j77763J89404k52870m4759K17644l56102r254N3960J70251
$$ 691532 1021894 844131 1033535 780665 735906 953550 597448 588194 642154 812405
1934H12405L81134r6758j94655k01388j28794L30020M6920k19643k92596K15165
$$ 812405 1193539 1096781 902126 700738 571944 901964 948884 729241 436645 651810
1924F51810O47345j83927n2552n581k2704l68252O5704K85899P4879J77239j51297
$$ 651810 1299155 1115228 1062676 1057095 1034391 666139 731843 1017742 1092621 1269860 1118563
1913A118563l06489l56139M59492K14907n19373q1721R6007J74892J24570J78701
$$ 1118563 812074 455935 915427 1130334 610961 529240 625247 800139 924709 1103410
1903A103410j30454j98403k6007m95838K64505K35413J07221l60160K04225N1615
$$ 1103410 972956 774553 748546 252708 517213 752626 859847 499687 703912 755527
1893G55527j78462O65101J8680o44911j53192J34851N5986L58370J68213Q7030
$$ 755527 577065 1242166 1260846 615935 462743 597594 653580 1011950 1180163 1267193
1883A267193K49431l04997j43227J32547j73846k50551L3694J77125L19242k71060
$$ 1267193 1516624 1211627 1068400 1200947 1027101 776550 810244 987369 1306611 1035551
1873A035551K3957j96786N8052L04117j10518J99657J70484k89251m4555L18738
$$ 1035551 1059508 862722 920774 1224891 1114373 1314030 1484514 1195263 1150708 1469446
1863A469446R4197J58954q4384k44379J18179M90099j47150j54752K56770m14955
$$ 1469446 1563643 1722597 1638213 1393834 1512013 2002112 1854962 1700210 1956980 1542025
1853A542025K098M74604m13738l35425M64784J75229K47113N00901k46208j23330
$$ 1542025 1544123 2018727 1604989 1269564 1734348 1909577 2156690 2657591 2411383 2288053
1843B288053Q2579K65207J04260N2035k1468J39280J30759k05193J93222J93260
$$ 2288053 2370632 2635839 2740099 2792134 2770666 2909946 3040705 2835512 3028734 3221994
1833C221994M6895J44464q116j91958m3879K23782J58452K82346L18406R5371
$$ 3221994 3268889 3413353 3405237 3213279 3169400 3393182 3551634 3833980 4152386 4247757
1823D247757J85093L7234l17509J62371K99119J2240j88539M25440R0459L48596
$$ 4247757 4432850 4470084 4152575 4314946 4614065 4626305 4437766 4863206 4953665 5302261
1813E302261M34650P1417L90935J94289o6412l4531k09307K0695J82799M478K30691
$$ 5302261 5736911 5808328 6199263 6393552 6327140 6292609 6083302 6103997 6286796 6291274 6521965
1802F521965K40135k06600k79285N12040P86716n04235r6812J40482j08093J14356
$$ 6521965 6762100 6555500 6276215 6788255 7574971 7070736 6973924 7114406 7006313 7120669
1792G120669L93790O68209J87363k84132l1244J49534K62596r736R540L14711
$$ 7120669 7514459 8182668 8370031 8085899 8054655 8204189 8466785 8457049 8466589 8781300
1782H781300N61051l13388j16637O31492L58771M8148L20934L72297l14815K69797
$$ 8781300 9342351 9028963 8912326 9543818 9902589 9950737 10271671 10643968 10329153 10598950
1772A0598950k24292N71159M60429j00199o40820J37467O0201j37867L9453j59341
$$ 10598950 10374658 10945817 11406246 11306047 10665227 10802694 10862895 10725028 10764481 10605140
1762A0605140J9973k68965p8564J398J14143J37720N5531p31530O7038q2227j67046
$$ 10605140 10625113 10356148 10277584 10278982 10393125 10530845 10586376 9854846 9921884 9839657 9672611
1751I672611M47160l86388j97538K10795k41350j23186L0720l3797q29698K28274
$$ 9672611 10119771 9733383 9535845 9746640 9505290 9382104 9412824 9379027 8549329 8777603
1741H777603k07465m91940L62247o6243j81805K01017M66629j85197m6358k10203
$$ 8777603 8570138 8078198 8440445 8374202 8192397 8393414 8860043 8674846 8628488 8418285
1731H418285k77010P0557n25653n7433R6973m40943m85085n48480J77999N9788
$$ 8418285 8141275 8211832 7686179 7628746 7725719 7284776 6799691 6251211 6429210 6488998
1721F488998j69356Q070o3386r0511n85705l8015M62931k29296p22064j80183
$$ 6488998 6319642 6327712 6264326 6173815 5588110 5550095 6013026 5783730 5061666 4881483
1711D881483K02057l18255L804k77008k4448M7555l18333p5731J30318j33244
$$ 4881483 5083540 4765285 4769089 4492081 4467633 4515188 4196855 4121124 4251442 4118198
1701D118198k53226k43101J4668K66829o12055m82422k938j39838r6415J23965
$$ 4118198 3864972 3621871 3636539 3903368 3291313 2808891 2805953 2666115 2569700 2693665
1691B693665j62140L33934J67187n75214j29974n41665n90135L35171P09962l79150
$$ 2693665 2531525 2865459 3032646 2457432 2327458 1785793 1195658 1530829 2240791 1861641
1681A861641L8386J19309r4656J88583J54553J85237k75120m68988O72804k09183
$$ 1861641 1900027 2019336 1924680 2113263 2267816 2453053 2177933 1708945 2381749 2172566
1671B172566n47682q8635K06869j95066L64701l66920r5227l66317r1114M61473
$$ 2172566 1624884 1536249 1743118 1548052 1912753 1545833 1450606 1084289 993175 1454648
1661A454648J1170L2131J35502K47560k58066M8352j11497k52400L10057M65412
$$ 1454648 1465818 1497949 1633451 1881011 1622945 1671297 1559800 1307400 1617457 2082869
1651B082869r3011n80833j69756M15227o38520j24142K82786J39863K26893j76464
$$ 2082869 1989858 1409025 1239269 1654496 1015976 891834 1174620 1314483 1541376 1364912
1641A364912l56927O4010Q0932M01501k27650o5290j59422k59414k56105o0335
$$ 1364912 1007985 1071995 1152927 1554428 1326778 1261488 1102066 842652 586547 526212
1631E26212J78174m96199L54521L85207k60254j87069l5883Q0140J53517j55920
$$ 526212 704386 208187 562708 947915 687661 500592 464709 544849 698366 542446
1621E42446k04200L66028k31107J31322M065j37490J77025L02751l33065r781
$$ 542446 338246 704274 473167 604489 608554 471064 648089 950840 617775 607994
1611F07994l04478k08182J70313J84210l79511o0714K3740K50518j75661J52933
$$ 607994 303516 95334 265647 449857 70346 9632 33372 283890 108229 261162
1601B61162n8251j19173L73137q6099N5847j11164P0387K37672J02172j28426
$$ 261162 202911 83738 456875 370776 426623 315459 385846 623518 725690 597264
1591E97264j76983o1805J05587J30519O5753m02064k59506j99808j99348M39943
$$ 597264 420281 358476 464063 594582 660335 258271 -1235 -201043 -400391 39552
1581C9552J85375n7978K63367k04318K2136n1414l04189n5133K11102M6088J23377
$$ 39552 224927 166949 430316 225998 248134 196720 -107469 -162602 48500 94588 217965
1570B17965l369J07461r2659m5374k02246K55778m4665N1419j24127L9267l3000
$$ 217965 214596 322057 229398 184024 -18222 237556 192891 244310 120183 159450 126450
1559A26450K50172l14946j77890J82068J73282J13209p10400M09406J53170J47355
$$ 126450 376622 61676 -116214 65854 239136 352345 -358055 51351 204521 351876
1549C51876j72456J52843K49666k1271O8081l41971k88318l70864Q1363K50007
$$ 351876 179420 332263 581929 560658 628739 286768 -1550 -372414 -291051 -41044
1539d1044j36082K89449Q2559K3047l4318n7249m08083q4340L95327j44818N3091
$$ -41044 -177126 112323 194882 217929 183611 126362 -281721 -366061 29266 -115552 -62461
1528f2461L09918M51374j1359n9591o84819q8109r5133K71705N13488M5142O4538
$$ -62461 247457 698831 687472 627881 -56938 -145047 -240180 31525 545013 590155 654693
1517F54693j06914o321L6937K35253J55530m33924k87224P9763L47095J02338
$$ 654693 547779 541458 578395 813648 969178 535254 248030 327793 674888 777226
1507G77226m07029J73140l5227L01628p5734j07486J19928k32517k36399M29286
$$ 777226 370197 543337 508110 809738 734004 626518 746446 513929 277530 706816
1497G06816J56256m45421m2281L34330J88356N3433p406k15785k43102r574J23162
$$ 706816 863072 417651 375370 709700 898056 951489 944083 728298 485196 475622 598784
1486E98784K98834q5324P2630o7703K15615j81600J39146N21385l35794m44355
$$ 598784 897618 812294 884924 817221 1032836 851236 990382 1511767 1175973 731618
1476G31618k34702N2973P3468J05786j07760J9036n0850M2845J23241M31054K80818
$$ 731618 496916 549889 623357 729143 621383 640419 589569 632414 755655 1186709 1467527
1465A467527n3410o00349j32893K43122L15332k30305k31849j0398K05393J6688
$$ 1467527 1414117 813768 680875 923997 1239329 1009024 777175 766777 972170 988858
1455I88858N69529j02378l18028n42964N26288O01306m05209J91570R14511j9148
$$ 988858 1558387 1456009 1137981 595017 1121305 1722611 1317402 1508972 2423483 2404335
1445B404335n32104j49253k43417j06595k63759R1199M6682M00298j22559J89433
$$ 2404335 1872231 1722978 1479561 1372966 1109207 1200406 1247088 1647386 1524827 1714260
$$ [...]
##END NTUPLES=NMR SPECTRUM
##END=
