##TITLE=1H_EC-3247
 CDCl3,8 sc, 
 2.03.2021
##JCAMPDX= 6.0         $$ Bruker NMR JCAMP-DX V2.0
##DATA TYPE= NMR FID
##DATA CLASS= NTUPLES
##ORIGIN= UXNMR, Bruker Analytische Messtechnik GmbH
##OWNER= root
$$ XWIN-NMR		Version 3.5
$$ Tue Mar  2 10:29:12 2021 Russian Standard Time (UT+4h)  she@DPX200
##.OBSERVE FREQUENCY= 200.1315066352
##.OBSERVE NUCLEUS= ^1H
##.DELAY= (6, 6)
##.ACQUISITION MODE= SIMULTANEOUS
##.ACQUISITION SCHEME= undefined
##.AVERAGES= 8
##.DIGITISER RES= 18
##SPECTROMETER/DATA SYSTEM= spect
##.PULSE SEQUENCE= zg30
##.SOLVENT NAME= CDCl3
##.SHIFT REFERENCE= (INTERNAL, CDCl3, 0, 15.7039)
##AUDIT TRAIL= $$ (NUMBER, WHEN, WHO, WHERE, WHAT)
$$ ##TITLE= Audit trail, XWIN-NMR		Version 3.5
$$ ##JCAMPDX= 5.01
$$ ##ORIGIN= Bruker BioSpin GmbH
$$ ##OWNER= she
$$ F:/spectra/data/she/nmr/H-F/1/audita.txt
$$ ##AUDIT TRAIL=  $$ (NUMBER, WHEN, WHO, WHERE, WHAT)
(   1,<2021-03-02 10:28:04.95 +0400>,<she>,<DPX200>,
      <created by zg, POWCHK disabled, PULCHK disabled
       configuration hash MD5:
       00 E9 B6 7A A2 85 ED C7 34 08 36 98 17 FE 4E 26
       data hash MD5: 16K
       85 93 EF D3 DC FA 2D 3C 37 43 0A 4E EA 2D 0F DD>)
$$ ##END=
$$ 
$$ hash MD5
$$ CC FC AB A6 E9 6D 15 68 74 5C 8E 34 F3 69 57 50
##$RELAX= 
##$RELAX= 
##$RELAX= 
##$RELAX= 
##$RELAX= 
##$RELAX= 
$$ Bruker specific parameters
$$ --------------------------
##$DU= <F:/spectra>
##$EXPNO= 1
##$NAME= <H-F>
##$PROCNO= 1
##$TYPE= <nmr>
##$USER= <she>
##$AMP= (0..31)
100 100 100 100 100 100 100 100 100 100 100 100 100 100 100 100 100 100 
100 100 100 100 100 100 100 100 100 100 100 100 100 100 
##$AQSEQ= 0
##$AQ_mod= 1
##$AUNM= <au_zg>
##$AUTOPOS= <>
##$BF1= 200.13
##$BF2= 200.13
##$BF3= 200.13
##$BF4= 200.13
##$BF5= 200.13
##$BF6= 200.13
##$BF7= 200.13
##$BF8= 200.13
##$BYTORDA= 1
##$CFDGTYP= 0
##$CFRGTYP= 5
##$CHEMSTR= <none>
##$CNST= (0..31)
1 1 145 1 1 1 1 1 1 1 1 1 1 1 1 1 1 1 1 1 1 1 1 1 1 1 1 1 1 1 1 1 
##$CPDPRG= <>
##$CPDPRG1= <>
##$CPDPRG2= <>
##$CPDPRG3= <>
##$CPDPRG4= <mlev>
##$CPDPRG5= <mlev>
##$CPDPRG6= <mlev>
##$CPDPRG7= <mlev>
##$CPDPRG8= <mlev>
##$CPDPRGB= <>
##$CPDPRGT= <>
##$D= (0..31)
0 1.2 0 0 0 0 0 0 0 0.06 0 0.03 0 0 0 0 0.0002 0 0 0 0 0 0 0 0 0 0 0 0 
0 0 0 
##$DATE= 1614666484
##$DBL= (0..7)
120 120 120 120 120 120 120 120 
##$DBP= (0..7)
150 150 150 150 150 150 150 150 
##$DBP07= 0
##$DBPNAM0= <>
##$DBPNAM1= <>
##$DBPNAM2= <>
##$DBPNAM3= <>
##$DBPNAM4= <>
##$DBPNAM5= <>
##$DBPNAM6= <>
##$DBPNAM7= <>
##$DBPOAL= (0..7)
0.5 0.5 0.5 0.5 0.5 0.5 0.5 0.5 
##$DBPOFFS= (0..7)
0 0 0 0 0 0 0 0 
##$DE= 6
##$DECBNUC= <off>
##$DECIM= 32
##$DECNUC= <off>
##$DECSTAT= 4
##$DIGMOD= 1
##$DIGTYP= 9
##$DL= (0..7)
0 120 120 120 120 120 120 120 
##$DP= (0..7)
150 150 150 150 150 150 150 150 
##$DP07= 0
##$DPNAME0= <>
##$DPNAME1= <>
##$DPNAME2= <>
##$DPNAME3= <>
##$DPNAME4= <>
##$DPNAME5= <>
##$DPNAME6= <>
##$DPNAME7= <>
##$DPOAL= (0..7)
0.5 0.5 0.5 0.5 0.5 0.5 0.5 0.5 
##$DPOFFS= (0..7)
0 0 0 0 0 0 0 0 
##$DQDMODE= 0
##$DR= 18
##$DS= 0
##$DSLIST= <SSSSSSSSSSSSSSS>
$$ [...]
##$SUBNAM2= <"">
##$SUBNAM3= <"">
##$SUBNAM4= <"">
##$SUBNAM5= <"">
##$SUBNAM6= <"">
##$SUBNAM7= <"">
##$SUBNAM8= <"">
##$SUBNAM9= <"">
##$SW= 16.9725356469052
##$SWIBOX= (0..15)
0 0 2 0 0 0 0 0 0 0 0 0 0 0 0 0 
##$SW_h= 3396.73913043478
##$TD= 16384
##$TD0= 1
##$TE= 0
##$TE2= 300
##$TE3= 300
##$TEG= 300
##$TL= (0..7)
0 120 120 120 120 120 120 120 
##$TP= (0..7)
150 150 150 150 150 150 150 150 
##$TP07= 0
##$TPNAME0= <>
##$TPNAME1= <>
##$TPNAME2= <>
##$TPNAME3= <>
##$TPNAME4= <>
##$TPNAME5= <>
##$TPNAME6= <>
##$TPNAME7= <>
##$TPOAL= (0..7)
0.5 0.5 0.5 0.5 0.5 0.5 0.5 0.5 
##$TPOFFS= (0..7)
0 0 0 0 0 0 0 0 
##$TUNHIN= 0
##$TUNHOUT= 0
##$TUNXOUT= 0
##$USERA1= <user>
##$USERA2= <user>
##$USERA3= <user>
##$USERA4= <user>
##$USERA5= <user>
##$V9= 5
##$VALIST= <valist>
##$VCLIST= <CCCCCCCCCCCCCCC>
##$VD= 0
##$VDLIST= <DDDDDDDDDDDDDDD>
##$VPLIST= <PPPPPPPPPPPPPPP>
##$VTLIST= <TTTTTTTTTTTTTTT>
##$WBST= 1024
##$WBSW= 4
##$XGAIN= (0..3)
0 0 0 0 
##$XL= 0
##$YL= 0
##$YMAX_a= 423979
##$YMIN_a= -448812
##$ZGOPTNS= <>
##$ZL1= 120
##$ZL2= 120
##$ZL3= 120
##$ZL4= 120
##$ABSF1= 10
##$ABSF2= 0
##$ABSG= 5
##$ABSL= 3
##$ALPHA= 0
##$AQORDER= 0
##$ASSFAC= 0
##$ASSFACI= 0
##$ASSFACX= 0
##$ASSWID= 0
##$AUNMP= <proc_1d>
##$AZFE= 0.1
##$AZFW= 0.1
##$BCFW= 1
##$BC_mod= 2
##$BYTORDP= 1
##$COROFFS= 0
##$CY= 11.3945322036743
##$DATMOD= 1
##$DC= 2
##$DFILT= <>
##$DTYPP= 0
##$F1P= 15.9154993809931
##$F2P= -4.1035820241983
##$FCOR= 0.5
##$FTSIZE= 0
##$FT_mod= 4
##$GAMMA= 1
##$GB= 0.15
##$INTBC= 1
##$INTSCL= 1
##$ISEN= 128
##$LB= 0.24
##$LEV0= 0
##$LPBIN= 0
##$MAXI= 10000
##$MC2= 0
##$MEAN= 0
##$ME_mod= 0
##$MI= 1.114404
##$NCOEF= 0
##$NC_proc= 0
##$NLEV= 6
##$NOISF1= 3.799351
##$NOISF2= 2.8
##$NSP= 1
##$NTH_PI= 0
##$NZP= 0
##$OFFSET= 15.70392
##$PC= 1
##$PHC0= -10763.6
##$PHC1= 15.00094
##$PH_mod= 1
##$PKNL= yes
##$PPARMOD= 0
##$PSCAL= 0
##$PSIGN= 0
##$REVERSE= no
##$SF= 200.130013532006
##$SI= 16384
##$SIGF1= 3
##$SIGF2= 2
##$SINO= 400
##$SIOLD= 16384
##$SREGLST= <1H.CDCl3>
##$SSB= 0
##$STSI= 0
##$STSR= 0
##$SW_p= 3612.71676300578
##$SYMM= 0
##$S_DEV= 0
##$TDeff= 0
##$TDoff= 0
##$TI= <>
##$TILT= no
##$TM1= 0
##$TM2= 0
##$TOPLEV= 0
##$USERP1= <user>
##$USERP2= <user>
##$USERP3= <user>
##$USERP4= <user>
##$USERP5= <user>
##$WDW= 1
##$XDIM= 8192
##$YMAX_p= 0
##$YMIN_p= 0
$$ End of Bruker specific parameters
$$ ---------------------------------
##NTUPLES= NMR FID
##VAR_NAME=  TIME,          FID/REAL,        FID/IMAG
##SYMBOL=    X,             R,               I
##VAR_TYPE=  INDEPENDENT,   DEPENDENT,       DEPENDENT
##VAR_FORM=  AFFN,          ASDF,            ASDF
##VAR_DIM=   8192,          8192,            8192
##UNITS=     SECONDS,       ARBITRARY UNITS, ARBITRARY UNITS
##FACTOR=    0.0002944,     1,               1
##FIRST=     0,             0,               0
##LAST=      2.4114304,     0,               0
##MIN=       0,             -448812,         0
##MAX=       2.4114304,     423979,          0
$$ Real data points
##PAGE= N=1
##DATA TABLE= (X++(R..R)), XYDATA
0@%%%%%%%%lJ1j6J6k4L2l2M0n6O9q2J01j20J40j64J92k25K65l11L59m12M72n39
31b87O12o96P89q87R97j120J256j404J563j737J931k140K366k617K891l190L516
48A843l872M265m699N176n705O296o958P704q554R533j0670J2010j3625J5608
62H352j8104K1359k5793L2193m2249O0286j01847L50173Q3378q16560O23040P4023
74B48251m65775L24018Q6466l04329J85363k0472o2385R2109j02415o349J27698
85A02180j04132q1014J49772l2224j42972J18031L8561n9893j2993n5956M9046
96c1594J42784j53563l2657J18010j11709N4239O6204q6840J9023k1180L3654
107c629P6861j83580N5535K08236k55969J0859K05328j57313l4654Q7158L145
$$ y = [0, 0, 0, 0, 0, 0, 0, 0, 0, -3, 8, -8, 8, -16, 16, -16, 24, -32, 37, -45, 56, -64, 76, -88, 104, -121, 144, -167, 192, -220, 252, -287, 325, -371, 418, -469, 528, -592, 664, -740, 823, -914, 1017, -1123, 1243, -1374, 1517, -1673, 1843, -2029, 2236, -2463, 2713, -2992, 3304, -3654, 4050, -4504, 5029, -5641, 6369, -7256, 8352, -9752, 11607, -14186, 18007, -24242, 36044, -65803, 284370, 367748, -448812, 174228, 248251, -217524, 106494, 192960, -111369, 73994, 53522, -8863, 83246, -19169, -25518, 102180, -1952, -82966, 66806, 34582, -108390, 9641, 48202, -11691, -24684, -80640, -31594, 111190, -42373, -75030, 42980, -68729, -14490, 51714, -35126, -16103, -37283, -3629, 73232, -110348, -54813, 153423, -102546, -91687, 113641, -43672, -78326, 8832, 11977]
118A1977N188o0734R558N8002p8592J04215K6374j83081J13370O4456r7222P0882
130D4393j110j02949J17077L7150j59225O7296J03927j04169m3321J05276k9568
141C4777o0652J9634K1294N0913j13183o867J50117j69810k4341K84452k31851
152d5517j67444L54198j27801j51943K22493j17116m5477J64709j46153L160J50833
163I3942j66320M8384J21975j71403L6727J28154j24962j4124J33866r2682m0539
174d6982Q2079m9769K8567N5953j29729O648J53909j13715m6012J25101o2882
185C168n2408Q1383Q580q6080K5578Q9835n3452r0833J04064L4880j26895O4263
197B083N1631o5825K522Q070l288J8109n861r505j2063j9083O1397k6125m0793
$$ y = [11977, 17165, -43569, -34011, 23991, -54601, 49614, 75988, -107093, 6277, 70733, -26489, 44393, 43283, -59666, 57411, 94561, -64664, 2632, 106559, 2390, -40931, 64345, 34777, -25875, -6241, 15053, 65966, -47217, -54084, 96033, -73777, -98118, 186334, -45517, -212961, 141237, 13436, -138507, 83986, -33130, -78607, 86102, -60051, -56891, 93942, -72378, -23994, 97981, -73422, -36695, 91459, -33503, -47627, 86239, -6443, -46982, 35097, -14672, 13895, 69848, -59881, -53233, 100676, -13039, -59051, 66050, 3168, -49240, 32143, 40723, -45357, -19779, 70056, 16604, -74229, 29835, 64715, -62180, 2083, 53714, -12111, -9589, -1519, -4807, 13302, 7441, -2064, -14127, -33210, 28187, 2062, -38731]
210c8731N8245m3328m37O4471q0139k0763J27683o9928p5840J10586k1770n0550
222d0501N2174p924j5645L9244n6358J4521P2138r5043L8567P5884j40245K9616
234c3572J51948j40291m1747J47083q0422k8776O2074m9756J9865L3150o4029
245b4473K8682K2263n9071N8143p691n0176N5945j4939l6890M4917k1420j5857
257b0567P3851q3400l6285J35431m9438j02781J06361K9653j17144N4698N2791
268D3170p7834R941O0707l8624m3923N4505J0098l1201J042J0024K321N622k2677
281a6829j3680O5447k6597n3637N3584Q719m2957L2501R213m0357L7471q559j6470
294a2151K8883k9621J1857M5438o1374k0864R4425l8919n1259N3372K537j5186
$$ y = [-38731, 19514, -23814, -24251, 40220, -39919, -60682, 67001, -2927, -78767, 31819, 10049, -40501, 11673, 3749, -11896, 27348, -29010, -14489, 57649, -37394, 1173, 77057, -63188, -33572, 118376, -21915, -63662, 83421, 2999, -25777, 36297, -13459, 6406, 39556, -24473, 4209, 26472, -32599, 25544, 17853, -32323, 23622, 8683, -28207, 16710, -4710, -20567, 53284, -30116, -66401, 69030, 19592, -83189, 23172, 52825, -64319, -9621, 43170, -34664, -24723, 35984, -2640, -46563, 7942, 18040, -13161, -12119, -2095, 226, 5848, -16829, -30509, 34938, 8341, -45296, 8288, 17007, -25950, 6551, 15764, -24593, 12878, 4319, -12151, 16732, -12889, -1032, 44406, -16968, -37832, 56593, 17674, -33585, 19787, 22324, 7138]
306G138j2164j171L9727j7137n2208P4907j4554q8375J07569O338j20963P9307
318H414N3737j14468M3434M6076p7850N6827N467q1072O7785L4169r3930L9263
330a2148N0663p0508J4624L4168k4728j0737K0864R966k3143k0699M0695K4382
342C3399p0663J6245N6681m1918k4300L7712J389j9071J2420q981P422L8p986
355g613K1039r516k0841K4786J7296m1665J1231L3506j6927k0223R213J9271j0889
368H668L90o093k953K1695j1978l1321L6980J3100o2884M7743K0714q1941M2515
381e365N7214q2944p643P8191m4279l1157L9854L865j7224k253N023K676L711
394c31j0413J5230p123j5618K9932o001k5890K2967Q357j9442K4416k7439p897
$$ y = [7138, -5026, -6197, 33530, 16393, -35815, 39092, 24538, -63837, 43732, 50070, -70893, 8414, 62151, -52317, -8883, 37193, -40657, 16170, 21637, -59435, 8350, 42519, -51411, -12148, 38515, -31993, -17369, 16799, -7929, -18666, 2198, 12164, -10979, -31678, 9017, 33399, -37264, -21019, 35662, -6256, -30556, 7156, 8545, -10526, 1894, -7087, 335, 373, -7613, 13426, 3910, -16931, 7855, 25151, -16514, -5283, 28223, 11296, -8927, 286, 19557, 8668, 9058, 2965, 12, 21707, 9729, -21592, 15388, 28488, -34396, 13347, 34061, -47880, -5365, 51849, -31095, -38738, 39453, -4826, -35983, 3871, 7736, -9488, -11741, -6718, -4042, -331, -10744, 4486, -2637, -18255, 11677, 5676, -20214, 2753, 11110, -8332, 16084, -11355, -19252]
407a9252N9348m5763k4760O1846k4305l6346N0520j3126k0481K8775j9394M43
419b495J0944q439P317L436k5100J4431L2672m0883j7086N0487r24n2615L4058
432E803J5611m7436L1095J3529l6452O444K2274j6793q124J3454K989j5618k611
445a5835K0848k1356J1439J4305l8215K0226L0017l1551j2304L0922J751j4425
457d178m95J9189j5742j4111N0985k6727l1550M6116p054k4731K3296o386m756
470C856J1597k9286K2804J7452l7864K219K5264r318k1150K3050k116k8310K7091
483E289J8957m5612O643K9469k4468J6800j0993j7464L7001j7670j9688L2459
495A0723m773k5609J2202J1298K629k7857J1381L1311n0667J4914M6079n1053
$$ y = [-19252, 40096, -5667, -30427, 31419, 7114, -29232, 21288, 8162, -12319, 16456, -2938, -2495, 8449, 10, 7327, 10763, -14337, 94, 32766, -8117, -25203, 25284, 24360, -28255, 5803, 21414, -26022, 5073, 18602, -17850, -11406, 10868, -5925, -14049, -595, 2394, -13224, -15835, 5013, -16343, -4904, 9401, -28814, -8588, 21429, -10122, -22426, 8496, 10247, -4178, -4673, 14516, -1226, -15337, 35648, 8921, -22629, 23487, 16433, -8298, 14998, 8612, 3856, 15453, -13833, 8971, 26423, -11441, -9222, 16042, 6724, -14426, 8624, 6508, -21802, 5289, 24246, -21366, -14723, 14746, -9722, 7078, -3915, -21379, 15622, -2048, -21736, 10723, 5950, -19659, -7457, 3841, 6470, -21387, -10006, 21305, -29362, -14448, 31631, -19422]
507a9422j7138N7511m954m1219J2529K6029j4087j4682L6362k0173k0291M1711
519B2176j7616p322K3356k2900K655K4860k9012R510J8655k8885N047J2708M395
532A7627j9112q345K3448o529p867N645j7676Q938K0494l2016J4536P651l2954
545b6160L0551O648k6992N837J3206l360j1299L507K3529k3564j8056M5611j7007
558B451j7335J9341j3007P260J1460j6380j946R737n698M799M452l150k0480J4463
572d033L6578n2002m05N4240m1223j8919N0857j3711k9918K1876P378m206j2002
585e490J1500L995k1176K0062M951j6235j049r9J1903Q848l2360O339K7649k7297
599h459L137J2767r337o493L341J3690j1261r885J7768m539j4985K5030j0575
$$ y = [-19422, -36560, 20951, 15997, -25222, -12693, 13336, -751, -15433, 20929, 756, -19535, 22176, 4560, -2762, 20594, -2306, 349, 25209, -3803, 5707, 24362, -4523, 524, 13232, 17627, -1485, -9830, 13618, 7089, -778, 4867, -12809, -3871, 16623, -15393, -857, 6794, -26160, 4391, 11039, -15953, -10116, 3090, -270, -11569, -8062, 15467, -8097, -26153, 19458, 2451, -14884, 4457, -8550, -1290, 10170, -6210, -8156, 1581, -4117, 682, 5134, 1984, -18496, -4033, 32545, -19457, -19862, 34378, -6845, -25764, 25093, 11382, -18536, 3340, 10718, 6512, -5490, 6010, 10005, -11171, 8891, 13842, -2393, -3442, -3541, 8362, 17210, -15150, -8811, 18838, -8459, -5322, 7445, -1892, -8385, -5044, 8646, -2615, -12500, 5268, 729, -14256, 10774, 199]
612A99j2674J9011j3232R680R297k4184J819K3990o594j5544P584Q341j0531l147
626e985K4672k3889r769L3337j9491q999K1728j1633r511J8047q814l946R539
639E286q195m620Q477J4102k5417m242K9793j4633j1865K1362j0236j5815K5733
652I730l445j4013L628N874L137j0633N449L751n524l4J295J999L394j0973q86
667g251J9960j6199j708J2693j2917j6J3668k560j5789P259J0595n609p585R437
681C978l649n011J4180j3335P07J3029j3372k196J7358j0228j1957K0183n248
694D439j3081J3289Q411k4306K394K9373k0984j2047K1127m169j3895J6120k189
707D482j4797J2695J522o680n96O775n453j579P994q757M01Q451o271q495J7325
$$ y = [199, -12475, 6536, -6696, 2984, 12281, -11903, -10084, 13906, 7312, -8232, -648, 7693, -2838, -5985, 18687, -5202, -14971, 18366, -1125, -10124, 11604, -29, -9540, 8507, -307, -4253, 5286, -2909, -7529, 948, 15050, -10367, -14609, 15184, 551, -11314, 10048, -188, -16003, 9730, 6285, -7728, -4100, 1774, 4911, -5722, -273, 3478, -2046, -2080, -785, 1214, 4608, -6365, -7251, 12709, -3490, -5198, 7495, -5422, -5438, 8230, 5670, -10119, -2860, 7735, 2126, -5459, 3978, 329, -4682, 9498, -3837, -3130, 9899, -3473, -5669, 11689, 1461, -10496, 9687, 4439, -8642, 4647, 13058, -11248, -8854, 20519, -465, -12512, 8615, 4446, -9449, 6671, 4482, -10315, 2380, 3902, -2778, -3374, 3401, -2052, -3631, 4363, -4394, -3993, 4458, -1813, -10308, 7017]
722G017l041j5830J0794N734o169l079O960n398n32N965l935j351R59R22M59M740
738D215j2189M750J4644j7662l804K0528n725k0582K1994N394k2092J0530J1963
751A1964j7055L91K0903j7845m923J7952q860n316J2608p193j0028K1183q100
764E681j6589J7350O174k0126J790K0255j6827p987J7646j563j7492J0662J1254
777A0228k0336L162J3683p458r334R738J69m681O261q159L089P926q662m271J4186
792E541o385j0327J7308n552r800J0671L597j1749N375N554q189N789j869l165
806c201P413J912j3947P546J4573j9478l58J8338q352j4963K0005J684k1532J2725
820B365J1757j6066n922J9874p622j2573J3095k13r164N000L533j0967Q367L278
$$ y = [7017, 3976, -11854, -1060, 4674, -1495, -4574, 2386, -3012, -3544, 2421, -1514, -2865, -1906, -984, -525, 4215, -7974, -3224, 11420, -6242, -10046, 10482, 4757, -15825, 6169, 11563, -10529, 1, 11964, -5091, -4700, 16203, -1642, -6565, 11387, 2527, -2789, 9819, 2626, -7402, 13781, 5681, -10908, 6442, 12616, -7510, -5720, 14535, -2292, -10279, 7367, 5804, -11688, -1026, 10228, -10108, -6946, 6737, -721, -10055, -317, -148, -4829, 1432, -6727, -3638, 4288, -4374, -8645, 5541, -844, -11171, 6137, 585, -9215, 1456, 5053, -6696, -1321, 4233, -3956, 1833, -36, -3201, 4212, 6124, -7823, -277, 14296, -5182, -5540, 12798, 4446, -10517, 9488, 11172, -10360, 2365, 14122, -1944, -7866, 12008, 4386, -8187, 4908, 4695, -4469, 531, 4064, -6903, 1464, 4742]
834D742j2485M522Q580q908n892J7091r630j0576J9536k965j7904J4703R043k0202
848a0345Q767N873p700L814m79j500M500j118p243R932j584p641P216K232q918
863d194J799J1808j2244j497J0058n010k609L272l81k650M469k528j303M0N121
878D151m325o501J5528r062r802J7326l523j6719J7984L087k1853J2861R983j3522
892d387n429J5527l880j2451J4514j439j1572J0502M028j3477R822J804r531J0311
906D342k648m432M771K184o075J887P481o613l736P712N38q492Q963l956m622
921b696R499o813L32K259m617L531K685q415L893K316m066L046n729Q211m645
936a209q765J6164m973j3436J5849L54j8385J7367M155j8654O653J2771j0751
$$ y = [4742, -7743, -3221, 5359, -3549, -9441, 7650, -1980, -12556, 6980, 4015, -13889, 814, 9857, -10345, -1578, 4295, -3405, 409, -70, -1570, 2930, 1812, -5431, 4501, 2917, -4724, 2492, 4724, -4194, -2395, 9413, -2831, -4328, 5730, 720, -1889, 1383, 1002, -1648, 2821, 293, -1010, -970, 4151, -174, -6675, 8853, -209, -10011, 7315, 3792, -12927, 5057, 8144, -13709, -848, 9135, -4387, -9816, 5711, 1831, -10620, 3894, 2455, -9117, 1385, 5413, -8064, 1758, 3562, -5969, 4342, 1694, -2738, 2033, 4217, -1858, 29, 7510, 897, -2839, 4873, 5411, -3081, 5882, 1926, -2696, 6803, -10, 322, 2581, -2036, 1495, 4180, -4235, -342, 1974, -2092, 954, -4775, 3436, -1209, -9974, 6190, 1217, -12219, 3630, 3984, -14401, 2966, 7121, -11533, -4880, 7891, -2860]
949b860p429J8449j0123r132K0169p253j4067J8034j603j4053J5762l327p386
962d819O190P03K44m562M832J346q041O216O720j3383M669O591j0026R048l503
977B225n561P735j780l091K566n31k425J185J928J414r992P662M182j3412J0860
992B965P11j0082N916K719n389M602k492m968Q281j96n829j070J0868r106o542
1007i612K2431j4286j5276K7852l909k3698K2755J354j8784J2139M482n294n548
1020e394N610M875r182L224P124j1349J642J2250j2961K677N484q340M038N507
1034E205n534o466J0871Qj0085Q159L972j4078Q034Q625j5763R467O46r255J1513
1049E319k975o729P989k796n131R451l329m430P12M701J507r180P711n73p876
$$ y = [-2860, -10289, 8160, -1963, -11095, 9074, 1821, -12246, 5788, 4185, -9868, 5894, 2567, -4819, 1371, 2074, 2318, -2244, 2588, 3934, -4107, 2109, 8829, -4554, 115, 6706, -3320, 5728, 2225, -3336, 4399, 2619, -472, 2094, 1563, -862, 323, 2251, 3665, -6327, 1335, 5517, -7895, 2965, 3676, -6406, -490, 2229, -3160, 1442, -1050, -6018, 2263, 2067, -3762, -4832, 6036, -3070, -9612, 12819, -1467, -16743, 11109, 7200, -16498, 6257, 7611, -11173, 966, 5448, 154, -5394, 216, 5091, -4091, -867, 6257, -5092, -3450, 8800, -4161, -1484, 4000, -4340, -302, 5205, -329, -6795, 4076, 4084, -6001, 2158, 6130, -7948, 86, 8711, -7052, 2415, 3061, -6194, 5319, 2344, -4385, 3604, 808, -4323, 5128, 1799, -2631, -1919, 2782, 4289, -4891, 2820, 2247, -5629]
1064e629J0184o04j0736R602N20j0322J2057k023r297N741N831o594m615J2292
1078F407n672j0690J4247M459j8986P061J1933j2964J45P756k357r106Q424O750
1092G407j4230L563R353j0284J545R870j3715N370O569j2329R490J700j0447N957
1106a81N039p397L264Q48m547M544k18q86j480K301j791M28M756o909k08O125
1122C688k337m871O417j190m999L580K975j712p025Q616J1r481R747J450j3143
1137h274Q575Q349j5394O291O216j0286K746P780o168o414J0777q39q753O516
1151A122M722j1332L467R803j1577J661O196n635r59N852k606m226M933j380k07
1166a66M46r93j465K902J4l662M842l953o21M983k474l455M225N51m678L829O00
$$ y = [-5629, 4555, 3951, -6785, 2817, 3337, -6985, 5072, 3049, -6248, -507, 5324, -1270, -5885, 6407, 735, -9955, 4292, 8751, -10235, -3174, 8759, -4205, -4060, 3696, 1339, -7767, 657, 7407, -6823, -3260, 6093, -4191, -2646, 7224, -6491, -1121, 5448, -6881, 2609, 4309, -6138, -181, 4858, -2539, 725, 1573, -2974, 1570, 1352, 466, -1014, 1287, -504, -76, 4680, -2229, -2437, 3688, 1351, -3520, 2897, 1707, -3292, 288, 3263, 1551, -5474, 3142, 3153, -6328, 3419, 4869, -8274, 301, 8650, -6744, -453, 5763, -4523, -1777, 6003, -165, -6579, 4198, 3359, -5394, 1122, 5844, -5488, -2021, 7782, -3795, -2134, 4062, -1573, -2532, 3320, 714, -3512, 1421, 41, -166, 280, -713, -2178, 724, 738, -2924, 1918, -2035, -2656, 2327, -147, -3602, 623, 1174, -3504, 325, 925]
1183I25k014k420N081Q86p303O763J029q108N590O633j2955L976J0127j2402K516
1198a676R391r521l360J3773p079q486J3285k499r942Q393M821j2209M309P150
1212F350q253K17N385k325n186O284m5m741K496J211k869J207K983o519L454K783
1228B432n287J456K998l520j128N375m272o67K929j451j154J760Q25l672L863
1243D87o84l095M244O57o162L366P249j0316J344R263p390m107J1147k933j0101
1258g031J1826k65r379O544M008r002L320N709q602K954L862m927q45N720k563
1273A329n390O335O84n688J162O526p036j856R271n666m073O651J87o699N300
1288A037R14n059L941l44k661K689J422o059N083K011p356M395K754n534J076
$$ y = [925, -1089, -3509, 1572, 2458, -4845, 1918, 2947, -5161, 429, 7062, -5893, -1917, 8210, -4192, -1676, 7715, -1806, -5166, 8607, 1528, -6958, 6327, 3828, -6114, 2279, 7100, -5109, -800, 6350, -1903, -1686, 3699, 1374, -3812, 2472, 2427, -2314, 182, 1393, -1476, -269, 2714, -3805, -351, 2432, -2855, -1399, 1599, -1921, -3049, 2326, -1946, -2613, 316, -1135, -2289, -529, 296, -3376, 487, -197, -3292, 952, 1609, -4553, -1187, 6062, -4254, -2910, 6353, -1037, -5144, 6003, 3070, -7031, 4795, 4530, -4849, 1695, 5703, -3299, 21, 5730, -2872, 82, 3944, -983, -1828, 3892, 1329, -4061, 2274, 2958, -2730, -1568, 4958, -2078, -3934, 5337, -329, -4402, 2249, 2436, -4263, 1037, 1951, -3108, 833, 489, -2172, 517, 1939, -4120, 963, 2974, -4382, 13, 2767, -2767, -1691]
1303a691N345n586m68N176l367o52K260p6l691M969p61n120N830Q28p145L916
1319b33O078j0280K709P385p913j311P017k031o825O953J527o708K088M478m772
1334a838r06O096n469k8M577l060j869L945P6m966M857R23m674J953M479o087
1350a991M76O867p654J264M549m236M97L148l908O80L513m627J340J560j289j160
1366i71K302M11m509M126N99m234K282K847n469J902L709n372J571K381k082k245
1382b752M384L57o658M968L164p536J668P408r331R95Q359p692p19N473j719m026
1398c657M151J511m855J692L568l852q73O317o182N13N732n528O90L152k917k58
1414g96L775l307l27K431m27j787O88K688n388K967L222o297K307L767n429R06
$$ y = [-1691, 3654, -1932, -2400, 2776, -591, -1243, 1017, 941, -2750, 2219, 1458, -3662, 2168, 2996, -4149, -233, 5845, -4435, -1726, 5659, -2254, -3565, 3452, 1421, -5404, 1549, 3076, -3632, -1544, 2934, -1838, -2744, 3352, -2117, -2145, 2432, -628, -2497, 1448, 1524, -3442, 1415, 2338, -2336, -383, 4096, -1991, -1515, 5352, -2302, -1038, 3511, -725, -228, 2920, -988, -308, 3205, -1422, -82, 1478, 189, -971, 1331, 1742, -2767, 1359, 1958, -2276, 6, 2853, -2616, -714, 2995, -2377, -806, 1575, -507, -2752, 1632, 1989, -4669, 299, 3463, -4073, -2405, 5003, -4328, -3333, 5026, -2666, -3385, 2088, 369, -3657, 494, 2005, -2850, -1158, 2410, -1442, -2315, 4002, -2180, -1667, 4065, -1463, -773, 2379, -538, -796, 2979, -328, -655, 1776, 1349, -438, 250, 2938, -2450, 517, 3739, -2558, -251, 3516, -1913, -1007]
1430a007M688n524J280K188j771l1L14J071l506K909K323n872K351M639p767K165
1446a550P564j0214J714P222n593k945N961N8p055M523M224o932m44Q015o517
1461a969j366P821o727l33M699k735r11K483j376j383K384N27j981j061M796l969
1477a101n76N369n940Q81M318m274L22L940m587Q47L559l270q4R50J280l665K310
1494B79L719o954J651O202n815j416O799o016j06N233m028n25K100Jk886K769
1510A007J542n344K330M823o704j85Q251q774n41Q513n084l564M842Q84m556J994
1526e66K702l442j808N350j774l807N258l144l65L522l142j47K534k159m63L332
1542A881k174j266J213K112k187j025M050m319P36M179m132r05M848l964m60M952
$$ y = [-1007, 3681, -1843, -563, 1625, -146, -177, 137, 1208, -2298, 611, 2934, -2938, -587, 4052, -3715, -1550, 6014, -4200, -2486, 4736, -857, -3802, 2159, 2217, -4838, -315, 3909, -3023, -3467, 4548, -1969, -3335, 4486, -2241, -2574, 2125, -610, -1521, 962, -414, -1797, 587, 1114, -867, -1928, 2868, -1101, -1677, 3692, -2248, -1367, 2951, -1323, -1001, 2939, -1648, -801, 2758, -512, -596, 354, 1634, -2031, 279, 3998, -2956, -1305, 4897, -918, -2334, 4465, -1551, -1657, 3576, -452, -977, 1123, 1124, -1762, 1007, 2549, -2795, -465, 4358, -2346, -2531, 5720, -3054, -3595, 4918, -166, -3730, 1112, 1996, -2560, -566, 2136, -1306, -3114, 2236, 462, -3345, 1913, -1231, -1596, 1926, -1216, -1363, 1171, -988, -1451, 1881, -293, -1559, -346, 1766, -421, -1446, 2604, -1715, -979, 3200, -932, -1837, 3011, -953, -1413, 3539]
1558C539m812k33L221m88k937K077K185m838J496M239m336j808N903l699j780
1573b271N707m210j181L524l67k981K515Q27l594K170K773m127j123O003m260
1588e95j972N750l336k289L734j16k750K063p5j169P02P06n96j603K725j966L87
1605d00K317l470J43L663k453j924M154k584j242L449r83k630J499K206l851J647
1621d59K574m208K28M147l297j468N186m036j140M431j617k805K553J555l627
1636a983K105J903l295K41L950l073j850M925l241q44L604j143l019L060P30l467
1652a397K582P90k629j72L212k361j227L308k960l6K820j642k116L196o52k616
1668a900L250q15k333J574K028l438P76K739l563M75K999k324j662L951k600j370
$$ y = [3539, -1273, -1506, 1715, 1227, -1710, 367, 2552, -2286, -790, 3449, -887, -2695, 3208, -491, -2271, 3436, -774, -1955, 1569, 1202, -1779, 736, 1563, -2031, 139, 2912, -1215, -2338, 3665, -595, -2567, 3183, -153, -2442, 1292, 1176, -1574, 489, 414, -755, -53, 653, 57, -1546, 1179, -787, -400, 1917, -1553, -1410, 2253, -200, -2124, 2030, -554, -1796, 1653, 670, -1960, -461, 1745, -2106, -459, 2115, -2093, -1865, 2282, -1015, -2483, 2703, -1333, -2473, 1958, 341, -2464, 89, 1644, -1983, 122, 2025, -1270, -1029, 2921, -152, -2002, 2923, -318, -1162, 2442, 1299, -1720, 1340, 2070, -1397, 1185, 1975, -654, -826, 2386, 25, -1202, 2106, -854, -890, 1930, 288, -1828, 1368, 716, -1900, 1350, 535, -1798, -224, 1804, -1634, -858, 1881, -1682, -1207, 1792, -532, -2194, 1757, -843, -2213]
1684b213L888k163k134L051R35m182K563K068m261J513K985k852j887M907k014
1699B04k401L745o16k537K273J452l695K169J321l183J223K555k910j315M705
1714B990k971j553L970j644k915L258Q77m231K681Q05k238P79J526k201j30K719
1730A722k877L73K749k554j211L553j133l036L948o19k727K176J307l247N63K811
1746A798k811L60J764j644r17K809j644j758L669j887j722K740N96l573K072K195
1762B047l790Q57K766k034k065M241j351k843L667r05j923K016M21k939K364R28
1778A457l034J509J424k244n07L676k914j309L843j750j852K632K10k861K383
1793F63L5j524J142M06j128K9K160k487J57K381j972r13K755r81k664L372o13
$$ y = [-2213, 1675, -488, -2622, 429, 1364, -2818, -255, 1813, -2448, -935, 2050, -802, -2689, 2218, 204, -2197, 1548, 932, -1605, 668, 2120, -1575, 594, 1915, -1268, -45, 2510, -400, -1715, 2990, 19, -1534, 2436, 792, -2123, 1135, 2012, -2219, 462, 1267, -971, -192, 1334, -867, -997, 1722, -1155, -782, 1967, -587, -1798, 1755, 622, -2414, 1534, 915, -1812, 364, 1671, -1576, -1013, 1798, -1013, -653, 1111, -533, -1450, 1359, -285, -2043, 1626, -261, -1983, 757, 1353, -2220, -148, 2047, -1743, -886, 1880, -154, -2219, 2022, 671, -2172, 1495, 590, -1333, 683, 1104, -1835, 529, 1457, -1577, -68, 1356, -888, -1395, 2281, -633, -1942, 1901, 151, -1701, 931, 1141, -1720, 663, 698, -826, 316, 722, -406, -377, 1783, -704, -547, 1834, -138, -1051, 1704, 723, -1941, 1431, 818]
1810H18k160J873M83j797K93J884k308M33J749j682q13K741j736j943M059j975
1826h1j832K928l73k625K315J259l411J253J774j829q63K721j302j945L505j658
1842a64j235K271o46j749K090j20j811J764k6j022J2J918j631r37K970j765j249
1859a330K520o55k149K956m98k370K560k28j393L52J790j995k46K258j601q81
1875i10K338j021k068L606j420k179L225j520j330K304R0k619J744J138k237J88
1891f71K126j499k196M241k044j958L366r48k159K340J91k471J704M82j290J31
1907f55J197p05j586L191j569j775K976r80k027K763l48k586K997m50j508J114
1923D9R05j598k81K602k101r16K955j313k282L978r91l291L679m91j870J326N35
$$ y = [818, -1342, 531, 1014, -783, -490, 1394, -914, -481, 1268, -414, -1227, 1514, -222, -2165, 1894, -81, -1913, 1015, 642, -1983, 332, 1591, -1820, -567, 1207, -622, -1485, 1236, -66, -2011, 1494, -164, -1399, 872, 226, -1523, 567, 447, -1364, 400, 374, -648, -636, 1282, -349, -1286, 1684, -81, -1330, 1190, 535, -1614, 1342, 844, -1526, 1034, 806, -587, -235, 1555, -440, -686, 1572, -29, -910, 1428, 407, -1661, 1945, 525, -1654, 1571, 51, -1279, 1025, 1115, -1504, 240, 1378, -859, -671, 1455, -44, -2240, 2001, -43, -2001, 1365, 417, -1742, 598, 789, -1682, 22, 504, -786, -655, 542, -163, -1749, 1442, -127, -1902, 1074, 94, -1933, 830, 482, -2104, 893, 443, -1065, 49, 954, -644, -925, 1677, -424, -1340, 1615, 302, -1980, 1998, 1007, -2284, 1395, 904, -966, 360, 895]
1940H95j519M66J335j219l23J130n19j264K706j624j691L728j963j778K896l54
1956I02k684K220J041k197r1J895q24k298L245n80k835L157l49k233J900N07k600
1973a824K445J64k140J308O96j219m50K583j938j423L060q11k291K627O8l186
1989b331L340k18k065J684K23j191L3J837j730m02K012n70k053K388L7k854K941
2006A081m3k308J646M54j513P60J004j606M00O22m46p26J620q80j479L101j272
2023D15k171K701O8k681K039J016k603R93J233r62j084J974m92j761K485q47j401
2040a078J544J42k007K368m39k129K017L55j492J27J541j472n89J855p42j231
2056a230J329N94k052J989l1j931J682K71j208K24J053j610M89J471j365o37J450
$$ y = [895, -624, -158, 1177, -42, -365, 765, 246, -1018, 1688, 64, -1627, 2101, 138, -1640, 1256, 902, -1782, 438, 1479, -718, -809, 1086, 262, -2036, 1209, 629, -2206, 951, 602, -1631, 269, 776, -1824, 621, 785, -1355, -47, 649, -570, -1020, 1563, -375, -1798, 1262, 451, -1840, 787, 855, -2331, 1009, 791, -1274, 410, 633, -558, -525, 1312, -418, -820, 1192, 622, -1431, 957, 994, -1860, 1081, 1038, -1270, 376, 830, -683, 77, 1081, -525, -125, 497, 51, -675, 945, 65, -1414, 1687, 415, -1756, 945, 1013, -1668, 371, 1387, -1216, -223, 1010, 48, -1036, 938, 446, -1315, 1170, 323, -1078, 466, 608, -1399, 969, 530, -1599, 418, 773, -719, -592, 949, -523, -1112, 743, 1, -1230, 99, 693, -1359, 630, 599, -1332, 350, 621, -587, -363, 690, -920, -431, 1040, -325, -962, 488]
2073D88r7j741K548r64j598K047k69j391J225P50k185J552N32j525M51J218r04
2090A37j167K637j237j542K348o5j979J401Q14k600J906N47j739L85J126r91n20
2107e39J648j347p14J694k24j667J654K50k139J899K2j349M91J033j424K2J611
2124I21j635j96J375l50j422J923m37j898K320l56j543J294J016k158R49J237
2140A040k121P05R70p60j014K264j131j241K427q20j387J480R44k559J567R88
2156A352k136M86J595j138j002K067r07j149J963m55j672J507N62k298J725O29
2172A129k225R36J189j586j78J939j540p11J877m49j580J514M11j918J603J84
2188E95j506J073O60j619M12J575k181M56J586j299j072K074m45k019K436k46
$$ y = [488, 391, -1350, 1198, 234, -1364, 683, 414, -977, 248, 998, -1187, 365, 897, -628, -177, 1041, 137, -1030, 1607, 370, -1172, 1176, 1111, -868, 533, 1347, -1253, 653, 1200, -539, -154, 972, -19, -539, 1109, -238, -952, 742, 518, -1149, 505, 755, -1384, 515, 537, -812, -321, 712, -712, -690, 921, -714, -910, 465, 115, -1307, 616, 179, -1719, 601, 245, -1298, -4, 1012, -1146, -197, 1040, -1081, -376, 594, -166, -1180, 1084, -47, -1288, 1139, 319, -1068, 412, 1356, -1203, 364, 1352, -784, -298, 1297, 159, -843, 1224, 317, -832, 1131, 676, -996, 511, 1073, -1225, 500, 1129, -1096, -160, 1029, -557, -735, 1204, -336, -1047, 830, 381, -1199, 315, 726, -1192, 411, 595, -911, 162, 822, -797, -385, 1190, -991, -535, 1051, -248, -1320, 754, 309, -1710, 726, 480]
2204D80j711J131R80j801O15J206j736O54J084j288m73J765p69j405K297n92j527
2221a090J471Q29k500J336J337k393P87J347j147o54J663r30q84J650p72q90J437
2238E97Q7j760J526M84j921J161N64j154k31J780j412l90J583p84r22J067M01
2255F76j699J547O2j421J212L07j284M88J164k070Q11J294j283n87J449m80j521
2272a335J941q2j605J248O03j744O87J117j988J012Q43j175j39J271o34j173K029
2289H76p17j129J391L29j838R58J121k195J379M63j215K90J071r06m87J464r70
2306a15l60R90J68j684J420M89j932J498L27j438L36J400j508K52J157j196K0
2323a76N72%j241J545k86j622K013k65j669J206J008k091P99J142j562K03J010
$$ y = [480, -1231, -100, 880, -921, -306, 900, -836, -182, 902, -386, -859, 906, 137, -1268, 1029, 437, -1090, 381, 1210, -1290, 46, 1383, -1010, -223, 1124, -23, -677, 986, 56, -828, 822, 50, -840, 597, 684, -1076, 450, 934, -987, 174, 738, -416, -647, 1133, -279, -669, 914, 130, -792, 275, 676, -1023, 524, 586, -835, 377, 684, -600, -112, 1052, -1018, -207, 1087, -196, -783, 666, 186, -1335, 606, 524, -1081, 167, 770, -974, -287, 830, -1158, -146, 697, -478, -617, 654, 20, -1153, 876, 159, -970, 421, 750, -1088, -130, 991, -1204, 175, 638, -577, -287, 784, -122, -609, 855, -115, -475, 515, 683, -1001, 419, 908, -1024, 474, 801, -637, -301, 1099, -409, -157, 1000, -196, -176, 396, 396, -845, 700, 414, -1208, 805, 540, -1129, 77, 1085, -1006, -207, 935, -627, -424, 586]
2340E86n39j125J584j14j487J561K6j539R28R88k105J196O75j517N90P65p70m63
2358g60J538q87q31J393J8j590J415P26k489J951K99j886J159P48j224j04J533
2375A009j035n02J041q4j096J118N75j936J536J05j475J079N62j597P32J176j931
2392g23P09Q79r64o09J619k80j816J865J01k030J516P47k076J007J155k026O78
2409b48Q39q83m40J329m36j388J665L4j569J213Q14k246J245R69k063J146M67
2426D48r95j05J444r33o87J551o37r23J046N54k116J700P04k179J224Q97j515
2443e22J73J409j316p7Q42n11m03O93L64j508J278J85j684J569M28j730R77J170
2461A337k255O99J239j362j90J355m16j533J615L17j684P93Q88j537O30J174j895
$$ y = [586, 47, -1078, 506, 392, -1095, 466, 492, -1047, -119, 869, -1236, -40, 635, -882, -292, 473, -297, -760, 778, -109, -940, 453, 471, -1119, 296, 1022, -1467, 484, 783, -1103, 56, 804, -420, -524, 1009, -26, -528, 513, 429, -667, 451, 1026, -910, 626, 731, -744, 335, 897, -700, 32, 1208, -723, -14, 865, -99, -708, 911, 631, -1185, 680, 781, -1249, 267, 1014, -1062, -55, 1100, -926, -248, 591, -292, -732, 597, 161, -1227, 438, 472, -1097, 116, 930, -1316, -71, 898, -1165, -19, 448, -547, -652, 792, -141, -828, 723, 86, -837, 209, 763, -1353, 347, 1051, -1128, 96, 993, -522, -349, 1060, -256, -333, 509, -2, -405, 288, 652, -856, 422, 607, -1077, 492, 920, -810, 167, 1337, -918, -219, 1020, -342, -532, 823, 407, -1126, 489, 806, -878, -85, 803, -734, -104, 1070, -825]
2478h25P34P05j102J92R33o07p37J237k46r41P18P76j847Q61J066j954J051N78
2496E92j075K99R36j229j18J221q89l31Q89J01j355J022O65j715J135M20j311
2513g43L65J158j404J14J177j126K66O73l41r02J333j77j491J515K58j491P95
2530b1J353k222P00J072j238l8J119n47j066J472j06r95O87O87j362N78Q34j690
2548g83J041O23j530O41O45r09k01J202o80n66R45j37p85P53L94j753J277L46
2566E23j181M97P29j365L29J194j218j18Q96l15q61J044L85j629J375N2j103N76
2584a90P76j362N12J178j698M72R09n65q14J404k96j136J389n6j138P81P60j402
2602d76M71J136j593L79Q14p39n40J304n47r03J398l86p49Q00K73j451R44O78
$$ y = [-825, -91, 614, -488, -296, 637, 30, -707, 530, 284, -657, 61, 837, -1010, -149, 917, -1037, 14, 592, -483, -184, 752, -477, -595, 626, -263, -594, 295, 396, -959, 63, 728, -987, 148, 568, -743, -378, 780, -624, -510, 667, -459, -193, 480, 139, -763, 570, 393, -1098, 417, 675, -816, -21, 1332, -890, -190, 882, -356, -394, 725, 178, -888, 584, 478, -517, 170, 857, -505, 73, 907, -783, 258, 881, -649, -8, 637, -272, -473, 729, 49, -517, 428, 291, -494, 259, 653, -1100, 177, 523, -658, -161, 568, -797, -468, 726, -492, -610, 286, -29, -890, 154, 539, -1090, 285, 337, -766, -190, 586, -776, -264, 914, -784, -312, 597, 32, -782, 622, 326, -810, 579, 523, -615, 166, 926, -476, -5, 1131, -462, -83, 731, -8, -548, 756, 209, -694, 704, 318, -431, 369, 642, -809, 135, 813]
2620H13j549M89J016j124j38J372j205m02J505q04n79P28L53j431J185K87j401
2637h85Q57N92j018O8J224j521M7J316q49n44J189j04j296J299R7j302R69M48
2655E87j291M52J203j641L77J022q60n22J252j94j143J247j47r62P42N97j232
2672e13L62R82j428N19Q81j084k31J115p13o47J500p00n68P51L29j261N51R13
2690G58j508Q26N57j067l6J408j168l35J326q94l16P14Q3j086R78L83j530Q78
2708b9O74j106j36J389j252kJ343j138j22O99j87j049J265j4j069J032J30j001
2726e73K99J007j420L87J046j135l6Q22k27r44J306j21r91P82L18j087N22P68
2744G23j301N16R41j178j80J179r52l72J480q36n61J031l5q49M87O41j392O02
$$ y = [813, -736, -247, 769, -355, -493, 879, -326, -728, 777, -27, -606, 122, 475, -956, 229, 516, -885, -28, 564, -454, -386, 838, -683, -636, 680, -169, -713, 476, 372, -924, 375, 472, -830, 139, 587, -704, -252, 951, -690, -313, 709, -151, -673, 579, 385, -758, 489, 342, -620, 122, 719, -513, -151, 831, -597, -78, 803, -281, -512, 603, -110, -757, 743, 43, -525, 226, 555, -706, -155, 758, -750, 76, 633, -434, -470, 938, -230, -565, 761, -133, -449, 265, 348, -738, 240, 623, -907, -29, 645, -461, -597, 792, -460, -462, 881, -257, -379, 320, 133, -916, 349, 335, -734, 298, 428, -573, -274, 733, -687, -300, 746, -389, -425, 397, 170, -774, 532, 411, -580, 202, 520, -567, -45, 723, -578, -62, 879, -299, -479, 700, -252, -624, 856, 20, -541, 490, 455, -394, 93, 734, -658, -56]
2762e6O14j000J88R18r83L3J210j168k18J145m89r06J098O1j225Q74M73j030P3
2781c88J197j257Q7J024j117K22O89n67l27Q16k78r00Q87Rp05L75R76j465L31
2800c91J003j153J82P62n68m37J262p36o90J142l44m69N16O26j339N73P55j100
2818d06K43R02p57m00J286j089k56R79n20j95N27N5r11Q39J99j109P19O04j085
2837c75J4J382j398j27J245p33n31R52N6j300J240J12j062K90R04j087O6J058
2855G06j444N23P66q23k42J043o31n99J203m74o46N56O73j389M67J153j524L89
2873b93R97r38l42J239p01p71J247k71n08L91M61j254O58Q53j303L72Q81q33l63
2892d78J278r23j50J113j014j49P85q4q32Q83J95j156O74P39j331m7J610j361
$$ y = [-56, 558, -442, -254, 664, -319, -286, 924, -244, -462, 683, 194, -712, 386, 447, -778, 96, 569, -461, -388, 809, -448, -361, 663, -454, -232, 457, -110, -437, 379, 101, -799, 88, 97, -608, -233, 743, -722, -391, 612, -541, -359, 403, -165, -602, 660, -76, -766, 376, 32, -437, 79, 705, -634, -61, 694, -406, -163, 739, -18, -418, 868, -221, -477, 502, -18, -213, 314, 369, -542, 297, 496, -613, 106, 710, -375, -361, 1021, -377, -504, 741, 8, -523, 429, 485, -815, 425, 537, -525, -235, 669, -418, -352, 706, -738, -215, 551, -272, -514, 529, -102, -701, 502, 28, -618, -62, 611, -778, -311, 842, -682, -293, 704, -234, -576, 663, -38, -809, 438, 167, -341, 50, 511, -743, -85, 768, -535, -163, 718, -115, -478, 800, -123, -273, 840, -174, -323, 462, 378, -454, 429, 624, -532, 142, 881, -450, -497, 1113, -248]
2910b48j78J136q05l72J095m22r29J062p3p65O57K31q29O7J109j422L68J156j360
2929e22J19R00n12q16J344n58n75O62M96r67J52J038j464M22J005j075k73J305
2947F81n68o99J246o35n62Q50n6q37P04K27r12M06N15p61J14J115j222NJ335j269
2967c23j70R97l41r15J101N7q95O68J34m44m6J004j088j31J216j125K27O60n41
2986D5o73J128j80p84P10J89o97J31Q03j150J88J056j087j40R35n36o97J332o82
3005a09m04Q10n7o45K81O02j075L86O67r59K39P14n02o73J250o86l84R31o08l90
3025f12P34Q9r84P29M24q79K88Q57r62M9J004j008j79R80n48n18R47j32p92P03
3045A90L7p45O67M06q94O6J130j088j00J112q85m15J134l34r84J363m41o64P03
$$ y = [-248, -426, 710, -95, -467, 628, 206, -723, 339, 266, -499, 158, 389, -440, -373, 736, -686, -318, 838, -522, -403, 497, -15, -831, 513, -45, -620, 42, 538, -429, -277, 761, -703, -281, 724, -351, -624, 681, 113, -586, 660, 25, -537, 313, 257, -580, 124, 351, -561, -155, 360, -401, -287, 828, -394, -389, 946, -323, -493, 504, 163, -752, 349, 406, -489, 179, 313, -131, -177, 827, -261, -392, 824, -301, -74, 586, 45, -628, 500, 320, -464, 246, 435, -262, -131, 672, -478, -290, 766, -321, -461, 474, -62, -759, 573, -109, -513, 297, 240, -405, -124, 478, -597, -211, 456, -503, -264, 450, -52, -725, 525, -161, -545, 386, -222, -612, 122, 211, -773, -44, 380, -499, -211, 646, -316, -267, 737, -271, -450, 530, -18, -536, 411, 279, -513, 190, 227, -518, 149, 555, -339, -273, 857, -231, -331, 781, -104, -519, 615, 281, -703, 660, 219, -445, 258]
3064B58K62q53K11P79j044J67P74p20l81J018n83o06J294o53n07P68J62j004N79
3083g9M16r38M12M32m10l05R86r14k46J224q94j63P29Nj063J116l4j065R13M42
3103E64r56R9J182j244r2J207p69m04P78j13q93J025Pq98Q67N8q55M05Q80j079
3123b31O0R52r68k48J105l41r95J220l80n80P51J51r74M42O45j042N63K91m75
3142e4l04R08o23o13J267q49j35N08J89q57P01L86j274N84M45o25j43J078q86
3161b97k68J143o52m05P92Pj096J178J52j247P22J72o20J3R96j144J1J098p15
3180a60k17P24k18p97J119j87r80Q23L30o98K79O55j150K60P90n20j85N83m39
3199A2n21J108m78m85P88j60o47L86L63q07N12L64o33M3O67l99n57J161p20m64
$$ y = [258, 520, -333, -122, 657, -387, -220, 554, -166, -547, 471, -112, -718, 576, -77, -584, 184, 346, -658, -79, 337, -601, -189, 243, -167, -472, 514, -400, -646, 578, -316, -479, 250, 255, -808, 308, 274, -791, 122, 564, -392, -293, 889, -355, -447, 760, -9, -413, 365, 252, -641, 384, 391, -507, 360, 418, -437, -32, 848, -231, -171, 781, -187, -435, 670, 329, -666, 554, 174, -406, 345, 496, -478, -36, 609, -433, 130, 421, -54, -358, 550, -73, -686, 581, -268, -403, 105, 294, -563, 138, 524, -750, -166, 279, -346, -489, 589, -297, -565, 578, -74, -479, 313, 320, -776, 402, 554, -693, 29, 201, -419, -406, 590, -554, -543, 555, -160, -377, 347, 129, -668, 451, 264, -716, 107, 437, -261, 18, 673, -477, -217, 573, 53, -132, 451, 12, -509, 599, 121, -364, 424, 264, -383, 3, 366, -441, 71, 435, -198, -155, 512, 113, -444, 717, -3, -467]
3219d67R46m83m77O09J47r82R64K5n74P2O36q28j27J058p45l27Q58j64q33J003
3239C11n8r43J084l31n52K35O09p93O9R76r51K1N84n0j010J187j45q04Q15n2l98
3260a96K02K98n94K29N97r09K54M89k83m49J086p45l77J081o41m42O07L29q07
3279b71M08M34p77J70M90m55m15J097p76n46J127m70n47P83M1r24P31K53q09L00
3299a56L87n32j33R63q46k26J128q01k98P43j37q18R99j77p29O06L50q60L36P00
3319D99q76Q0P39o48m19R58j13r31J180l41n70P13M8o35L36O02j070L05P98p86
3339a31j42R93n75q08J506q25n53R19kq32Q60J60r55N19M03n41k84R92q44m28
3359e68J087n13m09P92k27q66J214r3r41O87J73p35J92P57q70j95J105p38m14
$$ y = [-467, 479, -4, -481, 128, 275, -707, 257, 282, -292, -220, 416, -412, -539, 519, -226, -553, 305, 141, -692, 311, 253, -690, 394, 63, -489, -254, 355, -438, -369, 607, -344, -323, 261, 211, -799, 388, 243, -561, 254, 202, -196, 6, 304, -290, -61, 536, -373, -119, 370, 87, -362, 724, -21, -398, 683, 42, -400, 207, 536, -271, 137, 571, -206, -36, 454, -1, -416, 681, -95, -641, 486, 16, -531, 252, 293, -631, 100, 353, -456, -156, 231, -301, -434, 529, -317, -543, 585, -216, -514, 229, 92, -726, 273, 96, -633, -27, 323, -537, -201, 499, -377, -297, 442, -206, -625, 333, 220, -711, 469, 128, -442, 271, 319, -316, 20, 622, -448, -143, 655, -131, -273, 720, 145, -663, 843, 18, -535, 384, 382, -450, 410, 570, -385, 134, 537, -4, -288, 704, -140, -568, 519, 6, -403, 389, 162, -704, 510, 417, -524, 163, 336, -399, -207, 550, -320, -515, 590, -148, -562]
3378e62R38k41q72J039o8q66Q60K14p51J83O17r16K08P04m93l19Q46m79o89J261
3398F14o20m51O89j24n98N84M23r53L90O01o53p6P44o66n25J305p14o19J103j43
3418C11r57R40K96j130O15L42n19k0O12n43l17J014p61k73Q04j62p35Q48k05q28
3438f68R50k8n36N0Q07q47k7O71n36k45O83j24q08J217m60p60Q85j99l70L51L77
3459C83q22L69L87n84l8N89l36n74J280o34p72J059j04o72O06K93r11M35N33r58
3479d71M24N42n67l05J089q41l79J127o54m04O14K07q81O48L31p55K58M59n70
3498a28j7P31o13j16O22k38n66P06n6p57J011j96r04Q41K11q03J90M59o42j0O53
3519C78l65o55P30J02q71R16j63p51O30K67q38N36M83r68L29N34m57l34R17n36
$$ y = [-562, 376, 135, -737, 302, 234, -632, 228, 442, -309, -126, 491, -425, -217, 487, -6, -325, 521, 42, -647, 614, -6, -457, 232, 108, -490, 94, 517, -436, -46, 555, -98, -174, 570, -96, -621, 684, -30, -649, 454, 311, -646, 294, 590, -540, 75, 417, -102, -122, 490, -53, -370, 644, -117, -390, 414, 252, -483, 365, 160, -668, 282, 254, -282, -232, 575, -272, -299, 372, -164, -409, 274, 150, -658, 559, 99, -661, 224, 25, -345, 6, 383, -439, -70, 317, -267, -305, 284, -52, -626, 654, 20, -752, 307, 203, -469, 137, 430, -481, -46, 487, -471, -47, 495, -72, -377, 712, -129, -508, 619, -35, -439, 175, 382, -499, 149, 480, -275, -17, 442, -128, -145, 586, -27, -143, 479, 241, -325, 381, 325, -432, 579, 383, -521, 320, 531, -272, -82, 377, -265, -275, 378, 13, -642, 88, 190, -681, 235, 72, -679, -49, 218, -620, -84, 399, -569, -240, 294, -163, -497, 420, -116]
3539a16m67J020k80n32N76K67j130P01M54r17L22O28m08n08R94n58l90R30m51
3558A35m74O26J62j008P72J03q93O46M05o14j49Q78o73j55Q37n38k02O39k13p67
3578d83R24k06p92O55L01q24L66O10r44Q4Q17p49r7O20k35o81R99k67p47J099
3598D50l05p71O71M72r30L50N50q05p7R05o51n95J144l90n58O55M7q05O59M18
3618D34r82L91N25o82j3Q50n19l67R00p29k01O50j13n35P87J17j071O02L76o61
3638b41K08P08q66Q4O48o52j78O26j35p34R37k60o96R16P3q37M11O39j221N24
3658d6N95p90j55P87k29p50R98j88p72R42J4q58O01L05j007O39N00j014J82M54
3678B08l22l22Q65n86k93N97j04o26L91N70r30M14N01q09L19L69m25l25J002o16
$$ y = [-116, -583, 437, 157, -375, 201, 468, -662, 39, 493, -424, -102, 526, 118, -390, 604, 46, -344, 586, 135, -339, 287, 449, -559, 213, 316, -577, 69, 474, -140, -289, 589, -84, -239, 598, 60, -142, 497, 284, -483, 441, 235, -557, 98, 399, -425, -59, 551, -393, -309, 508, -241, -338, 282, 47, -634, 365, 98, -649, 450, 145, -626, 45, 517, -413, -63, 487, -318, -395, 510, -141, -736, 408, 18, -540, 115, 162, -643, 16, 434, -548, -157, 368, -314, -327, 523, 4, -363, 537, -192, -393, 257, 144, -391, 396, 513, -558, 44, 420, -241, -33, 675, -191, -107, 541, -111, -289, 337, 202, -532, 405, 145, -551, 365, 438, -399, 12, 651, -570, -46, 549, -241, -396, 391, 162, -588, 410, 222, -550, 392, 406, -452, 149, 454, -553, 86, 586, -428, -246, 208, -114, -436, 429, -157, -450, 147, 43, -583, -192, 378, -552, -138, 363, -446, -127, 242, -183, -508, 494, -122]
3698a22j54O55l45m50O41K7o63N24O5o23M57N44r92L27M57o51K18L78o5o16Q49
3719D61k16p58R96j76n21M41L02r10M14O18q25n4N74l97l10P91k93p86R03k3n95
3740c64M23K72q19N74K07q07L84K62l46j13P49n11n36Q25k71l76M91K33o50L32
3760d1N25r83M42K82o02J32P04n95k00N19j44m97O60m9q38R97O0q09N40L46p88
3781c39L75P10r50J75O49n37o15R98o6q29Q12l05n53O13L81r65O79J77p51L08
3801c3O19o82j21O99l52n12P65m04l15L22K74o42M09L27p78L82K65m51m8P05n42
3822a13k81Q18o32m98Q49J89j025Q65J08q32O32K57p20J40N99o13o8O61l20l41
3842c25N85L5p50O74K02j054Q07J61o33J2P65p43R8P04n67k51O66j51q16R47k91
$$ y = [-122, -276, 379, 34, -416, 225, 252, -411, 113, 178, -445, 12, 556, -436, -109, 348, -303, -85, 293, 228, -388, 461, 245, -513, 483, 307, -214, 227, 529, -381, 33, 651, -174, -228, 346, -51, -361, 430, 137, -649, 254, 231, -364, 59, 331, -488, 86, 293, -514, -130, 132, -214, -327, 422, -89, -625, 200, -71, -447, 44, 277, -373, -41, 484, -499, -57, 225, -377, -245, 459, -136, -336, 183, 39, -458, 202, 153, -685, 312, 372, -437, 103, 449, -339, 36, 746, -204, -29, 620, 83, -532, 466, 400, -429, 383, 78, -475, 138, 519, -446, 233, 410, -341, -33, 586, -96, -217, 482, 130, -382, 383, -21, -336, -14, 260, -382, 27, 354, -424, -42, 223, -228, -276, 429, -113, -394, 424, -208, -706, 143, 332, -693, 172, 280, -552, 80, 337, -383, -243, 356, -257, -325, 336, 16, -325, 260, 295, -455, 219, 421, -633, 174, 335, -298, -286, 479, -264, -166, 538, -29, -280, 386, 235, -581, 366, 75]
3863G5m93M47M25q17N01L38q44L66M00p40R0O93m59l52P64l37l52K76L41q06N31
3884D7L68q96M86M73r87L79M28n10j21P11m64k29M90Ln48N63K67r82O78K26p11
3905c29J78M57o31r0Q23o77o1N72k89l89N37P9o10Q04M3o61J68M93q08K56N97
3926D62o47M0L33Km90O14o6p66P70R4n57K14M77q86L63N55n60j10N71m79o5O35
3948E04n82k13O87k56m68M09M76q75M70K15o37K80K38j53k86P05p04o1N38k43
3968D4k19L32J38q75O39R5o52L07M76o68l7Q08o04j59O29l81j77M74j83n48Q27
3989B66j0o16M54J58o70L79M75p81K59M71k33m57O88l67j82N19k10m42M10K41
4009C52p06N52J58o04K64L95n91j5P85o71k28P75l92l55M40J99o77M06K91o82
$$ y = [75, -418, 29, 454, -363, 138, 476, -368, -2, 398, -342, -252, 441, -18, -370, 394, 57, -295, -19, 322, -484, 47, 415, -481, 5, 478, -509, -130, 298, -212, -333, 378, -86, -315, 175, 178, -370, 193, 460, -522, 156, 382, -329, -151, 306, -325, -415, 408, -269, -330, 242, -47, -436, 101, 180, -430, 374, 417, -244, -76, 417, -391, -135, 462, -185, -145, 188, 190, -300, 314, 248, -518, 252, 346, -211, 3, 480, -406, -43, 512, -48, -158, 413, -66, -131, 504, -78, -291, 396, 140, -328, 81, 557, -318, 152, 367, -270, 10, 248, 95, -191, 514, -190, -251, 287, 44, -175, 157, 295, -580, 59, 154, -498, -191, 285, -383, -420, 388, -216, -375, 254, -127, -304, 170, -13, -561, 266, 256, -360, 94, 252, -418, -39, 436, -345, -86, 385, 152, -305, 383, 16, -166, 353, 143, -299, 111, 352, -354, 198, 356, -248, 16, 411, -180, -195, 590, -81, -309, 466, 74, -281, 159, 358, -319, 87, 378, -304]
4029c04L32L91o57J33M92o43K0P25o17k95O53j37n67O90O5q10M18N67o37l9O24
4050D04p86J69L81m40J1M06m8m75N20o9l13M68J18o75L19M22p82L44M61n85n9
4071b09O58m29m43P75j09o29M96L69p27L68L69p74K94K93m30K4M69n00k14P88
4091D39m85j54M56j69m27M57K41p69M58L20l63k23N46m21j2N25m34j58L47r8m35
4112c59O78j04o36O19L0n15J56N21q01K04N93n90mK97k8n31O51k57j21N08l20
4133il26K54L95o78M42K02o07J29M96l67m33Q84l24k71M46K0l69N4M75o98L44
4154E9K23n28M8N49m45o4O06n93K9M49j1m44K37K78o39L85P5l77K31L27n18o2
4176a85O46n94J34K52k54k14N49k39m07M37l8m34K52M93o98J05M26n64R0M96k95
$$ y = [-304, 28, 419, -238, -105, 387, -256, -236, 489, -128, -423, 230, 93, -474, 216, 281, -529, -111, 456, -181, -220, 404, -382, -213, 168, -272, -261, 145, 97, -378, 142, 73, -240, 228, 346, -329, -10, 412, -370, -26, 435, -150, -209, 449, 20, -423, 352, 243, -386, 110, 479, -248, 120, 489, -285, 9, 302, -128, -104, 365, -135, -349, 439, -46, -200, 256, 87, -340, 117, 358, -411, 47, 367, 4, -219, 327, -94, -106, 419, -15, -173, 174, 76, -359, 319, 215, -421, 198, 228, -287, -131, 390, -411, -207, 386, -204, -208, 89, 61, -470, 181, -76, -197, 311, -9, -335, -81, 314, -364, 78, 280, -327, -198, 298, -69, -502, 382, 58, -213, 233, 253, -116, -62, 413, -285, 59, 282, -246, -198, 351, -94, -158, 448, -145, -116, 333, 322, -122, 115, 393, -246, 139, 214, -163, 68, 395, -123, -185, 461, -133, 1, 253, -1, -215, 334, 95, -312, 125, 87, -347, -95, 398, -300, -195, 231, -333, -243, 253, -42]
4197d2l76O00j03m60N68j35l01J15L94n02J10M78p32K25M82m95P7N70o16j02M07
4218A62nm60M09J19o91N08K61m26N4L98m35j01P46o95j76P38m92N1L02K1o61P03
4240C30j11l57Q6L54n62J2O95p23P9M78m37o5N98k08m15N14m8n01K79L07n85K13
4262f7M17o76J62M34l27k58M65k47k54O26l24j82L22N4n84M91K72p21M04J20l35
4283b08m3M70l31j71O83n32j56N55L4o26M40M29r31L69K80k59k01N56m62j64O22
4304C54m64l3K95l3m73N48q7m40O42k80j12j03N95n57j36N67m35j6L45l8m49N48
4326B38j01l78L98K29n20N7M44p48K81L51l35j51N86l60m31Q99l64m16M63%m19
4347b77J92K84m90K03J62l53N9N10k52l59P21m46p4K61l1m76L73K64o67M58K30
$$ y = [-42, -418, 182, 79, -381, 187, 52, -249, -134, 260, -242, -132, 346, -386, -161, 321, -174, -97, 473, -143, -245, 162, 157, -303, 106, 225, -466, 42, 303, -123, -69, 329, -106, -207, 539, -156, -332, 406, -86, -35, 267, 288, -373, 330, 219, -138, -52, 302, -260, -248, 447, -276, -197, 281, -156, -221, 377, 169, -246, 268, 220, -281, -2, 305, -280, -67, 350, -326, -164, 270, -57, -315, 150, -97, -351, 275, -49, -231, 91, 145, -439, 52, 324, -397, 7, 127, -208, -251, 219, -112, -283, 400, -132, -288, 267, 301, -325, 115, 544, -387, -18, 262, 3, -198, 358, -104, -268, 354, -110, -143, 152, 119, -354, 194, 107, -333, 309, 29, -83, -186, 409, -148, -284, 283, -152, -168, 177, 139, -310, 238, 137, -241, 157, 386, -134, -77, 367, -381, -100, 251, -84, -235, 351, -9, -440, 459, 95, -321, 142, 142, -277, -85, 199, -291, -88, 74, -279, -220, 290, 38, -321, 400, -46, -120, 141, 110, -366, 7, 271, -396, 62, 292]
4368B92m28J00K70k55k00O50n68r0L34kk91M38p6n50N64l1l61K56L32k67k61O29
4390D85o34l5M89j67k83N74l99k98N73k67o3N1K06n12J96L80n04K4M07k10l69
4411c56O83k63n28O10l6l98L11J97n27K59J75l25PL03r3l38L76j00l53N54k02
4432d4k57K70J96m61L26K56m77L75J0k26j05L94m56O8L76k93j05L25j71k92O26
4453C35k33j49K04J75n11O7N38n33k3M16j17l81M36p7m01M63j84l10L31J37m29
4474b46K03L10l46O0L42l50j65O18m29l33N18j73k31L48R2n67K59L20n51L31j
4495Ij83m5M58m12j2M08k11l18L42ok93M61n7l71K29K52k62r4M40m68O1K93k47
4518b6q7K16q1k95M93J7m21K94J08m28J28N60p82K01J99k09k19M08O0m77N08j19
$$ y = [292, -136, -36, 234, -21, -221, 429, -139, -229, 105, 103, -188, 250, 174, -376, 188, 157, -204, 52, 384, 117, -144, 485, -149, -184, 305, 138, -145, 429, 30, -268, 305, 38, -25, 26, 232, -280, -84, 296, -208, -184, 223, 13, -356, 327, 64, -464, 146, 110, -288, 23, 220, -307, -48, 127, -198, -191, 112, 19, -319, 57, -43, -396, 158, -44, -301, -31, 165, -296, 30, 286, -191, 184, 194, -32, -137, 257, -199, -131, 245, -48, -153, 172, 1, -291, 335, 102, -47, 157, 332, -179, -112, 426, -107, -130, 286, 169, -212, 224, 147, -254, 209, 25, -285, 46, 183, -246, -43, 267, -79, -19, 323, -27, -192, 426, -3, -336, 182, 9, -222, 126, 218, -349, -90, 230, -321, 10, 9, -174, -219, 239, -173, -185, 223, 12, -306, 36, 30, -263, 198, 141, -230, -1, 251, -11, -105, 335, -133, -72, 221, -26, -113, 103, 22, -273, 220, 237, -184, 110, 218, -210, -82, 478, -304, -103, 96, -113, -332, 76, 136, -341, 167, 48]
4540D8n6K10j43k07K87J91m87J61K99m49J65K41k51k13L95k56k82K82J36l04L00
4561F7J46m79K84K11k66%K80m35j31N83l66j06L03j31k28N66q4l59K08o4j09q2
4583a92K33k10j03N11l14j6K13q9k98M09pk28K28j01k61K83K60o00L22R7j08j9
4605A0L89l26k64M60p5l42K37N9k80J22K71m51K59J01n0j04K56m08P6K74j79k73
4627b38M63l41L8K36M6n30M27k8k35L4L13k98NL25n10J67L11j57m01N39r6m71
4649d01M76N9m35K64K09l13J5M05o57K11L65j86k90K30Q4k89M97j35k34K35R8
4670B08m39K59J70k31q8K03p7k08M19j71j72L72m7k25j08L12m37M29K19n15K41
4691A14Q1k42j57N19m46p2L07k00j05L86O1l03L08J88p44L71J31l27L0L07k72
$$ y = [48, -8, 202, 59, -148, 139, 330, -157, 4, 303, -146, 19, 260, 9, -204, 191, -65, -347, -65, 71, -233, 67, 213, -266, 18, 229, -37, -37, 243, -192, -323, 260, -106, -212, 91, -40, -268, 298, 214, -145, 63, -1, -110, -192, 41, -169, -272, 239, -75, -91, 122, 33, -265, 144, 137, -91, 137, 36, -225, 58, 318, -282, 40, 137, 29, 10, 399, 73, -191, 269, 194, -148, 89, 148, -132, -10, 261, -190, 69, 170, 120, 16, 272, -136, -60, 214, 35, -238, 225, -116, -78, 158, 204, -326, 101, 73, -162, -128, 185, -113, -108, 217, -293, -126, 185, 28, -373, 166, 70, -401, 75, 134, -301, -37, 172, -141, -126, 279, -378, -167, 198, 12, -278, -48, 36, -253, 244, 109, -125, 110, 208, -231, 28, 198, -33, -121, 82, 5, -203, 216, 45, -127, 245, 198, -27, -135, 177, -260, 169, 388, -127, 114, 195, -47, -204, 315, -131, -203, 104, -96, -201, 185, 246, -57, 251, 439, -305, 66, 197, -130, -100, 207, -65]
4712f5k9K33j34j25J70l6j38K60j48j93K00J49l74J04N16n36j0M62n98J92J64
4733F4j27l27M39k5l19L71P4l93K50K62n63L10J68l79J8K78j31k58N31j16k34
4754a07J91q3j04L02n7k77L19j97j80J85K52m34O7L86l61p2L59Rk67J38J74m94
4776b51K35J05k47K9L50k81j05L02l50M8M03k92l29M22m4k74M69j79j91J67L55
4797C42n16o9M13k28r4K27j62o7K19j51j7J34J02j90O4P5l06K15J28k28J30J01
4819A22j12k00M63j74l00K05R2l27L18K16n48J89J50j20K79Nk08k21L92m48oN85
4841C52l05k17K87J32n07L96J16l74K58K3k08q1J98j50P6Q1k3l62M15L9k18J66
4863I4j20j46J18L26n48L68k7l03J38K63p7j82K38m6k36J82m6r2R1%k50L29O4
$$ y = [-65, -94, 139, 5, -120, 50, 14, -124, 136, -12, -205, -5, 144, -230, -126, 390, -146, -156, 306, -292, -100, 64, -63, -390, 49, 24, -295, 76, 150, -243, 7, 269, -294, 16, 184, -195, -177, 101, -30, -288, 243, 127, -107, 84, 1, -103, 199, 142, -135, 184, -13, -193, -8, 244, -190, -123, 263, -98, -170, 189, 198, -69, 69, 243, -251, -16, 89, -158, -129, 221, -60, -165, 137, -213, -165, 238, -54, -383, 39, -5, -279, 190, 11, -180, -13, 342, -174, -243, 170, -58, -152, 75, -87, -154, 65, -86, -103, 31, 133, -57, 7, 82, -224, -9, 119, -109, 21, 122, 10, -190, 273, 99, -201, 4, 96, -231, 87, 303, -245, -56, 94, -26, 253, 258, 50, -171, 221, -227, -233, 352, 47, -170, 117, 249, -258, 138, 254, -120, 138, 161, -47, -128, 70, -80, -4, 77, 54, -308, 107, 146, -72, 94, -26, -172, -54, 272, -276, 92, 65, -238, -100, 163, 86, -96, 142, 96, -140, 42, -4, -96, -5, -5, -255, 74, 138]
4886A38j72J74j95j21n7M99k22j48K66n7n1o7K13l54K06K11k85J48j57P0J6K77
4908C32l37J02J65k73j15M50j69l25L11j5l23J36J05j77K0K73j53J8K38k63r6
4929i6J69j9k38K16J13l51K49J39l64O7J84j48r4K08m5j30L43j62k34L81k95L4
4951g3R7J6l29M63j39l29L27R0l00M9K95k95L2K24j80p1J97P1k77K61J49m92L13
4974I9Q9l72R8J80j72p2L62k81O6Q5j01MK01P9m79M33j40l21L08Q2j71N2L3j33
4998g1NR4j77n7M82n00P5K61j05JJ4J06m09K48L5J5k6Q5o3l6K20k24j55K98N4
5023A70k51J21m0k93K61J80l55J28K58k71J63K17l64j33L74j31k62K47J16k67
5043a32K25j01j28K1M30k93J42J06j46j61J20j81K2K53r3k11L11j37o6m0L83m42
$$ y = [138, -34, 140, -55, -176, -233, 266, 44, -104, 162, 105, 54, -13, 200, -154, 52, 263, -22, 126, -31, 39, 55, 332, -5, 97, 262, -11, -126, 324, 155, -170, 141, 126, -197, -61, 44, -133, -113, 160, 7, 25, 263, 0, -96, 73, 54, -184, 32, 145, -206, 43, 182, -182, -115, 69, -79, -173, 35, -10, -140, 203, 41, -193, 188, -107, -73, 24, 40, -289, 174, 35, -294, 33, 123, -177, -128, 167, -128, -96, 128, -52, -123, 74, 145, -132, 129, 278, -214, 99, 188, -184, -86, 94, -78, -150, 212, -69, -3, 82, -19, -15, 186, 265, -214, 219, 79, -242, 66, 148, -23, 29, 62, -71, -66, 28, -149, -206, 276, -224, -149, 112, 7, 8, 22, 128, -281, -33, 2, 17, -9, 76, 13, -23, 197, -27, -182, 116, 170, -81, 40, 0, -293, -32, 148, -207, -79, 179, -92, 71, 288, -76, -209, 165, 34, -228, 19, 135, -132, 93, -8, -136, -115, 315, 22, 164, 270, 124, -37, 83, -98, -76, 177, 84, -127, 184, 47, -19, -59, 324, -118]
5065a18P0J71j03J16Q0k00j24K70k42k18M56j73K3R0m3k46K22J1k09K00m0j15
5087a22l1N49k62k03J65L0k61K44q2j42M8R3j15K57Mk07qK12k48m6J74Jj94K27
5111H3n4k46K97J03l64K39L1j42Q2J52m40L65P5l33QK84j81j56L46j9j37P0Q0
5134A43l36J03L70m43J30J95k82o6K98j47o6J52K0l34K02J80m66M07L2k40K32
5155H4Mk13J46J69k17j50L09j97n6J73N8l03Q1J33q6J64m4l55J59K14l20J58J44
5178E5j16j47K42rk46M57k33j79J68N7k9J8K7j24K2J68j84j44L02j38p1L79l84
5201a09jK20J2l23K47J68l72J37k7p8M5K44j44j29K22j45l7J34J8k76Q2K18j56
5224e0M4K94l93P8J29l51K49K31l96J10J60j77M0J28J9l75N09j75k76J21J13j95
$$ y = [-118, -48, 123, 20, 136, 216, 16, -108, 162, -80, -298, 158, -15, 8, 98, 55, -191, 31, 42, -167, 33, -7, -122, -153, 396, 134, -69, 96, 126, -135, 109, 27, -115, -67, 26, -89, 168, 172, -35, -43, 169, -79, -125, 49, 50, -144, 83, 29, -217, 80, 183, -181, 58, 89, -53, 29, 181, -259, 106, 181, -152, -144, 140, -41, -197, 149, 130, -7, 63, 143, -193, -90, 280, -163, -33, 162, -120, -186, 112, -35, -101, 51, 71, -263, -61, 119, -347, 60, 92, -148, 84, 88, -125, 21, 190, -27, -177, 132, -65, -121, 52, 110, -193, -112, 21, -65, 99, 55, -300, -141, 73, -247, -89, 55, -61, -208, 34, 25, -221, 236, 3, -176, -8, 49, 20, 38, 65, -59, -37, 131, -53, -197, 105, -33, -104, 275, -109, -110, 110, 122, -201, 46, 214, -158, -21, -48, -126, -81, 163, 19, -110, 112, -33, -70, 64, 82, -194, -112, 106, -50, -6, 288, -105, -27, 102, -249, 0, 231, -165, -55, 105, -72, -32, 96, 115, -260, 249, 74, -202, -81, 32, -163]
5246a63J13l7o4j4K73M2l80M34k54p2K35r2r9J44k6j65J88K2r9J9k9K3j13K50
5270A36m8n6m2J92l13K98o8k77J72P4j21L4J11J7l04K62k57J19K94k62n3J57N7
5293A22k75J31J0O0j3J59k61M9Q9k39K15P2j40j26L43l2n12M93k34j04J34J00
5315D1j01k0J63k03O6O5k11O3K22p4q8J80j48k8J66j16n5jK51k33J03L9j75J6
5339g8L11j73j00J32j81nL65l46p1K07L26n19J44K50l61J4K65k90J36R3k80j0
5361a71L25K4k89K33k2k43R1J73p8k7K8k14J80pj04m7K17p0j67K95j68k33K99
5384B5J64k64J9K31k12l7L91m37L0K59j63j69K82k61N1N4k8k18K13J98j76J32
5406H4k4j41k8P0q2r0M23l21p7L61k4j89N4O4k38J51R3j39m0K21j69l9K45l27
$$ y = [-163, -50, -87, -151, -165, 108, 150, -230, 204, -50, -122, 113, 21, -78, 66, 40, -125, 63, 85, -14, 5, -24, -1, -114, 136, 88, 32, -10, 182, -131, 167, 99, -178, -6, 68, -53, -19, 92, 109, -195, 67, -190, -71, 223, -39, -92, 65, 122, -153, -22, -12, 48, 35, 194, -67, -18, 71, -168, 47, 119, -21, -147, 196, 164, -348, 145, -89, -193, -59, 41, -60, -80, 83, -120, -54, 11, -200, -137, 85, 11, -77, 103, -45, -73, 93, -23, -78, -79, 172, -61, 42, 81, -94, -78, 233, 60, -40, 92, -89, -94, 271, -75, -146, 61, 387, -132, 12, 262, -99, -85, 180, -110, 26, 119, -161, -171, 154, 178, -111, 122, 100, -143, -52, 121, 43, 16, 44, -170, 10, 3, -101, -148, 69, -1, -168, 127, -41, -274, 25, 189, -75, -56, 175, -37, -74, 317, -120, -90, 169, 6, -163, 119, -142, -91, -37, -65, -283, -70, 128, -48, 84, 60, -81, -109, -39, -121, -211, 212, -109, -186, 175, 151, -38, 16, 80, -158, -7, 86, -53, -93, 128, -41, -80, 165, -162]
5430a62j9K11M9n1J58q7k20K77p6p1q0J22j92K63qj86R5J57k45j23M30k31n9J43
5454I5j55k6J67R0l32M4K87l51J72J57k39P3K44k49j16J53J41j30o2N0j80J51
5476a6k4l1J48K16l57LL30k43J09J15j70k00L54p1j74J05O3k56K26R2l62J96O0
5499A13o2j6Q6k02M7J84j58j39K94n4j81K39m0j72pJ40j71J35J20k72N1K27k58
5522i6lK42Mk32N9j1k34K31J29k46N6J99k00N4J27q3r1p5K00j82K14K9k12K36
5546A15J4k34L07k25j43mL30o7j31J26j60nK50p6k55K96j72j52K43J27j80j19
5568a15K56k34O1J99k66o3K81p3j91L26r6p8M9j3l5O0J09j77J02K3k08N7J18k08
5592a16O9P5J3N5n2O3r2J33j75k4Q2N6j90m2K06j27j4K36l4k26J46j3l04M93j23
$$ y = [-162, -181, 30, 79, 28, 186, 99, -121, 156, 80, 9, -71, 51, -141, 122, 114, -72, 23, 180, -65, -188, 242, 11, -48, 95, -60, -86, 81, 171, -161, -117, 170, -181, -9, 148, -91, -18, 226, -23, -139, 14, 155, 25, -37, 13, -167, -16, -40, -71, 77, 293, -64, -61, 269, 26, 135, 250, 80, -120, 234, 163, -11, 94, 157, -99, 127, 219, -143, 53, 113, 51, 35, 121, -81, -34, 150, -8, -147, 147, 93, -88, 151, 111, -61, -68, 72, -99, 36, 156, -116, -65, 162, -96, -99, 143, 147, -85, -26, -37, -271, -40, 89, -157, -101, 98, -102, -48, 79, -4, -95, -170, 30, -152, 62, 91, -121, 115, 129, -105, 202, -23, -166, -170, 160, 93, -38, 88, -72, -77, 173, 97, -158, 138, -34, -186, 57, 184, 4, -115, 141, -93, -32, 167, -99, -162, 119, 46, -145, 181, 85, 7, 56, 43, 8, 68, 177, 0, 102, 125, -83, -26, 92, -116, -47, 28, 41, 96, 44, 107, 15, 148, -27, -51, 31, 87, -103, -145, 61, -66, -80, 156, 122, -104, 42, 29, -275, 218, 95]
5617I5k60K46m0m6P7R8k27J7K12l82K40J28o8j72o4J18j23L56j26k05K62j74J06
5640F8r7Q5j27p5K80j95n7L62j86r6N3N3j37J18j61j01J80J06r6n3L65m81J97
5663EQ7r8k12K80o3l01K52J82j25j22J31OJ0o7N4k74L13j71j0K84j76j67J58m8
5687g2l6J00O3n5O1m6o4Q9P0j64p7K7l3J27J53j10j51K04R5k40J15K0k50K30q
5712D8l9r8L17l38M9K70m3M1Q5j43l06J74J21l04L36j04j45J15J00k50r7L20k33
5735a24M5O5l7o6K02j1k33J14J57j64O0J98l33J25J57l30K3R4j5M2J52j34j95
5758b08K18J00k42J13L1j35J54O7l26R1J32R2j00J39j20j35O3N6j5o3NM8R0L6
5782I1r8k3J40j20j25K92k44r6L06j64j31K43m8j76L27Nk91mK48j38j15K55j32
$$ y = [95, -165, 81, 41, -5, 72, 170, -57, -40, 172, -210, 30, 158, 90, -82, -146, -28, -151, 205, 79, -126, 136, -38, 68, -29, 56, -71, -146, 134, -61, -118, 244, 58, -38, 15, 68, -69, 49, -112, -213, -33, 73, -23, -76, 289, -192, 5, 92, -6, -218, 62, -1, -302, -50, 132, 7, -115, 16, 22, 32, -35, 19, -255, 58, -113, -123, 161, -15, -182, -24, -72, -108, -8, 55, 0, 61, 15, -49, 40, 110, -54, -131, -104, -137, -10, 143, 33, -118, 86, 181, -59, 56, 76, -174, 56, 48, 9, -89, 228, -110, -61, 209, 166, 207, 292, 149, -157, 17, 138, -166, 170, 66, -79, 36, 136, -114, -211, 109, -124, -79, -14, -51, -117, 85, 74, -159, -45, 112, -52, 8, 206, -127, -2, 155, -175, -152, -58, -73, -31, 121, -13, -208, 10, 110, -132, -19, 12, -123, 31, 98, -228, -137, -5, 87, -13, 126, 6, -129, -66, -10, -25, -88, -83, -35, 55, 91, -7, -30, 110, -10, -135, 157, -87, -183, 123, -41, -172, 71, 23, -153, 174, 179, -112, -116, 132, -6, -121, 134, 2]
5805Bj37K30j16q6K68j98j57K57Pk38K42l2k98K75Q4j94N7K68l25PJ08O6l95M25
5829A20l4k89K66R0k02j0K36l52q3M29k41L8pL8j20K56r6k48K33N0j44P0J69l59
5853a90K84k08n3M6Q7p5J30Q4k15P2J63j3o2J27p3j32K5Q3m8j76J14r1OJ74j38
5878g9o2K38j19q3J24P1k56K69j38j0R9m3j19J19K21l33J92Pl72J71K53k81o8
5901a99L16j37K3N0J11k77k8L57k18jR5j34j02K25p6o3J81j45p2K80k78m2K18
5924H4m3J3k5Rj4r3J35k44O0L83j58j65J45l6l26K83J70l87K92L4j28j43K98m12
5948b68J20L52r7j57J76n8j30L74l83n8J54N4k32K04Mj69LJ39l6k8M0m0j27K78
5972A15j71pJ23J16k91K04q0j09N7K10j75q7J64m4k08L37o9k41R7L8m1O2K39l08
$$ y = [2, -135, 95, -21, -107, 161, -37, -194, 63, 70, -168, 74, 42, -256, 19, 103, -91, -34, 234, -91, -84, 24, 90, -305, 120, 86, -203, 63, 153, -49, -59, 177, -175, -258, 171, -70, -32, -39, -1, -121, 135, 39, -209, 24, 74, -70, 0, 169, -190, 94, -114, -167, -121, -34, -109, 21, 105, -110, -38, 125, 112, 50, 177, 104, -28, -3, 80, 32, -144, -30, -121, -115, 59, -79, -141, 97, -22, -105, 19, 90, -166, 103, -35, -45, 54, 11, -108, 11, 232, -101, 91, 98, -274, -103, 150, -131, -199, 117, -20, 3, 53, 164, -113, -141, 216, -2, -3, 92, -42, -144, 81, 5, -58, 123, -22, -94, 186, -92, -134, 84, 41, 54, 29, 38, 24, -69, 66, -178, -118, 265, 107, -58, 87, 51, -275, 8, 178, -209, 83, 117, -11, -154, 144, -268, -148, 204, 107, -50, 126, 68, -62, 312, -71, -129, 25, 79, -153, 51, 55, -114, -111, 28, -8, -36, 4, -36, -163, 115, -56, -63, 60, 176, -115, 89, 9, -100, -43, 167, -8, -95, 69, 25, -183, 154, 85, -156, -59, -21, -62, 0, 239, -69]
5996f9K2K10k73J9J97j86J92l8p2q4J90j09p2J2J65j24J64K9l48K08J38l91R5
6019a25L08k03OJ09p8j43K77j83j12K22Mj26n9K14o0p9J70j52o1J34j21p0M12
6042B84l95K6O3K06l51J09J24k17L47r2j62j97L10n4j31L14k39l0J53K3j35Q0
6064C6K67m99K39OL7k55K84k57o4M10k16J93K8j76j71L17j25k40J40K85l60J63
6086D2O9j69N9J07k18L6O0q9P1J21r1j44K35l5j44J74J11l56J25K26l97J11L31
6109B35j79k29L36l49j5K86n3k18L45r1k52K10Q9l52J42K38k19j35L44j73j13
6130a53J88o9j01J47nk19J00N2j46K45J84m76K38K01l38O2K12j39r1K16mk15K11
6153A00M3k54J96R3j95n6J86l77K84P6j54j65L82j71j29L37k28j9o3J65j93J36
$$ y = [-69, -47, 163, -110, -91, 106, -80, 112, 74, 2, -82, 108, -1, -73, -61, 104, -20, 144, 173, -175, 33, 171, -220, -125, 183, -20, -14, 95, 17, -126, 151, -32, -144, 78, 82, -44, -103, 111, 51, -28, 142, -10, -71, 63, -58, -128, 284, -111, -85, -22, 184, -167, -58, 66, -151, 196, 104, -58, -255, 55, 1, -130, 184, -55, -85, 68, 91, -44, 36, 303, -196, 43, 49, 86, -169, 115, -142, -206, 204, -12, 181, 209, 33, -138, 179, 54, -186, -46, 239, -121, 42, 111, -58, 1, 108, -110, -74, -14, -103, -32, 89, -2, -146, 89, 54, -90, 84, 195, -161, -36, 190, -207, -96, 235, 56, -173, 163, -186, -201, 85, 32, -186, 159, 68, -184, 26, 115, -237, -95, 143, -76, -211, 133, -40, -153, 35, -34, -135, 12, 7, -212, -112, -60, -206, 39, 223, -253, -15, 186, -152, -90, 122, -17, -108, 108, 104, -111, 100, 143, -111, 85, 178, -17, -73, 113, -264, 20, 96, -58, -223, 159, -12, -141, 196, -32, -51, -114, 51, -142, -6]
6175fJ20p1J17m8j60j2K21j30q0q4Q1j73K23J65k70K04l5j31J22P3k51J04K44
6198B23n13J74L21k73j9J56kk57K37o7k57L84J7j22j37K24j32k09L37r3k59L54
6220H7ok87M13k37j96L09O8j24l8J23k00l5K67j39NJ46j18j23J85j16p7J60K6
6243I3l96J90M36l43Q0M5k16N3J96j94n1K94k66K08q5qj16Q0J19j61P5K21l87
6266a33Q5J49k03O4J00j61K7Q6N2k20J67pj65K56L0k73J69J11j88R0J48k30m3
6289h9J05o4r6L17r1j04L1M2n8J21k0k62J47J20l12J64J92k85m8L37j29j59K72
6312A31m0j29j8O9k00L14o4k64K80m5j61n0M48l62JJ87o5j46J02j26J22K1M3n1
6336cr6K18j76Q8l1qm5L05k54p7J68P9k97J96k0j79J44L6k62J51J48m4m9P6q4
$$ y = [-6, 114, 43, 160, 112, -48, -60, 161, 31, -49, -133, -52, -225, -2, 163, -107, 97, 62, -69, 53, 126, -125, -21, 223, -290, -116, 205, -68, -87, 69, 67, -190, 47, -20, -277, 107, 124, 2, -135, 89, -43, -252, 85, -8, -267, 87, 81, -206, 207, -30, -226, 83, 151, 27, -11, 112, -88, -123, 144, 5, 10, 156, 38, -85, 100, -16, -93, 67, 93, -303, -113, 323, -20, 60, 105, -111, -58, 138, -56, -107, 187, -79, 129, 44, 36, -80, 0, 119, -42, 33, 254, -133, -48, 101, -102, -38, 62, -99, -72, 14, 66, -154, 13, 6, -159, 97, 127, -146, 23, 134, -54, 36, 184, -46, -89, 16, -48, -144, 173, 82, -22, 9, 51, -7, 114, 94, -168, -21, 99, -213, -49, 143, -142, -190, 147, 18, -141, 131, 91, -38, -56, 13, -187, 127, 63, -201, 79, 34, -127, -177, 271, -91, -90, 97, 32, -114, -12, -138, -16, 5, 48, -3, -99, 119, -57, 31, 0, -8, -53, 252, -2, -79, 89, 168, -129, 67, 47, -132, 12, 48, -214, -63, 85, 41, -8, 68, -16]
6361a6q3J84j3r6P4p0o6k0J76k30J33J80k04N2P8j06o6L11l06O2J0J41j43J36
6385A18q0k31L46o8p7M4Q3k36p7L78j73j06K08j84J2J11M9k10J00Jj89K32J02
6408A53j63j82M74l96KJ87j03n1J51n3j08J55l8m03M98j30j84J90R0j24J58k7
6430I6k09k8L33k78j32M79l80n6J03K79j58Q1n2l9J6L9j57N5J43j53j02K10j95
6453a05m6K64m1k86K51nr0J00R9n4j35K24j78M0P2j36j27K66r9r8K01j02k05K04
6477A4Qk36L15mj81J61j02j6j30K66l2k45K58p3j15K14j06k9j4K27k84M5O1n4
6501e2k2KK3k56L11K9j00J10J08m05J47M39o38K44J22j28P9P5m6m8J28j79j10
6524a67K43N9j83K22j65k00K82qj53j6J30j33o1K86k56k9K31m9k79L08j47KP0
$$ y = [-16, -99, 85, 72, -24, 50, -20, -86, -106, 70, -160, -27, 153, -51, 1, 79, -27, -93, 218, -88, -26, -16, 125, -18, 118, 38, -193, 153, 85, 8, 52, 135, -101, -178, 200, 27, -79, 129, -55, -43, 68, 117, -93, 7, 8, -181, 51, 153, -10, -192, 282, -114, -112, 75, -28, -79, 72, 19, -89, 66, 28, -375, 123, -7, -191, -1, 89, -35, 123, 96, -113, -141, 192, -86, -218, 261, -119, -175, -72, 207, 49, 130, 78, 39, 55, 94, -63, -8, 135, -18, -120, 90, -105, -151, 113, 72, -214, 37, 32, -58, 42, 141, 87, -48, 176, -2, 38, 110, -26, -153, 113, 14, -84, 117, 15, -190, 14, 22, -214, 101, 97, -84, 77, -25, -41, -171, 95, 63, -182, 76, 3, -112, 102, -4, -33, -47, 180, -104, -59, 2, -52, -74, -72, -49, -305, 6, 35, -65, 45, 153, -252, -105, 334, -304, -60, 62, -66, 13, 88, 42, -6, 122, -57, -167, 76, 135, -48, 174, 9, -191, 91, 83, -70, -86, 44, -89, -150, 136, -120, -149, 82, 33, -246, 62, -85, -83, -13]
6547a3K89n56K94J39j64p1J30l8p9J96j26k28K12J15k82K95m0j28J82O1m09K12
6569iJ11k11P0J82j31j67K63j62o0L80k30j15M7Qj45K60K8k25J19J62l16J27J92
6592A78k08m8J33R4l11K57jj78K78k37j86J94J6j06J4L24m13o8L90j27j28K03
6614G0n0k10L76l63J7K82j30L3J1K8j39l3J92j24n3K03o9m54L74l4j71L39p0l6
6638a1k6K5p2M6N0n7j52L09k59K9Q5n8p9J91l8j15R5J78l78N4J53o9MJ60j61R
6664h7K51j53j55J37J34l86M31k8k21J12J88l53J85J68k65M8M6o9o0J08j8p0K02
6687A45j05o7M3K26j75K8r2k4l8J74j1j05R2P4j38O9j88J98o7l8k2N9N8k61K72
6712A07k61J77q7J96k02J8P3j39J52N2j75l0K51m2k03P9Q3j36P4P8r7j38L65k93
$$ y = [-13, 276, -280, 14, 153, -11, -82, 48, 10, -69, 127, 1, -227, -15, 100, -182, 113, 73, -55, 127, 188, -221, -9, 102, -109, -39, 143, 12, -155, 108, -54, -114, 266, 36, -79, -32, -24, -169, 91, 119, -106, 13, 175, -141, -14, 178, -30, -78, 55, 149, -162, 95, 94, -84, 194, -43, -229, -35, -19, -125, -111, 213, -200, -268, 122, -5, -133, 70, 20, -190, 186, -177, -160, 122, -8, 25, 36, 64, -75, -108, 84, -40, -93, 110, 41, -413, -39, -73, -244, 95, 25, -11, -37, -12, -84, -38, 12, -45, -197, 112, -147, -118, -33, -91, -170, 21, -17, -132, -37, 141, -237, -183, -30, -99, -95, 65, -96, -87, 164, 11, -144, -7, 127, -259, 172, 144, -77, 35, 223, -130, 55, 223, -42, 6, 52, -17, -77, 31, 13, -57, 145, 40, -27, 16, 242, 67, 95, 3, -21, -59, 115, 104, -1, 91, 165, 27, 96, -92, 106, 39, 1, -21, 38, 96, -165, 107, -154, 23, -64, 132, -70, -52, 21, -118, 34, 86, -89, -119, 132, 90, -113, -34, 49, -87, -13, 65, -32, -170, 195, -98]
6736i8O0J43o2k89L55m4j63K07l2k5r1K62j12k49L32j40L8l2n3L6Om2M3O0m1j87
6762a18J5K79k88J69J07k08m6J97j24oJ10j63M3K54j81l01L65M6l94K74o4oJ8
6785b2J50k38N2K14k57O3O7q7O5n1Q8j93K45J46l16n5K65j05k22L76j22j89R4
6808c2qj39K48q6o1J13O8j53j11J63j73l6L80l72J26K80q8l56J71M2k58M20o2
6831G6o3l1J43n4Q9p0j64R2O1N4k17J60l6j66K56k5j78K1K57l52K36k09p6K27
6855C1l3nj20L41j31q7Q3r6j70K36o0k4jQ1j04l7K09j80L3R7r8J48j28J06k40
6880a49J14J79j32R0m2q5J6K13k66K4K39j99J17L7q9j22K11q5l29L86q0Q2l1J36
6904B35l33P4J08j20J11j33nL6L24j88k13K12k02J08P7L9j46P8l7j39L28k08k11
$$ y = [-98, -38, 105, 43, -246, 109, 65, -98, 109, 77, 52, -39, 223, 111, -138, 194, 54, 92, 60, 7, 43, 49, 7, 50, 110, 69, -118, -103, 176, -112, 57, 164, -44, -90, 107, -17, -23, 87, -76, -33, 221, 40, -261, 104, 150, -244, 30, -34, -40, -22, 128, -110, -58, 156, -101, -38, 29, -58, 7, -44, 44, -149, 96, 242, -74, -129, 136, 31, -191, 185, 63, -126, -32, -40, -179, 69, -17, -78, 35, 103, -50, -161, 2, -171, -207, 173, -199, -73, 207, 119, -237, -66, -24, -282, 138, 76, 13, -18, 125, 71, 160, 90, -74, 18, 79, 133, -84, 76, 40, -126, 130, 105, -73, -52, 205, -147, 89, -120, -196, 31, -2, -7, -127, 214, 83, -4, 79, -17, -187, 49, -11, -35, -36, 45, -59, -96, 113, -67, -34, 63, -35, 113, -15, 91, -149, -35, 144, 12, 102, 60, -25, -9, 204, -62, -38, 201, 2, 119, 156, 67, -55, 156, 71, -258, 128, 48, 130, 99, 235, -98, -24, 84, -36, 75, -58, -63, -27, 297, 109, -104, 108, -94, 14, 91, 130, -16, 62, 25, -114, 214, 6, -205]
6927b05J92K22k26%M5m6kl6n5N7M0M2j32J09J08j43k12K37k2J4k1j50M2L23k39
6952e8p8K50r5j43L39j34j00q0L70m37L9K51j55L6J10P0k66J30j11oJ40p7K8j75
6976a52K67k29K36j09RL6j5M7k96L18q2k1J4J25l08K08N4j93J92l3j51L1J19j58
7000i1m1K28l8j78K98r4k28M45k33k11J56P5j98P4K45l68l6L43k88q9K23J20p9
7023C5R2j53J1J3Q9j60L4P1j11R9J79l71J79M1n5k7L24k26k56J68Q3N4n0J3k51
7048a75K01n5Oj7K21j44j96M63l74O0J99j39l4RJ45k78J97J43k57K4Q6k39N3L26
7072B25l06L5J46j53k7J95j91k5K25j26m8P9qRm5J05k06j3J22M8j66K42k4r3J97
7097A97j70o4O1Qk25K40j0p4J9Q7j48l9J88m3k22M06j68j99M8L67m09K27L5j82
$$ y = [-205, -13, 209, -17, -17, 28, -18, -20, -56, -111, -54, -14, 28, -104, 5, 113, -30, -242, -5, -27, -13, -34, -184, -142, 181, -58, -136, 114, 19, -124, 215, 81, -19, -99, 271, -166, -127, 124, -31, 5, 115, 185, -81, 49, -62, -68, 72, -5, 23, -152, 115, -114, 122, 13, 22, 58, 43, 90, -206, 112, 30, 9, 23, 148, -160, 48, 102, -91, 101, 68, -83, -52, 67, -91, -132, 96, 58, -120, 178, 84, -144, 301, 68, -143, 13, 88, -110, -36, 209, -159, -195, 148, -140, -229, -6, 114, 35, 127, -26, -15, -2, 87, -73, -39, 32, -79, 20, 199, -172, 7, 48, -7, -34, 290, 64, -192, -24, 59, 113, 63, 76, -175, 26, -29, -23, -40, 181, 37, -159, 304, -70, -10, 189, 50, 16, 25, 170, -108, 89, 232, -25, -1, 85, -154, -101, 225, -81, -46, 100, -53, -80, 115, -76, -101, 124, -2, -50, 29, 21, 30, -15, 90, -116, -129, -7, 41, -125, 117, 93, 0, 197, 27, -37, 24, 32, -193, 47, 37, -37, -18, 69, -79, -118, 70, 27, -195, 211, 43, -156, -108, 259, -150, 77, 112, -70]
7121g0J66n3J8p5K42k46q8L04k79l7j8M8p8K05L3k23L12j05j24J57J27k48K9J68
7145A65j55P1J06k28j01J44k6%j05K13k22J24J11j07j5M2k79K06J77k55O0J34
7167F0r9p3L33m6k98J61Q6k16R6P8j49QJ91j26j38L93k32p2K2K8KJ2J85m08L62
7192A60Kj80o4K13j71K9J44k70K02K5j30P2Q7j8k82J68J16m3j13N3k01K57Q8j43
7216Aj0R1o7j55K76j37k03L83q7p3jL7l51L59n7q6K03O3k92P6J25j36O7roj08
7242i7J99J20m18K17Q5j43L5n2J23k20N07l61j12L75k56q6K25j73q0J78j60j17
7264b11K34J1j15J1J89o3r2K79k49k42L29K2l44L72Qj95J12N8k86K24K05l36J34
7287E5k9o3M9Q6j55j73K68l0k85L32O1l50K58J49k87J05Q3j94J62Q5j25NR7q3
$$ y = [-70, 96, 43, 61, -14, 228, -18, -106, 198, -81, -118, -136, -88, -166, 39, 72, -151, 161, 56, -68, 89, 216, -32, -3, 165, 10, 81, 187, -41, -142, 2, -24, -24, -129, 84, -138, -14, 97, -10, -25, 17, -262, -56, 121, -134, -74, 60, -39, -112, 221, 175, -123, 38, 124, -92, 4, 82, -67, -59, 132, 6, -132, 261, 29, -43, -21, 7, 9, 21, 206, -202, 160, 162, -18, -82, 131, -40, -11, 133, -137, 65, 90, -40, 32, 119, 101, -181, -13, 103, 60, -53, 0, -201, 56, 144, 1, -9, 82, 15, -140, 136, -1, -204, 179, 92, 19, 18, 55, -296, 63, 6, -80, 123, 186, -106, -30, 95, -41, 26, 17, 11, -97, 102, 222, -196, 21, 106, -37, -2, -54, 69, -151, 356, -5, -117, 258, 2, -84, 141, -32, -112, 66, -94, -211, 23, 34, -81, -70, 119, 56, -36, 243, -6, -248, 81, 103, -241, 131, 139, -56, 56, 114, -172, 52, 257, -79, 55, 26, -37, 12, 98, -57, -230, 38, 8, -277, 55, 116, -234, 24, 173, -114, -9, 74, -120, 42, 127, 2, 7, 104, 21]
7311B1k40J82N3j92K47Kj49L1J59q9PO4j66l2P7N9j28J10J38k73L2K86l00J06
7335EJ24l14J02J20m6j99L57jk37P1R1j54K00j28P3J3Q3j96o5K16j67j6Q5n2o
7360d1K08k33p8J63M4j33k1j7R5n2J34j75J52p2n0n6J07P6j77K37k59J55j2J22
7384A17k20J42P5l63K47J0k76K89R4j33q1J56N4j69K08o9j76J36O7l20K54M4j88
7407a02O8J0O9j5J69k24J40q1Jq0OK50l36K13K1k80L04R3k74m5J63j20O9R4j49
7432c6j34K25n1r3l8K22j53K57Kk24J11R6k26jN3J19j68K89k49q2Qoj43K60N8
7457I6j85J01rl7k55L91j37n6K61j75j45J57l8jK36q7j52j6O7j6j16J49m4M8P5
7482A12r6j25J93m9j32K65j63j17J31j05J44LP9k73K09M0k23Q6J61j39j15L40
$$ y = [21, -219, -37, 16, -176, 71, 73, -76, -45, 114, 25, 32, 96, -70, -102, -25, 34, -94, 16, 154, -119, -87, 199, -101, 5, 129, -185, -83, 37, -9, -208, 149, 148, -89, -18, 73, -81, 119, -9, 64, 77, 160, -36, -101, 115, -52, -68, 17, -35, -41, 167, -66, -144, 19, 63, -70, -91, -108, -13, -65, 69, -106, 46, -26, -76, -132, -25, 51, -126, 111, -148, 7, -5, 117, -103, 39, 114, -249, -2, 8, -268, 21, 115, -18, -99, 57, 111, -58, 150, 81, -95, 41, 108, -212, 42, 86, -102, -34, -24, 45, 30, 199, -25, 115, 34, 35, -45, -39, 211, -125, 88, 109, -171, 133, 226, -48, -93, 70, -50, 19, 113, -36, -170, 55, 4, -89, -127, 95, -58, 199, 201, -23, 88, 184, -42, -43, 10, 129, -39, 250, 1, -81, -73, -79, -222, 38, 96, -89, 12, 3, -34, -289, 102, -35, -91, 170, -5, -150, 7, -31, -32, 204, 117, -35, -51, 16, 0, -116, 33, -11, 37, 112, 16, -109, 84, 35, -97, 168, 5, -112, 19, -86, 58, 61, 140, -133, 76, 116, -107, -21, 140, 1, -114, 226]
7504B26l56j7R7L8j41Q8J19j53J07Q2j90J52M1r6Q8oj00j56M52j34k56J20N8k95
7528b32K80N2j71j25L04m1k2j2j47O9J45j60P2L2mj21K47j51k8o9J97l15O9L95
7552B64l43L8P8j07j3J84M0k61J60l2N4j2O9%r6k0k02P5K05j15J02J48j91r3J96
7577A28p7k46K74Q9l16R9J66k02K26k1l36L01Lk2q2J99j06j87P4J54j79L3J76
7600A48k09K46k3j35r7M1r2J31N0j42J25p5O5k27J80N2l49L71mk63Q2K00k21J29
7624a7R9j44L1J06k3k08K89k26K0J02j9j65K03m2k17K43O3j27L9J22j84l9J25
7647C1j00o1K02L4j93R6R1j50k7J64o3j03J69j49J04r7j16J62j2J63l31L14j10
7670A8j65J54j04O5O4J46k37L3Q8j42j00J97O2l59M28r6j35N2J03j81J1Q4k5J6
$$ y = [226, -130, -147, -50, -12, -153, -65, 54, -99, 8, 90, -100, 52, 93, -3, 85, 79, -21, -177, 275, 141, -115, 5, 63, -232, 48, 100, -71, -196, 108, 67, 45, 33, -114, -45, 100, -60, 12, 44, 40, -81, 166, 15, -13, -82, 115, -200, -131, 264, -79, -41, 37, -70, -83, 101, 141, -120, 40, 8, 62, 50, 119, 119, 23, 3, -199, -124, 81, -34, 68, 216, 25, -68, 128, 51, -195, 79, 168, -148, -49, 117, -85, 141, 120, -216, 85, 88, 66, -16, 183, 77, -110, -36, 118, -61, -28, 148, -61, 185, 162, 27, -70, -29, -121, 10, 60, -82, 43, -32, 33, -194, -14, 38, -311, 60, 56, -207, -125, 75, -146, -17, 82, -62, -31, 75, 52, -156, 133, -93, -73, 29, 10, -155, 48, 6, -211, 32, 95, -32, 7, 129, -55, -94, 31, -69, -130, 72, 106, -87, 9, 100, -50, -77, 87, 24, -79, 90, -59, 45, -52, -168, -6, -18, 145, -186, 128, 18, -147, 7, -97, -32, 32, 178, -59, -26, 62, -80, -180, 17, 79, -280, 148, 52, -83, -31, 72, -109, -98, -14, -39, -23]
7694b3j7n1L5j2O1j8P7Jj73J82n3n5J03k8j29J05K47l36OL13l10l7J05N6o8J04
7720H5j02k07J68K67j88J58p7k46J97Nk02R7J33j7j01L5l2J7J06j20j60K73R7
7743A86k01m0P6rr0Q1n5LJ31k3j86K31r3j23P9M4j61QL10j90K5N8j03MJ21j76
7769i3J10L2r8j44K03l3p5r5K99k51N0J62j50K10J4k32R0J98j63OJ16j77n7J61
7793H3J3j25R7J83m47J30K74l36rK10j86J40J22l47NK08q3L2J21j1k76K89m4k63
7817b20M4L53j88j0l3j10o8J34J4RJ36qq8kO9j61J12J69k54J07O6k55J62J86j35
7842B9j00J75o4j41J00J58j72m1K04k65J56J30j13k8K7q0k7O5k1k07K19J07j46
7865c5J64m1k73J77K67k87j16J00j07J5nN8O3N4R1k60K54k06n0J82J8j43J44N5
$$ y = [-23, -40, -91, -56, -68, -7, -25, 52, 53, -120, 62, 9, -46, 57, 29, -100, 5, 252, -84, -78, 235, -75, -112, -7, 49, -19, 85, -17, -224, -56, 211, 23, 181, 104, -142, 55, 60, -142, -45, 88, 71, -30, 5, -27, -10, 96, -24, -184, 89, 186, -15, -55, 21, 12, -78, 3, -52, -49, 82, 59, -127, 104, 11, -112, -33, 11, -150, -142, 168, -22, 3, 61, -42, -38, 83, -93, 17, 49, -49, -193, 10, -23, -98, -193, 106, -145, -95, 67, -83, 127, 141, -91, -1, 197, 34, 40, 156, -21, -78, 83, 96, -29, 68, 251, -196, -66, 208, -128, -137, 73, -113, 27, 149, -198, -193, 15, -68, -36, 85, 74, -202, 87, 43, -220, -176, 177, -11, -21, -54, -164, -232, -98, -84, -75, 61, 53, -35, -37, 32, -129, -17, 152, -102, 5, 71, -184, -22, 164, 29, -71, 104, 40, -101, -1, 157, -15, -56, 148, -117, 39, 169, 56, 28, 55, -25, -52, 13, -8, -215, 4, 111, -35, 129, 88, -185, -8, 259, -28, -144, -44, -151, -136, -141, -83, -20, 34, 125, -135, 119, -87, -137, 45, 63, -80, 64, 119]
7889A19j60j2J98r3j31K00j28r0Q1j8o4J45M5p3p3J8l6J90j71M2n9J10j33Q7J18
7914A12j24j46K19J25l13L00j74K1p1J47j65k7J10j11J93J09k13N1L1L1k22J24
7936Gp1r0K34j4k97K07J08j88J04Q7r0r0J84k64N2O2J8n8J27J17j68qM1j13K69
7961A66N2k00L7j70Q7j0K87j16j79l0R6j55K05o2j55K35M5j99N0K4l1j81K87j62
7985g9KR6j05j85L04Q5j48qJ72j80O7K07m64L98L2j93Q4J3l2k73J80J29l37L94
8009A59j01l0o9J41k08J07O7j1j87K05P7j55N0q8P5M9k6j30K04O3j63j30K55k28
8033g4J89q2m9K2O2j69j3K97p0j80J12k9o8R0K7j43J18Q2j74J08j18o7J23O7j66
8058a05M5K06O4j64k3k4P0j80J75j38J1K30k72J19Rk30J53N0J37k57RJ85j82J41
$$ y = [119, -41, -53, 145, 52, -79, 121, -7, -97, -16, -34, -98, 47, 92, 19, -54, -36, -72, 118, -53, -11, -70, 40, -93, -6, 112, -12, -158, 61, 186, -127, 173, -1, 20, -51, 96, -69, -96, 14, -97, 96, 205, -8, 43, 74, 105, -117, 7, -64, -154, 80, 66, -231, -24, 84, -104, 0, 87, -3, -93, 91, -173, -121, -59, -41, -99, 28, 145, -23, -31, 10, -103, 166, 218, 18, 55, -115, -28, -38, 249, 133, -46, -76, 20, -135, 70, 8, -147, 88, 133, -66, -16, 8, -23, -204, 83, -79, -77, 19, -86, -271, 33, 118, -30, -38, 134, -46, 21, 228, -236, 162, 194, 1, 85, 98, 66, -207, -27, 102, -235, 159, 58, 28, -41, 100, -108, -1, 66, 55, -132, 73, 150, -5, 45, -43, 32, 81, 55, -75, 129, 192, 29, -101, 154, -74, 115, 33, -16, 6, 68, -101, -114, 183, 113, -67, 45, 16, -52, 38, 65, -78, 40, 122, -52, 56, -62, -129, -6, 61, -105, -60, 146, 210, 46, 23, -1, 69, -111, 64, -74, -63, 167, -105, 14, 23, -207, -54, -4, 133, -124, -115, 70, -112, 29]
8082B9Jk2J5O1k04J75m5J6k15K77K2l67L52j16n1Q6m4jJ21Q3o8j65J25j52l5R0
8108c2J61k16R7p9Q6K19k27k32L0K18o6r4L01j64kj33J21n7J63k4q7KOm8O6N3
8134F2j72J20m9M5j24J77k01Q6J29k01P7m6J01k15K91k10nJ42J1M7J7j00K6o9
8158f1J80j09Q9K5o9j77L3N5l4Q3J2l5J37M0k14O5J11j13j72L99l20l7J54r3O
8183d5J94j58r2lK33k18L5J16
$$ y = [29, 30, 8, 23, 84, -120, 55, 10, 26, -189, 88, 110, -257, 95, -21, -72, 14, -30, -31, 90, 173, 105, -60, 65, -87, -122, -32, 129, -87, 10, -69, 17, 236, 9, -223, -193, 25, -41, -135, 166, 2, 0, -133, -12, -69, 94, 70, -17, -15, -9, -57, 9, 62, -110, 10, -39, 6, -118, 59, -142, -56, 73, -128, -51, -97, 4, -211, 80, -130, -135, 7, 18, 65, 82, -18, 8, -61, 119, 10, 99, 124, 55, -122, -89, -34, -68, 15, 27, -8, 129, 169, -45, 20, 131, 18, -154, 245, -75, -112, 42, -51, -45, 149, -9, -101, -104, 129, -89, -54, 62]
8191F2
$$ Imaginary data points
##PAGE= N=2
##DATA TABLE= (X++(I..I)), XYDATA
0@%%%%%%%%qJ6j6J6j6K4l2M0n4O2p2R4j18J40j64J95k34K74l18L70m29M97n73
31c06O53p42Q45r56J080j219J369j535J718j918K133k368K627k909L217l554L923
48B058m326M767n251N785o374P023p746Q557r471J0507j1692J3067j4688J6626
62H842j8992K1960k5807L1016l8522N0426p3066J87835n07222K70378N17131o66320
74b42341K15288K48358l51384O7525J54610j79341J05541n2510m8508J17769m7280
85a2273j19442J37776K6775j55258Q7537R5979j05281j0084L729K5895J14093
96H9446r7767j13713J68891n7657k7544J10624r4968j1669M0108j0722O7647j05354
108d2678l5186K29904j69856j15154K68169j14153j10784J39308L46l1721k8759
$$ y = [0, 0, 0, 0, 0, 0, 0, 0, 0, -8, 8, -8, 8, -8, 16, -16, 24, -30, 32, -40, 54, -64, 76, -88, 107, -127, 147, -171, 199, -230, 267, -306, 347, -395, 450, -506, 574, -645, 724, -811, 907, -1011, 1122, -1246, 1381, -1528, 1689, -1865, 2058, -2268, 2499, -2752, 3033, -3341, 3682, -4064, 4493, -4978, 5529, -6163, 6904, -7784, 8842, -10150, 11810, -13997, 17019, -21503, 28923, -44143, 143692, -363530, -93152, 423979, -242341, -27053, 221305, -130079, -62554, 92056, -87285, 18256, -34254, -82762, 35007, -12273, -131715, 6061, 32836, -122422, -34885, 61094, -44187, -54271, -50542, -24647, 89446, -8321, -122034, 46857, -10800, -38344, 72280, -22688, -34357, 5751, -4971, 62676, -42678, -77864, 152040, -17816, -132970, 135199, 21046, -89738, 49570, 49916, 18195, -10564]
119a0564j2512P9166m7524J1590P6079j72148N1686J38996j26457J2772N0462
130E1546j00387N9164Q0869j55505J8099J35341r5543p5332J05626M437r2838
141f4523L9616K6066J8646n8259n1333J50506p5463j08170K47455r7278k61192
152b33929L32113K0692k85478K19117J658j52163J75352o2810r7092J81695j02333
163c178o1818J72675j33769m0290J64333r1278p5325J41177m6969r6911J06436
174C5083j4627l1145O1642q4059l4601J57293o2709j13431J37194k0946q9795
185f0101P8499K6104q3659Q069Q8139m0103r2451P4241P4319j28331J8816R6121
197E9663q0995j4902L5358o002R061j800j9459L259q666L8064O153o4765N4307
$$ y = [-10564, -23076, 56090, 8566, 20156, 96235, -75913, -24227, 114769, -11688, 1084, 51546, -48841, 10323, 91192, -64313, -46214, 89127, -6416, -81748, 23878, 28315, -64523, -24907, 1159, 19805, -38454, -89787, 60719, -14744, -122914, 124541, 27263, -233929, 98184, 118876, -166602, 52515, 54173, -97990, 77362, 14552, -82540, 99155, -3178, -64996, 107679, -26090, -66380, 97953, 6675, -68650, 72527, 25558, -71353, 35083, 20456, -10689, 50953, -33106, -67707, 89586, 26877, -86554, 50640, 29694, -60101, 18398, 44502, -39157, -31088, 57051, 16948, -75503, -1262, 73057, -55274, -36458, 59663, -21332, -36234, -876, -6878, 2183, 383, -19076, -15817, -24483, 13581, 19734, -45031, 9276]
210I276k168l6224O4833m0033m8950J13078k1173j14980J05334K3829q6410M7407
222A3819J8482m0351K9349j8777k4955Q0384o1968k6548J00096r8814k9167J59495
234A01045r0402j10812J63717l2100r4916Q8227k4075k0529M9850n0276n434N5070
246B9365n6118K2225L2930o8415M1557J6455n2634L5436J1590m0898N4268l0349
258d588o7906J22358q021j25874Q1890P0474j20511J5696R1914p5667j5172O9193
270C3786k5195n3902N0890K7989m6152O04J8089J445k960o976j4096M6499j808
283B8213o7877M6713L1303n0438J2859L0539m4323J7917J9346l6698K8003r281
295F276j2562M1275l6752l9977Q4193r050q2207N6014J9441l5682k624K027K5196
$$ y = [9276, 7108, -29116, 35717, -4316, -53266, 59812, 38639, -76341, 28993, 52822, -33588, 13819, 32301, -8050, 21299, 2522, -22433, 57951, -4017, -30565, 69531, -29283, -58450, 101045, 10643, -100169, 63548, 31448, -63468, 24759, 684, -19845, 30005, -20271, -25705, 29365, -26753, -4528, 28402, -40013, 1544, 17999, -34635, 801, 12391, -28507, 25761, -4588, -72494, 49864, 41843, -84031, -2141, 68333, -52178, -36482, 55432, -20235, -35407, 33786, 8591, -45311, 5579, 33568, -12584, -11980, 6109, 7554, 4594, -2382, -16478, 30021, 28213, -39664, 7049, 38352, -12086, 773, 31312, -13011, 4906, 24252, -12446, 15557, 6276, -6286, 34989, -1763, -41740, 42453, 33403, -48804, 7210, 26651, -9031, -11655, -9628, 15568]
308A5568l278n2310M3239K9655r5009O6097N4392j26695M0463R4731j06703m767
320d4617R3435p5501J0773M9187q0473L6383O3577q7579K465Q1120o5254j3259
332b9743N6291k5874j7598K1546R607k1829j2711K8334K7738n7518p081P0321
344D1483l3995l8544M1439J3586l0879R612L698m285J0326j2425J3606j216k1624
357i218J6359K1059l4662m774M1154j9492k5026J0735K0449j1890j1128L826o411
370i019J4832n010k7599K0753K8473n5394J4833N0316p3120J3034P4543o6101
382a9459l4764Q8419k1965n5843M9774J2754k5879k320J1830J732K378p051M073
395C679O129k0541K1861N236k9954J5188J9663k5761Q850kk5219N1250k0444m7944
$$ y = [15568, 12290, -40020, 3219, 32874, -62135, 3962, 58354, -68341, -27878, 66853, -39850, -44617, 48818, -26683, -15910, 33277, -47196, -10813, 52764, -34815, -32350, 48770, -16484, -29743, 26548, 674, -16924, 4622, 14229, -7600, -20311, 8023, 35761, -21757, -28838, 41483, 7488, -31056, 10383, 23969, -6910, 2702, 6400, 2115, 12441, 16, 13622, 12406, -9218, 7141, 28200, -6462, -11236, 29918, 10426, -14600, -3865, 16584, 4694, -6434, -2608, -9019, 5813, 803, -26796, -6043, 22430, -32964, -18131, 32185, -40935, -27901, 46642, -19459, -54223, 34196, 12231, -43612, 6162, 18916, -6963, -9283, 2547, 4279, 6657, -394, 3679, 9808, -10733, 11128, 16364, -13590, 1598, 21261, -4500, 4350, 4348, -20871, 30379, 9935, -38009]
409c8009N9844r47n3504M2503J2152m2383K9140m434j5140J9800q336r12O143
422E917j5440K190L1865k9002k6367M6585Q269n4008J5261L9491m8095J1179L2319
435B0164l8757o78K9395j2180j4905J7116L312j1447m946K1677p721q238K5552
448A8344k9242M966L7685k7725k0606L3702O089k2576k00J3698k530k2318L5852
461B5139m495m9345M2154R592l9062J7951P747j9772J4074j5309K778K8363l6869
474a7054n220L0895n647k3761J5681J1696k7899J5767K4960l7552q104M4297k0849
487b790n020J1827k5113L0671m77l1193K8567O905l1443J2218J6737n032j5569
500i712k084L6531l3027j0646N4745l6747l1244N7348N644n0906J1492L1851j0463
$$ y = [-38009, 21835, 20888, -32616, 9887, 22039, -20344, 8796, 4362, -10778, 9022, 686, -226, 5917, -9523, -7333, 24532, -4470, -30837, 15748, 24017, -29991, -14730, 24761, -23334, -12155, 20164, -18593, -19271, 10124, -2056, -16961, 155, 3467, -7980, -12926, 8751, 1030, -7208, 18344, -10898, -5932, 31753, 4028, -16578, 17124, 23213, 637, 437, 14135, 11605, -10713, 25139, 20644, -28701, 13453, 23045, -16017, 1934, 9681, -10091, 3983, -11326, -8548, 19815, -17054, -22274, 8621, 2974, -20787, -5106, 6590, -21309, -5542, 19418, -18134, -26238, 18059, -2790, -7810, 4017, -21096, 9575, 9098, -22095, 6472, 13377, -18066, -5848, 10889, 5857, -9712, -11796, 24735, -8292, -18938, 35807, -940, -32184, 25164, 30808, -20098, -8606, 23245, 12782]
513A2782k1813K5325P38l5634L8225r30k8887K5469j1349j3124K7897j8755j1204
526a1260K8915k5939m542K0481l917j2663j1020K4062p4j7818P584n266n22K3822
540A1843k2535n747K6961l0425J5772K1783l2951L498J9229m746r943K711J6925
553A2375j0019k5690L9034J191l6964K5184j705n660J4964j4398o737J5026k625
566C976k051N602o093q755M089L3399l3393k4187N9955k3813l8247N0275M83m3772
580b2532K2416J5566j3267q095L546J1970k0111R477J3688k1838n26P422N185
593B901O064k2234m898L5330j9919j2149K3195j0488o025N161J1030o345j3136
606a1513J5258M456j8633J6111M478k4342K0846k530o314J4575j9997k830K4744
$$ y = [12782, -9031, 16294, 17032, -18602, 19623, 18693, -10194, 15275, 3926, -9198, 18699, -56, -11260, 17655, -8284, -12826, 7655, 3738, -8925, -19945, 4117, 4043, -13775, -6191, -11457, -11979, 11843, -10692, -16439, 10522, -19903, -4131, 17652, -15299, -11801, 7428, 2682, -7261, -4550, 12375, 2356, -23334, 15700, 16891, -20073, 5111, 3406, -2254, 12710, -1688, -8425, 6601, 3976, 1925, 7527, 1434, -7321, -3232, 30167, -3226, -27413, 32542, 8729, -29518, 20757, 21240, -22532, -116, 15450, 2183, -5912, -2366, 9604, -10507, -1030, 12658, -9180, -9706, -2284, 2901, 8965, -13269, -18167, 17163, -2756, -14905, 8290, -2198, -8223, -3062, 7968, 1623, -11513, 3745, 8201, -10432, 5679, 10157, -14185, 6661, 4131, -2183, 12392, -7605, -10435, 14309]
619A4309m431k1229Q125J0255p072p883J8456q752k2488L4108o788k2910K3598
632G298l049j6575J7048jj3260J2347m665m965P397R381j5307j2870L1570o462
646G887k2132J9425O85k0770K0575O132k2460P239O629J928q697M89Q432p135
660a773l76L011R74M47m406m648J8016p971j3187J7952q511m947J3687j337j5591
675h660N084J3901p063q500O268L955j0207J1359m623q936J5983q988p499J5540
689G614l316j7022J7187L191j8276J0473R965j7637n620L0067j3179k2255K3257
702D449K971j8035J0596P222j8739J0390P355j0256q0N865j092n921Q647m899
716a527l625R006k802r090J1651M222j9212R655R792q370m389O463n84n007Q081
$$ y = [14309, 9878, -11351, -3226, 7029, -43, -7926, 10530, 1778, -20710, 13398, 6610, -16300, 7298, 4249, -12326, 4722, 4721, -8539, 3808, -857, -5822, 1575, 10956, -4351, -17221, 14349, 7887, -14245, 5180, 5865, -14905, 5670, 11802, -10658, -3419, 3210, 5138, -3559, -3070, 5362, -1773, -2149, 862, 1836, 2283, -2123, -6771, 11245, 3274, -9913, 8039, -472, -5419, 8268, 6931, -8660, -3576, 10325, 3262, -5238, 1030, 4985, -5222, 6137, 1514, -7422, 8561, -427, -7926, 7614, 4298, -12724, 4463, 7654, -10622, -149, 9816, -7821, -13441, 16626, 3447, -18808, 4449, 7420, -10615, -19, 7203, -11536, -1146, 6209, -4047, -4127, 1738, 646, -5275, 3372, -1527, -5152, 3854, 1052, -8038, 3613, 7835, -11377, -1722, 8070, -300, -4689, 1774, 1190, -3817, 4264]
731D264l420k730K270J662p59K478n219k492J6475j2735r138J9682k10k1670J3963
746B421J5029k5033M294J6725j3933o765K0210r714j5301K0741m145j1774J0795
759C550n45j3436J5023J536k1704J4717J0339j8382l423K1418r840j5048J8727
772B932K382j7107N243J6371j7236l298J8323o136j0859Q122O362r024N486k834
786a273j782R476o715n838J1248Q19j4698J3945K315j4776R655O144j0918L11
800b087J0507r036J438L757n667N566K168r990Q92J6529j4763q241J9961m743
814F291j7090J3788R782k3560O841J6062j4954r438J7872n7j8530J2394M959j1478
828g118K715P029q594K076Q674j2126K055J0084n728p942J3713m76j5933J6651
$$ y = [4264, 844, -1886, 384, 2046, 1287, 3765, -1454, -3946, 12529, -206, -9344, 10338, 10128, -11542, 2421, 17450, -7583, -3289, 13436, -497, -7262, 12948, 3234, -12067, 8674, 4529, -7245, 3550, 3005, -10431, 4592, 6128, -15576, -859, 9480, -8902, -12325, 9093, -747, -15795, 2932, 5314, -11793, -6550, 9821, -7415, -10713, 7610, 1474, -9385, -1263, 5099, -3925, 1561, -1273, -3055, 6421, -294, -6132, 5116, 5935, -8763, 5182, 7497, -7279, 2376, 8520, -2398, -2087, 8420, -616, 822, 4579, -1088, 4478, 6646, -3344, -2452, 14077, -686, -8927, 11034, 6291, -10799, 2989, 12771, -10789, -3948, 12114, -2840, -12278, 5594, 5537, -12993, -599, 4360, -7118, -4403, 2626, -5968, -3892, 4782, -7344, -5289, 4795, -933, -8875, 4838, 4362, -11571, 5080]
842E080L787j9193Q758J5449j9550P32J4686j0887J218K790l017K353R97o760
856c557N332L955j0874N974L832p442j387J1465p282p943J3193l624n660L747
870b71J456l329K831o7l074J753J740O1p998J1060o82j4780J5114L087j7936J0760
886b75J1761k2585O571J6411j4346o547J3834K249j6034J0794N775j3991O998
899F15Q390j2991K707R894j2489O208L421q343M599K348m666j183P634n377n308
914d541O875K367q934M000L338r675R388k826n222O033m175J118L943o421j39
929d871O988o034K443j444J589L070j1307J2455K415j6240J1146Q473j9071R367
943a021J2817k0289L240J5319p844j1167J5505k71j6257J7707P25j8339J3468
$$ y = [5080, 8867, -10326, -1568, 13881, -5669, -4937, 9749, -1138, 80, 2870, -147, 2206, 3203, -3557, 1775, 5730, -5144, 830, 4662, -2780, -4167, 7298, 16, -7927, 5266, 1642, -4018, -271, 1185, -2144, 687, 620, -2454, -701, 1039, 1100, -6898, 4162, 3480, -11300, 3814, 6901, -11035, -275, 11486, -11099, -4528, 11883, -2463, -9010, 4824, 7073, -8961, 1833, 7608, -6383, 615, 9005, -3986, -1279, 8615, -3874, 2334, 5755, -2588, 2011, 4359, -307, -1490, 6144, 767, -4541, 2334, 4701, -4233, -233, 3105, -6570, 2818, -8, -5230, 803, -3372, -2254, 1689, -4732, -4871, 2117, -3917, -1474, -2918, -1329, 1741, -9566, 2889, 5304, -10936, 210, 8683, -10388, -1021, 11796, -8493, -5253, 10066, 2222, -8945, 6560, 6289, -9968, 7739, 8464, -9875, 3593]
956C593P477j8521J0529N593j3966P931J491j957k962J614L764p145K091Q295
970G827j0698k212J2662j0526K448L829r818Q029O77n434K014J133k851J604J350
985C4N47n842J588J0043j3140M381P997j2461M153O511o257J055K563o469P038
1000A741J950o952k58P622j842j1571J7823l516k1116K3160O464k8455J4769J4235
1014A4054k4412Q836J0168r521l239L812O646q258r26Q681p171m034J3826q610
1028a48n515J1304p846Q97O338m728o056Q035M028j1628M497P281j1258J033J3708
1043I942j4190P62J0315j2650Q024K390j0291O533K103p605P193P59p978L720
1057i73K690K134q173K875N864r928O656L731j1315N130P031j2160P064M640j2544
$$ y = [3593, 11070, -7451, 3078, 8671, -5295, 2636, 4127, 2170, -792, 822, 4586, -2559, -468, 7827, -2871, -5083, 7579, -2947, -499, 3330, -6488, 1541, 2218, -3216, -1202, -69, -2920, -1316, 34, 581, -5261, -3673, 6370, -6770, -2389, 5608, -6853, -2700, 3811, -2446, -1391, 1172, -5297, 1741, 3691, -3261, -3519, 4103, 2261, -9310, 8513, 4997, -16119, 7041, 13505, -14950, -181, 14054, -10358, -1522, 8646, -875, -4114, -302, 6344, -1914, -2840, 5841, -1330, -5364, 8462, -148, -5663, 5641, -2205, -1308, 5030, 302, -5754, 2281, 6309, -5319, -822, 6459, -4799, -3766, 9942, -4248, -3486, 6829, -5821, 2203, 4593, -5698, 835, 2938, -4667, 2526, 3285, -4693, -973, 1717, 3851, -4322, -1447, 4417, -5511, 1145, 4876, -6439, -1309, 5722, -6438, 626, 5266, -7278]
1072g278N500O666n246o074R803j13j2274J0359Q052j7033M28J7780j2074n083
1086f587J0677j883p373M330R576j2652j660J2437p108m498J1531q392l286J3245
1100H357j1689K453P515j1267L168P984p493j037N457n649L114J602k913m72J116
1115B46Q42k117M222m517k568O953j147n672M247K476o650L494K818j781n436
1130d590M727N055j0822N837N554j1967L339J2279j3626r07J2108j0098k25Q456
1144E120m273p717Q765L519j0779M344O270q675j528J2208q803m363J0177m872
1158f07k668N380o36n692M689Q77k688J497j157k86J524J689m545L255L4l779
1174c113N917j560l950L203K527n129K416K335l154q03K635L084p406L455M565
$$ y = [-7278, -1778, 4888, -358, -6432, 3371, 3258, -9016, 1343, 9395, -7638, -7210, 10570, -1504, -6587, 4090, 2207, -5166, -836, 8740, -3912, -5572, 6865, -243, -4741, 6790, -1602, -4888, 8357, -3332, -879, 6636, -4631, -1463, 6521, -972, -2009, 3448, -2201, 913, 2515, -398, -870, 246, 1088, -1029, 3193, -1324, -3892, 3061, 1914, -3758, 489, 2965, -3685, -191, 2627, 846, -4590, 137, 5192, -5630, 207, 5761, -6206, -2867, 9412, -4214, -5121, 6987, -3111, -3336, 5120, 847, -6870, 1895, 5414, -5365, -1021, 5249, -3426, -4954, 7254, -1549, -5912, 4265, -607, -3275, 2105, 1469, -4223, 466, 1343, -1345, 152, -1005, -1291, 233, 1922, -2623, 632, 666, -3113, 2804, 1244, -2706, 497, 3024, -2105, 311, 2646, -508, -1311, 1324, 4408, -2998, 457, 5022]
1189E022q141K501P826r473k390J3258r576l547J1500o554o733J2073j208j3057
1203h499J1645K393j2165N902P464j0785p10J0901p743k713O423j356n502M582
1217a63K702o586K338K408k225o40L618m101k41N860n563K74L945k548k201M777
1233A654j260l726M740j026j362J127J735l069J694K173m452L281J756m947O14
1248a068P732p152l603J1078n198o741R296J092j2163Q318N449j2236M192O738
1262E734q034j041Q768o990j459O682m703j978M744n7o503N107K877o190K94O170
1278C421l802n221R484k552o912O562K123o792K401M684o501K662K184l712J707
1293b64K318m552J549N214p489J873N200n392p38N851l272l616O333k261k563
$$ y = [5022, -3119, -618, 7208, -2265, -4655, 8603, -973, -4520, 6980, 426, -6307, 5766, 4558, -8499, 3146, 5539, -6626, -724, 6740, -4045, -4755, 6146, -1597, -4310, 2113, 757, -4745, -163, 2539, -4047, -1709, 699, -1526, -2166, 1452, -2649, -2890, 2970, -2593, -2319, 1626, -922, -3123, 1654, 394, -3332, 1408, 382, -980, 147, 1882, -1187, 507, 2680, -1772, 1509, 3265, -1682, -1068, 6664, -488, -4091, 6987, 1789, -4952, 4344, 5436, -6727, 1591, 7040, -5196, -1004, 5734, -2300, -3341, 5427, -1563, -3022, 3660, -1043, -3021, 1723, 1666, -4837, 270, 3147, -3043, -2749, 3421, -381, -5602, 3882, 1330, -5582, 980, 3103, -3689, -1288, 3396, -3105, -443, 1741, -1971, -264, 2054, -2498, -949, 4265, -3224, -1351, 3849, -1543, -2281, 3570, 298, -3318, 3015, 754, -1809]
1308a809K840M03k957K068K235o238M073K991o597J138P132p194k539R983o367
1323h38l978P163L1p194M490M714p471R17N283l006l483O419k493l421O004k502
1339F35k478L099J459m842K477L441n298P80M522l919l013P764m838l026O845
1354C608l633j803L891k407j861M560l237j042L511k151o93J024J547l998K090
1369e94L006m901R51L683l794j126N658m421r12M287k216j888K553K031o237K645
1385a275N219o438q94Q075n563m187J0670n551m178P181r61m544K815L014m844
1400a461P80M029k644k996N998k798l867P598m415k211M763k329j690L632j856
1415E33k336L270o74j336k58K651l016p80N397n566j68N283m216j557N688l764
$$ y = [-1809, 1031, 1434, -1523, 545, 2780, -3458, 615, 3606, -2991, -1853, 5279, -1915, -4454, 5529, -838, -4816, 2347, 2378, -4816, -326, 4388, -3083, -2166, 3117, 111, -3372, 3047, 554, -2867, 3137, 635, -1843, 1256, 2715, -2127, 350, 3791, -1507, -727, 3795, -124, -3137, 4627, -211, -3237, 3608, -25, -1828, 2063, -344, -2205, 2355, -882, -1924, 1587, -564, -1257, -233, 1314, -2684, -594, 2412, -2489, -1538, 2145, -1649, -2775, 2883, -1538, -2450, 1837, -379, -2267, 286, 2317, -3920, -1275, 3944, -2494, -3388, 4687, -876, -5063, 5607, 56, -4122, 3059, 2098, -2446, 369, 3383, -1461, -681, 3348, 704, -2292, 3706, 908, -2959, 4639, 224, -1987, 2776, 447, -1243, 2389, 533, -1803, 1467, 793, -543, -801, 1850, -1166, -1946, 3451, -2115, -2283, 3000, -1216, -2773, 2915, -849]
1431h49j787M543k542q1K96J013k196R33L397m893oN538n138k010Q996p134l218
1448e138J0100m650m613N461J759o881K513N817n928k484P889k747n990Q912l545
1463D75m427O677j917k484K646k8k112K188M57j856q48L215q64l824O111l547
1479a38k379N948l177k187M670k706k097M943k891j375J913O92j866l12M580n139
1495a521j266O813l614m477P119k724l997O825l337k307L101K1k250J190K509
1510B085m545M56N272m339l436Q639m540n244J0116l360n888N218K241m858P40
1525a443L575k751k029L984P92n504M489J58l455M430k190j459K901r57j937L250
1541A854j116k204K043J032r88k289L773k006j939N071l046k710M823j398l532
$$ y = [-849, -2636, 1907, -635, -716, -420, 593, -1603, -670, 2727, -2166, -2172, 3366, -1772, -3782, 5214, -1920, -5138, 4962, 312, -4301, 1160, 2919, -3962, -1449, 4368, -1560, -4044, 3845, 1098, -4892, 4020, 475, -3952, 2725, 808, -1676, 970, 942, -1170, 1018, 1475, -381, -1229, 1986, 1122, -2702, 3409, -138, -2517, 3431, 254, -1933, 2737, 31, -2066, 2877, -14, -1389, 524, 1216, -650, -962, 3618, -1521, -2787, 4026, 412, -4065, 3054, 330, -3667, 3158, -179, -2486, 615, 636, -1614, -424, 2085, -2460, -2004, 3268, -1071, -4507, 4132, -408, -5652, 4464, 1104, -4784, 434, 2675, -2183, -1443, 2132, -619, -2648, 1336, 2128, -3376, 1113, 1271, -2184, 2246, 56, -1403, 1498, 541, -1396, 1854, 738, -1466, 577, 1609, 621, -1668, 2105, 99, -1840, 3231, 185, -2525, 2298, 900, -2632]
1556b632N545k935k579M433o03k713N93L377l699o10M892l067l186N231o90m623
1572c266N774j999l385M397j80l033J176K273l559J106L185l000k574N628j336
1587A207n018O010j097m156L928O53l176R81J610j863P87N36k15j695J978Kj940
1604a468L173k447j132L788j187l237L771o96k943L678m86k551Q44K668k798l92
1620a415L921l546q38M235j721l419M971j527l403M941p66l305J909K803l405
1635e65L57K767l035n94L570j239l722M928j387l310M343p67l382K016K200l919
1651a739J297J996k609m38K708p77l040L655j231j839L154j046k300K246J108
1666A145l587K578O92k811J259K341k537j179L985k587j211L562j412k706L415
$$ y = [-2632, 2913, -22, -2601, 1832, 1229, -1484, -891, 2486, -1213, -1823, 3069, 2, -3184, 2047, 1357, -3266, 2508, 509, -2876, 1521, 1341, -1692, -516, 1757, -1802, -696, 2489, -511, -3085, 2543, 1207, -3811, 2199, 1102, -3054, 874, 1527, -1649, -668, 942, -921, -134, 402, 187, -1508, 470, 472, -1468, 1705, -742, -1874, 1914, 727, -2510, 1261, 565, -2378, 1300, 814, -1737, -893, 1775, -1023, -1415, 2506, -1040, -1878, 2357, 636, -2783, 2188, 661, -2742, 2199, 1433, -1872, 37, 2840, -565, -208, 2559, -476, -1070, 2500, 1261, -2461, 2467, 1080, -2230, 2113, 1346, -2036, -20, 2180, -1739, -442, 1554, -1055, -1493, 1215, 438, -2602, 1053, -178, -2017, 1137, 91, -2209, 37, 1145, -2442, 136, 828, -1983, -724, 1617, -920, -2099, 1886, -701, -1912, 1650, 238, -2468, 947]
1681I47N3l576M092p87l029K999J603l794P68L547l869m8L579j917k712M154j
1698B009m058L429L37l004J541K082l159K42K924l458N71K601j998k289M430j288
1714I12l612M106l94l592K384K429m345J048K931k871R1J813j098j321K999j657
1730a77j451L153j501j978K925K72l844L039J145l678J824J924k600p88L476k077
1746c36j151K543j027j318J864P1k884L330j25k965K545J193l082M78L350l311
1762h25o17L580j476k628L158O92m336L154N51k754J787J074k636Q24K562l377
1778a267O92K164j959r88L055j085k826L906p48k627K295J180k908Q89K019k651
1794h59R95O77r55m96K022j156j364K529j250j685K242K33l016K444R99l519J939
$$ y = [947, 1000, -2576, 1516, 729, -2300, 699, 2302, -1492, -724, 2823, -1046, -1094, 2485, 568, -2144, 2010, 2009, -2049, 1380, 1717, -1287, 254, 2336, -823, -581, 2343, -1115, -544, 2057, 59, -2230, 2200, 912, -2700, 1406, 1012, -2580, -196, 2233, -2112, -1064, 1867, -1004, -913, 900, -198, -1519, 1480, -177, -1628, 1525, 24, -1954, 971, 1243, -2601, 438, 1583, -2095, -271, 1653, -947, -1735, 1741, -336, -1487, 1056, 29, -1289, 575, 646, -2238, 1092, 967, -1998, 547, 1740, -1342, -864, 2486, -825, -1442, 2138, 662, -1966, 1192, 1884, -2452, 702, 1253, -1501, 286, 1360, -1276, -452, 2110, -1267, -575, 1589, -370, -1358, 1697, 612, -2214, 1692, 944, -1683, 612, 1792, -1116, -227, 1792, -859, 136, 813, -142, -638, 1384, 228, -1136, 1393, 143, -1542, 700, 933, -2083, 361, 1360, -2159, -220]
1811b20J002j718j6J999j374p52J967j190r34J947j11l018L516k8l489L263L55
1828A199k911J337K231l127K19K733j724j383K272K96l048K938M3k561K171M25
1844A110k243J241J288k650J388J010j525K65J209m35j852K615n67k269K244L07
1860A136k445J822J311l368K199N62k082O38J337j148j258K557j026j751K285
1875G69O6k711K541Q38l548K875q6k472J991Q29k461P43K259k494l24K090o86
1892B19k347K913K94l697L416J92k781J718J381k727Q60J757j851J88Q29r3j626
1909a355K198K08k978K710L86k555J847J213l275J976J307k595J299Q13j178q54
1925h33K237q10j868K724l98k566K517J012m253K718J318l199J368J056j239m27
$$ y = [-220, 782, -936, -952, 1047, -327, -1079, 888, -302, -1236, 711, 600, -2418, 1098, 1070, -2419, 844, 1199, -1712, -375, 1856, -1271, -1052, 1681, -43, -1426, 846, 1142, -1906, 1032, 1075, -1486, 685, 1110, -1133, 108, 1396, -1254, 134, 1144, -381, -116, 1093, 658, -1194, 1421, 854, -1415, 829, 1136, -1309, 513, 1824, -1544, 655, 1217, -865, -227, 1110, -38, -1296, 1261, 235, -1516, 769, 835, -1876, 665, 1503, -2045, 830, 744, -1728, 263, 1092, -1369, -626, 1633, -861, -1185, 905, 219, -2128, 785, 1079, -2618, 798, 990, -1791, -73, 1308, -1419, -559, 1198, -653, -465, 364, 271, -1355, 843, 1051, -1927, 783, 1169, -1386, 461, 1674, -1601, 375, 1682, -913, 386, 1199, 21, -833, 1404, 594, -1274, 1450, 1052, -1514, 1003, 2015, -2238, 480, 1798, -1401, -33, 1023, -216, -643]
1941f43J688r82r14J320L2j621J539M18l046L247l59k899K739M20k673J208K175
1958A649k655l36K042j40k331J862J367l634K349J127k816J274J422k444J143
1973a21J399k498R77J260j136r19K102n06k454L045O6k578J770J175l211J901
1989B72J548l323J508J000j032l31J365j003j143K130j16k053J421J486l437J792
2005H4J520l017J418Q74j248M2J081j183K0J002n97o17Q96K76k071K550Rl029
2023a990K360J060k814Q84K180k759L68J785r74j014J161O51k426J829O36k374
2039a437J564N85j905J119J300k856J499J126j700J68J056m45j203J849l06j519
2055a105J125J204k151P38J436k626J363P61j190L4J069j028m55J980j155p92
$$ y = [-643, 1045, 63, -851, 469, 501, -1120, 419, 837, -2209, 1038, 679, -2220, 519, 939, -1734, -526, 1649, -1006, -1342, 700, 560, -1771, 91, 1458, -2176, 173, 1300, -1516, -242, 1180, -1264, -121, 1278, -1220, -243, 1017, -119, -1038, 1064, 558, -1896, 1149, 1215, -1363, 407, 1582, -1629, 272, 1820, -1503, 5, 1005, -27, -358, 1007, 4, -1139, 991, 875, -1178, 243, 1729, -1708, 84, 1604, -1413, 5, 879, -369, -327, 754, -429, -409, 593, -4, -621, 275, 551, -1520, 1030, 1039, -1990, 370, 1430, -1384, -500, 1680, -1079, -711, 1074, 100, -914, 247, 898, -1528, 301, 937, -1437, 127, 712, -1193, -74, 1226, -1630, -131, 995, -705, -537, 519, 74, -1129, 720, 414, -1105, 20, 1224, -927, -189, 1247, -1379, -16, 745, -445, -411, 658, -370, -825, 1155, 0, -792]
2071g92J231L38j790J294Q66k402J789N63j894P66J310j942N41J741k225K92J186
2088H72l72j203J686l4k496K283L32k161P45J648k367N98J774k238J39J289m79
2105A6j312J890l47j534J590K75j730P13J456k247Q75J322k016M98J308q87n72
2122g02J597j047q23J559j21j255Q83J132k645J749P58k231R29J281j556Q8J755
2139A351j843M5J536q51r19J388Qj735J969O7j895R63J351k174L31K074k216k04
2157g54J968q51j416J550L45k205J979J23j939J054J272k104K75J928k243K28
2173g90J795j360q66K065p49j530K054l16j376O76J292j844N81J437k105P31R76
2190F71j204m43J912j305o49K182j124j090J546K73k216J762Q47k329J029J193
$$ y = [-792, 439, 777, -1013, 281, 1147, -1255, 534, 1097, -797, -31, 1279, -663, -122, 1619, -606, -314, 872, 500, -703, 983, 949, -1547, 736, 1068, -1093, -348, 1300, -1067, -469, 1305, -933, -794, 495, 16, -1296, 594, 247, -1287, 303, 578, -1152, -439, 1017, -1230, -355, 967, -1049, -551, 757, -130, -702, 895, -152, -975, 584, 463, -792, 91, 1223, -1422, 327, 1085, -1146, -217, 1064, -492, -404, 1351, -492, -447, 1089, 238, -681, 707, 715, -1020, 949, 1016, -879, 84, 1435, -739, -408, 1666, -550, -754, 1214, 363, -1053, 497, 842, -1363, 616, 739, -1200, -146, 1126, -978, -703, 1225, -1018, -790, 1005, -355, -1221, 844, 95, -1435, 619, 303, -1073, -397, 895, -949, -368, 1069, -1036, -305, 671, -533, -976, 936, -369, -1018, 1164, 40, -1050, 496, 769, -1447, 315, 1162, -1167, -138, 1055]
2206A055j421j80J641j422k00J634j067q74J528J68k086J759L68j937J292J032
2222A290j948j32K381j871m60J854j150p78J338J16j616J499m1j299J043P05j752
2239h21L91J903k304M49J462j482n47J750m19j499J823l88j074P94N09j457P95
$$ y = [1055, -366, -546, 1095, -327, -527, 1107, 40, -834, 694, 862, -1224, 535, 903, -1034, 258, 1290, -658, -790, 1591, -280, -740, 1114, -36, -814, 524, 640, -976, 523, 482, -817, 226, 931, -821, -430, 1473, -831, -382, 1080, -402, -949, 801, 382, -1117, 706, 318, -756, 38, 547, -910, -115]
$$ [...]
8191f8
##END NTUPLES=NMR FID
##END=
