##TITLE=1H_EC-3246xnf
 CDCl3,8 sc, 
 2.03.2021
##JCAMPDX= 6.0         $$ Bruker NMR JCAMP-DX V2.0
##DATA TYPE= NMR SPECTRUM
##DATA CLASS= NTUPLES
##ORIGIN= UXNMR, Bruker Analytische Messtechnik GmbH
##OWNER= root
$$ XWIN-NMR		Version 3.5
$$ Tue Mar  2 10:40:19 2021 Russian Standard Time (UT+4h)  she@DPX200
##.OBSERVE FREQUENCY= 200.1315066352
##.OBSERVE NUCLEUS= ^1H
##.ACQUISITION MODE= SIMULTANEOUS
##.ACQUISITION SCHEME= undefined
##.AVERAGES= 8
##.DIGITISER RES= 18
##SPECTROMETER/DATA SYSTEM= spect
##.PULSE SEQUENCE= zg30
##.SOLVENT NAME= CDCl3
##.SHIFT REFERENCE= (INTERNAL, CDCl3, 0, 15.9948)
##AUDIT TRAIL= $$ (NUMBER, WHEN, WHO, WHERE, WHAT)
$$ ##TITLE= Audit trail, XWIN-NMR		Version 3.5
$$ ##JCAMPDX= 5.01
$$ ##ORIGIN= Bruker BioSpin GmbH
$$ ##OWNER= she
$$ F:/spectra/data/she/nmr/H-F/1/pdata/1/auditp.txt
$$ ##AUDIT TRAIL=  $$ (NUMBER, WHEN, WHO, WHERE, WHAT)
(   1,<2021-03-02 10:38:42.37 +0400>,<she>,<DPX200>,
      <created by zg, POWCHK disabled, PULCHK disabled
       configuration hash MD5:
       00 E9 B6 7A A2 85 ED C7 34 08 36 98 17 FE 4E 26
       data hash MD5: 16K
       86 7E 8D 4F 98 A7 CD 9D 4E 83 F7 7C 02 4D B1 B2>)
(   2,<2021-03-02 10:38:49.46 +0400>,<she>,<DPX200>,
      <Start of raw data processing
       efp BC_mod = 2 LB = 0.24 FT_mod = 6 PKNL = 1 PHC0 = -10763.6 PHC1 = 13.20094 SI = 16K 
       data hash MD5: 16K
       DB A8 FF AB 6F BB EB ED 28 AD C8 9C E6 03 0C C3>)
(   3,<2021-03-02 10:38:53.23 +0400>,<she>,<DPX200>,
      <abs ABSG = 5 
       data hash MD5: 16K
       8F B1 CD 4E 1F 10 8E 4A F8 97 54 BC 5A 97 DF 4B>)
(   4,<2021-03-02 10:39:09.29 +0400>,<she>,<DPX200>,
      <pk PHC0 = -0.313531 PHC1 = -3.427267e-07 
       data hash MD5: 16K
       1C 36 0D 81 DF A4 2D 1B F5 2A 4B E6 61 23 15 51>)
(   5,<2021-03-02 10:39:12.20 +0400>,<she>,<DPX200>,
      <abs ABSG = 5 
       data hash MD5: 16K
       69 45 B2 6E B1 87 8B CB 5A 1D E5 06 48 0B 65 30>)
$$ ##END=
$$ 
$$ hash MD5
$$ 4A 84 39 32 39 85 51 4D 4C 65 D5 C5 60 D2 DF 5F
##$RELAX= 
##$RELAX= 
##$RELAX= 
##$RELAX= 
##$RELAX= 
##$RELAX= 
$$ Bruker specific parameters
$$ --------------------------
##$DU= <F:/spectra>
##$EXPNO= 1
##$NAME= <H-F>
##$PROCNO= 1
##$TYPE= <nmr>
##$USER= <she>
##$AMP= (0..31)
100 100 100 100 100 100 100 100 100 100 100 100 100 100 100 100 100 100 
100 100 100 100 100 100 100 100 100 100 100 100 100 100 
##$AQSEQ= 0
##$AQ_mod= 1
##$AUNM= <au_zg>
##$AUTOPOS= <>
##$BF1= 200.13
##$BF2= 200.13
##$BF3= 200.13
##$BF4= 200.13
##$BF5= 200.13
##$BF6= 200.13
##$BF7= 200.13
##$BF8= 200.13
##$BYTORDA= 1
##$CFDGTYP= 0
##$CFRGTYP= 5
##$CHEMSTR= <none>
##$CNST= (0..31)
1 1 145 1 1 1 1 1 1 1 1 1 1 1 1 1 1 1 1 1 1 1 1 1 1 1 1 1 1 1 1 1 
##$CPDPRG= <>
##$CPDPRG1= <>
##$CPDPRG2= <>
##$CPDPRG3= <>
##$CPDPRG4= <mlev>
##$CPDPRG5= <mlev>
##$CPDPRG6= <mlev>
##$CPDPRG7= <mlev>
##$CPDPRG8= <mlev>
##$CPDPRGB= <>
##$CPDPRGT= <>
##$D= (0..31)
0 1.2 0 0 0 0 0 0 0 0.06 0 0.03 0 0 0 0 0.0002 0 0 0 0 0 0 0 0 0 0 0 0 
0 0 0 
##$DATE= 1614667121
##$DBL= (0..7)
$$ [...]
##$SUBNAM3= <"">
##$SUBNAM4= <"">
##$SUBNAM5= <"">
##$SUBNAM6= <"">
##$SUBNAM7= <"">
##$SUBNAM8= <"">
##$SUBNAM9= <"">
##$SW= 16.9725356469052
##$SWIBOX= (0..15)
0 0 2 0 0 0 0 0 0 0 0 0 0 0 0 0 
##$SW_h= 3396.73913043478
##$TD= 16384
##$TD0= 1
##$TE= 0
##$TE2= 300
##$TE3= 300
##$TEG= 300
##$TL= (0..7)
0 120 120 120 120 120 120 120 
##$TP= (0..7)
150 150 150 150 150 150 150 150 
##$TP07= 0
##$TPNAME0= <>
##$TPNAME1= <>
##$TPNAME2= <>
##$TPNAME3= <>
##$TPNAME4= <>
##$TPNAME5= <>
##$TPNAME6= <>
##$TPNAME7= <>
##$TPOAL= (0..7)
0.5 0.5 0.5 0.5 0.5 0.5 0.5 0.5 
##$TPOFFS= (0..7)
0 0 0 0 0 0 0 0 
##$TUNHIN= 0
##$TUNHOUT= 0
##$TUNXOUT= 0
##$USERA1= <user>
##$USERA2= <user>
##$USERA3= <user>
##$USERA4= <user>
##$USERA5= <user>
##$V9= 5
##$VALIST= <valist>
##$VCLIST= <CCCCCCCCCCCCCCC>
##$VD= 0
##$VDLIST= <DDDDDDDDDDDDDDD>
##$VPLIST= <PPPPPPPPPPPPPPP>
##$VTLIST= <TTTTTTTTTTTTTTT>
##$WBST= 1024
##$WBSW= 4
##$XGAIN= (0..3)
0 0 0 0 
##$XL= 0
##$YL= 0
##$YMAX_a= 158164
##$YMIN_a= -144035
##$ZGOPTNS= <>
##$ZL1= 120
##$ZL2= 120
##$ZL3= 120
##$ZL4= 120
##$ABSF1= 15.98335
##$ABSF2= -0.9893122
##$ABSG= 5
##$ABSL= 3
##$ALPHA= 0
##$AQORDER= 0
##$ASSFAC= 0
##$ASSFACI= 0
##$ASSFACX= 0
##$ASSWID= 0
##$AUNMP= <proc_1d>
##$AZFE= 0.1
##$AZFW= 0.1
##$BCFW= 0
##$BC_mod= 2
##$BYTORDP= 0
##$COROFFS= 0
##$CY= -3
##$DATMOD= 1
##$DC= 0
##$DFILT= <>
##$DTYPP= 0
##$F1P= 0
##$F2P= 0
##$FCOR= 1
##$FTSIZE= 16384
##$FT_mod= 6
##$GAMMA= 0
##$GB= 0
##$INTBC= 1
##$INTSCL= 2.992141e-10
##$ISEN= 128
##$LB= 0.24
##$LEV0= 0
##$LPBIN= 0
##$MAXI= 10000
##$MC2= 0
##$MEAN= 0
##$ME_mod= 0
##$MI= 1.114404
##$NCOEF= 0
##$NC_proc= -8
##$NLEV= 6
##$NOISF1= 3.799351
##$NOISF2= 2.8
##$NSP= 0
##$NTH_PI= 0
##$NZP= 0
##$OFFSET= 15.99475
##$PC= 1
##$PHC0= -10763.91
##$PHC1= 13.20094
##$PH_mod= 1
##$PKNL= yes
##$PPARMOD= 0
##$PSCAL= 0
##$PSIGN= 0
##$REVERSE= no
##$SF= 200.130003975662
##$SI= 16384
##$SIGF1= 3
##$SIGF2= 2
##$SINO= 5.538805
##$SIOLD= 16384
##$SREGLST= <1H.CDCl3>
##$SSB= 0
##$STSI= 16384
##$STSR= 0
##$SW_p= 3396.73913043478
##$SYMM= 0
##$S_DEV= 0
##$TDeff= 16384
##$TDoff= 0
##$TI= <>
##$TILT= no
##$TM1= 0
##$TM2= 0
##$TOPLEV= 0
##$USERP1= <user>
##$USERP2= <user>
##$USERP3= <user>
##$USERP4= <user>
##$USERP5= <user>
##$WDW= 1
##$XDIM= 16384
##$YMAX_p= 332155452
##$YMIN_p= -1187564
$$ End of Bruker specific parameters
$$ ---------------------------------
##NTUPLES= NMR SPECTRUM
##VAR_NAME=  FREQUENCY,     SPECTRUM/REAL,   SPECTRUM/IMAG
##SYMBOL=    X,             R,               I
##VAR_TYPE=  INDEPENDENT,   DEPENDENT,       DEPENDENT
##VAR_FORM=  AFFN,          ASDF,            ASDF
##VAR_DIM=   16384,         16384,           16384
##UNITS=     HZ,            ARBITRARY UNITS, ARBITRARY UNITS
##FACTOR=    0.207333158178281, 1,           1
##FIRST=     3201.02938567033, 0,            0
##LAST=      -195.709744764448, 0,           0
##MIN=       -195.709744764448, -1187564,    0
##MAX=       3201.02938567033, 332155452,    0
$$ Real data points
##PAGE= N=1
##DATA TABLE= (X++(R..R)), XYDATA
$$ [...]
$$ plain form
5211 17405586 17158757 16890317 16926065 16757800 16774837 16915376 16761298 16332758 16173465 15823134
5201 15823134 15144220 14470003 14384600 13732919 13231678 12865055 12442018 11940369 11603401 11447013
5191 11447013 10920190 10132492 9634154 9453024 9171189 8829343 8387766 7933300 7992832 7658473
5181 7658473 7217956 6762271 6849850 6540234 6351788 6236047 6027059 6030014 5850536 5719324
5171 5719324 5645192 5830193 5596845 5442442 5385842 5111826 4902843 4625363 4616118 4362490
5161 4362490 4417087 4334747 4043307 4059270 4212422 4125356 4381422 4455096 4474750 3996381 3620512
5150 3620512 4318646 4613123 4496073 4548799 4154811 3609901 3791404 4113543 4193375 3927373
5140 3927373 3389179 3522676 3705911 3752385 3928084 3479685 3726460 4021665 4227561 4353273
$$ packed form
5211A7405586k46829k68440L5748j68265J7037J40539j54078m28540j59293l50331
5201A5823134o78914o74217q5403o51681n01241l66623m23037n01649l36968j56388
5191A1447013n26823p87698m98338j81130k81835l41846m41577m54466N9532l34359
5181G658473m40517m55685Q7579l09616j88446j15741k08988K955j79478j31212
5171E719324p4132J85001k33348j54403n6600k74016k08983k77480r245k53628
5161D362490N4597q2340k91440J5963J53152q7066K56066P3674J9654m78369l75869
5150C620512O98134K94477j17050N2726l93988n44910J81503L22139P9832k66002
5140C927373n38194J33497J83235M6474J75699m48399K46775K95205K05896J25712
$$ plain form
5130 4353273 4351197 4186520 4023215 3964575 3847731 3925485 4187404 4197688 3807552 3787247 3980010
5119 3980010 3853454 3749744 3853648 4085816 3883978 4023128 4104248 4218247 4004466 3784074
5109 3784074 3752070 3864292 4238864 4245928 3908599 4271845 4498809 4600913 4302867 4342524
5099 4342524 4477020 4578821 4371005 4146813 4372842 4551141 4553721 4750989 4837566 4716534
5089 4716534 5051119 5150559 5274776 5152568 5237810 5350670 5088631 5286485 5428314 5251204
5079 5251204 5307387 5754226 5689878 5564884 5716964 5992504 6322711 6356393 6507888 6374226
5069 6374226 6459798 6875871 6948011 6942356 7151210 7494367 7499130 7335848 7730338 7840764 8360842
5058 8360842 8283751 8507915 9398548 9686189 9788208 9878577 9772548 10435641 11198504 11812487
$$ packed form
5130D353273k076j64677j63305n8640j16844P7754K61919J0284l90136k0305J92763
5119C980010j26556j03710J03904K32168k01838J39150Q1120J13999k13781k20392
5109C784074l2004J12222L74572P064l37329L63246K26964J02104k98046L9657
5099D342524J34496J01801k07816k24192K26029J78299K580J97268Q6577j21032
5089D716534L34585R9440J24217j22208Q5242J12860k62039J97854J41829j77110
5079E251204N6183M46839o4348j24994J52080K75540L30207L3682J51495j33662
5069F374226Q5572M16073P2140n655K08854L43157M763j63282L94490J10426N20078
5058H360842p7091K24164Q90633K87641J02019R0369j06029O63093P62863O13983
$$ plain form
5048 11812487 11996700 12228868 12785014 13198267 13765236 14045919 14778123 15333267 15874039
5039 15874039 16375514 16803172 17243670 17800108 18366589 18943483 19576734 19469296 19751095
5030 19751095 20472143 20928743 21147845 21750242 21921889 22539769 22967747 23342459 23451401
5021 23451401 23758761 24405942 24806739 25553843 25955007 26555765 27319301 28150859 29160413
5012 29160413 29786522 30566617 31158852 31646191 32205278 32345401 32792966 32841408 33081369 33156228
5002 33156228 32640207 32506444 32652253 32486661 32129842 32106758 32037933 32106217 31929243 31802748
4992 31802748 31665107 31615365 32054551 32133853 32254990 32547346 32782589 33184257 33718459 33963476
4982 33963476 34568996 35607793 36314832 36615996 37042895 37532274 37599669 38256646 38574228
$$ packed form
5048A1812487J84213K32168N56146M13253N66969K80683P32204N55144N40772
5039A5874039N01475M27658M40498N56438N66481N76894O33251j07438K81799
5030A9751095P21048M56600K19102O02397J71647O17880M27978L74712J08942
5021B3451401L07360O47181M00797P47104M01164O00758P63536Q31558J009554
5012B9160413O26109P80095N92235M87339N59087J40123M47565M8442K39961P4859
5002C3156228n16021j33763J45809j65592l56819k3084o8825O8284j76974j26495
4992C1802748j37641m9742M39186P9302J21137K92356K35243M01668N34202K45017
4982C3963476O05520J038797P07039L01164M26899M89379O7395O56977L17582
$$ plain form
4973 38574228 38543905 39038423 39397628 39902413 40112717 40632308 40715782 40776774 40730272 40566396
4963 40566396 40413481 40789093 41082455 40804358 40420015 39916793 39448770 39568308 39497591 39495679
4953 39495679 39505427 39288728 39388879 39236150 39505335 40066768 40360207 40197498 40455907 41202226
4943 41202226 41775856 41969194 42409440 42735526 43094016 43380268 43557558 43542970 43310863 43176169
4933 43176169 42951454 42523708 41901807 41382348 40779180 39946001 39143562 38318917 37113474
4924 37113474 36338732 35767247 35044840 34673164 34249187 34091770 33623834 32949210 32828553
4915 32828553 32395439 31847270 31616105 31380089 31560632 31648668 31382395 31425408 31242801 31213218
4905 31213218 31159877 30796068 30480971 30014061 29878049 30045955 29386976 29025508 29103951 28806647
$$ packed form
4973C8574228l0323M94518L59205N04785K10304N19591Q3474O0992m6502j63876
4963D0566396j52915L75612K93362k78097l84343n03222m68023J19538p0717j912
4953C9495679R748k16699J00151j52729K69185N61433K93439j62709K58409P46319
4943D1202226N73630J93338M40246L26086L58490K86252J77290j4588k32107j34694
4933D3176169k24715m27746o21901n19459o03168q33179q02439q24645j205443
4924C7113474p74742n71485p22407l71676m23977j57417m67936o74624j20657
4915C2828553m33114n48169k31165k36016J80543Q8036k66273M3013j82607k9583
4905C1213218n3341l63809l15097m66910j36012J67906o58979l61468P8443k97304
$$ plain form
4895 28806647 28293167 27865346 27281491 26790329 26391945 25880767 25326314 25070870 24874733
4886 24874733 24334746 23823404 23472983 23318915 23009699 22887768 22590899 22112977 21600538
4877 21600538 21775800 21851338 21220826 21012379 21434210 21351082 21089614 20969583 20672347 20591597
4867 20591597 20543889 20644124 19988364 19465456 19368694 19081057 18620593 17649096 16984049 16689259
4857 16689259 16247547 15830776 14949589 14352552 13543670 13226456 12991453 12317136 11880342
4848 11880342 11582681 11222492 10677506 10327406 9855777 9544333 9416397 9069558 8438381
4839 8438381 8340733 8398024 8104707 8139477 7391350 7053099 6805531 6399063 6224322 6318684
4829 6318684 6284856 5990480 5614882 5505496 5422738 5245189 5159994 5112940 5241941 5199249
$$ packed form
4895B8806647n13480m27821n83855m91162l98384n11178n54453k55444j96137
4886B4874733n39987n11342l50421j54068l09216j21931k96869m77922n12439
4877B1600538J75262P5538o30512k08447M21831q3128k61468j20031k97236q0750
4867B0591597m7708J00235o55760n22908r6762k87637m60464r71497o65047k94790
4857A6689259m41712m16771q81187n97037q08882l17214k35003o74317m36794
4848A1880342k97661l60189n44986l50100m71629l11444j27936l46839o31177
4839H438381r7648N7291k93317L4770p48127l38251k47568m06468j74741R4362
4829F318684l3828k94376l75598j09386q2758j77549q5195m7054J29001m2692
$$ plain form
4819 5199249 5257156 4765238 4756801 4900654 4754163 4268499 4588048 4206357 4365686 4103888
4809 4103888 3994359 4218524 4316008 4387342 4182433 4175915 3957082 3883862 4168395 4080487 3897583
4798 3897583 3933104 3942178 3636642 3662012 3517827 3925872 3703848 3323028 3212772 3452523
4788 3452523 3673860 3454075 3310006 3265719 3404992 3207251 3266176 3148064 3096525 3104312
4778 3104312 3048637 3545121 3525394 2999649 2922104 2671685 2858280 2930653 2991876 3053321 2681338
4767 2681338 2590149 2441864 2474859 2578739 2324256 2708336 2617407 2705381 2420263 2336197
4757 2336197 2313642 2270113 2378960 2274454 2272823 2553583 2407367 2357735 2656973 2740502 2292083
4746 2292083 2024194 2101016 2265225 2237449 2392054 2376723 2417414 2333988 2072902 2159006 2560713
$$ packed form
4819E199249N7907m91918q437J43853j46491m85664L19549l81691J59329k61798
4809D103888j09529K24165R7484P1334k04909o518k18833p3220K84533q7908j82904
4798C897583L5521R074l05536K5370j44185M08045k22024l80820j10256K39751
4788C452523K21337k19785j44069m4287J39273j97741N8925j18112n1539P787
4778C104312n5675M96484j9727n25745p7545k50419J86595P2373O1223O1445l71983
4767B681338r1189j48285L2995J03880k54483L84080r0929Q7974k85118q4066
4757B336197k2555m3529J08847j04506j631K80760j46216m9632K99238Q3529m48419
4746B292083k67889P6822J64209k7776J54605j5331M0691q3426k61086Q6104M01707
$$ plain form
4735 2560713 2615649 2655761 2595329 2360262 2549068 2467026 2553148 2450316 2297009 2435629
4725 2435629 2517241 2327592 2413228 2413586 2174124 1956422 2237416 2399934 2275433 2037971
4715 2037971 2115807 2405087 2422673 2755043 2770788 2633415 2541857 2308564 1845075 1992240
4705 1992240 2074265 2046685 2171125 2254523 2139606 2410404 2464716 2473187 2272150 2276914 2409054
4694 2409054 2193807 2413930 2609563 2903643 2842836 2780484 2446381 2136235 2117395 2250875
4684 2250875 2583112 2553992 2272149 2379018 2078189 2045964 2379033 2621593 2681891 2515112
4674 2515112 2540428 2077352 2493856 2918512 2850068 2559756 2747366 2584828 2578496 2548951
4664 2548951 2557811 2853717 2720103 2538427 2559174 2491610 2422038 2669948 2580214 2841322 2899763
$$ packed form
4735B560713N4936M0112o0432k35067J88806q2042Q6122j02832j53307J38620
4725B435629Q1612j89649Q5636L58k39462k17702K80994J62518j24501k37462
4715B037971P7836K89280J7586L32370J5745j37373r1558k33293m63489J47165
4705A992240Q2025k7580J24440Q3398j14917K70798N4312Q471k01037M764J32140
4694B409054k15247K20123J95633K94080o0807o2352l34103l10146j8840J33480
4684B250875L32237k9120k81843J06869l00829l2225L33069K42560O0298j66779
4674B515112K5316m63076M16504M24656o8444k90312J87610j62538o332k9545
4664B548951Q860K95906j33614j81676K0747o7564o9572K47910q9734K61108N8441
$$ plain form
4653 2899763 2840674 2862260 2492869 2447783 2527487 2956885 3134497 3200645 3030621 2603769
4643 2603769 2946590 2943469 2957289 2890539 2762806 2760289 2887075 3054964 2759962 3013338 3074652
4632 3074652 3198150 3555610 3070671 2945245 2958667 3087747 3088088 3602555 3427565 3514325
4622 3514325 3670489 3514691 3153223 3209582 3296275 3512969 3645587 3849353 3803039 3942228
4612 3942228 3802482 3899824 4068569 3926602 4137003 4069250 3907783 4252585 4289447 4183248
4602 4183248 4064896 4071695 4353159 4246957 4447985 4775990 4728910 4870166 4902350 4933048
4592 4933048 4743934 4969691 4954003 4810798 4889292 5038213 5464018 5876956 6075206 5874037
4582 5874037 5918519 5985830 6250106 6332007 6313877 6219518 6382877 6881625 7459651 7245757
$$ packed form
4653B899763n9089K1586l69391m5086P9704M29398J77612O6148j70024m26852
4643B603769L42821l121J3820o6750j27733k517J26786J67889k95002K53376O1314
4632C074652J23498L57460m84939j25426J3422J29080L41N14467j74990Q6760
4622C514325J56164j55798l61468N6359Q6693K16694J32618K03766m6314J39189
4612C942228j39746R7342J68745j41967K10401o7753j61467L44802L6862j06199
4602D183248j18352O799K81464j06202K01028L28005m7080J41256L2184L0698
4592D933048j89114K25757j5688j43205P8494J48921M25805M12938J98250k01169
4582E874037M4482O7311K64276Q1901j8130r4359J63359M98748N78026k13894
$$ plain form
4572 7245757 7239699 7419259 7209838 7732773 8169078 8258112 8458088 8499963 8964466 9209233
4562 9209233 9204084 9522248 9528495 9618089 10217536 10710995 10965161 10947531 11650415 12299698 12191456
4551 12191456 12247769 12440580 12977643 13651469 13899319 14254957 14645708 14973337 14958040 15425017
4541 15425017 15738945 16040525 16572099 17036208 17205257 17388711 18005303 18411572 18924046
4532 18924046 19458052 19853668 20197040 20690287 21096209 20981769 21656290 22049424 22385952
4523 22385952 22641671 23196904 23458506 23737613 23900501 24173675 24448940 24644347 25103728
4514 25103728 25353278 25457809 25488751 25841474 26359527 26253780 26155482 26431814 26644945 26809110
4504 26809110 27097952 27561762 27853857 27741665 28362343 28602840 28737071 29122852 29496130
$$ packed form
4572G245757o058J79560k09421N22935M36305Q9034J99976M1875M64503K44767
4562I209233n149L18164O247Q9594N99447M93459K54166j7630P02884O49283j08242
4551A2191456N6313J92811N37063O73826K47850L55638L90751L27629j5297M66977
4541A5425017L13928L01580N31574M64109J69049J83454O16592M06269N12474
4532A8924046N34006L95616L43372M93247M05922j14440O74521L93134L36528
4523B2385952K55719N55233K61602K79107J62888K73174K75265J95407M59381
4514B5103728K49550J04531L0942L52723N18053j05747r8298K76332K13131J64165
4504B6809110K88842M63810K92095j12192O20678K40497J34231L85781L73278
$$ plain form
4495 29496130 29501489 29633924 29929864 30090645 30207370 30525761 31267781 31503913 31935032 31831854
4485 31831854 32479240 32939871 33121945 33619031 33954768 34791467 35205985 35426422 35842385
4476 35842385 36867525 37757766 38113780 39044514 39455406 39885320 40826017 41464031 41820025
4467 41820025 42459801 43017223 43471263 43748542 44125816 44485458 44508538 44630054 44601457 44441655
4457 44441655 44500535 43964273 43446799 43192955 42454433 41727799 41176963 40932946 40496414 39341394
4447 39341394 39117697 38378108 37526313 36784920 35618634 35105486 34985159 34359077 33871368
4438 33871368 33227856 32427927 32233549 31467323 30781941 30157211 29509698 29107327 28827064
4429 28827064 28431771 28244561 27640885 26845179 26800023 26376610 26312697 25816272 25792099 25703038
$$ packed form
4495B9496130N359J32435K95940J60781J16725L18391P42020K36132M31119j03178
4485C1831854O47386M60631J82074M97086L35737Q36699M14518K20437M15963
4476C5842385J025140Q90241L56014R30734M10892M29914R40697O38014L55994
4467D1820025O39776N57422M54040K77279L77274L59642K3080J21516k8597j59802
4457D4441655N8880n36262n17474k53844p38522p26634n50836k44017m36532j155020
4447C9341394k23697p39589q51795p41393j166286n13148j20327o26082m87709
4438C3871368o43512p99929j94378p66226o85382o24730o47513m02371k80263
4429B8827064l95293j87210o03676p95706m5156m23413o3913m96425k4173q9061
$$ plain form
4419 25703038 25387672 25336760 25582264 25439132 25136220 24630587 24732148 24483543 24714678 24585732
4409 24585732 24254167 24489313 24831733 24535643 24028884 24234891 23748555 23662167 23602920 23565047
4399 23565047 23200716 23252470 23352709 23009679 23054574 23138457 22834649 22890271 22549497 22206114
4389 22206114 22247053 22215618 22255826 22068194 22137995 21721727 21573515 21571389 21144565 21158063 20955244
4378 20955244 21548623 21682677 21615132 21936499 21976790 21783482 21863720 22099100 22552448 22511641
4368 22511641 22387442 22407400 22517141 22520063 22386405 22395805 22287613 22056817 22452306 22217444
4358 22217444 21721041 21630221 21525637 21126938 20697291 20370739 20215103 20297819 19844040 19657283
4348 19657283 19395923 19308939 19162812 18926369 18507291 18551029 18574073 18140281 17793649 17895800
$$ packed form
4419B5703038l15366n0912K45504j43132l02912n05633J01561k48605K31135j28946
4409B4585732l31565K35146L42420k96090n06759K06007m86336q6388n9247l7873
4399B3565047l64331N1754J00239l43030M4895Q3883l03808N5622l40774l43383
4389B2206114M0939l1435M0208j87632O9801m16268j48212k126m26824J3498k02819
4378B0955244N93379J34054o7545L21367M0291j93308Q0238K35380M53348m0807
4368B2511641j24199J9958J09741K922j33658R400j08192k30796L95489k34862
4358B2217444m96403r0820j04584l98699m29647l26552j55636Q2716m53779j86757
4348A9657283k61360q6984j46127k36443m19078M3738K3044m33792l46632J02151
$$ plain form
4338 17895800 17862990 17159501 16987630 16504778 16287558 16253221 16093137 15696003 15236350 14905863
4328 14905863 14591102 14701555 14350850 13945027 13616687 12750306 12395612 12355741 12351111 11878863
4318 11878863 11324275 11328615 10947168 10546697 10553816 10070301 9457929 9420607 9396596 8998905
4308 8998905 8964086 8769395 8491076 8642458 8854918 8669300 8177409 7954928 7645677 7932714
4298 7932714 8005529 7786012 7536181 7433599 7626441 7210702 7169217 7009893 7323485 7039897
4288 7039897 7076622 7420252 7076070 6890029 6348706 6564066 7028772 7201835 7171847 7643650
4278 7643650 7476977 7075993 7077407 7094762 6784132 6653090 6862709 6762973 7036396 7266486
4268 7266486 6896802 7262002 7442038 7158360 7211522 7497111 7532887 7305928 7183035 7273472
$$ packed form
4338A7895800l2810p03489j71871m82852k17220l4337j60084l97134m59653l30487
4328A4905863l14761J10453l50705m05823l28340q66381l54694l9871m630m72248
4318A1878863n54588M340l81447m00471P119m83515o12372l7322k4011l97691
4308H998905l4819j94691k78319J51382K12460j85618m91891k22481l09251K87037
4298G932714P2815k19517k49831j02582J92842m15739m1485j59324L13592k83588
4288G039897L6725L43630l44182j86041n41323K15360M64706J73063k9988M71803
4278G643650j66673m00984J414J7355l10630j31042K09619r9736K73423K30090
4268G266486l69684L65200J80036k83678N3162K85589L5776k26959j22893R0437
$$ plain form
4258 7273472 7443668 7498834 7851696 8217608 8301244 8119473 8335332 8242605 8285602 8702018
4248 8702018 8754298 8797064 8892666 8843032 9123016 9764645 10131241 10276170 10574811 10858549
4238 10858549 10993533 11125804 11345076 11180310 11742370 12184434 12205254 12512180 12813818 13187367
4228 13187367 13284098 13636645 13931842 14110399 14103708 14284901 14387182 14982834 15224415 15083633
4218 15083633 14972384 14925472 15284210 15795004 15857560 15673287 15856877 16276223 16450461 16562523
4208 16562523 16570645 16860527 16942659 17195525 17643030 17842698 17907887 18186666 18414568 18705417
4198 18705417 18856650 19158066 19515873 19670488 19853058 19681931 20243347 21045382 21212139
4189 21212139 21304609 21775759 21827631 22037095 21935848 22024215 22475269 22799949 22881265 22736783
$$ packed form
4258G273472J70196N5166L52862L65912Q3636j81771K15859r2727M2997M16416
4248H702018N2280M2766R5602m9634K79984O41629L66596J44929K98641K83738
4238A0858549J34984J32271K19272j64766N62060M42064K0820L06926L01638L73549
4228A3187367R6731L52547K95197J78557o691J81193J02281N95652K41581j40782
4218A5083633j11249m6912L58738N10794O2556j84273J83590M19346J74238J12062
4208A6562523Q122K89882Q2132K52866M47505J99668O5189K78779K27902K90849
4198A8705417J51233L01416L57807J54615J82570j71127N61416Q02035J66757
4189B1212139R2470M71150N1872K09464j01247Q8367M51054L24680Q1316j44482
$$ plain form
4179 22736783 22534588 22548368 23172363 23119733 23207833 23540618 23491466 23834709 23941952 23962050
4169 23962050 23955907 24040413 23595929 23352766 23062576 23563406 23721112 23808551 24059575 24301795
4159 24301795 24404480 24055126 24089528 24354136 24218907 24050920 24228059 24096387 24564635 24215864
4149 24215864 24454727 24792148 24700830 24424166 24431088 24547960 24323789 24523497 24409271 24394463
4139 24394463 24404380 24211477 23986753 23620631 23512517 23593174 23562839 23486161 23568752 23613615 23414381
4128 23414381 22714778 22602521 22522081 22018745 21709495 21579754 21461001 21044566 20894932 20648112
4118 20648112 20090593 19747077 19640799 19456619 19042602 18705918 18273328 18075317 17729162
4109 17729162 17931024 17945127 17370852 17123182 17177693 16911891 16341949 16000896 15788569 15725611
$$ packed form
4179B2736783k02195J3780O23995n2630Q8100L32785m9152L43243J07243K0098
4169B3962050o143Q4506m44484k43163k90190N00830J57706Q7439K51024K42220
4159B4301795J02685l49354L4402K64608j35229j67987J77139j31672M68248l48771
4149B4215864K38863L37421r1318k76664O922J16872k24171J99708j14226j4808
4139B4394463R917j92903k24724l66122j08114Q0657l0335p6678Q2591M4863j99234
4128B3414381o99603j12257q0440n03336l09250j29741j18753m16435j49634k46820
4118B0648112n57519l43516j06278j84180m14017l36684m32590j98011l46155
4109A7729162K01862J4103n74275k47670N4511k65802n69942l41053k12327o2958
$$ plain form
4099 15725611 15121909 14762825 14492135 13930125 13750988 13710227 13726427 13583877 13008313 13089726
4089 13089726 13410934 12784257 12103926 11945305 11734094 11793486 11604263 11231469 10939933 10751063
4079 10751063 10826516 10914091 10770094 10397062 10449800 10616665 10081929 10063213 9789468 9638791
4069 9638791 9457509 9532964 9681920 9501476 9298891 9036571 8733071 8633101 8998118 8856098
4059 8856098 8625085 8666914 8713492 8412369 8265632 8664625 8639036 8788935 8493545 8306490
4049 8306490 8141583 8198359 8196717 8175846 8199185 7936255 8108253 7855670 7961035 7999019 7863478
4038 7863478 7751822 7821177 7976462 7923075 7665392 7532233 7960476 8232426 7669542 7454824
4028 7454824 7674945 7684953 7919349 8362887 8496015 8493564 8690362 8728570 8734790 8816870 9198477
$$ packed form
4099A5725611o03702l59084k70690n62010j79137m0761J6200j42550n75564Q1413
4089A3089726L21208o26677o80331j58621k11211N9392j89223l72794k91536j88870
4079A0751063P5453Q7575j43997l73032N2738J66865n34736j8716k73745j50677
4069I638791j81282P5455J48956j80444k02585k62320l03500r9970L65017j42020
4059H856098k31013M1829M6578l01123j46737L98993k5589J49899k95390j87055
4049H306490j64907N6776j642k0871K3339k62930J71998k52583J05365L7984j35541
4038G863478j11656O9355J55285n3387k57683j33159M28243K71950n62884k14718
4028G454824K20121J0008K34396M43538J33128k451J96798L8208O220Q2080L81607
$$ plain form
4017 9198477 9389690 9330670 9353905 9439239 9723457 9966272 9965187 9624301 10313362 10617682
4007 10617682 11008346 11166817 11598165 11729976 11864969 12367976 12586761 12631956 12549231 13023021
3997 13023021 13258570 13762209 14118131 14600734 14969766 14908335 14909043 15049930 15734011 15981207
3987 15981207 16027133 16488090 16646174 16665769 17287053 17211803 16930523 17580513 18180704 18589501
3977 18589501 18577589 18928632 19476466 19931954 19982612 20214881 20574006 20860393 21369236 22075876
3967 22075876 22098247 22691638 23459768 24234444 24889012 25204013 25757752 25928952 26390267 27172581
3957 27172581 27573364 27860308 28232898 28164946 28153924 28584831 28387104 28144061 28198899 27992273
3947 27992273 28051769 28023628 28068633 27835005 27798813 27365788 27031538 26578142 26055601 26035683
$$ packed form
4017I198477J91213n9020K3235Q5334K84218K42815j085l40886O89061L04320
4007A0617682L90664J58471M31348J31811J34993N03007K18785M5195q2725M73790
3997A3023021K35549N03639L55922M82603L69032o1431P08J40887O84081K47196
3987A5981207M5926M60957J58084J9595O21284p5250k81280O49990O00191M08797
3977A8589501j1912L51043N47834M55488N0658K32269L59125K86387N08843P06640
3967B2075876K2371N93391P68130P74676O54568L15001N53739J71200M61315P82314
3957B7172581M00783K86944L72590o7952j1022M30907j97727k43043N4838k06626
3947B7992273N9496k8141M5005k33628l6192m33025l34250m53396n22541j9918
$$ plain form
3937 26035683 25642668 25584649 25274977 24407481 24510200 24488812 23809991 23624286 23271206 23114182
3927 23114182 23148096 23032576 23076344 22603340 22661312 22302181 21858585 21956578 21975289 21787563
3917 21787563 21699975 21818066 21626359 21634473 21909230 22230807 22628790 22261345 22442340 22973038
3907 22973038 23171506 22990797 22980913 23125130 23290607 23772142 23942685 24059158 24105261 24828474
3897 24828474 24895705 24651699 24787630 25148747 25345355 25533193 26004413 26326058 26219113 26207874
3887 26207874 26441110 26320367 26764236 27035043 27184297 27435188 27967089 28196461 28139760 28609084
3877 28609084 28821788 28970042 28979191 29337357 29618102 29807567 29933773 29955861 29994899 30121956
3867 30121956 30278507 30551853 31121202 31063148 30895297 31204234 31368001 31503412 31414178 31999384
$$ packed form
3937B6035683l93015n8019l09672q67496J02719k1388o78821j85705l53080j57024
3927B3114182L3914j15520M3768m73004N7972l59131m43596R7993J8711j87726
3917B1787563q7588J18091j91707Q114K74757L21577L97983l67445J80995N30698
3907B2973038J98468j80709r884J44217J65477M81535J70543J16473M6103P23213
3897B4828474O7231k44006J35931L61117J96608J87838M71220L21645j06945j1239
3887B6207874K33236j20743M43869K70807J49254K50891N31901K29372n6701M69324
3877B8609084K12704J48254R149L58166K80745J89465J26206K2088L9038J27057
3867C0121956J56551K73346N69349n8054j67851L08937J63767J35411q9234N85206
$$ plain form
3857 31999384 32217871 32380989 32382588 32544354 33035155 32994519 33216951 33460441 33602957 33978918
3847 33978918 34216756 34616512 34876199 35353965 35946172 36418277 36401294 37056518 37838539 38597756
3837 38597756 39517952 40163196 40902734 41972554 43191078 44766176 46071895 47599349 49048497
3828 49048497 50069449 51684599 53749298 56051216 57881296 60600955 63295436 66241240
3820 66241240 69164624 72360400 75901852 79635824 83245186 87565589 91973645 96551792
3812 96551792 101533405 106204119 110679497 115740907 120271182 124032641 127944679 131198247
3804 131198247 133356104 134849489 136285981 137513491 137951895 137925459 137577392 136924335 136763207
3795 136763207 136170279 136107588 135476843 135070808 134973403 135242352 135785765 135934120 136306031 136190050
$$ packed form
3857C1999384K18487J63118J599J61766M90801m0636K22432K43490J42516L75961
3847C3978918K37838L99756K59687M77766N92207M72105j6983O55224P82021P59217
3837C8597756R20196O45244P39538J069820J218524J575098J305719J527454J449148
3828D9048497J020952J615150K064699K301918J830080K719659K694481K945804
3820F6241240K923384L195776L541452L733972L609362M320403M408056M578147
3812I6551792M981613M670714M475378N061410M530275L761459L912038L253568
3804A31198247K157857J493385J436492J227510M38404k6436l48067o53057j61128
3795A36763207n92928o2691o30745m06035r7405K68949N43413J48355L71911j15981
$$ plain form
3785 136190050 136304727 136089416 135138252 133823455 131694228 129445631 126688770 122580532
3777 122580532 118042964 113405582 108801482 104136523 99443689 94645906 89726285 84825310
3769 84825310 80569542 76547871 72621055 68644840 65168571 62129405 59007092 55849297
3761 55849297 52982090 50781218 48685137 46448901 44299460 42607193 40650066 38753432
3753 38753432 37029502 35431917 34391933 33227992 31997638 30851887 29751447 28777253
3745 28777253 28083623 27226230 26214587 25710532 24741294 24073436 23494603 22837070 22224357
3736 22224357 21527357 20723003 20595518 20366044 19183012 18912759 18638849 18214196 17472715
3727 17472715 17294051 17305249 17171569 16779047 16360083 16413178 16444541 15642317 15220381 14648591
$$ packed form
3785A36190050J14677k15311r51164j314797k129227k248597k756861m108238
3777A22580532m537568m637382m604100m664959m692834m797783m919621m900975
3769H4825310m255768m021671l926816l976215l476269l039166l122313l157795
3761E5849297k867207k200872k096081k236236k149441j692267j957127j896634
3753C8753432j723930j597585j039984j163941j230354j145751j100440r74194
3745B8777253o93630q57393j011643n04055r69238o67858n78833o57533o12713
3736B2224357o97000q04354j27485k29474j183032k70253k73910m24653p41481
3727A7472715j78664J1198j33680l92522m18964N3095L1363q02224m21936n71790
$$ plain form
3717 14648591 14410399 14407909 14258321 14073236 13651696 13215993 12751865 12882046 12639393 12026491
3707 12026491 11445336 11417790 11681220 11514415 11297508 11019392 10515822 10268438 10553853 10432660
3697 10432660 9841253 9501789 9672262 9393681 9311131 9292699 9126830 9243251 9187857 9107159
3687 9107159 8904564 8669038 8627932 8338276 8010310 8021692 7964399 7919528 7484038 7725505
3677 7725505 7510325 7575638 7239456 7075318 7177499 7146319 7004913 6661500 6587521 6963770
3667 6963770 6812134 6692446 6921159 6780208 6866330 6935998 7149102 6671986 7030326 7008309
3657 7008309 6138724 6362934 6307363 6368539 6578343 6721255 6449763 6208306 6022779 5960969
3647 5960969 5733748 5854593 5974096 5969738 5942576 6062453 6139568 6016366 6041087 6003468 5923101
$$ packed form
3717A4648591k38192k490j49588j85085m21540m35703m64128J30181k42653o12902
3707A2026491n81155k7546K63430j66805k16907k78116n03570k47384K85415j21193
3697A0432660n91407l39464J70473k78581q2550j8432j65869J16421n5394q0698
3687I107159k02595k35526m1106k89656l27966J1382n7293m4871m35490K41467
3677G725505k15180O5313l36182j64138J02181l1180j41406l43413p3979L76249
3667F963770j51636j19688K28713j40951Q6122O9668K13104m77116L58340k2017
3657G008309q69585K24210n5571O1176K09804J42912k71492k41457j85527o1810
3647E960969k27221J20845J19503m358k7162J19877P7115j23202K4721l7619q0367
$$ plain form
3636 5923101 5875093 5771108 5886248 6011217 5656813 5527740 5532715 5538744 5704103 5743514 5814602
3625 5814602 5617147 5393046 5396871 5174069 5406762 5701096 6062338 6269077 5944246 5733807
3615 5733807 5773841 5854110 5901440 5608429 5508817 5594444 5945823 5828849 5764567 5634180 5640660
3604 5640660 5620363 5422595 5746353 5853538 5590846 5885114 6018965 6174517 5851234 6024930
3594 6024930 6079430 5835443 5911515 6279818 6281667 6172618 6107859 5923000 6001976 6191708 6290561
3583 6290561 6136757 6466988 6499155 6334716 6345000 6393068 6791037 6717065 6658897 6811939
3573 6811939 6467368 6339974 6153633 6425447 6438349 6552451 6605791 6605912 6145812 6063882 6300842
3562 6300842 6435124 6513343 6482211 6595284 6773245 6342115 6599565 7023535 6952583 7019004
$$ packed form
3636E923101m8008j03985J15140J24969l54404j29073M975O029J65359L9411P1088
3625E814602j97455k24101L825k22802K32693K94334L61242K06739l24831k10439
3615E733807M0034Q0269M7330k93011r9612Q5627L51379j16974o4282j30387O480
3604E640660k0297j97768L23758J07185k62692K94268J33851J55552l23283J73696
3594F024930N4500k43987P6072L68303J849j09049o4759j84859P8976J89732R8853
3583F290561j53804L30231L2167j64439J0284M8068L97969p3972n8168J53042
3573F811939l44571j27394j86341K71814J2902J14102N3340J21m60100q1930K36960
3562F300842J34282P8219l1132J13073J77961m31130K57450M23970p0952O6421
$$ plain form
3552 7019004 6569857 6604528 7029575 7061574 6868826 6894757 7191369 6776654 6427643 6315518
3542 6315518 6589081 6820878 7066286 7243104 7146446 7174036 7002252 7416545 7514426 7583249
3532 7583249 7382656 7512339 7618960 7659616 7658005 7563231 8043972 7891352 7977370 8028627 8201024
3521 8201024 8523309 8640840 8996842 9078527 9161104 9343352 9451923 9402141 9704553 10149436
3511 10149436 10116971 10139748 10356973 10392579 10581029 10628259 11098140 11421738 11551317 11706904
3501 11706904 11971454 11990759 12544633 12639991 12791220 12934927 12989203 13033233 13353690 13568122
3491 13568122 13742217 13544556 13347508 13987856 14174982 14489219 14803622 14700965 15060524
3482 15060524 15148820 15114786 15245759 15425987 15575049 15815566 16285840 16410609 16999401 17498512
$$ packed form
3552G019004m49147L4671M25047L1999j92748K5931K96612m14715l49011j12125
3542F315518K73563K31797K45408J76818r6658K7590j71784M14293R7881O8823
3532G583249k00593J29683J06621M0656j611r4774M80741j52620Q6018N1257J72397
3521H201024L22285J17531L56002Q1685Q2577J82248J08571m9782L02412M44883
3511A0149436l2465K2777K17225L5606J88450M7230M69881L23598J29579J55587
3501A1706904K64550J9305N53874R5358J51229J43707N4276M4030L20457K14432
3491A3568122J74095j97661j97048O40348J87126L14237L14403j02657L59559
3482A5060524Q8296l4034J30973J80228J49062K40517M70274J24769N88792M99111
$$ plain form
3472 17498512 17690244 17941110 18283829 18444724 18741316 19062377 19395642 19531873 19914809
3463 19914809 20665395 20838786 20951393 21451496 21812646 22160795 22325125 22562120 22756018
3454 22756018 23050572 23150169 23582506 24161965 24424982 24742429 25172427 25515022 25990074 26850676
3444 26850676 27922242 28571793 28990537 29645664 30664557 31572073 32079424 32762147 33578364
3435 33578364 34894774 36088004 37089128 38355240 39409379 40245752 40932991 42025922
3427 42025922 42748298 43955950 44732918 45733629 46193694 47037246 47699544 48265050 48896470
3418 48896470 49609767 50497379 51357013 52529198 53811910 55185491 55932678 57109166 58243594
3409 58243594 59611730 61090080 63064191 64649895 66039267 68002335 69779932 71500974
$$ packed form
3472A7498512J91732K50866L42719J60895K96592L21061L33265J36231L82936
3463A9914809P50586J73391J12607N00103L61150L48149J64330K36995J93898
3454B2756018K94554R9597M32337N79459K63017L17447M29998L42595M75052Q60602
3444B6850676J071566O49551M18744O55127J018893R07516N07351O82723Q16217
3435C3578364J316410J193230J001124J266112J054139Q36373O87239J092931
3427D2025922P22376J207652P76968J000711M60065Q43552O62298N65506O31420
3418D8896470P13297Q87612Q59634J172185J282712J373581P47187J176488J134428
3409E8243594J368136J478350J974111J585704J389372J963068J777597J721042
$$ plain form
3401 71500974 73124488 74401464 76281393 77586359 78756583 80063116 81351153 82426190
3393 82426190 83541264 84724557 85663296 86646548 87965633 89098232 90085593 91327413 92422404
3384 92422404 93402520 94333170 95377222 96789082 97976922 99262661 100716499 102431567
3376 102431567 103748986 105159073 106737512 107634168 108749423 110332012 111897309 113320400
3368 113320400 114824661 116152644 117654225 119338771 120719223 122324738 124425946 126200782
3360 126200782 127621681 129455367 131789993 133688617 135642619 137654834 139966038 141824483
3352 141824483 143879068 145852329 147599467 149264340 150698209 151719522 152558172 153328077
3344 153328077 153483421 153171270 152484586 151187246 149534372 147570819 145026319 142664919
$$ packed form
3401G1500974J623514J276976J879929J304966J170224J306533J288037J075037
3393H2426190J115074J183293R38739R83252J319085J132599R87361J241820J094991
3384I2422404R80116R30650J044052J411860J187840J285739J453838J715068
3376A02431567J317419J410087J578439Q96656J115255J582589J565297J423091
3368A13320400J504261J327983J501581J684546J380452J605515K101208J774836
3360A26200782J420899J833686K334626J898624J954002K012215K311204J858445
3352A41824483K054585J973261J747138J664873J433869J021313Q38650P69905
3344A53328077J55344l12151o86684j297340j652874j963553k544500k361400
$$ plain form
3336 142664919 139816505 136932667 133360879 130017115 126540424 122845568 118898194 115210695
3328 115210695 111700914 107996833 104306792 100457295 96931647 93884401 90612696 87526589
3320 87526589 84582907 81340013 78998110 76397289 73759526 71031221 68699189 66995435
3312 66995435 65045633 63012438 60834515 58868104 57201382 55538661 54191795 52741627
3304 52741627 51266300 49992351 48253822 46810528 45777328 44520060 42851004 41716327
3296 41716327 40565527 39340178 38320555 37456909 36253718 35127369 34182153 33773565 33086117
3287 33086117 32069103 31727216 30493453 29434388 28795580 28087554 27633045 26940720 26500834
3278 26500834 25932260 25151944 24929947 24633236 23850412 23001471 22229713 22149563 22151186 21357266
$$ packed form
3336A42664919k848414k883838l571788l343764l476691l694856l947374l687499
3328A15210695l509781l704081l690041l849497l525648l047246l271705l086107
3320H7526589k943682l242894k341903k600821k637763k728305k332032j703754
3312F6995435j949802k033195k177923j966411j666722j662721j346866j450168
3304E2741627j475327j273949j738529j443294j033200j257268j669056j134677
3296D1716327j150800j225349j019623q63646j203191j126349r45216m08588o87448
3287C3086117j017014l41887j233763j059065o38808p08026m54509o92325m39886
3278B6500834n68574p80316k21997k96711p82824q48941p71758q0150J623p93920
$$ plain form
3268 21357266 20843013 20333037 19788299 19523725 19031743 18395358 18139010 17727087 17581955
3259 17581955 16898899 16444301 16021957 16114455 15901504 15430505 15250295 14813668 14212919 14054358
3249 14054358 14374536 14273267 14162945 13831324 12993372 12817847 12731214 12548667 12274266 12206085
3239 12206085 12372049 12130838 11930674 11600845 11452133 11475887 11277211 10761765 10688467 10498867
3229 10498867 10552134 10237946 9960971 9989866 10033490 9826068 10141749 10122941 9349180 9481481
3219 9481481 9598939 9239330 8771309 8467476 8628898 8603902 8685889 8262426 8241563 8389185
3209 8389185 8570223 8661282 8626526 8707539 8351005 7852597 7675716 7754316 8134783 8261214
3199 8261214 7861130 8007151 7757392 7859944 7961633 7532075 7476653 7679426 7433445 7120854
$$ packed form
3268B1357266n14253n09976n44738k64574m91982o36385k56348m11923j45132
3259A7581955o83056m54598m22344R2498k12951m70999j80210m36627o00749j58561
3249A4054358L20178j01269j10322l31621q37952j75525q6633j82547k74401o8181
3239A2206085J65964k41211k00164l29829j48712K3754j98676n15446p3298j89600
3229A0498867N3267l14188k76975K8895M3624k07422L15681j8808p73761J32301
3219I481481J17458l59609m68021l03833J61422k4996Q1987m23463k0863J47622
3209H389185J81038R1059l4756Q1013l56534m98408j76881P8600L80467J26431
3199H261214m00084J46021k49759J02552J01689m29558n5422K02773k45981l12591
$$ plain form
3189 7120854 7215721 7443587 7638000 7402909 7203904 7429223 7388942 7376155 7565036 7989978
3179 7989978 7533178 7374451 7328090 7337326 7614899 7473653 7384728 7214124 7331955 7419198
3169 7419198 7260060 7153254 7028831 7027597 7139382 7386135 7448878 7964344 8222380 8252627
3159 8252627 8309741 8283686 8083351 8096319 8475872 8274434 8072627 7546490 7660145 7656120
3149 7656120 7587618 7598685 7241215 7357049 7904059 7243699 7085859 7217819 6733189 6664185
3139 6664185 6799116 6389371 6377038 6192537 6194571 6175198 5811157 5904809 6044081 5999721 5766328
3128 5766328 5821236 5922022 5838274 5522813 5852562 5660231 5586071 5731543 5598960 5816607
3118 5816607 5936152 5360939 5328907 4976449 5184833 5447417 5464229 5288977 5107879 5005538
$$ packed form
3189G120854R4867K27866J94413k35091j99005K25319m0281j2787J88881M24942
3179G989978m56800j58727m6361R236K77573j41246q8925j70604J17831Q7243
3169G419198j59138j06806j24423j234J11785K46753O2743N15466K58036L0247
3159H252627N7114k6055k00335J2968L79553k01438k01807n26137J13655m025
3149G656120o8502J1067l57470J15834N47010o60360j57840J31960m84630o9004
3139F664185J34931m09745j2333j84501K034j9373l64041R3652J39272m4360k33393
3128E766328N4908J00786q3748l15461L29749j92331p4160J45472j32583K17647
3118E816607J19545n75213l2032l52458K08384K62584J6812j75252j81098j02341
$$ plain form
3108 5005538 5138360 4947026 4930955 4984623 4899804 5022444 5024422 4890065 4917976 5043223 5143419
3097 5143419 5021232 4739536 4787820 4985499 4999370 4491854 4723312 4628633 4704599 4727459
3087 4727459 5084710 5031611 5040147 4848237 4872133 4861727 4817387 4329013 4310830 4556021 4642941
3076 4642941 4996621 5122799 5143594 5002860 4762758 5337008 5613711 5478614 5392984 5208688
3066 5208688 5533032 5523285 5310184 5083322 5023495 4671732 5186810 5157612 5278240 5174575
3056 5174575 5121159 5325784 5020355 5223618 5830809 5749066 5671090 5357141 5121658 5671156
3046 5671156 5741786 5839217 5721249 5772799 6324694 6235950 6094691 6601843 6570830 6417699
3036 6417699 6779846 6898785 6772662 6884789 6784388 7091722 6934585 6788717 6671739 6447056
$$ packed form
3108E005538J32822j91334j6071N3668q4819J22640J978j34357K7911J25247J00196
3097E143419j22187k81696M8284J97679J3871n07516K31458r4679P5966K2860
3087D727459L57251n3099Q536j91910K3896j0406m4340m88374j8183K45191Q6920
3076D642941L53680J26178K0795j40734k40102N74250K76703j35097q5630j84296
3066E208688L24344r747k13101k26862n9827l51763N15078k9198J20628j03665
3056E174575n3416K04625l05429K03263O07191q1743p7976l13949k35483N49498
3046E671156P0630R7431j17968N1550N51895q8744j41259N07152l1013j53131
3036F417699L62147J18939j26123J12127j00401L07334j57137j45868j16978k24683
$$ plain form
3026 6447056 6494813 6808725 6620795 6620942 6793971 6496111 6424999 6567863 6815412 6864789 6714981
3015 6714981 6609401 6918452 6924628 7040090 7183729 7377825 7163072 7141201 7506393 7683027
3005 7683027 7617967 8008263 8303467 7945683 7698993 8054074 8412823 8262053 8208222 8190034
2995 8190034 8748642 8838978 8480112 8833906 9131838 9161846 8927448 9048172 9115802 9167259
2985 9167259 9259710 9342049 9262142 9616254 10106832 10347931 10530413 10365033 10441020 10569670
2975 10569670 10529127 10555447 10650378 10801697 11167504 11069414 11191552 11613500 11589280 11731582
2965 11731582 11866085 12021617 12319613 12633413 13113076 13326865 13658276 13740453 14040947 14386595
2955 14386595 14640569 14743085 14753264 15101102 15491996 15727578 16066805 16710020 16854820 16631977
$$ packed form
3026F447056M7757L13912j87930J47J73029k97860p1112J42864K47549M9377j49808
3015F714981j05580L09051O176J15462J43639J94096k14753k1871L65192J76634
3005G683027o5060L90296K95204l57784k46690L55081L58749j50770n3831j8188
2995H190034N58608R0336l58866L53794K97932L0008k34398J20724O7630N1457
2985I167259R2451Q2339p9907L54112M90578K41099J82482j65380P5987J28650
2975A0569670m0543K6320R4931J51319L65807r8090J22138M21948k4220J42302
2965A1731582J34503J55532K97996L13800M79663K13789L31411Q2177L00494L45648
2955A4386595K53974J02516J0179L47838L90894K35582L39227O43215J44800k22843
$$ plain form
2945 16631977 16979281 17188898 17435971 17811818 17909009 18486988 18700441 19165223 19679082 19662417
2935 19662417 19913683 20415950 20593460 20924068 20992300 20958017 21227586 21799829 22026913 22386839
2925 22386839 22795013 22588370 23455837 24354072 24487265 24714699 24860949 24994750 25507078
2916 25507078 26195551 26691849 27436322 27983013 28313318 29047641 29544336 29692007 29930856
2907 29930856 30566482 30852047 31018496 31202549 31524373 32013454 31927775 31933024 32196188 32217376
2897 32217376 32614353 33179393 33178789 33602879 33809129 34062397 34613323 34931909 35414293 35830824
2887 35830824 36117919 36685091 37472073 38336616 38545860 39814938 40835053 41763027 42838458
2878 42838458 43738917 45180686 46186844 47831500 49570562 51056831 52269120 53793579
$$ packed form
2945A6631977L47304K09617K47073L75847R7191N77979K13453M64782N13859j6665
2935A9662417K51266N02267J77510L30608O8232l4283K69569N72243K27084L59926
2925B2386839M08174k06643Q67467Q98235J33193K27434J46250J33801N12328
2916B5507078O88473M96298P44473N46691L30305P34323M96695J47671K38849
2907B9930856O35626K85565J66449J84053L21824M89081q5679N249K63164K1188
2897C2217376L96977N65040o04M24090K06250K53268N50926L18586M82384M16531
2887C5830824K87095N67172P86982Q64543K09244J269078J020115R27974J075431
2878D2838458R00459J441769J006158J644656J739062J486269J212289J524459
$$ plain form
2870 53793579 55547133 57727085 59364924 61196042 63094260 65208008 67510332 69550910
2862 69550910 71842015 74189130 76667083 79427455 82003580 84781061 87339132 90211430
2854 90211430 93230753 95990716 98790941 101908851 104835245 107783829 110836248 114023346
2846 114023346 116515465 119009124 121839313 124408873 127184962 129063072 130845623 133224389
2838 133224389 135483296 137171852 138795959 140085679 141329114 143065863 144126341 145048422
2830 145048422 145503712 145781301 145768178 145403343 145175549 144544877 143940291 142523696 141167949
2821 141167949 139558591 138198136 136673479 135327725 133304706 130722611 128538093 126290728
2813 126290728 123323869 120755175 118006321 114951615 111951866 108508699 105590491 102701783
$$ packed form
2870E3793579J753554K179952J637839J831118J898218K113748K302324K040578
2862F9550910K291105K347115K477953K760372K576125K777481K558071K872298
2854I0211430L019323K759963K800225L117910K926394K948584L052419L187098
2846A14023346K492119K493659K830189K569560K776089J878110J782551K378766
2838A33224389K258907J688556J624107J289720J243435J736749J060478R22081
2830A45048422M55290K77589j3123l64835k27794o30672o04586j416595j355747
2821A41167949j609358j360455j524657j345754k023019k582095k184518k247365
2813A26290728k966859k568694k748854l054706k999749l443167k918208k888708
$$ plain form
2805 102701783 99706848 96505095 93523077 90959491 87797490 84933021 82121511 79087832
2797 79087832 76584171 73730407 71086205 68411656 65880804 63479197 60920676 58626389
2789 58626389 56825864 55151990 53072462 51009542 49239706 47383412 46528372 44935853
2781 44935853 43092670 41619669 40178702 39433037 38555293 37364282 36285592 35642774 34785330
2772 34785330 33656310 33081368 32405367 31701009 31487529 30683252 30173100 29335538 29018917
2763 29018917 28625850 28281090 27859477 27255081 26889914 26360256 25841964 25365570 25045360
2754 25045360 25120496 25123627 24950072 24546342 24331137 24003319 23671403 23761238 23601931 23416260
2744 23416260 23426332 23251245 22665171 22873178 22902204 22969452 23005276 23549162 23427767 22785591
$$ packed form
2805A02701783k994935l201753k982018k563586l162001k864469k811510l033679
2797G9087832k503661k853764k644202k674549k530852k401607k558521k294287
2789E8626389j800525j673874k079528k062920j769836j856294q55040j592519
2781D4935853j843183j473001j440967p45665q77744j191011j078690o42818q57444
2772C4785330j129020n74942o76001p04358k13480q04277n10152q37562l16621
2763B9018917l93067l44760m21613o04396l65167n29658n18292m76394l20210
2754B5045360P5136L131j73555m03730k15205l27818l31916Q9835j59307j85671
2744B3416260J0072j75087n86074K08007K9026O7248L5824N43886j21395o42176
$$ plain form
2734 22785591 23052832 23267413 23075211 23232050 23807148 23539914 23803637 24095403 24187391 24314753
2724 24314753 24078336 24221538 24310943 24606128 25072404 25354490 25471179 25523367 25521839 25857978
2714 25857978 26175902 26436738 26846484 27648456 27919596 28126366 28409984 28918200 29345999
2705 29345999 29585949 29922543 30877635 31774116 32166172 32976670 33665761 34364618 35150886
2696 35150886 36267584 37053544 38021737 38607574 39367642 40564300 41741456 42950576 44187403
2687 44187403 45028835 45690114 46695746 47351689 48043129 48878729 49664879 50385204 51515536
2678 51515536 52360169 53041896 53425859 53663687 54147727 54508503 54843996 55919232 56730017
2669 56730017 56949332 57628524 57906031 58253204 58768654 59242695 59498129 59751044 60817629
$$ packed form
2734B2785591K67241K14581j92202J56839N75098k67234K63723K91766R1988J27362
2724B4314753k36417J43202Q9405K95185M66276K82086J16689N2188j528L36139
2714B5857978L17924K60836M09746Q01972K71140K06770K83618N08216M27799
2705B9345999K39950L36594R55092Q96481L92056Q10498O89091O98857P86268
2696C5150886J116698P85960R68193N85837P60068J196658J177156J209120J236827
2687D4187403Q41432O61279J005632O55943O91440Q35600P86150P20325J130332
2678E1515536Q44633O81727L83963K37828M84040L60776L35493J075236Q10785
2669E6730017K19315O79192K77507L47173N15450M74041K55434K52915J066585
$$ plain form
2660 60817629 61438567 61906455 62709213 64041546 65239161 66181782 67348293 68379384 70461602
2651 70461602 72092893 73805862 75915500 78217963 80918978 83785204 87101056 90341829
2643 90341829 93950510 98294153 102310938 106760814 111841487 117122920 122545640 128635637
2635 128635637 134970005 141473800 147869406 154362291 161082099 167988802 175445927 182662854
2627 182662854 189391009 196563958 203841496 210859396 217878321 224215190 230405139 236627526
2619 236627526 242141764 248010918 253709665 258348127 262782117 266469988 269776138 272179226
2611 272179226 273644208 274274180 274579121 274308974 272678075 270414994 267692840 264381411
2603 264381411 260688575 256496696 251813400 246769876 241066638 235798178 230774152 225328479
$$ packed form
2660F0817629O20938M67888Q02758J332333J197615R42621J166511J031091K082218
2651G0461602J631291J712969K109638K302463K701015K866226L315852L240773
2643I0341829L608681M343643M016785M449876N080673N281433N422720O089997
2635A28635637O334368O503795O395606O492885O719808O906703P457125P216927
2627A82662854O728155P172949P277538P017900P018925O336869O189949O222387
2619B36627526N514238N869154N698747M638462M433990L687871L306150K403088
2611B72179226J464982O29972L04941k70147j630899k263081k722154l311429
2603B64381411l692836m191879m683296n043524n703238n268460n024026n445673
$$ plain form
2595 225328479 219259168 212878828 206909622 200677139 194502904 188307733 181912529 175738964
2587 175738964 169704145 163553246 157817876 151771945 146013968 140776633 135823754 130720624
2579 130720624 126169378 121292416 116783677 113002414 109315440 106613765 103703493 100547497
2571 100547497 97981683 96194416 94242363 92553437 91053975 89788183 88927058 87844988
2563 87844988 87175420 86265577 85274456 84303140 84242328 83992131 83914366 83629209 83057821 83174969
2553 83174969 83097672 83090255 82931281 82746549 82182716 82023976 81700565 81385329 81506995 81067209
2543 81067209 80736577 80100978 79410604 79179702 78870219 78574848 77881897 76926156 76604051
2534 76604051 76377890 75860093 75519581 75050435 74056652 73542808 73094738 72469838 72516059 71633878
$$ packed form
2595B25328479o069311o380340n969206o232483o174235o195171o395204o173565
2587A75738964o034819o150899n735370o045931n757977n237335m952879n103130
2579A30720624m551246m876962m508739l781263l686974k701675k910272l155996
2571A00547497k565814j787267j952053j688926j499462j265792q61125j082070
2563H7844988o69568r09843r91121r71316o0812k50197p7765k85157n71388J17148
2553H3174969p7297p417j58974j84732n63833j58740l23411l15236J21666m39786
2543H1067209l30632o35599o90374k30902l09483k95371o92951r55741l22105
2534G6604051k26161n17797l40512m69146r93783n13844m48070o24900M6221q82181
$$ plain form
2524 71633878 71001623 70611200 70375530 70397329 70019516 69614084 69595672 69477484 69576919 69523756
2514 69523756 69964322 69977515 70279896 70783751 71098453 72021479 72546016 73290486 74391675
2505 74391675 75396514 77014865 78475475 79741937 81509873 83372623 85239036 87414439
2497 87414439 89881549 92525525 95195268 98324526 102008416 105889745 109973937 114443928
2489 114443928 119230910 124224148 129820529 136153772 142851977 149715564 157622993 165603557
2481 165603557 174251839 183811625 193347015 202987676 212958715 222847228 232561658 241802301
2473 241802301 250746660 259416996 267692376 275226022 282282831 289427940 296657513 303033850
2465 303033850 309093362 314869771 320228762 324544437 328203433 330515108 331981938 332155452
$$ packed form
2524G1633878o32255l90423k35670K1799l77813m05432j8412j18188R9435n3163
2514F9523756M40566J3193L02381N03855L14702R23026N24537P44470J101189
2505G4391675J004839J618351J460610J266462J767936J862750J866413K175403
2497H7414439K467110K643976K669743L129258L683890L881329M084192M469991
2489A14443928M786982M993238N596381O333243O698205O863587P907429P980564
2481A65603557Q648282R559786R535390R640661R971039R888513R714430R240643
2473B41802301Q944359Q670336Q275380P533646P056809P145109P229573O376337
2465C03033850O059512N776409N358991M315675L658996K311675J466830J73514
$$ plain form
2457 332155452 330528708 327782758 323733923 318619031 312517295 306309056 298933055 291664696
2449 291664696 283864053 275723090 267578302 259413285 250893467 242103685 233008619 223660800
2441 223660800 214383789 204449496 194894753 185281113 175451189 166310936 157276493 148490192
2433 148490192 139941781 132297239 124657959 118173063 111988752 105999005 100604598 95352616
2425 95352616 90594039 86480405 82527409 78541335 75156541 72090995 69111994 66124652
2417 66124652 63718981 61062136 58676723 56624816 54895019 53405635 52079195 50393396
2409 50393396 48787475 47346818 45729244 44574363 43258457 42024147 41247784 40306677
2401 40306677 39374393 38221705 37453865 36742390 35442336 34683964 33671201 32527745 32129879
$$ packed form
2457C32155452j626744k745950m048835n114892o101736o208239p376001p268359
2449B91664696p800643q140963q144788q165017q519818q789782r095066r347819
2441B23660800r277011r934293r554743r613640r829924r140253r034443q786301
2433A48490192q548411p644542p639280o484896o184311n989747n394407n251982
2425I5352616m758577m113634l952996l986074l384794l065546k979001k987342
2417F6124652k405671k656845k385413k051907j729797j489384j326440j685799
2409E0393396j605921j440657j617574j154881j315906j234310p76363r41107
2401D0306677r32284j152688p67840p11475j300054p58372j012763j143456l97866
$$ plain form
2392 32129879 31232697 30414400 29838188 29429487 28625623 28185482 27092515 26450541 25844416
2383 25844416 25346624 24687186 24168491 23829747 22949340 22439422 22210889 21278910 20510983
2374 20510983 20269284 20057785 19337524 18181464 17739790 17195630 17217330 16756223 16022694
2365 16022694 15661463 15500472 15263819 14878169 14722086 14380091 13950088 14025188 13531313 13115821
2355 13115821 12889191 12800078 12629028 12249718 12171580 11949293 11987248 11668360 11441453 11569244
2345 11569244 11008217 10842112 10501202 10019800 9908686 9750418 9662473 9027687 9335736 9354607
2335 9354607 9513865 9362340 9361739 9011501 8802459 8799697 8745292 8793790 8688008 8587523 8008799
2324 8008799 8136517 7972919 8478522 8279101 8548322 8587249 8629701 8211920 7949911 7832399
$$ packed form
2392C2129879q97182q18297n76212m08701q03864m40141j092967o41974o06125
2383B5844416m97792o59438n18695l38744q80407n09918k28533r31979p67927
2374B0510983k41699k11499p20261j156060m41674n44160K1700m61107p33529
2365A6022694l61231j60991k36653l85650j56083l41995m30003P5100m93875m15492
2355A3115821k26630q9113j71050l79310p8138k22287L7955l18888k26907J27791
2345A1569244n61027j66105l40910m81402j11114j58268q7945o34786L08049J8871
2335I354607J59258j51525o01l50238k09042k762n4405M8498j05782j00485n78724
2324H008799J27718j63598N05603j99421K69221L8927M2452m17781k62009j17512
$$ plain form
2314 7832399 7835332 8022439 7791753 7875245 8132850 8185126 7887497 7595085 7646935 7331539
2304 7331539 7164752 7323204 7368072 7315906 7078142 7054814 7196892 7288152 7269020 6643136
2294 6643136 6637574 6961041 6835453 6811791 6880628 6969706 6805206 6558875 6221666 6392829
2284 6392829 6148125 6014662 6121467 5769413 5604536 5409255 5402014 5582011 5562821 5567377
2274 5567377 5214111 5051870 5062509 4941845 4737523 4544232 4861834 5238487 5103019 4732712
2264 4732712 4643959 4453939 4851656 4710522 4411521 4545942 4168133 3864335 4129326 4611114
2254 4611114 4714638 4478489 4497751 4395889 3995984 4574292 4736008 4740065 4365826 4305222
2244 4305222 4451148 4206565 4321904 4340727 4247265 4095520 4461907 4535434 4221580 4290073
$$ packed form
2314G832399K933J87107k30686Q3492K57605N2276k97629k92412N1850l15396
2304G331539j66787J58452M4868n2166k37764k3328J42078R1260j9132o25884
2294F643136n562L23467j25588k3662O8837Q9078j64500k46331l37209J71163
2284F392829k44704j33463J06805l52054j64877j95281p241J79997j9190M556
2274E567377l53266j62241J0639j20664k04322j93291L17602L76653j35468l70307
2264D732712q8753j90020L97717j41134k99001J34421l77809l03798K64991M81788
2254D611114J03524k36149J9262j01862l99905N78308J61716M057l74239o0604
2244D305222J45926k44583J15339J8823r3462j51745L66387P3527l13854O8493
$$ plain form
2234 4290073 4191452 4154569 4316596 4466841 4493695 4393103 4623279 4605379 4657672 4639949 4560854
2223 4560854 4726821 4504732 4567542 4232968 4181696 4398925 4739970 4828666 4889450 4801202
2213 4801202 4895920 4270665 4274875 3950865 4076239 4407327 5091437 5023940 4486337 4521771
2203 4521771 4302223 4448186 4276893 4363310 4401405 4605033 4605583 4460712 4651540 4465550
2193 4465550 4688695 4882706 4686545 4905927 4990466 5214459 5237598 5214500 5301045 5455462
2183 5455462 5815584 5707875 5402718 5479876 5618181 6233962 6345508 6372298 6225638 6738367
2173 6738367 6929522 7076852 7285981 7968628 8175909 8112470 8079951 8159969 8257316 8423155
2163 8423155 8646641 9022017 9660537 9792227 10197769 10052708 10244026 10156820 9666840 9634337
$$ packed form
2234D290073r8621l6883J62027J50245K6854j00592K30176j7900N2293j7723p9095
2223D560854J65967k22089O2810l34574n1272K17229L41045Q8696O0784q8248
2213D801202R4718o25255M210l24010J25374L31088O84110o7497n37603L5434
2203D521771k19548J45963j71293Q6417L8095K03628N50j44871J90828j85990
2193D465550K23145J94011j96161K19382Q4539K23993K3139k3098Q6545J54417
2183E455462L60122j07709l05157P7158J38305O15781J11546K6790j46660N12729
2173F738367J91155J47330K09129O82647K07281o3439l2519Q0018R7347J65839
2163H423155K23486L75376O38520J31690M05542j45061J91318q7206m89980l2503
$$ plain form
2153 9634337 9773415 9634131 9608841 9570200 9239223 8728258 8096810 8151924 7739259 7425720
2143 7425720 7150248 7053543 7221143 7304395 7062491 6559219 6395663 6266441 6131334 6335989
2133 6335989 6279683 5866067 5550223 5598120 5716406 5702961 5273810 4925842 4971247 4814484
2123 4814484 4472810 4524636 4466230 4429721 4347819 4381657 4579923 4518245 4539095 4475388 4381901
2112 4381901 4553680 4763967 4487086 4172657 4385068 4341952 4153845 4208499 4309949 4612428
2102 4612428 4903150 4621149 4453852 4658718 4542219 4391889 4210771 4386103 4585859 4771193
2092 4771193 4287319 4111066 3883160 3833883 3647440 3511851 3831324 3610450 3404563 2896728
2082 2896728 2805317 3033134 2696493 2803845 2577218 2369467 2169047 2190468 2284441 2345142
$$ packed form
2153I634337J39078j39284k5290l8641l30977n10965o31448N5114m12665l13539
2143G425720k75472r6705J67600Q3252k41904n03272j63556j29222j35107K04655
2133F335989n6306m13616l15844M7897J18286j3445m29151l47968M5405j56763
2123D814484l41674N1826n8406l6509q1902L3838J98266o1678K0850o3707r3487
2112D381901J71779K10287k76881l14429K12411m3116j88107N4654J01450L02479
2102D612428K90722k82001j67297K04866j16499j50330j81118J75332J99756J85334
2092D771193m83874j76253k27906m9277j86443j35589L19473k20874k05887n07835
2082B896728r1411K27817l36641J07352k26627k07751k00420K1421R3973O0701
$$ plain form
2072 2345142 2581023 2592583 2380047 2408993 2677203 2333324 2083162 2110798 1869960 1967850
2062 1967850 2084761 2030795 2496798 2321847 2203332 2078219 2160217 2189664 2122164 2073675
2052 2073675 1832251 1821703 1820109 2039098 2100129 1929984 1773503 2021259 1806210 1899702
2042 1899702 1899372 1574502 1341351 1255757 1472794 1643211 1700078 1839097 1754909 1486003 1536388
2031 1536388 1402239 1359962 1290571 1291728 1424301 1058621 1039221 1135499 1044052 1252424 1196183
2020 1196183 1181525 826421 992902 1113752 1002244 1217552 1190185 1287365 1013063 1085813
2010 1085813 1132079 1153357 1132721 1150211 886264 1009537 1059625 1327744 1035103 682306
2000 682306 978517 976217 941665 759803 688845 584072 1140674 1010071 634702 334622
$$ packed form
2072B345142K35881J1560k12536K8946K68210l43879k50162K7636k40838R7890
2062A967850J16911n3966M66003j74951j18515j25113Q1998K9447o7500m8489
2052B073675k41424j0548j594K18989O1031j70145j56481K47756k15049R3492
2042A899702l30l24870k33151q5594K17037J70417N6867J39019q4188k68906N0385
2031A536388j34149m2277o9391J157J32573l65680j9400R6278r1447K08372n6241
2020A196183j4658l55104J66481J20850j11508K15308k7367R7180k74302P2750
2010A085813M6266K1278k0636J7490k63947J23273N0088K68119k92641l52797
2000F82306K96211k300l4552j81862p0958j04773N56602j30603l75369l00080
$$ plain form
1990 334622 610287 775121 689046 813611 1057599 1054288 730500 958757 970817 919764 1095321
1979 1095321 1124208 942741 903294 999625 1060595 1127894 1191035 1412341 1314998 939184 831448
1968 831448 976970 1073860 910176 694804 927720 752875 922685 1318528 1373580 1104594
1958 1104594 881666 876429 1143719 1154048 1447946 1529912 1286740 1254088 1150980 1119097 888804
1947 888804 463252 525391 932913 1416568 1299823 943257 1214311 1164841 1328134 1713036
1937 1713036 1530804 1334841 831163 835451 1593332 1026431 776172 1180115 1253692 983754
1927 983754 896694 958574 1226033 1299580 1409743 1170663 1281826 1194287 1319020 1395760 1062914
1916 1062914 1081843 1037798 1239591 1310657 1501511 1297016 1173120 1282663 1663393 1837318
$$ packed form
1990C34622K75665J64834q6075J24565K43988l311l23788K28257J2060n1053J75557
1979A095321K8887j81467l9447R6331O0970O7299O3141K21306r7343l75814j07736
1968H31448J45522R6890j63684k15372K32916j74845J69810L95843N5052k68986
1958A104594k22928n237K67290J0329K93898Q1966k43172l2652j03108l1883k30293
1947H88804m25552O2139M07522M83655j16745l56566K71054m9470J63293L84902
1937A713036j82232j95963n03678M288P57881n66901k50259M03943P3577k69938
1927I83754q7060O1880K67459P3547J10163k39080J11163q7539J24733P6740l32846
1916A062914J8929m4045K01793P1066J90854k04495j23896J09543L80730J73925
$$ plain form
1906 1837318 1844094 1303862 1459597 1617020 1796416 1860664 2069425 2103484 1808296 1844508
1896 1844508 1852879 1573979 1773329 2100240 1995894 1992515 2163680 1795325 1739999 1727004 1541842
1885 1541842 1691862 1352530 1607500 2133005 2113937 1607564 1735069 1899141 1856206 1645361
1875 1645361 2001930 2071166 1803037 2005522 2069614 2096549 2409130 2716852 3098997 2895526
1865 2895526 2460599 2286535 2557257 2590455 2722431 2604399 2854712 2880752 2707874 2846435
1855 2846435 2783962 2802708 2872767 2755230 2711055 2851603 2642781 2451272 2031851 1864054
1845 1864054 2446371 2235621 1739659 1509732 1775752 1763067 1925843 2258038 2284525 2121619
1835 2121619 2257644 2252745 2449379 2473792 2675437 2722555 2475819 2436993 1998094 2017004 2395319
$$ packed form
1906A837318O776n40232J55735J57423J79396O4248K08761L4059k95188L6212
1896A844508Q371k78900J99350L26911j04346l379J71165l68355n5326j2995j85162
1885A541842J50020l39332K54970N25505j9068n06373J27505J64072m2935k10845
1875A645361L56569O9236k68129K02485O4092K6935L12581L07722L82145k03471
1865B895526m34927j74064K70722L3198J31976j18032K50313K6040j72878J38561
1855B846435o2473J8746P0059j17537m4175J40548k08822j91509m19421j67797
1845A864054N82317k10750m95962k29927K66020j2685J62776L32195K6487j62906
1835B121619J36025m899J96634K4413K01645M7118k46736l8826m38899J8910L78315
$$ plain form
1824 2395319 2374570 2088210 2287539 2228992 2229654 2319690 2401525 2035187 2098731 2423609 2630203
1813 2630203 2578069 2287538 1935364 1959096 2130774 1979058 1699356 1931446 2348613 2119411
1803 2119411 2015817 1705671 1478575 2002305 2295606 2298242 2336665 2287612 2177637 2318439
1793 2318439 2466066 2290431 1785580 1840863 1677297 1792269 1764886 1733994 1661630 1399766
1783 1399766 1371569 1044499 1420658 1477803 1505143 1679774 1533013 1805161 1692900 2015452
1773 2015452 1737198 1564836 2220770 2519412 2250705 2317199 2471133 2475137 2406480 2154394
1763 2154394 2048192 1902904 1738852 1400215 1180874 1583580 1607297 1524605 1523599 1458618
1753 1458618 1406614 1476721 1555281 1601810 1574560 1823873 1486667 1128859 1437777 1439120 1498928
$$ packed form
1824B395319k0749k86360J99329n8547O62R0036Q1835l66338O3544L24878K06594
1813B630203n2134k90531l52174K3732J71678j51716k79702K32090M17167k29202
1803B119411j03594l10146k27096N23730K93301K636L8423m9053j09975J40802
1793B318439J47627j75635n04851N5283j63566J14972k7383l0892p2364k61864
1783A399766k8197l27070L76159N7145K7340J74631j46761K72148j12261L22552
1773B015452k78254j72362O55934K98642k68707O6494J53934M004o8657k52086
1763B154394j06202j45288j64052l38637k19341M02706K3717q2692j006o4981
1753A458618n2004P0107P8560M6529k7250K49313l37206l57808L08918J343N9808
$$ plain form
1742 1498928 1441756 1564111 1420640 1170140 1265772 1065977 806145 1003123 966324 812240
1732 812240 704332 599768 614439 520595 793170 1022993 1119017 904070 626201 706295
1722 706295 1029866 1016688 621901 599194 610434 636700 733812 742448 497045 265344 260173
1711 260173 364681 552100 631734 209218 234553 273597 23218 130088 388448 212055
1701 212055 252325 368688 352186 465728 562124 -222161 -214007 149978 209018 170263 -118222
1690 -118222 247722 200874 273028 299685 -113261 -106743 -310184 -588518 -434184 -23263 51868
1679 51868 -218055 -490586 -151427 -23140 -51319 -286148 -130939 -431032 -131132 89545
1669 89545 381818 83997 -370931 -503515 -431700 -80191 -230724 -238647 -150118 21837 -20523
$$ packed form
1742A498928n7172J22355j43471k50500R5632j99795k59832J96978l6799j54084
1732H12240j07908j04564J4671r3844K72575K29823R6024k14947k77869Q0094
1722G06295L23571j3178l94787k2707J1240K6266R7112Q636k45403k31701n171
1711B60173J04508J87419P9634m22516K5335L9044k50379J06870K58360j76393
1701B12055M0270J16363j6502J13542R6396p84285Q154L63985N9040l8755k88485
1690a18222L65944m6848P2154K6657m12946O518k03441k78334J54334M10921P5131
1679E1868k69923k72531L39159J28287k8179k34829J55209l00093K99900K20677
1669H9545K92273k97821m54928j32584P1815L51509j50533p923Q8529J71955m2360
$$ plain form
1658 -20523 -91926 212155 389779 194394 302875 60058 24088 -120674 -266533 -488891
1648 -488891 -269928 -142739 -119007 -283271 -214574 -445709 -310571 -205521 -440148 -815880
1638 -815880 -454187 86574 219530 288043 228235 -1927 -335228 -747270 -409748 -122665
1628 -122665 -423260 78346 2033 -49982 -221290 -173846 43256 23944 19753 -32737 6630
1617 6630 -213348 -355295 -80481 -395459 -464030 -295714 21734 21667 29560 -91081 -225443
1606 -225443 -199153 -263448 -266271 -98899 -154475 44021 71033 -144374 -107077 -386357 -262267
1595 -262267 -289615 -255298 -76490 72625 -138772 -400109 -377234 -226103 -181319 -137697 -238409
1584 -238409 -424143 -641369 -577612 -477456 -309244 -562124 -502317 -82609 -301610 -484328
$$ packed form
1658b0523p1403L04081J77624j95385J08481k42817l5970j44762j45859k22358
1648d88891K18963J27189K3732j64264O8697k31135J35138J05050k34627l75732
1638h15880L61693N40761J32956O8513n9808k30162l33301m12042L37522K87083
1628a22665l00595N01606p6313n2015j71308M7444K17102j9312m191n2490L9367
1617F630k19978j41947K74814l14978o8571J68316L17448o7P893j20641j34362
1606b25443K6290o4295k823J67372n5576J98496K7012k15407L7297k79280J24090
1595b62267k7348L4317J78808J49115k11397k61337K2875J51131M4784M3622j00712
1584b38409j85734k17226O3757J00156J68212k52880N9807M19708k19001j82718
$$ plain form
1574 -484328 -429446 -354940 -40353 66803 -30015 -26602 -51861 -417224 -375385 -103655 15327
1563 15327 -52776 -141165 -240571 -211351 -405116 -423513 -235488 203061 69109 -76801 -369500
1552 -369500 -295262 -227034 178877 146516 208793 287507 333754 234207 165716 316453 253044
1541 253044 394973 -4658 -10049 -120263 171160 423481 389151 126356 -120008 -416634
1531 -416634 -349728 138413 456729 262274 140781 206464 534876 142946 -54939 500
1521 500 241134 872186 387119 271006 634440 669770 460237 140746 267680 52314
1511 52314 168567 435553 533639 755741 536384 21993 73995 369592 451099 359510 276070
1500 276070 276626 256181 178449 260074 318518 -95102 -456856 -87177 305114 334812 357712
$$ packed form
1574d84328N4882P4506L14587J07156r6818L413k5259l65363M1839K71730J18982
1563A5327o8103q8389r9406K9220j93765j8397J88025M38549j33952j45910k92699
1552c69500P4238O8228M05911l2361O2277P8714M6247r9547o8491J50737o3409
1541B53044J41929l99631n391j10214K91423K52321l4330k62795k46364k96626
1531d16634O6906M88141L18316j94455j21493O5683L28412l91930j97885N5439
1521E00K40634O31052m85067j16113L63434L5330k09533l19491J26934k15366
1511E2314J16253K66986R8086K22102k19357n14391N2002K95597Q1507r1589q3440
1500B76070N56k0445p7732Q1625N8444m13620l61754L69679L92291K9698K2900
$$ plain form
1489 357712 520869 574102 988159 918845 680564 506065 591781 628214 958609 799972
1479 799972 383559 152508 427712 577539 806586 771430 598588 737380 787065 658911
1469 658911 600686 798728 692304 455455 622004 570536 542019 308266 309909 726538 793141
1458 793141 898150 1002949 556813 555946 902020 957953 782770 546236 691382 631459 681866
1447 681866 479989 526459 626157 892606 405342 503860 600865 685929 724533 763714 855857
1436 855857 819106 487902 505771 674142 351101 415036 488049 183595 255680 326703 459230
1425 459230 387751 1027921 996941 668624 646359 430296 530942 646737 592257 503534 469782
1414 469782 448123 351689 380692 115471 27424 400087 492411 229270 224453 64304 164458
$$ packed form
1489C57712J63157N3233M14057o9314k38281j74499Q5716L6433L30395j58637
1479G99972m16413k31051K75204J49827K29047l5156j72842J38792M9685j28154
1469F58911n8225J98042j06424k36849J66549n1468k8517k33753J643M16629O6603
1458G93141J05009J04799m46136q67L46074N5933j75183k36534J45146n9923N0407
1447F81866k01877M6470R9698K66449m87264R8518R7005Q5064L8604L9181R2143
1436H55857l6751l31204J7869J68371l23041O3935P3013l04454P2085P1023J32527
1425D59230p1479O40170l0980l28317k2265k16063J00646J15795n4480q8723l3752
1414D69782k1659r6434K9003k65221q8047L72663R2324k63141m817j60149J00154
$$ plain form
1403 164458 605752 160873 8137 -107 197892 576365 349471 82287 250221 235177
1393 235177 -13966 -36166 478 2432 341896 254570 -10242 -36217 159068 -28552 -102221
1382 -102221 -517088 -507615 141621 260084 -104024 105940 548858 566967 83816 -54563
1372 -54563 -234963 -450643 -143596 188434 -223361 -384066 -131675 136475 232169 -105360
1362 -105360 -502908 -354783 258381 258797 -55666 -123129 -304513 -253153 -226457 -175940 -106316
1351 -106316 80565 211775 123604 -93440 -347449 -410583 -487438 -132227 -438338 -547288
1341 -547288 -422935 -254790 -292891 -446080 -325554 -278227 -151803 -13694 -172683 -303420
1331 -303420 -147533 -285828 -556735 -375675 -375492 -224198 -148070 -224441 -183586 10273 -15609
$$ packed form
1403A64458M41294m44879j52736q244J97999L78473k26894k67184J67934j5044
1393B35177k49143k2200L6644J954L39464q7326k64812k5975J95285j87620p3669
1382a02221m14867R473O49236J18463l64108K09964M42918J8109m83151j38379
1372e4563j80400k15680L07047L32030m11795j60705K52391K68150R5694l37529
1362a05360l97548J48125O13164M16l14463o7463j81384N1360K6696N0517O9624
1351a06316J86881J31210q8171k17044k54009o3134p6855L55211l06111j08950
1341e47288J24353J68145l8101j53189J20526M7327J26424J38109j58989j30737
1331c03420J55887j38295k70907J81060J83J51294P6128p6371M0855J93859k5882
$$ plain form
1320 -15609 199892 -140338 -244080 -48926 -166633 -84264 -320054 -389145 -227044 -82311
1310 -82311 -153099 -56104 159817 -21065 -88133 -168543 -18601 15495 195725 94665 -237455
1299 -237455 -13918 272394 217450 -320136 -465254 -321787 -218926 -200639 206154 83241
1289 83241 -95738 -240809 -382787 -260328 -621023 -444532 -302654 -241259 37241 -2976
1279 -2976 -272961 -183279 -209838 -216664 -359817 -311447 -189037 -321379 -540631 -307578 2084
1268 2084 -366278 -4151 121670 257491 -173270 -238007 59172 -3853 -176339 210450
1258 210450 8735 -653635 -532755 -464443 -353853 -272493 -382334 -144543 -306734 -461312
1248 -461312 -100989 176916 -11320 -218326 13861 -107855 -64429 83483 62443 69085
$$ packed form
1320a5609K15501l40230j03742J95154j17707Q2369k35790o9091J62101J44733
1310h2311p0788R6995K15921j80882o7068q0410J49942L4096J80230j01060l32120
1299b37455K23537K86312n4944n37586j45118J43467J02861J8287M06793j22913
1289H3241j78979j45071j41978J22459l60695J76491J41878O1395K78500m0217
1279b976k69985Q9682k6559o826j43153M8370J22410j32342k19252K33053L09662
1268B084l68362L62127J25821J35821m30761o4737K97179o3025j72486L86789
1258B10450k01715o62370J20880O8312J10590Q1360j09841K37791j62191j54578
1248d61312L60323K77905j88236k07006K32187j21716M3426J47912k1040O642
$$ plain form
1238 69085 6520 113465 282466 488712 542455 601875 548151 172135 297888 452483 539062
1227 539062 406196 -169072 -213146 -132106 176346 299426 43012 193945 468384 72837
1217 72837 59811 473859 457515 509485 421146 -26947 156352 407369 228258 18043 -229722
1206 -229722 141790 183586 97595 355805 2346 -68125 -92335 42496 346076 249774 258833
1195 258833 -31858 -112807 25883 158826 113303 -112717 7447 22207 97526 379594
1185 379594 -87851 -219201 -7431 12180 432678 497133 406734 317402 -252945 -369295
1175 -369295 113876 524937 209616 333398 408182 63382 -148361 -192457 263923 283894
1165 283894 189233 173782 464398 399034 223760 363151 -24554 33013 335221 707412
$$ packed form
1238F9085o2565J06945J69001K06246N3743N9420n3724l76016J25753J54595Q6579
1227E39062j32866n75268m4074Q1040L08452J23080k56414J50933K74439l95547
1217G2837j3026M14048j6344N1970q8339m48093J83299K51017j79111k10215k47765
1206b29722L71512M1796q5991K58210l53459p0471k4210J34831L03580r6302R059
1195B58833k90691q0949J38690J32943m5523k26020J20164J4760P5319K82068
1185C79594m67445j31350K11770J9611M20498O4455r0399q9332n70347j16350
1175c69295M83171M11061l15321J23782P4784l44800k11743m4096M56380J9971
1165B83894r4661j5451K90616o5364j75274J39391l87705N7567L02208L72191
$$ plain form
1155 707412 593029 398953 196502 332004 -22484 75802 508253 655716 375295 200230
1145 200230 448227 310204 182521 143923 206360 -103786 -132028 -1605 50118 19273 25702
1134 25702 118310 -195641 -198636 47439 376139 502939 159409 84646 208960 485336 693671
1123 693671 508449 441015 512087 81937 224834 346831 155916 196474 242901 464802
1113 464802 217697 368696 315261 359900 411856 234642 575911 574873 433631 295860 503939
1102 503939 429199 585193 326727 544735 659182 628156 734528 647373 738352 1007140
1092 1007140 1041822 642336 569141 309566 448548 443243 432610 567147 422134 683012
1082 683012 1021590 984666 740161 450915 530024 667758 473437 304631 535654 584803
$$ packed form
1155G07412j14383j94076k02451J35502l54488R8286M32451J47463k80421j75065
1145B00230K47997j38023j27683l8598O2437l10146k8242J30423N1723l0845O429
1134B5702R2608l13951k995K46075L28700J26800l43530p4763J24314K76376K08335
1123F93671j85222o7434P1072m30150J42897J21997j90915M0558M6427K21901
1113D64802k47105J50999n3435M4639N1956j77214L41269j038j41242j37771K08079
1102E03939p4740J55994k58466K18008J14447l1026J06372q7155R0979K68788
1092A007140L4682l99486p3195k59575J38982n305j0633J34537j45013K60878
1082F83012L38578l6924k44505k89246P9109J37734j94321j68806K31023M9149
$$ plain form
1072 584803 553717 1010582 801925 744290 973765 1050231 926715 795994 622362 712307
1062 712307 1151230 849857 970289 1260132 1114045 895898 472633 936790 1253071 1006208
1052 1006208 822079 999313 1355731 1331020 1164387 1073633 886753 930215 1509891 1448168
1042 1448168 1623514 1858179 1591230 1756564 1691943 1482491 1589640 1451743 2020140 1864340
1032 1864340 1859191 2365868 2706506 2601041 2260875 2284011 2343603 2154649 1855516 1722707
1022 1722707 1912423 2371641 2710926 2843642 2703468 2940459 2898175 2717670 2866302 3061446
1012 3061446 3225676 3273937 3838129 4067570 3845885 3937940 3826267 4057001 4193885 4394465
1002 4394465 4612120 4909783 5103318 5149082 5499860 5694190 5848578 6142255 6474887 6500620
$$ packed form
1072E84803l1086M56865k08657n7635K29475P6466j23516j30721j73632Q9945
1062G12307M38923l01373J20432K89843j46087k18147m23265M64157L16281k46863
1052A006208j84129J77234L56418k4711j66633r0754j86880M3462N79676o1723
1042A448168J75346K34665k66949J65334o4621k09452J07149j37897N68397j55800
1032A864340n149N06677L40638j05465l40166K3136N9592j88954k99133j32809
1022A722707J89716M59218L39285J32716j40174K36991m2284j80505J48632J95144
1012C061446J64230M8261N64192K29441k21685R2055j11673K30734J36884K00580
1002D394465K17655K97663J93535M5764L50778J94330J54388K93677L32632K5733
$$ plain form
992 6500620 6654104 7099458 6971527 7345633 7331101 7595066 7884581 8186211 8750746 9197702
982 9197702 9366926 9439771 9520198 10174421 10631021 11266702 12009324 12557855 13385829 14087645
972 14087645 14463168 15044714 16187916 17119890 18225610 19261302 20452536 21857459 23538717
963 23538717 25253046 26730929 28764276 31205322 33815569 36777306 39915367 43118846
955 43118846 46820332 51184576 56139200 62217031 69123080 76674711 84621610 93183113
947 93183113 101415538 106801455 110034756 109531017 103293807 96924568 92485477 88534339
939 88534339 81588959 73296820 65120026 58486275 53402683 49344417 46222804 43455357
931 43455357 40333132 37416495 34335423 31543162 29276611 27297001 25772141 24086970
$$ packed form
992F500620J53484M45354j27931L74106j4532K63965K89515L01630N64535M46956
982I197702J69224P2845Q0427O54223M56600O35681P42622N48531Q27974P01816
972A4087645L75523N81546J143202R31974J105720J035692J191234J404923J681258
963B3538717J714329J477883K033347K441046K610247K961737L138061L203479
955D3118846L701486M364244M954624O077831O906049P551631P946899Q561503
947I3183113Q232425N385917L233301n03739o237210o369239m439091l951138
939H8534339o945380q292139q176794o633751n083592m058266l121613k767447
931D3455357l122225k916637l081072k792261k266551j979610j524860j685171
$$ plain form
923 24086970 22043875 20338093 18971818 17566899 16918918 15795998 15183577 14570908 13762120
914 13762120 12815831 12313246 11441909 10656028 10267586 10179676 9771151 9230646 8878435 8489637
904 8489637 8547649 7699808 6994188 6625633 6425455 6259369 6231351 6312011 5992417 5858937
894 5858937 5616138 5133215 5173424 5202194 4957674 4940959 4771690 4557359 4439503 4566295
884 4566295 4531163 4249034 4116915 4200989 3959421 3748918 3570357 3622800 3623552 3730907 3366982
873 3366982 2854905 2629881 3062500 2635053 2365689 2867431 2768716 2496719 1986307 2290009
863 2290009 2483010 2572871 2918401 2557994 2197243 1982600 2053318 2054475 2195169 2385115
853 2385115 2061125 1840543 1449610 1622427 1652887 1591785 1311936 1438727 1224562 1034544
$$ packed form
923B4086970k043095j705782j366275j404919o47981j122920o12421o12669q08788
914A3762120r46289n02585q71337p85881l88442q7910m08525n40505l52211l88798
904H489637N8012q47841p05620l68555k00178j66086k8018Q0660l19594j33480
894E858937k42799m82923M0209K8770k44520j6715j69269k14331j17856J26792
884D566295l5132k82129j32119Q4074k41568k10503j78561N2443P52J07355l63925
873C366982n12077k25024M32619m27447k69364N01742r8715k71997n10412L03702
863B290009J93001Q9861L45530l60407l60751k14643P0718J157J40694J89946
853B385115l23990k20582l90933J72817L0460o1102k79849J26791k14165j90018
$$ plain form
843 1034544 1668795 1854128 1530088 1240953 1192725 925111 911994 1144180 1202729 1129607
833 1129607 920417 542198 272831 405360 679001 673710 743742 995825 935818 1046561
823 1046561 654942 817722 745867 632125 911960 769798 823939 714368 856479 738686
813 738686 887046 688386 784326 815147 863001 956267 470313 508460 466738 272722 484266
802 484266 415757 762910 732028 534823 681805 524079 544720 690176 664750 305167 704371
791 704371 379961 527302 591830 238152 621398 308974 153910 186522 123289 368141
781 368141 551025 327403 391323 393421 305817 121430 193032 158036 55561 115085 159431
770 159431 195370 73012 46573 232048 7564 18132 198438 278446 121806 61323 -195446
$$ packed form
843A034544O34251J85333l24040k89135m8228k67614j3117K32186N8549p3122
833A129607k09190l78219k69367J32529K73641n291P0032K52083o0007J10743
823A046561l91619J62780p1855j13742K79835j42162N4141j09571J42111j17793
813G38686J48360j98660R5940L0821M7854R3266m85954L8147m1722j94016K11544
802D84266o8509L47153l0882j97205J46982j57726K0641J45456k5426l59583L99204
791G04371l24410J47341O4528l53678L83246l12424j55064L2612o3233K44852
781C68141J82884k23622O3920K098q7604j84387P1602l4996j02475N9524M4346
770A59431L5939j22358k6439J85475k24484J0568J80306Q0008j56640o0483k56769
$$ plain form
759 -195446 105177 327779 317223 -74644 -42419 15039 5410 113662 170270 317219 501881
748 501881 250949 -90092 141020 57030 210418 -105774 73960 49515 -167762 -19123
738 -19123 196341 50606 -59340 68013 -44608 -479940 -372114 -24413 125269 -46236
728 -46236 -24276 262314 107342 -162122 186058 -282639 -398050 -326131 -231770 12328 -165374
717 -165374 -284600 268550 299328 308003 -63330 56505 -2399 -177336 -152620 -112838 -217609
706 -217609 -366497 -218927 -145249 -25922 57312 400209 183516 -214985 172378 480859
696 480859 231734 -10893 -350627 -127629 23524 147146 -268552 -37269 -44054 -1760
686 -1760 8959 -9785 -128766 75929 441858 420942 476899 255811 126925 -136662 -272924
$$ packed form
759a95446L00623K22602j0556l91867L2225N7458r629J08252N6608J46949J84662
748E01881k50932l41041K31112q3990J53388l16192J79734k4445k17277J48639
738a9123K15464j45735j09946J27353j12621m35332J07826L47701J49682j71505
728d6236K1960K86590j54972k69464L48180m68697j15411P1919R4361K44098j77702
717a65374j19226N53150L0778Q675l71333J19835n8904j74937K4716L9782j04771
706b17609j48888J47570P3678J19327Q3234L42897k16693l98501L87363L08481
696D80859k49125k42627l39734K22998J51153J23622m15698K31283o785M2294
686a760J0719j8744j18981K04695L65929k0916N5957k21088j28886k63587j36262
$$ plain form
675 -272924 -40168 -94639 -145250 -346809 -487599 -18605 69176 132615 263790 -146284 -79518
664 -79518 -317597 -315901 81028 55827 -164091 -306440 -209532 -130993 12626 12968 -91396
653 -91396 104178 468503 361457 320079 206382 338596 434547 282825 177148 -2151
643 -2151 -188653 72769 89117 399370 477557 114221 41378 -311299 -161146 -257005 274908
632 274908 126195 -45018 -126404 -358625 -316927 -190730 -319361 -142205 -265848 -356653
622 -356653 -252856 -366736 -344053 -306450 -365536 -432325 -497106 -505220 82797 150263 -110852
611 -110852 -459617 -332405 -265786 -160892 -302770 -190877 -352657 -221175 -361261 -218453
601 -218453 -352675 -469222 -394451 -706112 -704688 -711790 -253005 -249069 19614 168795 259848
$$ packed form
675b72924K32756n4471n0611k01559j40790M68994Q7781O3439J31175m10074O6766
664g9518k38079J696L96929k5201k19918j42349R6908P8539J43619L42j04364
653i1396J95574L64325j07046m1378j13697J32214R5951j51722j05677j79299
643b151j86502K61422J6348L10253P8187l63336p2843l52677J50153r5859N31913
632B74908j48713j71213q1386k32221M1698J26197j28631J77156j23643r0805
622c56653J03797j13880K2683L7603n9086o6789o4781q114N88017O7466k61115
611a10852l48765J27212O6619J04894j41878J11893j61780J31482j40086J42808
601b18453j34222j16547P4771l11661J424p102M58785L936K68683J49181R1053
$$ plain form
590 259848 265404 111447 -89271 -315028 -255902 -109623 19169 -190846 -375764 -578488
580 -578488 -603908 -466554 -332896 -421418 -341591 -397142 -259606 -223414 -349497 -372017 -259601
569 -259601 -17373 -327376 -442699 -566237 -475026 134031 -283194 -287159 -517296 -423651 18681
558 18681 7785 7883 -122660 246384 194234 -338856 -712473 -526552 -559649 -901951 -561355
547 -561355 -238046 -220880 -240500 -159450 -93190 -209363 13787 -132042 -393438 -586568 -285285
536 -285285 -504289 -388050 -369663 -255856 29079 -6083 -253999 -551604 -624717 -431505
526 -431505 -392941 -53048 51440 -88213 -36543 62114 -87068 16329 312798 430415
516 430415 336226 93474 147674 -163276 -267702 -602286 -649739 -359758 -127768 -200365 110598
$$ packed form
590B59848N556j53957k00718k25757N9126J46279J28792k10015j84918k02724
580e78488k5420J37354J33658q8522P9827n5551J37536L6192j26083k2520J12416
569b59601K42228l10003j15323j23538R1211O09057m17225l965k30137R3645M42332
558A8681j0896R8j30543L69044n2150n33090l73617J85921l3097l42302L40596
547e61355L23309J7166j9620Q1050O6260j16173K23150j45829k61396j93130L01283
536b85285k19004J16239J8387J13807K84935l5162k47916k97605p3113J93212
526d31505L8564L39893J04488j39653N1670R8657j49182J03397K96469J17617
516D30415r4189k42752N4200l10950j04426l34584m7453K89981K31990p2597L10963
$$ plain form
505 110598 -222658 -414393 -280052 -485854 -373156 -226134 -217865 -351989 -306870 -221228 -274428
494 -274428 -252135 -289661 -233173 -296831 -496585 -557647 -627113 -133925 -429632 -478888 -305178
483 -305178 -270324 -102633 -91185 -511446 -927867 -856094 -687907 -139612 -28375 -288973
473 -288973 -14897 78685 -43752 117648 -212225 -338693 -184607 -303789 -108499 103675
463 103675 -227719 -499910 -252090 -2547 190132 140847 5467 -27092 -127584 -291155
453 -291155 -417111 -744658 -919665 -426252 -35400 -254173 -632581 -828759 -854424 -183319
443 -183319 -219942 -442660 -449032 -289895 64918 97090 -162834 -296029 -544542 -363636 -545438
432 -545438 -676370 -713507 -789260 -358453 -280628 -149076 -298507 -244361 -151357 -362303 -155686
$$ packed form
505A10598l33256j91735J34341k05802J12698J47022Q269j34124M5119Q5642n3200
494b74428K2293l7526N6488o3658j99754o1062o9466M93188k95707m9256J73710
483c05178L4854J67691J1448m20261m16421P1773J68187N48295J11237k60598
473b88973K74076R3582j22437J61400l29873j26468J54086j19182J95290K12174
463A03675l31394k72191K47820K49543J92679m9285j35380l2559j00492j63571
453b91155j25956l27547j75007M93413L90852k18773l78408j96178k5665O71105
443a83319l6623k22718o372J59137L54813L2172k59924j33195k48513J80906j81802
432e45438j30932l7137p5753M30807P7825J31552j49431N4146R3004k10946K06617
$$ plain form
421 -155686 -180754 121264 -284613 -655319 -428473 -538681 -703671 -674531 -611540 -310177
411 -310177 -227255 -98712 -138411 -433783 -337335 -273861 -111198 -197189 -2012 -230861 -568566
400 -568566 -412134 -665646 -346745 -92834 -297916 -553529 -403057 -378174 -234280 -482477
390 -482477 -555610 -266851 -468463 -525307 -660719 -614665 -327483 -338076 -323928 55887 -39057
379 -39057 99423 -37925 -352221 -455193 -492704 -191631 77976 -177952 -219990 -682399
369 -682399 -571127 -579685 -361027 -516756 -754953 -499317 -523695 -708101 -510311 -459328 -194602
358 -194602 -505183 -373691 -319563 -169765 228583 -193353 -445293 -503091 -467427 -272174
348 -272174 -434680 -419989 -376358 -368768 -419195 -246568 -337967 -440132 -505235 -457013 -468546
$$ packed form
421a55686k5068L02018m05877l70706K26846j10208j64990K9140O2991L01363
411c10177Q2922J28543l9699k95372R6448O3474J62663q5991J95177k28849l37705
400e68566J56432k53512L18901K53911k05082k55613J50472K4883J43894k48197
390d82477p3133K88759k01612n6844j35412M6054K87182j0593J4148L79815r4944
379c9057J38480j37348l14296j02972l7511L01073K69607k55928m2038m62409
369f82399J11272q558K18658j55729k38197K55636k4378j84406J97790N0983K64726
358a94602l10581J31492N4128J49798L98348m21936k51940n7798L5664J95253
348b72174j62506J4691M3631P590n0427J72627r1399j02165o5103M8222j1533
$$ plain form
337 -468546 -491225 -467172 -412620 -601463 -864772 -426144 -314435 -651009 -910507 -528492
327 -528492 -195070 -103886 -280618 -333703 -861275 -505628 -128267 50376 -213834 -316552
317 -316552 -320345 -329516 -172692 -157055 -410249 -457096 -556806 -396787 -596041 -478190 -144536
306 -144536 231638 -46051 -401689 -283452 -284591 -364732 -313219 142052 60140 -599186 -731925
295 -731925 -680389 -586622 -281058 -286234 -178420 -289362 -380116 -436455 -524838 -638731 -483433
284 -483433 -345156 -628215 -850870 -535243 -322973 -508261 -793693 -799275 -416659 -365333
274 -365333 -491533 -396703 -526374 -497916 -606592 -651660 -832004 -831013 -336056 -568549 -780532
263 -780532 -539739 -420360 -265440 -618282 -541050 -363461 -649259 -662598 -524091 -690861
$$ packed form
337d68546k2679K4053N4552j88843k63309M38628J11709l36574k59498L82015
327e28492L33422R1184j76732n3085n27572L55647L77361J78643k64210j02718
317c16552l793r171J56824J5637k53194m6847r9710J60019j99254J17851L33654
306a44536L76174k77689l55638J18237j139q0141N1513M55271q1912o59326j32739
295g31925N1536R3767L05564n176J07814j10942r0754n6339q8383j13893J55298
284d83433J38277k83059k22655L15627K12270j85288k85432n582L82616N1326
274c65333j26200R4830j29671K8458j08676m5068j80344R91M94957k32493k11983
263g80532K40793J19379J54920l52842P7232J77589k85798j3339J38507j66770
$$ plain form
253 -690861 -576478 -944125 -981298 -645978 -945690 -1095948 -843631 -839059 -967194 -814064
243 -814064 -854265 -649600 -824227 -554476 -764286 -580178 -522618 -562959 -325480 -227116 -202593
232 -202593 -732937 -1006927 -654082 -789687 -897832 -304270 -461002 -436868 -655668 -411210
222 -411210 -501225 -759255 -789300 -870469 -689636 -499826 -257279 -581455 -510517 -247965 -510987
211 -510987 -462270 -611287 -932040 -912445 -540980 -160199 -399601 -505705 -514250 -424624 -832482
200 -832482 -781131 -353569 -317931 -421195 -258172 -491073 -568445 -627386 -696108 -552170 -724326
189 -724326 -733595 -866339 -716645 -596631 -308788 -227057 -359762 -351680 -404029 -500542 -689292
178 -689292 -826326 -409093 -619679 -394245 -334059 -695312 -209520 -268729 -537903 -656715
$$ packed form
253f90861J14383l67647l7173L35320k99712j50258K52317M572j28135J53130
243h14064m0201K04665j74627K69751k09810J84108N7560m0341K37479R8364K4523
232b02593n30344k73990L52845j35605j08145N93562j56732K4134k18800K44458
222d11210r0015k58030l0045q1169J80833J89810K42547l24176P0938K62552k63022
211e10987M8717j49017l20753J9595L71465L80781k39402j06104q545Q9626m07858
200h32482N1351M27562L5638j03264J63023k32901p7372n8941o8722J43938j72156
189g24326r269j32744J49694J20014K87843Q1731j32705Q082n2349r6513j88750
178f89292j37034M17233k10586K25434O0186l61253M85792n9209k69174j18812
$$ plain form
168 -656715 -717098 -640733 -615620 -314498 -519063 -488075 -505681 -813118 -647677 -927694 -879939
157 -879939 -660105 -759584 -783188 -709973 -683003 -562336 -750530 -1289534 -1202397 -609690 -529542
146 -529542 -411996 -289169 -722226 -656856 -573029 -583728 -840716 -787969 -692298 -441865 -513930
135 -513930 -971859 -780265 -573786 -534979 -238698 -478787 -700988 -559914 -640519 -919468
125 -919468 -879636 -683339 -645606 -810536 -1068304 -954910 -1099087 -1075183 -901175 -516929
115 -516929 -416321 -613660 -796796 -793892 -1070269 -987453 -725701 -561257 -497940 -461983 -413706
104 -413706 -724593 -946601 -878399 -806613 -735545 -849487 -904216 -893883 -1139551 -1194019 -1117695
93 -1117695 -1182558 -998405 -862183 -732180 -884646 -936811 -872315 -785042 -742122 -860123 -795611
$$ packed form
168f56715o0383P6365K5113L01122k04565L0988j7606l07437J65441k80017M7755
157h79939K19834r9479k3604P3215K6970J20667j88194n39004Q7137N92707Q0148
146e29542J17546J22827m33057O5370Q3827j0699k56988N2747R5671K50433p2065
135e13930m57929J91594K06479L8807K96281k40089k22201J41074q0605k78949
125i19468L9832J96297L7733j64930k57768J13394j44177K3904J74008L84246
115e16929J00608j97339j83136K904k76377Q2816K61752J64444O3317L5957M8277
104d13706l10887k22008O8202P1786P1068j13942n4729J0333k45668n4468P6324
93a117695o4863J84153J36222J30003j52466n2165O4496Q7273M2920j18001O4512
$$ plain form
82 -795611 -670911 -610532 -743172 -634358 -786164 -543583 -704834 -913765 -821717 -876341 -794388
71 -794388 -1093311 -967643 -818696 -740161 -794741 -844426 -680834 -709554 -701737 -869793 -864875
60 -864875 -874502 -735208 -464099 -410407 -751018 -737708 -730418 -723548 -931121 -940486 -770317 -784105
48 -784105 -667235 -540223 -476424 -708099 -673369 -701989 -733202 -863342 -840693 -971614 -1097745
37 -1097745 -749366 -601927 -909977 -1030483 -1184286 -1188188 -817461 -549448 -650556 -704576
27 -704576 -854287 -925541 -917124 -1054791 -1068162 -950347 -900614 -826370 -649622 -895736 -846113
16 -846113 -776488 -887446 -804747 -827359 -901682 -925763 -930303 -967937 -756859 -564615 -563789 -780797
4 -780797 -958365 -1186614 -1121301 -1025241
$$ packed form
82g95611J24700O0379j32640J08814j51806K42581j61251k08931R2048n4624Q1953
71g94388k98923J25668J48947P8535n4580m9685J63592k8720P817j68056M918
60h64875r627J39294K71109N3692l40611J3310P290O870k07573r365J70169j3788
48g84105J16870J27012O3799k31675L4730k8620l1213j30140K2649j30921j26131
37a097745L48379J47439l08050j20506j53803l902L70727K68013j01108n4020
27g04576j49711p1254Q417j37667j3371J17815M9733P4244J76748k46114M9623
16h46113O9625j10958Q2699k2612p4323k4081m540l7634K11078J92244Q26k17008
4g80797j77568k28249O5313R6060
$$ plain form
0 -1025241
$$ packed form
0a025241
$$ Imaginary data points
##PAGE= N=2
##DATA TABLE= (X++(I..I)), XYDATA
$$ plain form
16383 -4672131 -4575461 -4483966 -4600172 -4713951 -4616580 -4251330 -4158550 -3968462 -3841428 -3808453
16373 -3808453 -3789608 -3750504 -3919271 -3807824 -3727357 -4060923 -3986650 -3834195 -3645643 -3271890
16363 -3271890 -3224720 -3217577 -3139599 -3238002 -3294802 -3169312 -3115151 -3272292 -3122380 -3311418 -3126577
16352 -3126577 -3125684 -3188358 -2959971 -2981716 -2842002 -3014883 -2823170 -2752040 -2762122 -2502034 -2180320
16341 -2180320 -2113461 -2339055 -2426413 -2317171 -2034266 -2284576 -2104312 -2054927 -1743052 -1650136
16331 -1650136 -1375446 -1555453 -1725032 -1579586 -1866333 -1752205 -1639598 -1261827 -1410217
16322 -1410217 -1393455 -1364469 -1102680 -1208242 -1162746 -987022 -805691 -903886 -1083753 -969220
16312 -969220 -1105435 -1089520 -764048 -770733 -800045 -681119 -478136 -295103 -235971 -301354 -61544
$$ packed form
16383d672131R6670R1495j16206j13779R7371L65250R2780J90088J27034L2975
16373c808453J8845L9104j68767J11447Q0467l33566P4273J52455J88552L73753
16363c271890M7170P143P7978r8403n6800J25490N4161j57141J49912j89038J84841
16352c126577Q93o2674K28387k1745J39714j72881J91713P1130j0082K60088L21714
16341b180320O6859k25594q7358J09242K82905k50310J80264M9385L11875R2916
16331a650136K74690j80007j69579J45446k86747J14128J12607L77771j48390
16322a410217J6762K8986K61789j05562M5496J75724J81331r8195j79867J14533
16312i69220j36215J5915L25472o685k9312J18926K02983J83033N9132o5383K39810
$$ plain form
16301 -61544 2459 16282 -53170 -243664 -307237 103394 245370 158272 364553 530893 495774
16290 495774 430622 400443 566409 625206 248942 390311 665818 576212 434927 677592
16280 677592 733907 946361 808355 807613 905030 997855 1222378 1203900 1252957 1285425 1230745
16269 1230745 1085939 1164236 1150493 988381 1014741 934045 1298897 1451998 1526595 1549282
16259 1549282 1414643 1457962 1377081 1499852 1738444 1473848 1560068 1576208 1586268 1566241
16249 1566241 1326486 1403831 1642160 1673126 1980619 2051352 2136762 2021639 1857402 1924717
16239 1924717 1991083 2006763 2168196 2096172 2237247 2117431 2036911 2192711 2188500 2314853
16229 2314853 2355209 2371409 2473621 2482919 2344492 2274586 2351691 2717682 2504956 2485534 2533593
$$ packed form
16301f1544O4003J3823o9452j90494o3573M10631J41976q7098K06281J66340l5119
16290D95774o5152l0179J65966N8797l76264J41369K75507q9606j41285K42665
16280F77592N6315K12454j38006p42R7417R2825K24523j8478M9057L2468n4680
16269A230745j44806P8297j3743j62112K6360q0696L64852J53101P4597K2687
16259A549282j34639M3319q0881J22771K38592k64596Q6220J6140J0060k0027
16249A566241k39755P7345K38329L0966L07493P0733Q5410j15123j64237O7315
16239A924717O6366J5680J61433p2024J41075j19816q0520J55800m211J26353
16229B314853M0356J6200J02212R298j38427o9906P7105L65991k12726j9422M8059
$$ plain form
16218 2533593 2772268 2827349 2936871 2661622 2759303 2831335 2872006 3218212 2974129 2688521
16208 2688521 2601212 2761542 2923794 2773033 2870921 2974364 2942539 3129956 3047815 3058788
16198 3058788 3429431 3385827 3423935 3508938 3017179 2907364 2964288 3133550 3159055 3276248
16188 3276248 3217845 3241360 3199687 3035902 2902980 2784090 3150457 3326772 3543683 3830503
16178 3830503 3573071 3315941 3309795 3208559 3353045 3397510 3111525 3213505 3676938 3776331
16168 3776331 3776504 3049780 3365573 3825157 3506870 3049259 3098863 3106982 3290636 3391893
16158 3391893 3484147 3562217 3169604 3172555 3456788 3640893 3583647 3947527 3582695 3623036
16148 3623036 3713396 3643043 3841969 3794334 3544830 3562921 3659794 3789479 3977975 3973942 3987477
$$ packed form
16218B533593K38675N5081J09522k75249R7681P2032M0671L46206k44083k85608
16208B688521q7309J60330J62252j50761R7888J03443l1825J87417q2141J0973
16198C058788L70643m3604L8108Q5003m91759j09815N6924J69262K5505J17193
16188C276248n8403K3515m1673j63785j32922j18890L66367J76315K16911K86820
16178C830503k57432k57130o146j01236J44486M4465k85985J01980M63433R9393
16168C776331J73p26724L15793M59584l18287m57611M9604Q119J83654J01257
16158C391893R2254P8070l92613K951K84233J84105n7246L63880l64832M0341
16148C623036R0360p0353J98926m7635k49504J8091R6873J29685J88496m033J3535
$$ plain form
16137 3987477 3846541 3833291 3720656 3824206 4083390 3940033 3821758 3735546 3618703 3742793
16127 3742793 3904323 4039112 4146661 3743352 3783567 4054929 4003668 4021781 4229416 4293956
16117 4293956 4088135 3777266 3672498 3969959 4346306 4147361 4026062 3990040 3981447 4318178
16107 4318178 4047718 4302318 4436475 4561489 4697730 4422514 3811712 3785253 3806446 3843008
16097 3843008 3828262 3970307 4180483 3972199 4251860 4054068 3740892 3879746 4163932 3782192
16087 3782192 3524071 3639965 4053059 4278806 4256173 4080654 4170918 4285920 4126334 4302185
16077 4302185 4314730 4120622 3982528 3849925 3532308 3697283 3971549 4010551 4466388 4457980
16067 4457980 3970957 4151259 4380162 4095707 4247286 4077866 3707682 3990504 4133107
$$ packed form
16137C987477j40936j3250j12635J03550K59184j43357j18275q6212j16843J24090
16127C742793J61530J34789J07549m03309M0215K71362n1261J8113K07635O4540
16117D293956k05821l10869j04768K97461L76347j98945j21299l6022q593L36731
16107D318178k70460K54600J34157J25014J36241k75216o10802k6459K1193L6562
16097C843008j4746J42045K10176k08284K79661j97792l13176J38854K84186l81740
16087C782192k58121J15894M13094K25747k2633j75519R0264J15002j59586J75851
16077D302185J2545j94108j38094j32603l17617J64975K74266L9002M55837q408
16067D457980m87023J80302K28903k84455J51579j69420l70184K82822J42603
$$ plain form
16058 4133107 4333263 4413833 4503767 4463345 4157955 4019066 4215847 4053324 3573739 3762669
16048 3762669 4279794 4476839 4218004 4567676 4473635 4184550 4476296 4688749 4895832 4850269
16038 4850269 4358642 4360254 4350213 4513519 4737223 4473081 4553084 4480612 4179317 4324120
16028 4324120 4318936 4176121 4733984 4753499 4581687 4649249 4402801 4327701 3980870 3937289
16018 3937289 4134675 4499565 4108839 4610829 4691778 4449876 4443923 4493639 4673658 4179311
16008 4179311 4069650 4372930 4646586 4668133 4771220 4137275 4326274 4153726 4504435 4691944
15998 4691944 4068788 3998952 3983551 4052114 4209015 3769054 3789124 3866919 3955665 4288286
15988 4288286 4519318 4129217 3979350 3831638 4219991 4437059 4416603 4396381 4284532 4255873
$$ packed form
16058D133107K00156Q0570Q9934m0422l05390j38889J96781j62523m79585J88930
16048C762669N17125J97045k58835L49672r4041k89085K91746K12453K07083m5563
16038D850269m91627J612j0041J63306K23704k64142Q0003p2472l01295J44803
16028D324120n184j42815N57863J9515j71812O7562k46448p5100l46831m3581
16018C937289J97386L64890l90726N01990Q0949k41902n953M9716J80019m94347
16008D179311j09661L03280K73656K1547J03087o33945J88999j72548L50709J87509
15998D691944o23156o9836j5401O8563J56901m39961K0070P7795Q8746L32621
15988D288286K31032l90101j49867j47712L88353K17068k0456k0222j11849k8659
$$ plain form
15978 4255873 4188336 4260639 4149880 4286202 4548548 4448805 4270019 4252232 4444561 4247072
15968 4247072 3756961 4136911 4392069 4470847 4488556 4426838 4282680 4546233 4572166 4450440
15958 4450440 4202123 4664827 5003818 4833243 4365598 4074713 4001946 3924339 3855883 4046631
15948 4046631 4527991 4341256 4251363 4420820 4427096 4361409 4296748 4386563 4446300 4340203 4119350
15937 4119350 4114427 4375541 4647704 4529514 4423816 4257864 4419627 4527939 4407719 4099191
$$ packed form
15978D255873o7537P2303j10759J36322K62346r9743j78786j7787J92329j97489
15968D247072m90111L79950K55158P8778J7709o1718j44158K63553K5933j21726
15958D450440k48317M62704L38991j70575m67645k90885p2767p7607o8456J90748
15948D046631M81360j86735q9893J69457O276o5687o4661Q9815N9737j06097k20853
15937D119350m923K61114K72163j18190j05698j65952J61763J08312j20220l08528
$$ [...]
##END NTUPLES=NMR SPECTRUM
##END=
