##TITLE=1H_EC-3246x
 CDCl3,8 sc, 
 1.03.2021
##JCAMPDX= 6.0         $$ Bruker NMR JCAMP-DX V2.0
##DATA TYPE= NMR SPECTRUM
##DATA CLASS= NTUPLES
##ORIGIN= UXNMR, Bruker Analytische Messtechnik GmbH
##OWNER= root
$$ XWIN-NMR		Version 3.5
$$ Mon Mar  1 11:01:33 2021 Russian Standard Time (UT+4h)  she@DPX200
##.OBSERVE FREQUENCY= 200.1315066352
##.OBSERVE NUCLEUS= ^1H
##.ACQUISITION MODE= SIMULTANEOUS
##.ACQUISITION SCHEME= undefined
##.AVERAGES= 8
##.DIGITISER RES= 18
##SPECTROMETER/DATA SYSTEM= spect
##.PULSE SEQUENCE= zg30
##.SOLVENT NAME= CDCl3
##.SHIFT REFERENCE= (INTERNAL, CDCl3, 0, 16.002)
##AUDIT TRAIL= $$ (NUMBER, WHEN, WHO, WHERE, WHAT)
$$ ##TITLE= Audit trail, XWIN-NMR		Version 3.5
$$ ##JCAMPDX= 5.01
$$ ##ORIGIN= Bruker BioSpin GmbH
$$ ##OWNER= she
$$ F:/spectra/data/she/nmr/H-F/1/pdata/1/auditp.txt
$$ ##AUDIT TRAIL=  $$ (NUMBER, WHEN, WHO, WHERE, WHAT)
(   1,<2021-03-01 11:00:20.20 +0400>,<she>,<DPX200>,
      <created by zg, POWCHK disabled, PULCHK disabled
       configuration hash MD5:
       00 E9 B6 7A A2 85 ED C7 34 08 36 98 17 FE 4E 26
       data hash MD5: 16K
       13 65 B2 13 C3 4B 96 35 9C 1C CB 02 39 FC 43 8B>)
(   2,<2021-03-01 11:00:22.43 +0400>,<she>,<DPX200>,
      <Start of raw data processing
       efp BC_mod = 2 LB = 0.24 FT_mod = 6 PKNL = 1 PHC0 = -10765.09 PHC1 = 19.20094 SI = 16K 
       data hash MD5: 16K
       E8 F4 F2 63 55 B4 BA 44 36 55 7E 8B 07 F8 2E BF>)
(   3,<2021-03-01 11:00:45.53 +0400>,<she>,<DPX200>,
      <pk PHC0 = 7.083399 PHC1 = -9.399999 
       data hash MD5: 16K
       00 A0 A4 DD 9C C2 C3 06 A2 12 5D 7D 9D AE 4A 0D>)
(   4,<2021-03-01 11:00:48.73 +0400>,<she>,<DPX200>,
      <abs ABSG = 5 
       data hash MD5: 16K
       B0 DA 9C 53 AD 09 26 1B 8C 76 26 62 FB 70 DF 67>)
$$ ##END=
$$ 
$$ hash MD5
$$ CE 4C 92 3E 9D 69 C5 6D 32 57 EA 28 F1 63 EC 60
##$RELAX= 
##$RELAX= 
##$RELAX= 
##$RELAX= 
##$RELAX= 
##$RELAX= 
$$ Bruker specific parameters
$$ --------------------------
##$DU= <F:/spectra>
##$EXPNO= 1
##$NAME= <H-F>
##$PROCNO= 1
##$TYPE= <nmr>
##$USER= <she>
##$AMP= (0..31)
100 100 100 100 100 100 100 100 100 100 100 100 100 100 100 100 100 100 
100 100 100 100 100 100 100 100 100 100 100 100 100 100 
##$AQSEQ= 0
##$AQ_mod= 1
##$AUNM= <au_zg>
##$AUTOPOS= <>
##$BF1= 200.13
##$BF2= 200.13
##$BF3= 200.13
##$BF4= 200.13
##$BF5= 200.13
##$BF6= 200.13
##$BF7= 200.13
##$BF8= 200.13
##$BYTORDA= 1
##$CFDGTYP= 0
##$CFRGTYP= 5
##$CHEMSTR= <none>
##$CNST= (0..31)
1 1 145 1 1 1 1 1 1 1 1 1 1 1 1 1 1 1 1 1 1 1 1 1 1 1 1 1 1 1 1 1 
##$CPDPRG= <>
##$CPDPRG1= <>
##$CPDPRG2= <>
##$CPDPRG3= <>
##$CPDPRG4= <mlev>
##$CPDPRG5= <mlev>
##$CPDPRG6= <mlev>
##$CPDPRG7= <mlev>
##$CPDPRG8= <mlev>
##$CPDPRGB= <>
##$CPDPRGT= <>
##$D= (0..31)
0 1.2 0 0 0 0 0 0 0 0.06 0 0.03 0 0 0 0 0.0002 0 0 0 0 0 0 0 0 0 0 0 0 
0 0 0 
##$DATE= 1614582019
##$DBL= (0..7)
120 120 120 120 120 120 120 120 
##$DBP= (0..7)
150 150 150 150 150 150 150 150 
##$DBP07= 0
##$DBPNAM0= <>
##$DBPNAM1= <>
##$DBPNAM2= <>
##$DBPNAM3= <>
##$DBPNAM4= <>
$$ [...]
##$SUBNAM3= <"">
##$SUBNAM4= <"">
##$SUBNAM5= <"">
##$SUBNAM6= <"">
##$SUBNAM7= <"">
##$SUBNAM8= <"">
##$SUBNAM9= <"">
##$SW= 16.9725356469052
##$SWIBOX= (0..15)
0 0 2 0 0 0 0 0 0 0 0 0 0 0 0 0 
##$SW_h= 3396.73913043478
##$TD= 16384
##$TD0= 1
##$TE= 0
##$TE2= 300
##$TE3= 300
##$TEG= 300
##$TL= (0..7)
0 120 120 120 120 120 120 120 
##$TP= (0..7)
150 150 150 150 150 150 150 150 
##$TP07= 0
##$TPNAME0= <>
##$TPNAME1= <>
##$TPNAME2= <>
##$TPNAME3= <>
##$TPNAME4= <>
##$TPNAME5= <>
##$TPNAME6= <>
##$TPNAME7= <>
##$TPOAL= (0..7)
0.5 0.5 0.5 0.5 0.5 0.5 0.5 0.5 
##$TPOFFS= (0..7)
0 0 0 0 0 0 0 0 
##$TUNHIN= 0
##$TUNHOUT= 0
##$TUNXOUT= 0
##$USERA1= <user>
##$USERA2= <user>
##$USERA3= <user>
##$USERA4= <user>
##$USERA5= <user>
##$V9= 5
##$VALIST= <valist>
##$VCLIST= <CCCCCCCCCCCCCCC>
##$VD= 0
##$VDLIST= <DDDDDDDDDDDDDDD>
##$VPLIST= <PPPPPPPPPPPPPPP>
##$VTLIST= <TTTTTTTTTTTTTTT>
##$WBST= 1024
##$WBSW= 4
##$XGAIN= (0..3)
0 0 0 0 
##$XL= 0
##$YL= 0
##$YMAX_a= 148515
##$YMIN_a= -142825
##$ZGOPTNS= <>
##$ZL1= 120
##$ZL2= 120
##$ZL3= 120
##$ZL4= 120
##$ABSF1= 15.97921
##$ABSF2= -0.9934521
##$ABSG= 5
##$ABSL= 3
##$ALPHA= 0
##$AQORDER= 0
##$ASSFAC= 0
##$ASSFACI= 0
##$ASSFACX= 0
##$ASSWID= 0
##$AUNMP= <proc_1d>
##$AZFE= 0.1
##$AZFW= 0.1
##$BCFW= 0
##$BC_mod= 2
##$BYTORDP= 0
##$COROFFS= 0
##$CY= -3
##$DATMOD= 1
##$DC= 0
##$DFILT= <>
##$DTYPP= 0
##$F1P= 0
##$F2P= 0
##$FCOR= 1
##$FTSIZE= 16384
##$FT_mod= 6
##$GAMMA= 0
##$GB= 0
##$INTBC= 1
##$INTSCL= 2.992141e-10
##$ISEN= 128
##$LB= 0.24
##$LEV0= 0
##$LPBIN= 0
##$MAXI= 10000
##$MC2= 0
##$MEAN= 0
##$ME_mod= 0
##$MI= 1.114404
##$NCOEF= 0
##$NC_proc= -9
##$NLEV= 6
##$NOISF1= 3.799351
##$NOISF2= 2.8
##$NSP= 0
##$NTH_PI= 0
##$NZP= 0
##$OFFSET= 16.002
##$PC= 1
##$PHC0= -10758.01
##$PHC1= 9.800941
##$PH_mod= 1
##$PKNL= yes
##$PPARMOD= 0
##$PSCAL= 0
##$PSIGN= 0
##$REVERSE= no
##$SF= 200.130002525279
##$SI= 16384
##$SIGF1= 3
##$SIGF2= 2
##$SINO= 5.538805
##$SIOLD= 16384
##$SREGLST= <1H.CDCl3>
##$SSB= 0
##$STSI= 16384
##$STSR= 0
##$SW_p= 3396.73913043478
##$SYMM= 0
##$S_DEV= 0
##$TDeff= 16384
##$TDoff= 0
##$TI= <>
##$TILT= no
##$TM1= 0
##$TM2= 0
##$TOPLEV= 0
##$USERP1= <user>
##$USERP2= <user>
##$USERP3= <user>
##$USERP4= <user>
##$USERP5= <user>
##$WDW= 1
##$XDIM= 16384
##$YMAX_p= 525969793
##$YMIN_p= -2072724
$$ End of Bruker specific parameters
$$ ---------------------------------
##NTUPLES= NMR SPECTRUM
##VAR_NAME=  FREQUENCY,     SPECTRUM/REAL,   SPECTRUM/IMAG
##SYMBOL=    X,             R,               I
##VAR_TYPE=  INDEPENDENT,   DEPENDENT,       DEPENDENT
##VAR_FORM=  AFFN,          ASDF,            ASDF
##VAR_DIM=   16384,         16384,           16384
##UNITS=     HZ,            ARBITRARY UNITS, ARBITRARY UNITS
##FACTOR=    0.207333158178281, 1,           1
##FIRST=     3202.48046225781, 0,            0
##LAST=      -194.258668176966, 0,           0
##MIN=       -194.258668176966, -2072724,    0
##MAX=       3202.48046225781, 525969793,    0
$$ Real data points
##PAGE= N=1
##DATA TABLE= (X++(R..R)), XYDATA
$$ [...]
5037D430743K27383p78594Q12j09029r16663O76439K54315j38964o36424j30579
5027B879439N30095j95338N69889j80109m83761O57704N11851m80855J71324k57060
5017C723179R9412l79846o7207K72612M42409K70672m29591J72012m05372l85677
5007C312603N2831l87625M86166k0296L3312L49270j95342J45498Q15053r98240
4997C593230n16739K77330O25117J45014p6530L05438l40954K08561J96307m68143
4987C948631n73483R2555L36620j44040l58106O50633l16370J45069P02355j45363
4977D338501j08533j9315o6731N4188m6213M2062k80546r95634m23554Q88098
4967C382323j71111j89200L63273j54647K42892O16099j5527n64571j23782k62679
$$ y = [4430743, 4658126, 3879532, 3880344, 3771315, 2854652, 3531091, 3785406, 3646442, 3010018, 2879439, 3409534, 3214196, 3784085, 3603976, 3120215, 3777919, 4289770, 3808915, 3980239, 3723179, 3822591, 3442745, 3375538, 3648150, 4090559, 4361231, 3931640, 4103652, 3698280, 3312603, 3365434, 2977809, 3463975, 3443679, 3476991, 3826261, 3630919, 3776417, 4591470, 3593230, 3076491, 3353821, 3978938, 4123952, 4047422, 4352860, 4011906, 4220467, 4416774, 3948631, 3375148, 3467703, 3804323, 3660283, 3302177, 3952810, 3636440, 3781509, 4483864, 4338501, 4229968, 4210653, 4143922, 4198110, 4151897, 4193959, 3913413, 2917779, 2494225, 3382323, 3211212, 3022012, 3385285, 3230638, 3473530, 4089629, 4074102, 3509531, 3385749, 3123070]
4957C123070j0320L31775k08268N84437N64240K77798m04510l96380k04625M6046
4947C703263o6135J02978m62200K13653J526584q8896o93687Q4400m20088M26361
4937D326233O05562j87993j16243m38428M02075J96770K59017j99098k93984k90541
4927D263370k69839K63297J33739k68380o12161N49885N76860K10777m17554K51733
4917D681727r309J8584k83314k53708O16390M69817l46276j87140M60519J26488
4907E293778r88739L26960M88408K92022j48693J90561r85822j00899L93475l87642
4897D373409m42467l44575M43808N03649L60600k46520O98736j11100o8600n44702
4887D622238k80476j74782K0903m33833k66782l41611N23258j65366O5651Q33147
$$ y = [3123070, 3112750, 3444525, 3236257, 3820694, 4384934, 4662732, 4258222, 3861842, 3657217, 3703263, 3637128, 3740106, 3277906, 3491559, 5018143, 4929247, 4235560, 4319960, 3899872, 4326233, 4931795, 4743802, 4627559, 4189131, 4591206, 4787976, 5046993, 4847895, 4553911, 4263370, 3993531, 4256828, 4390567, 4122187, 3510026, 4059911, 4636771, 4847548, 4429994, 4681727, 4672418, 4691002, 4407688, 4153980, 4770370, 5240187, 4893911, 4706771, 5167290, 5293778, 4305039, 4631999, 5120407, 5412429, 5263736, 5454297, 4468475, 4367576, 4761051, 4373409, 3930942, 3586367, 4030175, 4533824, 4894424, 4647904, 5346640, 5235540, 5166940, 4622238, 4341762, 4166980, 4187883, 3754050, 3487268, 3145657, 3668915, 3503549, 3569200, 4402347]
4877D402347L61402o75861j1634l57059l62290K31752P52789N02100k24758M2768
4867D661556o8744J17829M81214j037361m85233M19052K63816m54916m9887L78943
4857D226269K29678J86795K06157L4438j73691q04238Q06254K71062j396564P13479
4847D299639n9545J09235n78675N6108R92058n9288k03159j13282J74915o8033
4837D549973O88813o24797P9402K99503m30474K94696l12698J39432r1593J58700
4827D750957j19681K17370n3727k01727p3599N81846K9249k68832J28120L19880
4817E309856m23140j98254K91053L4122n9388L9370J92852J58320j66058m55448
4807D723285K03832M04716r6992N52175K65382k05545o94061L089P84769k22148
$$ y = [4402347, 4763749, 4087888, 4076254, 3719195, 3356905, 3588657, 4341446, 4843546, 4618788, 4661556, 4592812, 4710641, 5191855, 4154494, 3669261, 4088313, 4352129, 3897213, 3847326, 4226269, 4455947, 4642742, 4848899, 4883337, 4709646, 3905408, 4711662, 4982724, 3586160, 4299639, 4240094, 4349329, 3770654, 3826762, 4818820, 4759532, 4556373, 4443091, 4618006, 4549973, 5238786, 4613989, 4693391, 4992894, 4562420, 4857116, 4544418, 4683850, 4592257, 4750957, 4631276, 4848646, 4794919, 4593192, 4519593, 5101439, 5130688, 4861856, 4989976, 5309856, 4886716, 4688462, 4979515, 5013637, 4954249, 4993619, 5186471, 5344791, 5178733, 4723285, 4927117, 5331833, 5234841, 5787016, 6052398, 5846853, 5152792, 5155881, 5940650, 5718502]
4797E718502n39905K5643Q07613j6656K92488Q4162m74566m18267j03912N49850
4787E924952k67037j45196N05127K78114l86792K6599r2481O25187o70904o39705
4777E157864R65227L25119Q21803o1409p64012n58542N03489P27770p61515J771
4767F357565n42725K49417j3998l90508K81780M58118L43926j38090J023915J81877
4757G811277l08948k7344l08479m61218J54796L09903L20349j59855P4950K37706
4747G643137O0775j02759j1220r5344N90513k71162O94832K2485K29885Q30884
4737I592026n22129m3402p22925o53692Q36008R73634O73312k03334p99387M05217
4727I535328P26243L15237n22742L22630k379m66767K66764O08022J5803n01807
$$ y = [5718502, 5178597, 5204240, 6011853, 5995197, 6287685, 6371847, 5897281, 5479014, 5375102, 5924952, 5657915, 5512719, 6017846, 6295960, 5909168, 5935767, 5843286, 6468473, 5797569, 5157864, 6123091, 6448210, 7270013, 7208604, 6444592, 5886050, 6389539, 7117309, 6355794, 6357565, 5814840, 6064257, 6050259, 5659751, 5941531, 6399649, 6743575, 6605485, 7629400, 7811277, 7502329, 7474985, 7166506, 6705288, 6860084, 7169987, 7490336, 7330481, 7405431, 7643137, 7703912, 7601153, 7589933, 7494589, 8085102, 7813940, 8508772, 8531257, 8761142, 9592026, 9069897, 9026495, 8303570, 7649878, 8485886, 9459520, 10132832, 9929498, 9130111, 9535328, 10261571, 10576808, 10054066, 10376696, 10374317, 9907550, 10174314, 10782336, 10798139, 10296332]
4717A0296332M23390P28091K35715p6975M78255K8048J01474L98194J51307q15207
4707A1948624K38138Q95833O63796M47585p64886J19413O9017L60914K24621J29535
4697A4332590R75599P47343q53126N17053L06966O66182K93894J335705M66513
4688A8788719p3947P16050n8759Q81379O84691k6899O17302M83889L12313L07373
4678B2632111K29623J328335R63582P10902N85264N78765O50422J104984k4331
4669B8759657J698289k03158K77223R11126N93151J567087N30821O01182M71695
4660C5207073J20800P89787O36784P64566N03760P67393P08550Q03191K49318
4651D0551222l36862J020332J033336J538102M15709M97937O03682J89640P34591
$$ y = [10296332, 10719722, 11447813, 11683528, 11606553, 12084808, 12112856, 12214330, 12612524, 12763831, 11948624, 12186762, 13082595, 13746391, 14193976, 13429090, 13548503, 13617520, 13978434, 14203055, 14332590, 15308189, 16055532, 15202406, 15719459, 16026425, 16692607, 16986501, 18322206, 18788719, 18714772, 19430822, 19372063, 20253442, 20938133, 20911234, 21528536, 22012425, 22324738, 22632111, 22861734, 24190069, 25153651, 25864553, 26449817, 27028582, 27679004, 28783988, 28759657, 30457946, 30254788, 30532011, 31443137, 32036288, 33603375, 34134196, 34735378, 35207073, 35327873, 36117660, 36754444, 37519010, 38022770, 38790163, 39498713, 40301904, 40551222, 40214360, 41234692, 42268028, 43806130, 44221839, 44719776, 45323458, 45513098, 46247689]
4642D6247689Q05195R3803k73149L05880N9468J40189Q57548J6935r6587j046316
4632D7110655P3157K32715n74845J09203r2959K75856q35230L50138M92405K7419
4622D7168514J73790N96429M61196m33483l0185j72710k77818R56672K33497l78996
4612D8296906p43456L5691N91396l08278K90142m32840j9519J75199L82765L12270
4602D8580276N57806L03393N85599J36211P07173J42434R5882R33608K93682j70225
4592E2165839P32578J285524J108766Q98593P42467K98921K06505L79174J103194
4583E8921561J591843L06197L21392J488274J461931P04406M70870J123096J043855
4574F7433425J019686R30554R95821R24115N99163P68558J320472J297715p2237
$$ y = [46247689, 47052884, 47146687, 46873538, 47179418, 47238886, 47379075, 48236623, 48253558, 48156971, 47110655, 47183812, 47416527, 46841682, 46950885, 46857926, 47133782, 46298552, 46648690, 47141095, 47168514, 47342304, 47938733, 48399929, 47966446, 47936261, 47763551, 47485733, 48442405, 48675902, 48296906, 47553450, 47589141, 48180537, 47872259, 48162401, 47729561, 47710042, 47885241, 48268006, 48580276, 49138082, 49441475, 50027074, 50163285, 50870458, 51012892, 51108774, 52042382, 52336064, 52165839, 52898417, 54183941, 55292707, 56191300, 56933767, 57232688, 57439193, 57818367, 58921561, 60513404, 60819601, 61140993, 62629267, 64091198, 64795604, 65266474, 66389570, 67433425, 68453111, 69383665, 70379486, 71303601, 71902764, 72671322, 73991794, 75289509, 75217272]
4565G5217272J174246L65587K06335J292746L86897N34474M83071j37582L80352
4556G9903398M52293m16107j18073P23989N24L13768L34715M9792j37140J95483
4546H1302642k13758L53402J14053k45959n79988J0006j87375m69209j97249M649
4536G9891214K95361q30995k33523K95756q23697p86937j21643N35005q7751M5874
4526G8178664j43651q20259m58614O58693j62184j69442P9832L31722l53379m75726
4516G6665656M28415R9575J2129k49813l51402l61552O77142r497P31735p1963
4506G7570425Q17321M05171n49460P91080Q03449J67709m02848j13161o9730O27074
4496H0047030L26645k15981N10514P99802l31413l2937K61257q92658M68591q9380
$$ y = [75217272, 76391518, 76757105, 76963440, 78256186, 78643083, 79177557, 79660628, 79523046, 79903398, 80355691, 79939584, 79821511, 80545500, 80546024, 80859792, 81194507, 81244299, 81107159, 81302642, 81088884, 81442286, 81556339, 81310380, 80730392, 80740398, 80553023, 80083814, 79886565, 79891214, 80186575, 79355580, 79122057, 79417813, 78594116, 77807179, 77685536, 78220541, 78132790, 78178664, 78035013, 77214754, 76756140, 77414833, 77252649, 77083207, 77163039, 77494761, 77141382, 76665656, 77094071, 77193646, 77205775, 76955962, 76604560, 76243008, 76920150, 76910653, 77642388, 77570425, 78387746, 78792917, 78243457, 79034537, 79837986, 80005695, 79602847, 79489686, 79419956, 80047030, 80373675, 80157694, 80668208, 81468010, 81136597, 81103660, 81364917, 80472259, 80940850, 80851470]
4486H0851470K2207j033838J32602l53751o07653j35996r31688k11327K4185l02490
4476G7453721R527q62979m98950r73195j08884P2407m81947p12985J77395o46402
4466G3427708J39817M25647k51434M55538p64268m81044L83146O46543o73857
4457G3307796L97353J4501O50258m50779L29038R95138m58272r8943J65374k33298
4447G4618166j51283l08370m6231L36105N5120j687389K2418k42467o53869n89284
4437G1352916j085138j433316j110298p52233M3039m52427j573295r68142q94860
4428F3126246n00079r17328p11017M41257l18826p01550j05727j836555o88348
4419E7788073o27601k2873O60611j028946p85229N25416j40142q55099q8826p2381
$$ y = [80851470, 80873677, 79839839, 79972441, 79618690, 79011037, 78875041, 77943353, 77732026, 77756211, 77453721, 77463248, 76600269, 76101319, 75128124, 75019240, 75091647, 74609700, 73896715, 74074110, 73427708, 73567525, 73993172, 73741738, 74197276, 73433008, 72951964, 73335110, 73981653, 73307796, 73705149, 73719650, 74369908, 73919129, 74248167, 75243305, 74785033, 74686090, 74851464, 74618166, 74466883, 74158513, 74112282, 74448387, 74503507, 72816118, 72838536, 72596069, 71942200, 71352916, 70267778, 68834462, 67724164, 66971931, 67014970, 66562543, 64989248, 64021106, 63126246, 62626167, 61708839, 60997822, 61439079, 61120253, 60418703, 60312976, 58476421, 57788073, 57160472, 57137599, 57798210, 56769264, 55984035, 56509451, 56369309, 55514210, 55425384, 55353003]
4409E5353003j52696p80471n50635K83763o0506n49720j76541m25458J75802m97626
4399E2618915k68640m54526k16110l79448n16675m55866j106833r25314n5223
4390D8240280n10553o40573n82188p53237n93787p31143o40616Q4018j62938m90056
4380D3219207n11693q53289l84269o14033L25915l77127k99572l72763n12953
4371C9619423j180370N217L56749q91234j05362m14497j94589M80564o03654r60795
4361C6111452m6409j11543p09517P71255O80929r39134n70454N51178q76066n21881
4351C4339810o57863o29919n16661p62037n23536m02863l30472l78735q15761
4342B9321963j683148j88269J27252p7648k87357p35174m22079m29915r66366
$$ y = [55353003, 55200307, 54419836, 53869201, 54152964, 54092458, 53542738, 53366197, 52940739, 53116541, 52618915, 52350275, 51895749, 51679639, 51300191, 50783516, 50327650, 49220817, 48295503, 48240280, 47729727, 47089154, 46506966, 45753729, 45159942, 44428799, 43788183, 43872201, 43709263, 43219207, 42707514, 41854225, 41469956, 40855923, 41181838, 40804711, 40505139, 40132376, 39619423, 38439053, 38444270, 38801019, 37909785, 37804423, 37389926, 37195337, 37675901, 37072247, 36111452, 36065043, 35953500, 35243983, 36015238, 36696167, 35757033, 35186579, 35737757, 34861691, 34339810, 33681947, 33052028, 32535367, 31773330, 31249794, 30846931, 30516459, 30137724, 29321963, 27638815, 27450546, 27577798, 27500150, 27212793, 26477619, 26055540, 25625625, 24659259]
4333B4659259J87974M814j226163n64781K50372j07259o31182j51491p32200j54015
4323B1535328m74101k45627P483L25065m63122q77019K05524p27362k83472N5553
4313A9058250N45777k24488m78181N01817q99181r24631k52306l84240o49597
4304A6293220p01N17670J92873K72427M11829j117500o84414l89501l67975l81446
4294A4746482K88931M69643j27561K25282o64611P04201l02416n91200k13383
4285A4535368Q07968O9645o95746K66651n37591l20459N53119q76242Q4880O28943
4275A4516536n83786m71900O31254L39897k1648r6933p72006r9021J056995L86605
4265A4885993n78549r5439M50190k88584q657K58660K61493L78819R0706l96944
$$ y = [24659259, 24847233, 24852047, 23625884, 23061103, 23311475, 23204216, 22573034, 22421543, 21689343, 21535328, 21061227, 20815600, 20823083, 21148148, 20685026, 19808007, 20013531, 19286169, 19002697, 19058250, 19604027, 19379539, 18901358, 19403175, 18503994, 17579363, 17327057, 16942817, 16293220, 16292519, 16810189, 17003062, 17275489, 17687318, 16569818, 15885404, 15495903, 15127928, 14746482, 15035413, 15505056, 15377495, 15602777, 14938166, 15642367, 15339951, 14748751, 14535368, 15343336, 15412981, 14717235, 14983886, 14446295, 14125836, 14678955, 13802713, 13887593, 14516536, 13932750, 13460850, 14092104, 14432001, 14410353, 14313420, 13541414, 13442393, 14499388, 14885993, 14307444, 14212005, 14662195, 14373611, 14364954, 14623614, 14885107, 15263926, 15354632, 14957688]
4255A4957688o14621m2048L10721q9930J69978l72034m62357J013380L12671q98303
4245A4285145m65993M18651j96221q2727n14173l5992N51356L24867r7644k39552
4235A3947717J09044J57738n09304K91123L1502l72546K60155m17458l02825M42406
4225A3637552J57388K21266l94943l29245r45630o80383N74220N35212l3971J12056
4215A2853522K0972l50602l31876k35155N8313q0749K85379j86021k51367j49080
4205A1633336m5314p50616m40850L92216J49285J32388p20263m2004J29835N96507
4195A1034520k6745k61017k08627j67471P21212p95985l16354J04381k8878P83870
4185A0838906K20562j109231K57670l50341q04816o5522R43231O30374L97788
$$ y = [14957688, 14343067, 14301019, 14611740, 14521810, 14691788, 14319754, 13857397, 14870777, 15183448, 14285145, 13819152, 14237803, 14041582, 13958855, 13444682, 13408690, 13960046, 14284913, 14187269, 13947717, 14056761, 14214499, 13705195, 13996318, 14027820, 13655274, 13915429, 13497971, 13195146, 13637552, 13794940, 14016206, 13621263, 13292018, 12346388, 11666005, 12240225, 12775437, 12741466, 12853522, 12874494, 12523892, 12192016, 11956861, 12015174, 11934425, 12219804, 12033783, 11782416, 11633336, 11588022, 10837406, 10396556, 10788772, 10938057, 11070445, 10350182, 10308178, 10438013, 11034520, 11007775, 10746758, 10538131, 10370660, 11091872, 10295887, 9979533, 10083914, 10055036, 10838906, 11059468, 9950237, 10207907, 9857566, 9052750, 8987228, 9930459, 10560833, 10958621]
4176A0958621j99592k51737q16279j36926M03645k67203M87027n26783n39917
4167I110856K19636N93337n84061K72969l25692K81472K06271q33424N79373K83081
4157I803818K22636J85708M88454L48764o05127J48593j18618k60984k91846J79303
4147A0100701J31362j26474k19985j00295J56416n65874L83398j22093m8814m25581
4137I162761n30640R29608P52887q61165l46216N45843j92460K4629p5402L73577
4127I783422K14862N74986M70706m34306k94246l85320J62898R1320J25197l22778
4117I986741K79328R12044J67575l26426J53043l31277o28906L4886K06212K21085
4107A0674305N41514J95831K3441P18844k08153j5722k00721L88852L98531m8294
$$ y = [10958621, 10759029, 10507292, 9691013, 9554087, 9957732, 9690529, 10177556, 9650773, 9110856, 9330492, 9923829, 9339768, 9612737, 9287045, 9568517, 9774788, 8941364, 9520737, 9803818, 10026454, 10212162, 10700616, 11049380, 10444253, 10592846, 10474228, 10213244, 9921398, 10100701, 10232063, 10105589, 9885604, 9785309, 9941725, 9375851, 9759249, 9637156, 9588342, 9162761, 8632121, 9561729, 10314616, 9453451, 9107235, 9653078, 9460618, 9485247, 9409845, 9783422, 9998284, 10573270, 11043976, 10609670, 10315424, 9930104, 10093002, 10184322, 10309519, 9986741, 10266069, 11178113, 11345688, 11019262, 11172305, 10841028, 10212122, 10247008, 10453220, 10674305, 11215819, 11411650, 11435091, 12153935, 11945782, 11930060, 11729339, 12118191, 12516722, 12468428]
4097A2468428m87174j2172O06264K11401p57296M55N06507l53302Q01134L63335
4087A3347580L03115J59887o4119k24239m49611K33297j54067j01272Q09950N32639
4077A4393160J75462j03677N78505M84860K8499k52738k82383J06884J37765M79950
4067A5746287L09399K43627M02556L51443K07778K39652N7221O33564m22500m76048
4057A7292979O078P78408K13349N3623K05139J5534O55660O49684O10024l84517
4047B0095961m83035k52473N15734L08317L0214Q54549P2386P46850M95673K19559
4037B2603735J011232L04420M89728l41196M41156J024850N24508J023119J106848
4028B8188400L97375l40469O12357j19020k40428J877238J142381p17652m48735
$$ y = [12468428, 11981254, 11969082, 12575346, 12786747, 12029451, 12029906, 12536413, 12183111, 12984245, 13347580, 13650695, 13810582, 13746463, 13522224, 13072613, 13305910, 13151843, 13050571, 13860521, 14393160, 14568622, 14464945, 15043450, 15528310, 15556809, 15304071, 15021688, 15128572, 15266337, 15746287, 16055686, 16299313, 16701869, 17053312, 17261090, 17500742, 17557963, 18191527, 17769027, 17292979, 17299057, 18077465, 18290814, 18344437, 18549576, 18565110, 19220770, 19870454, 20480478, 20095961, 19612926, 19360453, 19876187, 20184504, 20214718, 21069267, 21141653, 21888503, 22384176, 22603735, 23614967, 23919387, 24409115, 24067919, 24509075, 25533925, 26058433, 27081552, 28188400, 28585775, 28245306, 28857663, 28738643, 28498215, 30375453, 31517834, 30800182, 30351447]
4019C0351447O15242Q65697J180170J129768Q54335Q8977O38395R69542J80860
4010C6874433J063763J461936R74150J009802O07333J880112R27833J458504J274863
4001D7532729Q00079J096837J250955R00529J079787L91630j73884J793260J711191
3992E6383113J165121J597603J137901J412007J453845J159616J468824J023771
3984F6801801J524841J844419Q41195J595528J155140J084900K091072J513083
3976G8451979K582525J359174J643448J722371J513949J552934J919451J378657
3968I2124488J653231J184984K249691K357796J551341K173670K369742K177067
3960A07842010K455707K744494K776915K303808L658024M184425L342250M552548
$$ y = [30351447, 30966689, 31832386, 33012556, 34142324, 34996659, 35085636, 35724031, 36693573, 36874433, 37938196, 39400132, 40374282, 41384084, 41991417, 43871529, 44799362, 46257866, 47532729, 48332808, 49429645, 50680600, 51581129, 52660916, 53052546, 52878662, 54671922, 56383113, 57548234, 59145837, 60283738, 61695745, 63149590, 64309206, 65778030, 66801801, 68326642, 70171061, 71012256, 72607784, 73762924, 74847824, 76938896, 78451979, 81034504, 82393678, 84037126, 85759497, 87273446, 88826380, 90745831, 92124488, 93777719, 94962703, 97212394, 99570190, 101121531, 103295201, 105664943, 107842010, 110297717, 113042211, 115819126, 118122934, 121780958, 125965383, 129307633, 133860181]
3952A33860181M079567M319269N497065O020520N180314N860327O950286O746343
3944A78513872O933839P760717P415097P572355Q374006P292022P979409O900127
3936B38741444O709591O173212M576982K912215J830687K509689J198666j2841
3928B64639645j011320O4027o44444r2446M68314o96243K50219M89237M70814
3919B63937803J449638J313531L29846R65210J433820M12308o7346j049144k925928
3910B65799738l705109m110838n502068n355087o936094p163680p407622q655740
3902B16963500q587397q129997o909616o862630o706276o286016n684924n765759
3894A62030885o074536n273688m142426l598164l793511l650304k836944l155520
$$ y = [133860181, 137939748, 142259017, 147756082, 153776602, 158956916, 164817243, 171767529, 178513872, 185447711, 193208428, 200623525, 208195880, 216569886, 223861908, 231841317, 238741444, 245451035, 251624247, 256201229, 259113444, 260944131, 263453820, 264652486, 264639645, 263628325, 263692352, 263047908, 262955462, 263423776, 262727533, 262977752, 263466989, 263937803, 265387441, 266700972, 267030818, 267996028, 269429848, 269842156, 269774810, 268725666, 265799738, 262094629, 257983791, 252481723, 247126636, 240190542, 233026862, 225619240, 216963500, 208376103, 200246106, 193336490, 186473860, 179767584, 173481568, 167796644, 162030885, 155956349, 150682661, 146540235, 142942071, 139148560, 135498256, 132661312, 129505792]
3886A29505792l462844j598891j912081k848705k161246k252062k360258k067211
3878A10842494j737168j071993j225233j925090j004895m35315j648293l77989
3870A01416518O5721l75408n00367o04522n7436q0939K29236L32596O92131k47573
3860A00869957R01644P8897J35660R63588l01214j742P65988M02407M01186K62786
3850A04479157j6272J146348R87249Q16175J130407R36931J772175K593106K126271
3841A15971547K817381M359801L174883M407140O640176O911307O941463Q792727
3833A60016425J1996235J4288936J6347162J8581040K0726451K1236647J8615981
3826B81808877J1879970K295046p712939j8718346k5571083k6009627k2727774
$$ y = [129505792, 126042948, 124444057, 122531976, 119683271, 117522025, 115269963, 112909705, 110842494, 109105326, 108033333, 106808100, 104883010, 103878115, 103442800, 101794507, 101416518, 101482239, 101106831, 100606464, 100001942, 99944506, 99863567, 100092803, 100425399, 101117530, 100869957, 101771601, 101850498, 101986158, 102949746, 102648532, 102646790, 103412778, 103815185, 104216371, 104479157, 104462885, 105609233, 106596482, 107412657, 108543064, 109479995, 111252170, 113845276, 115971547, 118788928, 123148729, 126323612, 130730752, 137370928, 144282235, 151223698, 160016425, 172012660, 186301596, 202648758, 221229798, 241956249, 263192896, 281808877, 293688847, 295983893, 288270954, 269552608, 243981525, 217971898, 195244124]
3819A95244124j8459326j5638245j0881297r703894p955989o243584n970923m730522
3811A15660344l738954k486204l012324k886653j534084j742428j684641j376983
3803I7198073j141535n66986j445491o27775q29177j406462j758298j084358k95832
3794H8042159j109161K95169N80774K20724q28696o64532m30056Q62297J519298
3785H8487976J303265J292310J656872J278175n65956j70895j412067j960487
3777H9909193k181609k928298k126648j709665q18442q89764k27807J00414l20747
3768G8806627m47584k85816M29661j05437L81434P00076K34038O57996L85473
3759H0756468P90647Q84848J099969J505782K378289K523361J459328K285339
$$ y = [195244124, 176784798, 161146553, 150265256, 140561362, 132605373, 126361789, 120390866, 115660344, 111921390, 109435186, 106422862, 103536209, 102002125, 100259697, 98575056, 97198073, 96056538, 95489552, 94044061, 93416286, 92587109, 91180647, 89422349, 88337991, 88042159, 86932998, 87228167, 87808941, 88029665, 87200969, 86536437, 86106381, 86968678, 88487976, 89791241, 91083551, 92740423, 94018598, 93452642, 93281747, 91869680, 89909193, 87727584, 84799286, 82672638, 80962973, 80144531, 79254767, 79026960, 79127374, 78806627, 78359043, 78073227, 78502888, 78397451, 78778885, 79478961, 79712999, 80370995, 80756468, 81547115, 82431963, 83531932, 85037714, 87416003, 89939364, 91398692, 93684031]
3751I3684031L272807L787116M831249N452782N685057O927347Q663135J0507086
3743A42810610J2047958J4715567J7892890K0128408K1914672K2603185J9032696
3736B71145986J1857295K094122r542906j9069160k4450369k7532687k5548637
3729A78953644k0999065j5717799j2602370j0665619q193587o118189n856277
3722I8800738m478301l599477l505783k363518k478798k044422j890383j534697
3714G6905359j747723j252204l84875o99629j211225n81116l62910j212497l42060
3705F9111120j932463n46452o86960j535890k76108m44502L16280q84090j109131
3696F2011804N9222q179o26730q25226K83347J46508K75471j13975K7119K84711
$$ y = [93684031, 96956838, 100743954, 105575203, 111027985, 116713042, 123640389, 132303524, 142810610, 154858568, 169574135, 187467025, 207595433, 229510105, 252113290, 271145986, 283003281, 285097403, 275554497, 256485337, 232034968, 204502281, 178953644, 157954579, 142236780, 129634410, 118968791, 110775204, 104657015, 98800738, 94322437, 90722960, 87217177, 84853659, 82374861, 80330439, 78440056, 76905359, 75157636, 73905432, 73520557, 72820928, 71609703, 71028587, 70665677, 69453180, 69111120, 67178657, 66632205, 65945245, 64409355, 64133247, 63688745, 64005025, 63120935, 62011804, 62071026, 62062847, 61436117, 60610891, 60894238, 61040746, 61316217, 61202242, 61229361, 61514072]
3686F1514072r4619k01141l45719j05666j48717J363574R6091L26137J090510
3677F3494522Q79393J075921K31812O96195J720776J076746K08807Q29792J352262
3668G1566226R28807P86166N00468l89408j697796p66735r42810k09478j800203
3659F7975237j583243m57482p78314j68705m27503K25827m23369j304733m27998
3650F2629717P59266j47056k64619k74394l74788k787m0814p2678r02566j132288
3640F0176993k479922k322084j025416o45090j918739j304627k172088j642841
3632D6666186K14078r63216j150668j391597j635007j123139p27002j208947j307769
3623C7372919k35424l88246n54669q34660j653936r55877j0378j000842k96036
$$ y = [61514072, 61419453, 61218312, 60872593, 60766927, 60618210, 61981784, 62077875, 62404012, 63494522, 64373915, 65449836, 65681648, 66377843, 68098619, 69175365, 69384172, 70213964, 71566226, 72495033, 73281199, 73781667, 73392259, 71694463, 70927728, 69984918, 69775440, 67975237, 66391994, 65934512, 65156198, 64987493, 64559990, 64785817, 64362448, 63057715, 62629717, 63388983, 63241927, 62977308, 62702914, 62328126, 62325339, 62284525, 62211847, 61309281, 60176993, 57697071, 55374987, 54349571, 53704481, 51785742, 50481115, 48309027, 46666186, 46880264, 45917048, 44766380, 43374783, 41739776, 40616637, 39889635, 38680688, 37372919, 37137495, 36749249, 36194580, 35359920, 33705984, 32750107, 32739729, 31738887, 31442851]
3614C1442851k40709j257823k12359k89972J19254m33820r92741l1167J85452
3605B8288966j2459m75608r08936n89554r53277m90671m07208k46353k34858p17867
3595B3252175n67768L0679r32447j0914n0023k81960m41636m3566n59946j213198
3585A9181396j95383Q0908m26531n62112o4523j178511l12845k43580m1575k42587
3575A5994657J86031q46396j349280N12439K26579r4102R4641j77063p63543K45026
3565A4028989q2597m07016P8996J11915q40437o28093k41952M83033L46585J59150
3555A3008573o17843k61702K67610j92704L9097k79624M42965r08471r13219K01914
3545A0786596L57175O56339j52616Lq70691q7631K83522R214K7844O0934J64291
$$ y = [31442851, 31202142, 29944319, 29731960, 29441988, 29561242, 29127422, 28134681, 28103514, 28288966, 28276507, 27800899, 26891963, 26302409, 25349132, 24858461, 24451253, 24204900, 23970042, 23252175, 22684407, 22715086, 21782639, 21771725, 21721702, 21439742, 20998106, 20954540, 20394594, 19181396, 18986013, 19066921, 18640390, 18078278, 18013755, 16835244, 16522399, 16278819, 16237244, 15994657, 16180688, 15334292, 13985012, 14497451, 14724030, 14629928, 14724569, 14547506, 13783963, 14028989, 13946392, 13539376, 13618372, 13730287, 12889850, 12261757, 12019805, 12502838, 12849423, 13008573, 12390730, 12129028, 12396638, 12203934, 12243031, 11963407, 12406372, 11497901, 10584682, 10786596, 11143771, 11800110, 11647494, 11647497, 10776806, 10689175, 10972697, 10981911, 11009755, 11070689, 11234980]
3534A1234980L75487p3032J95025l31903k52946m65002k34002O67401m09816k54293
3524A0451899M51984q3152k86346j20149Q8603P02093q4848K35952K38643o07563
3514A0987116O71189L95729p5370l58854j66604L50472M39922M31443J35808k35382
3504A2575469R5154P89609j97028K45515Q19415M30369n30849J183195Q47556
3495A6258405R62748P34081R0991M27131J029156K45898N78876K00593K62192
3486B0790071l26130j19957n54516m1579M7973P59094q512q2103J367546m3577
3476B1788310M35324J002556P95487O80991J135255M16728R60848J596981J477220
3467C0289700J345031N92036J234143K204686J232121R47697R93534J679110J063898
$$ y = [11234980, 11610467, 11537435, 11732460, 11400557, 11147611, 10682609, 10448607, 11116008, 10706192, 10451899, 10903883, 10820731, 10534385, 10414236, 10502839, 11204932, 11120084, 11356036, 11594679, 10987116, 11658305, 12054034, 11978664, 11619810, 11453206, 11803678, 12243600, 12675043, 12810851, 12575469, 12670623, 13460232, 13263204, 13508719, 14328134, 14758503, 14227654, 15410849, 16258405, 17221153, 17955234, 18046225, 18473356, 19502512, 19748410, 20327286, 20527879, 20790071, 20463941, 20343984, 19789468, 19747889, 19795862, 20554956, 20546444, 20464341, 21831887, 21788310, 22223634, 23226190, 24021677, 24702668, 25837923, 26254651, 27215499, 28812480, 30289700, 31634731, 32226767, 33460910, 35665596, 36897717, 37845414, 38838948, 40518058, 41581956]
3458D1581956O17809J323226Q98430m41643M89838R9175P96748O16606k3465Q50273
3448D6808953J117522P98662Q31087J506120J744232J163780P28518J361618J916368
3439E7976860J593642J840970K627205J393977J108925M19408K74402M19363r53586
3430F6701166j304334k002459j823671j807632k569555j670218k287267j298673
3422E1937357j541950j262126j902040j440454m32956l54803p42184r53011O01871
3413D3909704j86699n69140r75324m45122k44752j632708j036272k71669l30171
3404C8217847j542092j801699k799820q52068q95422j571775n16762j343543j504941
3395B5389725j741917j205492j724831p14873r93994j037550q60264m73769o50723
$$ y = [41581956, 42199765, 43522991, 44421421, 43979778, 44469616, 44568791, 45365539, 45982145, 45958680, 46808953, 47926475, 48725137, 49556224, 51062344, 52806576, 53970356, 54698874, 56060492, 57976860, 59570502, 61411472, 64038677, 65432654, 66541579, 66960987, 67235389, 67654752, 66701166, 65396832, 63394373, 61570702, 59763070, 57193515, 55523297, 53236030, 51937357, 50395407, 49133281, 47231241, 45790787, 45357831, 45003028, 44260844, 43307833, 43909704, 43723005, 43153865, 42178541, 41733419, 41488667, 39855959, 38819687, 38548018, 38217847, 36675755, 34874056, 32074236, 31222168, 30326746, 28754971, 28238209, 26894666, 25389725, 23647808, 22442316, 20717485, 20002612, 19008618, 17971068, 17110804, 16637035, 15986312]
3386A5986312K94990k69045l44564p00793l49574n74252k90432o61724j139662
3377A1951256o64169q9732J00984j92151j02200q82252k30141L20876n2464O23411
3367A0783418l13102J62251l45628r4697K47770q63083N56865j73124l90307N61125
3357A0131488l02342r92746j58408k24796L29917J0043m99471J84151J25779J12852
3347H716467m8082j82905J42969l82983O01976l89219k93329j28925q05462R25096
3337H155603P76550j58524k24371n24797l54431L8660k61023l94889R0103k27385
3327F915496l97414m51330o09662l8720N39945r8868Q7187q5275J85062J82910
3317F229331l17288J12900l91384L2691Q7100L6596k27473l90828N12444P6991
$$ y = [15986312, 16281302, 16012257, 15667693, 14966900, 14617326, 14043074, 13752642, 13090918, 11951256, 11287087, 11197355, 11298339, 11106188, 11003988, 10121736, 9891595, 10212471, 10160007, 10783418, 10470316, 10632567, 10286939, 10192242, 10440012, 9576929, 10133794, 9960670, 9570363, 10131488, 9829146, 8836400, 8677992, 8453196, 8783113, 8793156, 8293685, 8477836, 8603615, 8716467, 8668385, 8485480, 8628449, 8245466, 8847442, 8458223, 8164894, 8035969, 7230507, 8155603, 8932153, 8773629, 8549258, 8024461, 7670030, 7708690, 7447667, 7052778, 7142881, 6915496, 6518082, 6066752, 5457090, 5418370, 5958315, 5859447, 5946634, 5861359, 6046421, 6229331, 5912043, 6024943, 5633559, 5666250, 5753350, 5789946, 5562473, 5171645, 5684089, 5761080]
3307E761080N14346m8460j31260k39816j49570j46581k48423K20777j81841J30147
3297E480399m36620L70106L72252N43706k33974r64883j61755L55460O50262j45219
3287E829734j349j54775K0823R05306j1352m52817p32862J9037q1831j23787p0235
3276E145892J40846R28624j05498j004302m74754K84190K26437M81371L74075
3267E996881N99658p85046j044067J42730N5955m05299M97449L70321n66301j8062
3257D844219N8774L95865L89752J43514l39663K28361o30963j68583K46562l63861
3247D803977N68900J5056j90956N30747l76616l3705p68278K21604M66445n07898
3237D729276O30439M24500k51069j1810L82842k30418k34470l05961L0580k376
$$ y = [5761080, 6275426, 6226966, 6095706, 5855890, 5706320, 5559739, 5311316, 5532093, 5350252, 5480399, 5043779, 5413885, 5786137, 6329843, 6095869, 5130986, 4969231, 5324691, 5974953, 5829734, 5828385, 5673610, 5694433, 6599739, 6588387, 6135570, 5402708, 5421745, 5339914, 5216127, 5145892, 5286738, 6215362, 6109864, 5105562, 4630808, 4914998, 5141435, 5622806, 5996881, 6596539, 5811493, 4767426, 4910156, 4966111, 4560812, 5058261, 5428582, 4862281, 4844219, 4902993, 5298858, 5688610, 5832124, 5492461, 5720822, 5089859, 4921276, 5167838, 4803977, 5372877, 5387933, 5196977, 5727724, 5351108, 5317403, 4549125, 4770729, 5237174, 4729276, 5359715, 5784215, 5533146, 5521336, 5904178, 5673760, 5439290, 5133329, 5163909, 5161533]
3227E161533J06501k10016K3239r11669j60380o1541L89072J300778j4814l87846
3217E234857K38825J62155J29307m02117l10698p7001N97199k42960k45119K43169
3207E327617R5475R552R55655l88396n75263j61537l54755R55998j53034M2941
3197E754253p60819j63874Q11119M46277K99326p43359K75013L67378L16562r29548
3187E672328k07633M7188N95810Q47080r1446N89885l33938K51769k23717O1373
3177G208699L23424N4262J86924m91110l24844Q95632Q66757R7799j07731J28774
3167H838586L58927m93720m51704j84873l49315N22810P04724J89094M51034P30004
3157A0315567J61538M60j00662L43149K58749P15344M93786Q61376l10282K14258
$$ y = [5161533, 5268034, 5058018, 5081257, 4169588, 4009208, 3947667, 4336739, 5637517, 5622703, 5234857, 5473682, 5635837, 5765144, 5363027, 5052329, 4975328, 5572527, 5329567, 5084448, 5327617, 5423092, 5432644, 6388299, 5999903, 5424640, 5263103, 4908348, 5864346, 5711312, 5754253, 4993434, 4829560, 5640679, 6086956, 6386282, 5642923, 5917936, 6285314, 6601876, 5672328, 5464695, 5511883, 6107693, 6954773, 6863327, 7453212, 7119274, 7371043, 7147326, 7208699, 7532123, 7586385, 7773309, 7282199, 6957355, 7852987, 8719744, 8817543, 8709812, 8838586, 9197513, 8703793, 8252089, 8067216, 7717901, 8240711, 8945435, 9134529, 9585563, 10315567, 10477105, 10477565, 10376903, 10720052, 10978801, 11694145, 12187931, 13049307, 12739025, 12953283]
3147A2953283L64078j20695m66221o25175r34853q5299m72345p05547m15024L79217
3137I871419J39657K73408L99827l54006o54342L87161M07463J95696p0197k95407
3127A0300679M68568K95168K90420n56787K16730N26947P92901L47241K1886L43198
3117A3046951P49663J63937k41932J122p78218L5144J084082M1740P26958K56362
3107A5085809K42766k21156J3823R99747Q34944L52136K65954J859608P47692
3098B0181323R71938M23963L46068J306059O47955J480439K671162K163885L122852
3089C3315644L807231M015495L286281L013172K022791R3j376432m278894m243263
3080C9562118m410208k909198j611116k051875j896017l11125K20171k90879n07828
$$ y = [12953283, 13317361, 13196666, 12730445, 12105270, 11170417, 11085118, 10612773, 9907226, 9492202, 9871419, 10011076, 10284484, 10684311, 10330305, 9675963, 10063124, 10470587, 10666283, 10596086, 10300679, 10769247, 11064415, 11354835, 10798048, 11014778, 11541725, 12334626, 12681867, 12703753, 13046951, 13796614, 13960551, 13718619, 13719741, 12941523, 12976667, 14060749, 14102489, 14829447, 15085809, 15328575, 15107419, 15121242, 16120989, 16955933, 17308069, 17574023, 19433631, 20181323, 21153261, 21577224, 21923292, 23229351, 23877306, 25357745, 28028907, 30192792, 33315644, 37122875, 41138370, 44424651, 47437823, 49460614, 49460707, 48084275, 43805381, 39562118, 35151910, 32242712, 30631596, 28579721, 26683704, 26372579, 26592750, 26301871, 25794043]
3071B5794043o81787K10754Q77075j52622M51683M16865J59631j54580O72987
3062B7594049K91086O68608N66258P75259M87290Q32521J287979J327738J456960
3053C5287748P25736O07949K405889K651945K288584L776892L096965L507822
3045E4349530M167658O041622O623997P917772Q403011P778676P614878N618520
3037A08515664L273714l181691q040221k860127K532741N102037O956649P661959
3029A19960725O022439L342636j491712r054968j3632179j3621402j1638953p729573
3021G2157013n746492l762314k497580j309418j814341r17427K44638n01238M35208
3012E6288049J171566J547617K719847L502485K811551M175357N291331N288616
$$ y = [25794043, 25112256, 25323010, 26200085, 26047463, 26499146, 26916011, 27075642, 26921062, 27594049, 27885135, 28553743, 29120001, 29895260, 30382550, 31215071, 32503050, 33830788, 35287748, 36013484, 36621433, 39027322, 41679267, 43967851, 47744743, 50841708, 54349530, 58517188, 64558810, 71182807, 79100579, 87503590, 95282266, 102897144, 108515664, 111789378, 108607687, 100567466, 97707339, 100240080, 105342117, 112298766, 119960725, 125983164, 129325800, 127834088, 118779120, 105146941, 91525539, 79886586, 72157013, 66410521, 62648207, 60150627, 58841209, 57026868, 56109441, 56354079, 55852841, 56288049, 57459615, 59007232, 61727079, 65229564, 68041115, 72216472, 77507803, 82796419]
3004H2796419N457421M976889K956925J966076j9668p26658j334548j282291k416911
2995I2373654m676095o600801p603979o074066m973422m192546l612836k296497
2987E2343412j479558j363070r40360j761257j466860o0745m39485n18135o55497
2978D3658445n02450n76395p31848J38399l88877M81458p9415j43886P936M19795
2968D2283162O6050K62835L95534N70531j67692J2441n66069J50691P74973M08842
2958D4191298P3614k46171P22059K01531P84935r5213M43960J219298o49645J86750
2948D6832416J653376M33909O22741N77025J39658K69005M53285M39271R50795
2939E2371481L03432O25257M02359Q27390Q67921J072950P23208N33228Q32952
$$ y = [82796419, 88253840, 93230729, 96187654, 98153730, 98134062, 97407404, 96072856, 94790565, 92373654, 87697559, 81096758, 73492779, 67418713, 62445291, 58252745, 54639909, 52343412, 50863854, 49500784, 48560424, 46799167, 45332307, 45271562, 44832077, 44313942, 43658445, 43155995, 42579600, 41847752, 41986151, 41597274, 42078732, 41999317, 41855431, 41863367, 42283162, 42349212, 42612047, 43007581, 43578112, 43410420, 43422861, 42856792, 43007483, 43782456, 44191298, 44264912, 44018741, 44740800, 44942331, 45727266, 45632053, 46076013, 47295311, 46645666, 46832416, 48485792, 48919701, 49542442, 50119467, 50259125, 50528130, 50981415, 51420686, 52371481, 52674913, 53300170, 53702529, 54529919, 55397840, 56470790, 57193998, 57727226, 58560178]
2930E8560178J173226P22676M88303k89398J867645Q21235J038930M26865M85180
2921F5294840J77031j032996n56994L15694j791344j101090j87605l74409n78954
2912F0164173j035219o55298p85980o0336m09396m82376n91034m77116r51502
2903E4715916K37295m26785N4802p4044N28009m10073J035135J459499R72786
2894E8092540P86400J148115J180567J327840J851964K678160O13583K32107O83135
2885F8594411o1288K07710l55261K36661r1631r36777j472640n88008l51503o91244
2875F4490430p42539p85474J50503j96926j154535q55127p99147j903226j235123
2866E6968836j220838p62159o68575j926476m94496q08632j580717o90993J73424
$$ y = [58560178, 59733404, 60456080, 60944383, 60654985, 62522630, 63343865, 64382795, 64809660, 65294840, 65471871, 64438875, 63881881, 64197575, 62406231, 61305141, 61117536, 60743127, 60164173, 59128954, 58473656, 57687676, 57627340, 57217944, 56735568, 56144534, 55667418, 54715916, 54953211, 54526426, 54581228, 54507184, 55035193, 54625120, 55660255, 57119754, 58092540, 58878940, 60027055, 61207622, 62535462, 64387426, 67065586, 67679169, 67911276, 68594411, 68533123, 68740833, 68385572, 68622233, 68530602, 67593825, 66121185, 65533177, 65181674, 64490430, 63747891, 62962417, 63112920, 62915994, 61761459, 60906332, 60107185, 58203959, 56968836, 55747998, 54985839, 54317264, 52390788, 51896292, 51087660, 49506943, 48815950, 48989374]
2857D8989374N79333l55351o96137j05083N8493k32819k50840p35923l26819P63862
2847D7688090J20056J03843Q3911k45299M80147P85250L39267k10925l812L61203
2837D9501731N65574L31998J021919J5171k31200J094657K96953m27509M55736
2828E2625030Q32536R68432J577944J045831N84938M16334J684945J923085J325857
2819F2984932Q03458J364357K199111K184630K157305K880594K789821J989729
2811G9353937L040614L473204K156306L027177L748249L083582L639137M041474
2803A05563680M139201M413672N290024M289462M795735N334431N449240M430611
2795A43706056M127514N760224N072659N458777O452133N730178N609316O247868
$$ y = [48989374, 49568707, 49213356, 48517219, 48412136, 48470629, 48237810, 47986970, 47251047, 46924228, 47688090, 47808146, 47911989, 47995900, 47750601, 48230748, 49015998, 49355265, 49144340, 49140528, 49501731, 50067305, 50399303, 51421222, 51436393, 51205193, 52299850, 52596803, 52169294, 52625030, 53457566, 54425998, 56003942, 57049773, 57634711, 58051045, 59735990, 61659075, 62984932, 63788390, 65152747, 67351858, 69536488, 71693793, 74574387, 77364208, 79353937, 82394551, 85867755, 88024061, 91051238, 94799487, 97883069, 101522206, 105563680, 109702881, 114116553, 119406577, 123696039, 128491774, 133826205, 139275445, 143706056, 147833570, 153593794, 158666453, 164125230, 170577363, 176307541, 181916857, 188164725]
2787A88164725N582379N241096N073297N261096M095907M568286M435817M370628
2779B26793231M538988M295520L600433L801710L623775L061061K786037L295306
2771B55796061K794530K350761L161553L395650L829648L834818M183851M158884
2763B83505756L498324J979581o02194j802380l338268n654197n669272o139682
2755B65777668o357385q643176j0842496j2471518j2733244j1347391r662961
2748A93719497r148109q155201p806499p082900o098663n982035o016166n844689
2740A37585235n070216m956325n102336n985660m962035m787094n072503l557222
2732I8091844l341356m184442k917922l516421l724848l740486l604694k060765
$$ y = [188164725, 193747104, 198988200, 204061497, 209322593, 213418500, 217986786, 222422603, 226793231, 231332219, 235627739, 239228172, 243029882, 246653657, 249714718, 252500755, 255796061, 258590591, 260941352, 264102905, 267498555, 271328203, 275163021, 279346872, 283505756, 287004080, 288983661, 288381467, 286579087, 283240819, 277586622, 271917350, 265777668, 259420283, 250777107, 239934611, 227463093, 214729849, 203382458, 193719497, 184571388, 176416187, 168609688, 161526788, 155428125, 149446090, 143429924, 137585235, 132515019, 127558694, 122456358, 116470698, 111508663, 106721569, 101649066, 98091844, 94750488, 90566046, 87648124, 84131703, 80406855, 76666369, 73061675, 71000910]
2724G1000910j902608j815423k645699j646778j714544k551317k415136k080853
2716E4228552j630371j873281j495997j144158j794512q67551j535174k004705
2708D1882803m95419q02220r13684q11644P0686o34094j826665q33020n39728
2699C5097015j101464o6933q35703j583632K45055r03189k45801m2156k38647
2690C0324545o05616p29491m17056L35409r09665o28946N11011l67868o10703
2681B6901620p64209m81432q9875J95819k54760m72839K8986Q2058n08710K51510
2671B4888168k66769N0486q2595p2458l51801k84221O9923J69351n78306o001
2661B3535777J83245K00756o58703l18096K33247k35660M32937N20838k0106n82979
$$ y = [71000910, 69098302, 67282879, 64637180, 62990402, 61275858, 58724541, 56309405, 54228552, 52598181, 50724900, 49228903, 48084745, 46290233, 45422682, 43887508, 41882803, 41387384, 40585164, 39671480, 38859836, 38930522, 38296428, 36469763, 35636743, 35097015, 33995551, 33928618, 33092915, 31509283, 31754338, 30851149, 30605348, 30563192, 30324545, 29718929, 28989438, 28572382, 28907791, 27998126, 27369180, 27880191, 27512323, 26901620, 26137411, 25655979, 25566104, 25761923, 25507163, 25034324, 25063310, 25145368, 24636658, 24888168, 24621399, 24671885, 24589290, 24516832, 24165031, 23880810, 23950733, 24120084, 23541778, 23535777, 23719022, 23919778, 23261075, 22942979, 23176226, 22940566, 23373503, 23894341, 23874235, 23291256]
2651B3291256N0088K74109N34579l91276o4273M25961o34256L87696M29302O79728
2641B4982914n21980k0805J000965k30189M30403n1036P20191J95536o4768K19212
2631B6660443o52694O88953L31243j90157O69195P15312J57737J11217L55443
2622B8846692Q76237M56289m15627l3245N09881N12306M19561M06156J690798
2613C3269048M43814Q07003L47946J97858J127862J286860R15696P10663P95479
2604C9902229O19777P23708J070652J073245J749354K005262J730609K397607
2596E1272443K536638L061652L207859K859533L312682L818384L723077M127376
2588G7919644O005128Q308575Q237572Q545884O859698M364662j438538p642721
$$ y = [23291256, 23341344, 23615453, 24150032, 23758756, 23694483, 24120444, 23486188, 23873884, 24303186, 24982914, 24460934, 24440129, 25441094, 25210905, 25641308, 25590272, 26310463, 26505999, 26441231, 26660443, 26007749, 26696702, 27027945, 26837788, 27506983, 28222295, 28380032, 28491249, 28846692, 29722929, 30179218, 29763591, 29730346, 30240227, 30752533, 31172094, 31578250, 33269048, 33712862, 34519865, 34867811, 35065669, 36193531, 37480391, 38396087, 39106750, 39902229, 40522006, 41245714, 42316366, 43389611, 45138965, 47144227, 48874836, 51272443, 53809081, 56870733, 60078592, 62938125, 66250807, 70069191, 73792268, 77919644, 83924772, 92233347, 100470919, 109016803, 115876501, 120241163, 118802625, 111159904]
2580A11159904j0589965r102880o361730m335440k254862k518018j583985j074385
2572G3338639k17200K75452p6346O59195M21554J200542P94157R02568J495860
2563G8794421J244308N39838J040427Q11166J570874K219704O09225K90571K081958
2554H9202492P62461R91865O62020O44602N40165J047359N58892J023445R21778
2545I6355079J149753J008162n7891P82418K45967J190267K9254q4316K84215
2536A00902908o91227J26555k73602k77623m86309m77529P14848L03145n97890
2527I9243276k09987N76208J027722J07930M70253P02578K69892M35951P64390
2518A03388213J155710J042693J857972J584434J376368K375866K116354J056038
$$ y = [111159904, 100569939, 91467059, 85105329, 80769889, 78515027, 75997009, 74413024, 73338639, 73121439, 73396891, 73320545, 73979740, 74401294, 75601836, 76395993, 77298561, 78794421, 80038729, 80578567, 81618994, 82430160, 84001034, 86220738, 86829963, 87120534, 89202492, 89964953, 90956818, 91618838, 92263440, 92803605, 93850964, 94409856, 95433301, 96355079, 97504832, 98512994, 98455103, 99237521, 99483488, 100673755, 100703009, 100618693, 100902908, 100211681, 100338236, 100064634, 99787011, 99300702, 98823173, 99538021, 99841166, 99243276, 99033289, 99609497, 100637219, 100745149, 101215402, 101917980, 102187872, 102623823, 103388213, 104543923, 105586616, 107444588, 109029022, 110405390, 112781256, 114897610, 115953648]
2510A15953648J544512J953042K164522K175051J574923K210176J773343K89091
2502A29638308K093487J079043N12630M09501J337459P29960K2192M37347m57563
2493A35802364J39124L62634p0186j91201k7569o8748K63043j11999m35981J70843
2483A35832324j23219l44634p16741P4569n36470Q55487J232093J320215J21241
2474A37714865J449197K281161K918349K406052L265010L394876L599023M084094
2466A61112627M970453P413395N729384O330906P380620P303919Q279048Q249711
2458B16770063Q936817R097016Q513426Q877802Q582995R348445Q304644Q234151
2450B86665359Q118604P339789P093335P110883N991757N825502M789940L814231
$$ y = [115953648, 117498160, 119451202, 121615724, 123790775, 125365698, 127575874, 129349217, 129638308, 131731795, 132810838, 133323468, 133732969, 135070428, 135800388, 135822580, 136259927, 135802364, 135941488, 136304122, 136233936, 136042735, 136015166, 135946418, 136209461, 136097462, 135661481, 135832324, 135709105, 135364471, 134647730, 134722299, 134185829, 135041316, 136273409, 137593624, 137714865, 139164062, 141445223, 144363572, 146769624, 150034634, 153429510, 157028533, 161112627, 166083080, 173496475, 179225859, 185556765, 192937385, 200241304, 208520352, 216770063, 225706880, 234803896, 243317322, 252195124, 260778119, 270126564, 278431208, 286665359, 294783963, 302123752, 309217087, 316327970, 322319727, 328145229, 332935169, 336749400]
2442C36749400L213354K793949J981956Q52289k00663j397618j122560j934481
2434C40935626k750276k805701k315423k993805l270692l631086k524787m277465
2426C16366391l956949l392396m091123l221706l620201k850715q37349o75463
2418B93720489j092688J182125K118660K650138L113988M033297O198700P222878
2410C19147587O871554Q380235R339470R755800J0997536J0791066R813442J0110242
2402C95206932R992570J0699718J0466530J0846097R892441R822491R678587Q868989
2394D75474355P571047Q640118P482527N977337N524437M648347L782801L154346
2386E22255315J762186J516197M36095o19548j486606k420468l187853l577339
$$ y = [336749400, 339962754, 342756703, 344738659, 345590948, 345390285, 343992667, 342870107, 340935626, 338185350, 335379649, 333064226, 330070421, 326799729, 323168643, 320643856, 316366391, 312409442, 309017046, 304925923, 301704217, 298084016, 295233301, 294395952, 293720489, 292627801, 293809926, 295928586, 298578724, 301692712, 305726009, 311924709, 319147587, 326019141, 334399376, 343738846, 353494646, 364492182, 375283248, 385096690, 395206932, 405199502, 415899220, 426365750, 437211847, 447104288, 456926779, 466605366, 475474355, 483045402, 491685520, 499168047, 505145384, 510669821, 515318168, 519100969, 522255315, 524017501, 525533698, 525969793, 525350245, 523863639, 521443171, 518255318, 514677979]
2378E14677979l628003m648724n445445n307046o081008n809662n862980p020776
2370D70874335o846453o648682n588316n903913n899182n413401n190245m248570
2362D25135573m351802m453031l389910l853861l642070l071343l661299m693625
2354C94018632m527043m952611m052800o006941o233567o193442o462008p658599
2346C47931621o994324p143227q377982p797677p471523q269562q360251p296152
2338B86220923p364133p310808q562058q609089r111275q356618q988223q816883
2330B19101836p937263q687199p957009p174901o671273o884014o806649o230487
2322A60753041n566270m714910l831429m333549n515629n060631l368160k678836
$$ y = [514677979, 511049976, 506401252, 500955807, 495648761, 489567753, 483758091, 477895111, 470874335, 464027882, 457379200, 451790884, 445886971, 439987789, 434574388, 429384143, 425135573, 420783771, 416330740, 412940830, 409086969, 405444899, 402373556, 398712257, 394018632, 389491589, 384538978, 380486178, 374479237, 368245670, 362052228, 355590220, 347931621, 340937297, 333794070, 325416088, 317618411, 310146888, 301877326, 293517075, 286220923, 278856790, 271545982, 262983924, 254374835, 245263560, 236906942, 227918719, 219101836, 211164573, 202477374, 194520365, 187345464, 180674191, 173790177, 166983528, 160753041, 155186771, 150471861, 146640432, 142306883, 136791254, 131730623, 128362463, 125683627]
2314A25683627k727680k657691k024464j942623j852244k316619k151290j960465
2306A08050551j877068j497999j643726j416224j418669j069228j319514k26918
2298I7581205n35935r65888p8105o60744j687837j574948j444329j558054k174198
2289H6901167j683992j902434k407796j592877j897518k476031k034086j671134
2281G1235299k746433k263685j807610k142332j450717j481279j553347k001693
2273E5788203k345566k202830j869187k273081k410995j195096o73832j606992
2265D1210624j278812j100271j360476j212457p00559j359364n96927p4564j035696
2256C2491498r88390q97265m69115p52484j017564o88838l35934o00855l33705
$$ y = [125683627, 122955947, 120298256, 118273792, 116331169, 114478925, 112162306, 110011016, 108050551, 106173483, 104675484, 103031758, 101615534, 100196865, 99127637, 97808123, 97581205, 97045270, 96079382, 96001277, 95340533, 93652696, 92077748, 90633419, 89075365, 86901167, 85217175, 83314741, 80906945, 79314068, 77416550, 74940519, 72906433, 71235299, 68488866, 66225181, 64417571, 62275239, 60824522, 59343243, 57789896, 55788203, 53442637, 51239807, 49370620, 47097539, 44686544, 43491448, 42817616, 41210624, 39931812, 38831541, 37471065, 36258608, 35558049, 34198685, 33601758, 33527194, 32491498, 31503108, 30605843, 30136728, 29384244, 28366680, 27677842, 27341908, 26741053, 26407348]
2247B6407348k00127r75257q52411P33736J12184j132335o31723j8148j33694
2238B3309573L61109j018467p62935m71545L44726j8452p25703j87336k31654
2229B0599316k89324j41678l23429j51586L35976k72103o94372O49368L49619
2220B0061787N7633j33630l64662J80221L69288m31054m46699N712m4378l71115
2210A8883103p95046m0653J9931q32542m85324L56914m93097j174658j65213M40843
2200A5714258N6122k0725l36474L6094p33100J27057L32109o33810m4259N61811
2190A5059083m71535O82271n46371l8979J55541j78474L94803j93031k15193l79987
2180A4268128O57245L60119l08080o6272m97086N39823n5627j58888L55705k96044
$$ y = [26407348, 26207221, 25231964, 24379553, 25113289, 25225473, 24093138, 23461415, 23443267, 23309573, 23670682, 22652215, 21889280, 21417735, 21762461, 21744009, 21018306, 20830970, 20599316, 20309992, 20168314, 19844885, 19693299, 20029275, 19757172, 19062800, 19712168, 20061787, 20119420, 19985790, 19621128, 19801349, 20170637, 19739583, 19292884, 19298596, 19254218, 18883103, 18088057, 18047404, 18067335, 17234793, 16749469, 17106383, 16613286, 15438628, 15273415, 15714258, 15770380, 15749655, 15413181, 15449275, 14716175, 14843232, 15175341, 14541531, 14497272, 15059083, 14587548, 15269819, 14723448, 14684469, 14840010, 14661536, 15056339, 14863308, 14648115, 14268128, 14925373, 15285492, 14977412, 14911140, 14414054, 14953877, 14898250, 14739362, 15095067, 14799023]
2170A4799023M91301Q08586J073127m4895J565658P34960O6756p0534J238218
2161B0662200J181416M33443J683907J167504J883453K368777J753029K306068
2153C3439797N19895m31322j625799k111512k532932k736586j155696j428951
2145B1936894j366283n94974j263965m97613J57191j018730o04887K1085J97922
2136A6966640q71666l48892p91005m80039Q5050j01221J66614o72341k56828N23236
2126A4219548m85956k05506k84325k08832j23640m80872l42089M57635K20613
2117A2766576p87156Q726j33745p54621L61592k31924L59523m49591j01269k82832
2107A0755279j42801K60919m78297K85881O04352K5845L10553J66712K07884J98514
$$ y = [14799023, 15290324, 16098910, 17172037, 17127142, 18692800, 19427760, 19494516, 19423982, 20662200, 21843616, 22277059, 23960966, 25128470, 27011923, 29380700, 31133729, 33439797, 33959692, 33528370, 31902571, 29791059, 27258127, 24521541, 23365845, 21936894, 20570611, 19975637, 18711672, 18214059, 18371250, 17352520, 16747633, 16768718, 16966640, 16094974, 15746082, 14955077, 14475038, 14560088, 14458867, 14625481, 13953140, 13696312, 14219548, 13733592, 13528086, 13243761, 13034929, 12911289, 12430417, 12088328, 12545963, 12766576, 11979420, 11988146, 11854401, 11099780, 11461372, 11229448, 11588971, 11139380, 11038111, 10755279, 10612478, 10873397, 10395100, 10680981, 11285333, 11311178, 11621731, 11788443, 11996327, 12194841]
2097A2194841m9579N39286n11218K0493K27893r50012l72276l96884j91526l36853
2087A0174165k47258K53802k423n17958L20518o59318J93481O91422j034588k18331
2077H953512N91934m36244J04563l50112p22379O99703R6659m74794k1266p26368
2067G715208m29631L51708L52898J10243J22449J64863k41809l9117o10330k90286
2057G206196j35131J88651K6247r04329m9933N96785N21935k77320n98643K61253
2047F835711p66277p3733m22757R95672J72814p75171p53436n25916J51055Q94140
2037E732102o21208n23756Q2661M82563K15533Q74115r31712j015313J85399l84020
2027D096364l62440j99375L17676J85262R42199m13762l67956j85974N30951j37792
$$ y = [12194841, 12145262, 12684548, 12173330, 12193823, 12421716, 11471704, 11099428, 10702544, 10511018, 10174165, 9926907, 10180709, 10178286, 9660328, 9980846, 9321528, 9515009, 10206431, 9171843, 8953512, 9545446, 9109202, 9213765, 8863653, 8141274, 8840977, 8937636, 8462842, 8441576, 7715208, 7285577, 7637285, 7990183, 8100426, 8222875, 8387738, 8145929, 8106812, 7496482, 7206196, 7071065, 7259716, 7285963, 6381634, 6331701, 6928486, 7450421, 7173101, 6574458, 6835711, 6069434, 5995701, 5572944, 6568616, 6741430, 5966259, 5212823, 4686907, 4837962, 5732102, 5110894, 4587138, 4669799, 5152362, 5367895, 6242010, 5310298, 4294985, 4480384, 4096364, 3733924, 3534549, 3852225, 4037487, 4979686, 4565924, 4197968, 4011994, 4542945, 4405153]
2017D405153j218339J149754P33244k93173r41370k40871M4393J74107m96308
2008C316590j18061P92813J49240L04458J28450j44592j37110p15347P00037L29711
1998D606189o00085o77043M4456K97926L72909j5329P33607L4012o96162Q3469
1988D183949m42730Q312p11272o2117R4326M89452j95676Q9212l26186j97352
1978B929918K22717L50035J48466K037k56241j72465J55027M51815n48611m68268
1968B814430m63508j55921J83048L60898L60649k89306J980N13566j16631k20139
1958B989066k49098J88035m94804M49868R73389k23492p97503k93210P9244L72645
1948B994140m75452k11031N96855J2161J95979l16666M66471M80411q94848j88706
$$ y = [4405153, 3186814, 4336568, 5069812, 4776639, 3835269, 3594398, 3638791, 3812898, 3316590, 3198529, 3991342, 4140582, 4445040, 4573490, 4428898, 4291788, 3576441, 4276478, 4606189, 4006104, 3329061, 3373517, 3671443, 4044352, 4029023, 4762630, 4796642, 4100480, 4183949, 3741219, 3749531, 3038259, 2976142, 3070468, 3559920, 3364244, 3453456, 3127270, 2929918, 3152635, 3502670, 3651136, 3653173, 3396932, 3224467, 3379494, 3831309, 3282698, 2814430, 2350922, 2195001, 2378049, 2738947, 3099596, 2810290, 2812270, 3325836, 3209205, 2989066, 2739968, 2928003, 2433199, 2883067, 3856456, 3632964, 2835461, 2542251, 2621495, 2994140, 2518688, 2307657, 2904512, 2916673, 3112652, 2795986, 3262457, 3742868, 2848020, 2659314]
1938B659314L70975N13052k56740J67019O86053k8250k59036o81841N07339m14519
1928C263366k11962L69253J51654k74432K6816l57320q34589l3467l4954K87210
1918B351575M63972L594n64020O82493O05885k78800K97602L4145m78890O7369
1908C184925k48592N5177j10636P9938l36603J026779l35325l44271L55886K76956
1898C604234R25668K83773m98206j324882k91004R59003O39704M34165K660k26380
1888D508735k04630o81475k00487P38986k0217p14937O82337Q8689O81642m68460
1878D410183m51718j18550m9628K22427J8759q99099N50700K55116k99392L03187
1868C941985N56152O0429m57834k0516n7041j25708Q28898l57351J97161N2661
$$ y = [2659314, 3030289, 3543341, 3286601, 3453620, 4139673, 4111423, 3852387, 3170546, 3677885, 3263366, 3051404, 3420657, 3572311, 3297879, 3324695, 2967375, 2132786, 2099319, 2064365, 2351575, 2815547, 2819141, 2255121, 2937614, 3543499, 3264699, 3562301, 3596446, 3117556, 3184925, 2936333, 2991510, 2880874, 2960812, 2624209, 3650988, 3315663, 2971392, 3327278, 3604234, 4529902, 4813675, 4315469, 2990587, 2699583, 3658586, 4298290, 4732455, 4735115, 4508735, 4304105, 3622630, 3422143, 4161129, 4140912, 3425975, 4108312, 4197001, 4878643, 4410183, 3958465, 3839915, 3790287, 4012714, 4031473, 3132374, 3683074, 3938190, 3638798, 3941985, 4498137, 4558566, 4100732, 4080216, 4023175, 3897467, 4726365, 4369014, 4566175, 4618836]
1858D618836K6002M86734J34453K13005P85999J39891r28445j06565k29569Q74293
1848F014634M57096q30440p26013L72745l38605j51966j40585k43604k63150L36228
1838D486340j54375L90481o72121n0293k37154m82304L37503n18489K379J52490
1828C254457o0283N09071k91136L4196M98625l7220m93812L3055L75921K42396
1818D065270P58979q53822j14821L57654j73508l91950j08052L80064m66360N66138
1808D019592J194033j46044m80376j69023L32982m08313K68551p71525o44263
1799C195614K50351N48669J37453R331l38643j11998J99583N35390Q5813o25737
1789C885826O54079m66748m59574P666K70143K77564j43456n61483o41045N85855
$$ y = [4618836, 4644838, 5131572, 5266025, 5479030, 6265029, 6404920, 5476475, 5369910, 5140341, 6014634, 6471730, 5641290, 4915277, 5288022, 4949417, 4797451, 4656866, 4413262, 4150112, 4486340, 4331965, 4722446, 4050325, 4000032, 3762878, 3280574, 3618077, 3099588, 3101967, 3254457, 3194174, 3703245, 3412109, 3446305, 3944930, 3907710, 3413898, 3446953, 3822874, 4065270, 4824249, 3970427, 3855606, 4213260, 4039752, 3647802, 3539750, 3919814, 3453454, 4019592, 5213625, 5067581, 4587205, 4418182, 4751164, 4342851, 4611402, 3839877, 3195614, 3445965, 3994634, 4132087, 4141418, 3802775, 3690777, 3890360, 4425750, 4511563, 3885826, 4539905, 4073157, 3613583, 3621249, 3891392, 4168956, 4025500, 3464017, 2822972, 3408827]
1779C408827m34437J98278L55433O84980k93465j107227R8584L14480m58939Q93303
1769C659817J84329K57876J11058n16790j84240M82837Q00499J20799p38163P91545
1759D969567j60858l62734K30972n05606N27452R6427M10876k33023j147430J6921
1749C842564N45906p57205n5282R6867J45664m94332J76214r794m29486k4284
1739C036832L28896k76376r4571o6888P2009l61755k7090K15568L8792j47510
1729B717907K27781p00954M192k10932L26586k55039J5848j34931n93983l87501
1719A008974M67017J73342k88768K30485K19062k95834p72259K93100Q1444M18629
1709A535192J90419j10700o7354J43924k02730m06086j98414N01949j5572j22253
$$ y = [3408827, 2974390, 3172668, 3528101, 4213081, 3919616, 2812389, 2910973, 3225453, 2766514, 3659817, 3844146, 4102022, 4213080, 3696290, 3512050, 3994887, 4795386, 4916185, 4178022, 4969567, 4808709, 4445975, 4676947, 4171341, 4698793, 4795220, 5206096, 4973073, 3825643, 3842564, 4388470, 3631265, 3575983, 3672850, 3818514, 3324182, 3500396, 3490602, 3061116, 3036832, 3365728, 3089352, 2994781, 2927893, 2999902, 2638147, 2611057, 2826625, 2865417, 2717907, 2945688, 2244734, 2248926, 2037994, 2364580, 2109541, 2125389, 1990458, 1396475, 1008974, 1475991, 1649333, 1360565, 1591050, 1810112, 1514278, 742019, 1035119, 1116563, 1535192, 1725611, 1614911, 1547557, 1691481, 1488751, 1082665, 884251, 1386200, 1370628, 1248375]
1699A248375n43577l68434n2114m80966L28017Q635O1809L90201K44417Q9056
1689I25419L21392j265360K29043Q5523q665n97193m79350L31697L23206L67876
1679B33588J91756j46814K38259j40591q11395M50778M36202K83368M8855N3680
1669H37686k90433j17323k35212q697j11409L30131l75923j23153m14952M50691
1659e8594L96116j11301J54381K70914k57618l47398R4217N18316J65039j3431
1649H10641m29885n5224j116018K27207N82349j52149L5555n03040k63894Q82508
1639A8050L35518j31274j52014K030m29284n52231M93260P6644L3844P24855q6749
1628C32649j74055k39460j33215L03079J36757p55109j36297P47292p4783j32363
$$ y = [1248375, 704798, 336364, 284250, -196716, 131301, 139936, 201745, 591946, 836363, 925419, 1246811, -18549, 210494, 296017, 287352, -309841, -789191, -457494, -134288, 233588, 425344, 278530, 516789, 376198, -435197, 15581, 451783, 735151, 784006, 837686, 547253, 429930, 194718, 186021, 74612, 404743, 28820, -94333, -509285, -58594, 337522, 226221, 380602, 651516, 393898, 46500, 140717, 659033, 824072, 810641, 380756, 325532, -790486, -563279, 19070, -133079, -97524, -600564, -864458, 18050, 353568, 222294, 70280, 72310, -356974, -909205, -415945, -339301, -305457, 419398, 332649, 158594, -80866, -214081, 88998, 225755, -529354, -665651, 81641, 6858, -125505]
1618a25505o0151K00029k48212l0327L17813j62285p57808j8009O10176k90885
1608e65164P90068M93233j453714L53934P20035n78209m1793L91855j63817j15603
1598a69175O4312Q5376r58258K13173n25715J1574R74303K7492l09208O1029m10150
1587i35247L58269l3121p29897O09816O09663O666L70768K04625m13761o08395
1577e60614N01552R21816m43081M9087k95647m73576L24057o57134Q2387M87756
1567f3397J5426n1438K79215L3176J90764j28813L49976R852m10271J15593l74874
1556c4791m34705M97721r8593l78862J033814J0281M80005n4981q0643K2434n50222
1545D11458K81524N13999o45521r16350l26610N25098J67219L06751k41841J77109
$$ y = [-125505, -185656, 14373, -233839, -264166, 53647, -108638, -866446, -884455, -274279, -565164, 224904, 718137, -735577, -381643, 338392, -239817, -281610, 110245, -53572, -169175, -104863, -19487, -977745, -764572, -1290287, -1278713, -304410, -276918, -586126, -525097, -935247, -576978, -610099, -1339996, -730180, -120517, -113851, 256917, 461542, 47781, -560614, -59062, 862754, 419673, 468760, 173113, -300463, 23594, -633540, -551153, -63397, -47971, -99409, 179806, 212982, 403746, 274933, 624909, 634761, 224490, 340083, -34791, -469496, 28225, -70368, -449230, 584584, 594865, 1074870, 1019889, 939246, 961680, 411458, 692982, 1206981, 561460, -354890, -681500, -156402, 10817, 317568, 75727, 252836]
1535B52836j25427L43094n3572P013O0255K94377L23459M405k44427n64545K49728
1524E47196o9084L01699m914J12083K02169p19049o95666J37718N61830O68319
1514A042301N60799j133315L01856N46289J3353o80580n10543J3878j6154K2469
1504A60353l09682O1494K59091L45083M02787M60653J44740j76536n0792L38951
1494A636142j034629M28261L16041k67033r12897P20835L47895l96441M01781
1485A239955N22258m25332j036862l94211k0196R32868L47355k0259m57783J10427
1475G98220N49903n10821k43989Q25287N36072L8409j91071j151693K99697O44026
1465A594040k94514l57121L74870q43498o42773J085280L42754k26578l6834n1774
$$ y = [252836, 127409, 470503, 416931, 423944, 484199, 778576, 1102035, 1106440, 862013, 297468, 547196, 478112, 779811, 774897, 886980, 1089149, 370100, -325566, -187848, 373982, 1042301, 1603100, 469785, 771641, 1317930, 1331283, 650703, 140160, 154038, 137884, 160353, -149329, -87835, 171256, 516339, 919126, 1379779, 1524519, 1347983, 1297191, 1636142, 601513, 1029774, 1345815, 1078782, 165885, 886720, 1234615, 838174, 1239955, 1762213, 1336881, 300019, -94192, -114388, 818480, 1165835, 1145576, 687793, 798220, 1348123, 837302, 593313, 1418600, 1954672, 1993081, 1802010, 650317, 950014, 1594040, 1299526, 942405, 1317275, 473777, -168996, 916284, 1259038, 1032460, 995626, 943852]
1455I43852P12815N64058m69721j17341j7749K87215J47130n19421J12684m02438
1445A241084j14775M66645J22977p19749n60627M14766O2189J58019o68451n55161
1435a53083K34678L76082O78096j1309o20073K22019M97621j59870k66217J8203
1425H16147Q55100j69336m89723l87490M09082k04986N64762J82142K29901n09026
1415A296573n6408P98792l66214K18424o0307j76159O69285K76809j503775k67363
1405H29657O40463n22108q07928o8209L46435m4634N7100j41775r07859K93549
1395c25309k05894O0511L80608K26566j46723l49377j171002O31341L02962O16572
1385B0255Q2961n15145j32119R03110k13409M18823k28848l3316L8178n00698
$$ y = [943852, 1656667, 2220725, 1751004, 1633663, 1615914, 1903129, 2050259, 1530838, 1643522, 1241084, 1126309, 1592954, 1715931, 996182, 435555, 850321, 912510, 1070529, 402078, -153083, 81595, 457677, 1135773, 1124464, 504391, 726410, 1224031, 1064161, 797944, 816147, 1671247, 1501911, 1012188, 624698, 1033780, 828794, 1393556, 1575698, 1805599, 1296573, 1240165, 2038957, 1672743, 1891167, 1830860, 1654701, 2323986, 2600795, 1097020, 829657, 1470120, 948012, 140084, 71875, 418310, 373676, 430776, 289001, -618858, -325309, -531203, -470692, -90084, 136482, -10241, -359618, -1530620, -899279, -596317, 20255, 103216, -411929, -544048, 359062, 145653, 564476, 335628, 302312, 340490, -160208]
1375a60208K76689j591783M61295J093931m33239P84371l04046l17442k19165
1366d09597N60504J075339K96579p69483l70662K75327j30504o88406m7877L1250
1356a77530k86944J93906l75500N78099j15854k64759j47917L26973M60905k33104
1346d1725j66784L87617o0610p0636r685k23548r09387N7196J50516N03810K42727
1335a40509l6434J01774L9349j36614k06890r56218O59825J13679M88633O2063
1325a1342P46534k78521l36552j86563k22870M80396j67227l75475n00168k47300
1315a099088J61627R70962k86658N09445j6004j94635j47609l92271n87587O29585
1305d52233N98660M41349l47210n07761r89218N58088K33277l02722J048159q79169
$$ y = [-160208, 116481, -1475302, -1014007, 79924, -353315, 431056, 127010, -190432, -409597, 150907, 1226246, 1522825, 753342, 382680, 658007, 527503, -160903, -208780, -177530, -464474, -270568, -646068, -67969, -183823, -448582, -596499, -269526, 191379, -41725, -208509, 179108, 118498, 47862, 38177, -185371, -1094758, -1037562, -887046, -383236, -140509, -176943, -75169, -35820, -172434, -379324, -1335542, -675717, -562038, -73405, -11342, 735192, 456671, 120119, -66444, -289314, 191082, 23855, -351620, -851788, -1099088, -937461, 33501, -253157, 256288, 240284, 45649, -101960, -494231, -1081818, -452233, 146427, 587776, 240566, -267195, -1256413, -698325, -465048, -767770, 280389, -598780]
1295e98780J25913M84485m29239L51767k73910P58316M83858l77644n86230j169808
1285a231272N67258N85206q4058j48196m56035J021109O74162k80609n68294n27613
1275d48342P59623l93531J53013j94814L80288q138q32926L91768M95724J14566
1265D17231k81535M76561n11250k58517r0221k00090O53013j08376r2799O25197
1255F29214k95132J08802q32516j51545M24205k49675Q53400k52032k04549N96174
1245F26346M40114l19350j8361q916J04113j53997K06571p34472k65465L68066
1235B44649M19224j09401k11374M23784j384001M06127M62776k56915N66112k33618
1225C27363n3219M38276Q46336J93606M30807j80780n44308r37135j42923M89988
$$ y = [-598780, -472867, 11618, -417621, -65854, -339764, 418552, 902410, 524766, -61464, -1231272, -664014, -78808, -162866, -311062, -767097, 254012, 928174, 647565, 79271, -448342, 311281, -82250, 70763, -124051, 256237, 248099, -584827, -193059, 302665, 417231, 135696, 612257, 101007, -157510, -247731, -447821, 205192, 96816, 4017, 629214, 334082, 442884, -389632, -541177, -116972, -366647, 486753, 234721, 30172, 626346, 1066460, 747110, 728749, 719833, 823946, 669949, 876520, 142048, -123417, 244649, 663873, 554472, 343098, 766882, -617119, -210992, 251784, -5131, 560981, 327363, 274144, 712420, 1558756, 1752362, 2183169, 2002389, 1458081, 520946, 378023, 868011]
1215H68011K75775p10076n43295K62987O05214R0598n56452k21572l66703j04192
1205c99705P35556l98062J91644L41889j88116J46099N161k05711Q7541P5058
1195C91354M61653m99764j41523p5236j00563J83484o62174N27131r8632j41122
1185a55392k89804Q34060j70890j90379n74956J17805M40752l58720L01464M91294
1175D45234o6611R28526l57118J71653p09715o34044M60131J63413p08709L44961
1165C7721j997j81583N94062K92251m53678M2388P28315r92154j59019l74289
1155d67983n41512Q03704J91481J7717q72791K05629R79526j59271J59807k49640
1145F6667l62385M0887k46454o3472L06318O21108k56765l58661M91983k08512
$$ y = [868011, 1143786, 433710, -109585, 153402, 758616, 849214, 292762, 71190, -295513, -399705, 335851, -62211, 129433, 471322, 283206, 429305, 434466, 228755, 316296, 391354, 853007, 353243, 211720, 136484, 35921, 219405, -442769, 84362, -14270, -155392, -445196, 388864, 217974, 27595, -547361, -429556, 11196, -347524, -46060, 445234, 378623, 1307149, 950031, 1121684, 411969, -222075, 238056, 401469, -307240, 37721, 35724, -145859, 448203, 740454, 286776, 329164, 1057479, 65325, -93694, -467983, -1009495, -205791, -14310, 3407, -869384, -663755, 315771, 156500, 316307, 66667, -295718, -254831, -501285, -564757, -258439, 362669, 105904, -252757, 239226, 30714]
1135C0714P6314j74519L49631J62476k87930K28412K93554m28270L97412L66936
1125A014730J42010m36470l96792J56051L10622L2307m32877L34144M99957m09947
1115H13735O14891j32632n68616M41690K17425K41274k95254l09776j83361J87469
1105A026845k91498n75028p7651J57778Q97826P39957J03859r56651J34574K1334
1095A181345m89240P68076J15460p63395L42993Q1659k02049P7345J65724q37087
1085D40831N18116M17307J04553n48693J96586L47070N1778K48843k92833P894
1075A491452m68703J58615j25133k07277N58279P03691j41897l8004K18525P61654
1065B911202R3297k33448j65864j69533J77611K95807l20929o63278K12386l57887
$$ y = [30714, 107028, -67491, 282140, 444616, 156686, 385098, 678652, 250382, 647794, 1014730, 1156740, 720270, 323478, 479529, 790151, 822458, 389581, 723725, 1223682, 813735, 1428626, 1295994, 727378, 1169068, 1386493, 1627767, 1332513, 1022737, 839376, 1026845, 735347, 160319, 82668, 240446, 1138272, 1878229, 1982088, 1025437, 1160011, 1181345, 692105, 1460181, 1575641, 812246, 1155239, 1236898, 1034849, 1112194, 1277918, 440831, 958947, 1376254, 1480807, 932114, 1128700, 1475770, 1527548, 1776391, 1483558, 1491452, 1022749, 1181364, 1056231, 848954, 1407233, 2110924, 1969027, 1931023, 2149548, 2911202, 3004499, 2771051, 2605187, 2435654, 2613265, 2909072, 2588143, 1924865, 2137251, 1779364]
1055A779364J08990Q19032K93532k65685N8427K99117J77222K35443q13703j26174
1045B565565m70981P3473M91286J012567o3855L2090K38847M40354L87294P8293
1035D784933L35132k31160J06752k89812L0453M16609j75340O02972J58859J51940
1025E891338j04691n11257K18888O42346O98935K26210l18808l29138k93823N86732
1015F706732k77827J89171P86262L29519N81415J96573n02427k16512P91457K37609
1005H821972K58190K52168j25550m31468R11820L53621q7455J25536m47843j15076
995I515915N15566Q32385j20018J76924L14061M57774k98273j41399Q12949L81669
985A2447553J196160j23815J015827R16985J30196O07772O18169L20315J071999
$$ y = [1779364, 1888354, 2707386, 3000918, 2735233, 2793660, 3092777, 3269999, 3505442, 2691739, 2565565, 2094584, 2168057, 2659343, 3671910, 3608055, 3640145, 3878992, 4319346, 4706640, 4784933, 5120065, 4888905, 4995657, 4705845, 4736298, 5152907, 4977567, 5580539, 5739398, 5891338, 5786647, 5275390, 5494278, 6136624, 6835559, 7061769, 6742961, 6413823, 6120000, 6706732, 6428905, 6618076, 7404338, 7733857, 8315272, 8511845, 8009418, 7792906, 8584363, 8821972, 9080162, 9332330, 9206780, 8775312, 9687132, 10040753, 9953298, 10078834, 9630991, 9515915, 10031481, 10863866, 10743848, 10920772, 11234833, 11692607, 11394334, 11252935, 12065884, 12447553, 13643713, 13519898, 14535725, 15452710, 15582906, 16190678, 16808847, 17129162, 18201161]
976A8201161K29449J116550P96345J046138K003739J725008M68156N73394J492417
967B7652357J567516J075634J268859J020931J328836J538993J681404K791155
959C9925685K307925K009673K897294L521326M353459M231101N040920M679017
951F8966400L628642N756839P583311Q199475Q632669J2732322J5580909K2207821
943A53288388K9515855L5510967L9181206L5449656L1343042J9219752K572914
936C46081780l9732016p2130015n3679475l5485351k3204960j5991136j2578517
929I3280310j0293732q938781p055118m491894l431104k666802k774809l042428
921E0585642k106301l432059m218767l025489k226120k518816k214177j303278
$$ y = [18201161, 18430610, 19547160, 20343505, 21389643, 23393382, 25118390, 25586546, 26159940, 27652357, 29219873, 30295507, 31564366, 32585297, 33914133, 35453126, 37134530, 39925685, 42233610, 44243283, 47140577, 50661903, 55015362, 59246463, 64287383, 68966400, 72595042, 78351881, 85935192, 94134667, 102767336, 115499658, 131080567, 153288388, 182804243, 218315210, 257496416, 292946072, 324289114, 343508866, 346081780, 306349764, 234219749, 180540274, 145054923, 121849963, 105858827, 93280310, 82986578, 74047797, 66992679, 62500785, 59069681, 56402879, 53628070, 50585642, 48479341, 45047282, 40828515, 37803026, 35576906, 33058090, 30843913, 29540635]
913B9540635j419498j471733j221375j682891j857024j423209j135569p83830
905A8545506j349042r57710k99446K773j561635j224122m19246k29005n21195
896A1986878L16378o20894q28758m27208O41774r60893o35139j90909l43663k1575
886H915991m33309l14583m48970L69311k25012j12959l51286k65835l90003j73348
876F569997j184732j15598j58469J57343O6264Q91710k03785n03166q9869L93148
866E822843n11063m5166n78575J98523L98119p61088m1518J3228k78615M52474
856D669162m41962P6391m2259j049638k06951M04036m82609k87664M68352j03062
846C003796n97666N32098N1145n87836k83297P7711N36437l04145L6655k61119
$$ y = [29540635, 28121137, 26649404, 25428029, 23745138, 21888114, 20464905, 19329336, 18545506, 17196464, 16238754, 15939308, 15942081, 14380446, 13156324, 12737078, 12508073, 11986878, 12303256, 11682362, 10853604, 10426396, 11068170, 10107277, 9472138, 9281229, 8937566, 8915991, 8482682, 8168099, 7719129, 8088440, 7863428, 7750469, 7399183, 7133348, 6743345, 6569997, 5385265, 5269667, 5111198, 5268541, 5334805, 6226515, 6022730, 5519564, 5429695, 5822843, 5311780, 5266614, 4688039, 4886562, 5284681, 4523593, 4482075, 4495303, 4216688, 4669162, 4227200, 4303591, 4261332, 3211694, 3004743, 3408779, 2926170, 2638506, 3106858, 3003796, 2406130, 2938228, 2989373, 2401537, 2118240, 2195951, 2732388, 2428243, 2464898, 2203779]
836B203779J85213O0185K73002j60011r03916m6065l86894o95273p77655N53390
826C05755M89264J42589l00513P7048j50155Q00308O20617p30446J6767m98530
816G72704L81814q82878m19430L83803L05222m89651L55503K03901K35360J5994
806H62342l14531m68513K91368K64549K94805j78007j26161m68128K38809L22478
796G19011n26936K38254M06898l0653m35496L18140J45699K34119P21253m53549
786A336740q07416L31318J30118o38639J01207k69296r15006j72701L09831M29015
776a64829J36386P91045j52252j77031j05343k20324l73285J98094J92720K40963
766C66144l02449j25943k16077K50446K8427n09334R09830q7807n17218M34718
$$ y = [2203779, 2388992, 2449177, 2722179, 2562168, 1658252, 1612187, 1225293, 530020, -247635, 305755, 795019, 937608, 637095, 714143, 563988, 1364296, 1984913, 1254467, 1271234, 772704, 1154518, 271640, -147790, 236013, 541235, 51584, 407087, 610988, 846348, 862342, 547811, 79298, 370666, 635215, 930020, 752013, 625852, 157724, 396533, 719011, 192075, 430329, 837227, 806574, 371078, 689218, 834917, 1069036, 1790289, 1336740, 529324, 860642, 990760, 352121, 453328, 184032, -730974, -903675, -593844, -164829, -28443, 762602, 610350, 433319, 327976, 107652, -265633, -67539, 125181, 366144, 63695, -62248, -278325, -27879, 548, -508786, 401044, 313237, -203981, 230737]
756B30737N84785l72258p40825k2545n75603L52997k0063M2141J222L90870O58936
745E30394j40369K9906K1297K00003p15323K11842m7174L22685n8019k61875J08181
734B01548m18100l39976M59052L5672q09989L42242K84697K97677N5341l27818
724b19654k29180J39961j72260l73615R09000k99447J12531M51646n59611L06416
714F5787M19733j31821K29537q18621r4973J87456K92055L65089p08064l99459
704e93281O91175J36387j27844K87449m39189m77232k65288M54217k31706J51714
694d13598K37250k07667M22442P0490j008532k22713P96363J19577n14781P24308
684C139K48287n57827n2196N37806j08631R1362m38440l876L46227l04656k99903
$$ y = [230737, 815522, 443264, -297561, -320106, -895709, -542712, -562775, -520634, -519412, -128542, 530394, 390025, 419931, 441228, 641231, -74092, 137750, 90576, 413261, 355242, 93367, 201548, -216552, -556528, -97476, -61804, -871793, -529551, -244854, 52823, 108164, -219654, -448834, -308873, -481133, -854748, 54252, -245195, -132664, 318982, -240629, 65787, 485520, 353699, 583236, -235385, -330358, -142902, 149153, 514242, -193822, -593281, 97894, 234281, 106437, 393886, -45303, -522535, -787823, -333606, -565312, -413598, -176348, -384015, 38427, 108917, -899615, -1122328, -325965, -206388, -721169, 3139, 251426, -306401, -358597, 179209, 70578, 161940, -276500, -280376, 65851, -238805, -538708]
673e38708Q57150Q7239p00809l97663P25721P40334q733n16289M32512l98103
663B82651l93038Q06675o23872p22536k2839J037440K96629o6540M10277L17745
653A322592j26974M78074j086734M9636l06977M55673n91670m24666J49032N62414
643D80400R1469k54201l63125j21959Q3375K45733O71198j94798j212748L14879
633b59777Q53543k23810o93201k11250l43872K01946O6913M05679N62898p21500
623c62431k19582j47048L89655l88378r42615n8209N68423j18055R17891Q1557
613b78792N24071m28354j64789j96469k61990N476K74451K7655O8113M49502m62950
602d44076K1757l73894j62646Q0798K71630O90288L1122l90049q97393J91418
$$ y = [-538708, 318442, 405681, -295128, -692791, 32930, 773264, 764531, 248242, 680754, 282651, -110387, 696288, 72416, -650120, -672959, 364481, 661110, 594570, 1004847, 1322592, 1195618, 1673692, 586958, 636594, 329617, 785290, 193620, -231046, -82014, 480400, 571869, 317668, -45457, -167416, -84041, 161692, 832890, 638092, -574656, -259777, 593766, 369956, -323245, -534495, -878367, -676421, -609508, -203829, 359069, -362431, -582013, -729061, -339406, -727784, -1670399, -1728608, -1160185, -1278240, -360349, -278792, 245279, -183075, -347864, -544333, -806323, -800847, -526396, -498741, -430628, 18874, -444076, -422319, -796213, -958859, -878061, -606431, 83857, 114979, -275070, -1172463, -981045]
592i81045J2805N21798K20656J20761p8238R6645k32904L91121k59434k24989
582d12824J43291P6954k84896l61255N18580L10540N70352j055603n45971j74741
572a215573j79675k00339M14281N62838K41916K40623j00006k48622l01655M2357
562g43855L1505m60827K16772P49499k09511k81366k17300K83740n17595k51864
552a400802K96313J27144J16067j15249j17445Q1843N04994n81616L52318R5340
542f41093j168201k63430L85457O41604J05520k36011m36442N06068Q24917l76539
532f58150o43998K40789Q13803n42875k27778N41731q6530J43052p8606K07831
522b90731k81725p36790l55703l14369K15991L04439N97489L40904L78847o06784
$$ y = [-981045, -968240, -446442, -225786, -105025, -183263, -86618, -319522, 71599, -187835, -412824, -269533, -192579, -477475, -838730, -320150, -9610, 560742, -494861, -1040832, -1215573, -1395248, -1595587, -1181306, -618468, -376552, -135929, -235935, -484557, -786212, -743855, -712350, -1173177, -956405, -206906, -416417, -697783, -915083, -631343, -1148938, -1400802, -1104489, -977345, -861278, -976527, -1093972, -1012129, -507135, -1088751, -736433, -641093, -1809294, -2072724, -1687267, -1045663, -940143, -1176154, -1612596, -1106528, -281611, -658150, -1302148, -1061359, -247556, -790431, -1018209, -476478, -563008, -419956, -498562, -290731, -572456, -1309246, -1664949, -1979318, -1763327, -1458888, -861399, -520495, -141648, -748432]
512g48432J21503k12268Q8456J94127k07959M2193Q199Q38601j7679r42982o8805
501i05046L97273m90321k27885J009529m7385M41180j104942L53919p2071J20973
491e24776R75724O7317l72063l47529Q54001n41875j84436K70094n84953o21996
481a010492n78874k92099K54292J137277L63142k80732j59557m02310j39288n37333
471a645974N00986L91762n41216j21127J186115l29782q40856L32031L49346n54801
461a273516N51068K29748k71425n3356J56271J36959m696k74349l5787p64985
451a604068Q27366j53747o66161J066149R77750m99533j75516r58166K906N32864
441f50156K70903M35372o68294o47880N9539O68491m71850j74943K09421N29440
$$ y = [-748432, -626929, -839197, -750741, -556614, -764573, -722380, -714181, 124420, 106741, -836241, -905046, -507773, -998094, -1225979, -216450, -263835, 177345, -927597, -573678, -645749, -524776, 450948, 518265, 146202, -201327, 652674, 110799, -73637, 196457, -388496, -1010492, -1589366, -1881465, -1627173, -489896, -126754, -407486, -567043, -969353, -1108641, -1645974, -1144988, -753226, -1294442, -1415569, -229454, -559236, -1400092, -1068061, -718715, -1273516, -722448, -492700, -764125, -817481, -661210, -524251, -528947, -803296, -839083, -1604068, -776702, -930449, -1596610, -530461, 447289, -52244, -227760, -1185926, -1183020, -650156, -379253, 56119, -612175, -1260055, -1200516, -532025, -1003875, -1178818, -969397, -439957]
431d39957l93050o35157K52221J68962M88497o16648l78611R13658n77514Q82203
421c35396J82125n06653L48967l41831n03683N38902J17402j75943m08563Q24812
411b59861O86768j189528q91483L98687M60536r7233m86956N07880K83630o90398
401a277958L1206N06540j36911m55616k00778J122486l46667k40149K4548l0269
391a003568j02179o03623k54637P33898J78508n63911J86627m93263K58746J13483
381a549919M67355R2808p71572M74949j16258j43213j28061p7509j20513k30385
371b102318K04716K86378n26940q5737P40765k52016L50164J15508L92396K91582
361e85502N83040m61152l36673q9557p66705N50956N23795k35657m20314n27561
$$ y = [-439957, -833007, -1468164, -1215943, -1046981, -558484, -1175132, -1553743, -640085, -1217599, -335396, -153271, -659924, -310957, -652788, -1156471, -617569, -500167, -676110, -1084673, -259861, 426907, -762621, -1654104, -1255417, -794881, -892114, -1379070, -871190, -587560, -1277958, -1246752, -740212, -877123, -1332739, -1533517, -411031, -757698, -997847, -973299, -1003568, -1105747, -1709370, -1964007, -1230109, -1051601, -1615512, -1428885, -1922148, -1663402, -1549919, -1082564, -989756, -1761328, -1286379, -1402637, -1545850, -1673911, -1751420, -1871933, -2102318, -1897602, -1611224, -2138164, -2223901, -1483136, -1735152, -1384988, -1269480, -877084, -585502, -2462, -463614, -800287, -889844, -1656549, -1105593, -581798, -817455, -1237769, -1765330]
351a765330L81550M20596r0850o8594k00956r0811K36015N9936M41403p19687
341a396728o2689k8870M08435O85917L59902j051855l04635o9630K46156m10019
331a624016l57194m8026J16484l81941P05262p5344n50942K32349R8094O23330
321a261944J53875o94789L11898L84737n70206P4597k11922O29423J20461L67107
311f96763L8468L3309l69783J53577r59197J92183m26934r1569Q17627P9520l16742
300a546304K53373n01854l55631N44032j83715j80821j39676Q79988L82846k70200
290a117962N70063o63506L12898m37008j59631k2483n1348l16629j75581Q63221
280a197966q2989j55828n5459k68950m70247N44152P5742K24324j34378j40006
$$ y = [-1765330, -1383780, -963184, -1054034, -1122628, -1323584, -1414395, -1178380, -1118444, -677041, -1396728, -1459417, -1488287, -1079852, -393935, -34033, -1085888, -1390523, -1460153, -1213997, -1624016, -1981210, -2029236, -1912752, -2294693, -1589431, -1664775, -2215717, -1983368, -1885274, -1261944, -1108069, -1802858, -1490960, -1106223, -1676429, -1601832, -1813754, -1184331, -1063870, -696763, -658295, -624986, -994769, -841192, -1800389, -1608206, -2035140, -2126709, -1309082, -1229562, -1546304, -1292931, -1794785, -2150416, -1606384, -1790099, -1970920, -2110596, -1230608, -847762, -1117962, -547899, -1211405, -898507, -1335515, -1495146, -1517629, -1568977, -1885606, -2061187, -1197966, -1280955, -1436783, -1492242, -1761192, -2231439, -1687287, -1611545, -1387221, -1521599, -1661605]
270a661605K65553j66628j5965L01443r36297n20261j77941J11830P8573L56944
260b364354L26193K2244K77153n74633K66147M2272O5571j83911j36602K46091
250b013829J92110l4870j62234J61151N78545k33915J85848o1610n72192R9510
240a861486P5197M00634R2199j38417K25061o24996R2361O06456k22339k68142
230a623472l98759J45967J48639J24827K9805n15752K6026L95989l46084P56142
220a256672k02575O2381O8825m75574j38106Q024K31333O31269n04132l56342
210a931569J62127K2871m40314M42408L72381j29906l78412k68686j67988J15249
200b201839J011345j39668j65325N8233k97317J39863k82649K81010J10850L9814
$$ y = [-1661605, -1396052, -1562680, -1578645, -1277202, -2213499, -2733760, -2911701, -2799871, -2721298, -2364354, -2038161, -2015917, -1738764, -2313397, -2047250, -2004978, -1939407, -2123318, -2259920, -2013829, -1821719, -1856589, -2018823, -1857672, -1279127, -1513042, -1327194, -1388804, -1960996, -1861486, -1786289, -1385655, -1293456, -1431873, -1206812, -1831808, -1739447, -1132991, -1355330, -1623472, -2022231, -1876264, -1727625, -1602798, -1572993, -2088745, -2062719, -1666730, -2012814, -1256672, -1459247, -1396866, -1328041, -1803615, -1941721, -1933697, -1702364, -1071095, -1575227, -1931569, -1769442, -1746571, -2186885, -1744477, -1372096, -1502002, -1880414, -2149100, -2317088, -2201839, -1190494, -1330162, -1495487, -1437254, -1734571, -1594708, -1877357, -1596347, -1485497, -1445683]
190a445683L46788n41068k87063o11241M21311N11438n51994o37178J00933M12053
180b281704O17290n9096L11572n80040o31598N27825K28572M4348j26236j03765
170b052832O60522n14838n75909j7736l58045O0490O44449o7813m5944l33959
160b601615Q3099J029404L22436o75977j97128P15784N07307o65810m93621l93181
150b369302k08404J40380L50855M9446m68902L00796p4456j77153N8494K9950
140b368296J60308P67920l65578k90198L09376J43251p80190j13841K38944q0351
130b378655K96284K97855J38610l63488K29100L72954N08986n57050o00998j23717
120b180119K13448K15006o20608m43989m26807l05066K36568R59335m81532K98374
$$ y = [-1445683, -1098895, -1639963, -1927026, -2538267, -2116956, -1605518, -2157512, -2794690, -2693757, -2281704, -1664414, -1723510, -1411938, -1991978, -2623576, -2095751, -1867179, -1822831, -1949067, -2052832, -1392310, -1907148, -2483057, -2500793, -2858838, -2798348, -2153899, -2221712, -2267656, -2601615, -2518516, -1489112, -1166676, -1842653, -2039781, -1323997, -816690, -1482500, -1976121, -2369302, -2577706, -2437326, -2086471, -2037025, -2505927, -2205131, -2279587, -2456740, -2398246, -2368296, -2207988, -1440068, -1805646, -2095844, -1786468, -1643217, -2423407, -2537248, -2298304, -2378655, -2082371, -1784516, -1645906, -2009394, -1780294, -1407340, -898354, -1455404, -2056402, -2180119, -1966671, -1751665, -2372273, -2816262, -3243069, -3548135, -3311567, -2352232, -2833764, -2535390]
110b535390M04097P95980N5152q26456L05187m58464k25140K47645p2310J89044
100b120655m06597L24170J2830m17150M00596N15973m58108K43937R7725O1336
90a745943n89411n47532L45963L9887J41965J93944j35262J66601L42045q2102
80a869845l92884O68921m31380l65102N30480j57344l57971l9811M05122l30073
70b339887n9468j4519P43320l27438o47741J4679P33530q18783k9652J69409J16242
59b460308m3348J71442K25348j90573l1925j98989j74949O48376J82957j43314
49b015283m67194N6774M96437K3086o62659l3638j65690o7377J76262m17247L43035
38b733494J38884L4447K41495j68700j09633M13718j83369K31995m9725j06447
$$ y = [-2535390, -2131293, -1335313, -1280161, -2106617, -1801430, -2259894, -2485034, -2237389, -2309699, -2120655, -2527252, -2203082, -2190252, -2607402, -2206806, -1690833, -2148941, -1905004, -1807279, -1745943, -2335354, -2882886, -2536923, -2497036, -2355071, -2161127, -2296389, -2129788, -1787743, -1869845, -2262729, -1593808, -2025188, -2390290, -1859810, -2017154, -2375125, -2414936, -2009814, -2339887, -2399355, -2413874, -1670554, -1997992, -2645733, -2631054, -1897524, -2716307, -2745959, -2576550, -2460308, -2503656, -2332214, -2106866, -2297439, -2329364, -2528353, -2703302, -2054926, -1871969, -2015283, -2482477, -2425703, -1929266, -1906180, -2568839, -2602477, -2768167, -2835544, -2659282, -3076529, -2733494, -2594610, -2560163, -2318668, -2487368, -2597001, -2183283, -2366652, -2134657, -2184382, -2290829]
28b290829J9258j47017k76867N63652r3095l43947m3320K08090m31368J9522q9055
17b904976K01040K32682J10878J39213l10721j8798L40432J85100k04314J18903
7b110561l04062l7109k64902L11103j40652R532l46551
0b883202
$$ y = [-2290829, -2271571, -2418588, -2695455, -2131803, -2224898, -2568845, -2612165, -2404075, -2835443, -2815921, -2904976, -2703936, -2471254, -2360376, -2221163, -2531884, -2550682, -2210250, -2025150, -2229464, -2110561, -2414623, -2451732, -2716634, -2405531, -2546183, -2536651, -2883202]
$$ Imaginary data points
##PAGE= N=2
##DATA TABLE= (X++(I..I)), XYDATA
16383h512272l82996J94151K65222m48150K17162O57844l38038K98709K95625
16374g752743l60638j90409L17392J76578L92413n5800N06199l327J01974N07357
16364f361004j83129k33949P12897K29447M43999n15738L9669J46619K76408l30133
16354e774914l52101L41870M63241j26515J23151N10509o01630L01952M84734
16345d629703J06630J69433K06137J2327J39477L37768m13516k40944Q8183M97598
16335c726610J44709M7351M51247M454l26456m2871K53939m69156J35614N34420
16325b993359L96599R1018K40246n9891L05742k36030L59761K81047J77527K46604
16315a190736R9482j75588J83370r1006P2203l30562j1919L65143o4263k53921
$$ y = [-8512272, -8895268, -8701117, -8435895, -8884045, -8666883, -8009039, -8347077, -8048368, -7752743, -8113381, -8303790, -7986398, -7809820, -7417407, -7473207, -6967008, -6970335, -6868361, -6361004, -6544133, -6778082, -6065185, -5835738, -5391739, -5907477, -5867808, -5721189, -5444781, -5774914, -6127015, -5785145, -5321904, -5448419, -5325268, -4814759, -5416389, -5114437, -4629703, -4523073, -4353640, -4147503, -4135176, -3995699, -3657931, -4071447, -4312391, -4224208, -3726610, -3581901, -3534550, -3083303, -3078849, -3405305, -3448176, -3194237, -3663393, -3527779, -2993359, -2596760, -2505742, -2265496, -2325387, -2019645, -2255675, -1895914, -1614867, -1437340, -1190736, -1091254, -1266842, -1083472, -1174478, -1102275, -1432837, -1444756, -1079613, -1143876, -1397797]
16305a397797J80158Q04074n85565J59914J48546M54201J90836n11326M4306J135167
16295F22514j13279m66226K58297R9322j73188M59614n45237M13739M23143r8453
16285H80246M24665j85307K61018k50832L07277M63654N67810k56051k9605n25671
16275A657204J8938N73978J64738j28665P8049j73197l00277M12064L71345j87619
16265B486558L5230O66814j04663k80721K89986N88539K29774j87264n30158k88747
16255B905348l86938M62677J37080m13066L61991m38934m9177L59353O85370P08810
16245D332514j52111J72997J72855n51184L12921O9470j83909k34417N89801M03720
16235D932657j95656l14997k58772j98273K66836k64949L46910O72509K83558
$$ y = [-1397797, -1217639, -413565, -999130, -839216, -690670, -236469, -45633, -556959, -512653, 622514, 509235, 43009, 301306, 400628, 227440, 687054, 141817, 555556, 978699, 880246, 1304911, 1119604, 1380622, 1129790, 1437067, 1900721, 2468531, 2212480, 2182875, 1657204, 1676142, 2250120, 2414858, 2286193, 2364242, 2191045, 1890768, 2302832, 2674177, 2486558, 2521788, 3188602, 3083939, 2803218, 3093204, 3681743, 3911517, 3724253, 3194095, 2905348, 2518410, 2981087, 3118167, 2705101, 3067092, 2628158, 2578981, 2938334, 3623704, 4332514, 4180403, 4353400, 4526255, 3975071, 4287992, 4357462, 4173553, 3939136, 4528937, 4932657, 4737001, 4422004, 4163232, 3964959, 4231795, 3966846, 4313756, 4986265, 5269823]
16226E269823l51342l29312N73440k2188p3809k47175K88704k31882K59230M63513
16216E599002k15177L4449j04320l21777L79254Q21638O1280o90871P0229O7723
16206E701430l3991J54037L0728J98398N32518q8118l44244m43529l88703j1391
16196E307135O47035L76429O49329j19497j005054j00104K02114O45411j12868
16187F489930k76499K33372J24824J12975P27736j47922l02795P96320j62094
16178G595847p7811q50805K843Q3343K19206n07386l03989J273099M89535K91314
16168H215196o89207r68505l52662J161345N20154m02747m35375j25535k7437
16159F895227L41343M7037K14924l07717P9894J468985j21509o63901j89809O2240
$$ y = [5269823, 4918481, 4589169, 5162609, 5140421, 5066612, 4819437, 5108141, 4876259, 5135489, 5599002, 5383825, 5418274, 5313954, 4992177, 5371431, 6193069, 6254349, 5563478, 5633707, 5701430, 5667439, 5821476, 5852204, 6050602, 6583120, 6495002, 6150758, 5707229, 5318526, 5307135, 5954170, 6330599, 6979928, 6860431, 5855377, 5755273, 5957387, 6602798, 6489930, 6213431, 6446803, 6571627, 6684602, 7412338, 7264416, 6961621, 7757941, 7595847, 7518036, 6667231, 6670074, 6753417, 6972623, 6465237, 6161248, 7434347, 7923882, 8215196, 7525989, 6557484, 6204822, 7366167, 7886321, 7483574, 7048199, 6922664, 6895227, 7236570, 7283607, 7498531, 7190814, 7270708, 8739693, 8618184, 7954283, 7764474, 7826714]
16149G826714l57191O00661J14721l53860Q6450r46176L02378R8447J28037j04821
16139G395360P0768m27027J01586M33036n27188L87405J78361P15276K03135n05975
16129H024737r2878L19258k05821K83911m3391j95606K40469L65796q8858k08841
16119H398776m73223P88041J68683l69933l69845L34640M57737n29203r5701q3872
16109H226100J32384L2437l4072J77602K16667j36445j96190K79469j34003j45708
16099H418241N9790k70035J021981l30252j99443l2063o39418l46837N45072m5349
16089H181687m93766P8711N12205K41727l88350r4075j91716l40665N7041L23705
16079G886504J008894N6026j93542o13335K49238L13261l92557M70991L07550
$$ y = [7826714, 7469523, 8070184, 8184905, 7831045, 7917495, 6971319, 7273697, 7372144, 7500181, 7395360, 7466128, 7039101, 7140687, 7573723, 7046535, 7433940, 7612301, 8327577, 8530712, 8024737, 7931859, 8251117, 8045296, 8329207, 8285816, 8090210, 8330679, 8696475, 8607617, 8398776, 7925553, 8713594, 8882277, 8512344, 8142499, 8477139, 8934876, 8405673, 8309972, 8226100, 8358484, 8390921, 8356849, 8534451, 8751118, 8614673, 8418483, 8697952, 8563949, 8418241, 8478031, 8207996, 9229977, 8899725, 8700282, 8668219, 8028801, 7681964, 8227036, 8181687, 7687921, 7766632, 8278837, 8520564, 8132214, 8038139, 7846423, 7505758, 7562799, 7886504, 8895398, 8951424, 8757882, 8144547, 8393785, 8707046, 8314489, 8785480, 9093030]
16070I093030K17246l72447m13538K32924P50975p43937l59225k98616O99751
16061H806163k68186q03927k30944N67740P99621n09949N0814J10797q5146J56539
16051H593522n08823L9413K77016k18693j33621O33125K58037l17756M37467j01272
16041H958415j07400l65948n37597J63436j33723K45681Q01368k44738m15106
16032H364388o97415O00685P03635N62271l34848l36847L55885j98203k38772
16023H780779k5834o16798O4664L56420O84237J34475p69592L81945j2930l16836
16013H660530n2221j26629n25837k26942M67836J21720k35195R9625N01631n17956
16003H166562Q3845O15572l25403k37580l62327L48414N99014j5415J83016L86880
$$ y = [9093030, 9310276, 8937829, 8524291, 8757215, 9508190, 8764253, 8405028, 8106412, 8806163, 8537977, 7734050, 7503106, 8070846, 8870467, 8360518, 8411332, 8522129, 8436983, 8593522, 8084699, 8124112, 8401128, 8182435, 8048814, 8681939, 8939976, 8622220, 9059687, 8958415, 8851015, 8485067, 7947470, 8110906, 7977183, 8222864, 9024232, 8779494, 8364388, 7666973, 8267658, 8971293, 9533564, 9198716, 8861869, 9217754, 9019551, 8780779, 8754945, 8138147, 8202811, 8559231, 9243468, 9377943, 8608351, 8990296, 8977366, 8660530, 8608309, 8481680, 7955843, 7728901, 8196737, 8318457, 8083262, 8182887, 8684518, 8166562, 8250407, 8865979, 8540576, 8302996, 7940669, 8289083, 8888097, 8872682, 9055698, 9442578]
$$ [...]
##END NTUPLES=NMR SPECTRUM
##END=
