##TITLE=1H_EC-3246(3)
 CDCl3, 8 sc, 
 12.05.2021
##JCAMPDX= 6.0         $$ Bruker NMR JCAMP-DX V2.0
##DATA TYPE= NMR SPECTRUM
##DATA CLASS= NTUPLES
##ORIGIN= UXNMR, Bruker Analytische Messtechnik GmbH
##OWNER= root
$$ XWIN-NMR		Version 3.5
$$ Wed May 12 10:16:05 2021 Russian Standard Time (UT+4h)  she@DPX200
##.OBSERVE FREQUENCY= 200.131506
##.OBSERVE NUCLEUS= ^1H
##.ACQUISITION MODE= SIMULTANEOUS
##.ACQUISITION SCHEME= undefined
##.AVERAGES= 8
##.DIGITISER RES= 18
##SPECTROMETER/DATA SYSTEM= spect
##.PULSE SEQUENCE= zg30
##.SOLVENT NAME= CDCl3
##.SHIFT REFERENCE= (INTERNAL, CDCl3, 0, 15.9751)
##AUDIT TRAIL= $$ (NUMBER, WHEN, WHO, WHERE, WHAT)
$$ ##TITLE= Audit trail, XWIN-NMR		Version 3.5
$$ ##JCAMPDX= 5.01
$$ ##ORIGIN= Bruker BioSpin GmbH
$$ ##OWNER= she
$$ F:/spectra/data/she/nmr/H-F/1/pdata/1/auditp.txt
$$ ##AUDIT TRAIL=  $$ (NUMBER, WHEN, WHO, WHERE, WHAT)
(   1,<2021-05-12 10:14:54.46 +0400>,<she>,<DPX200>,
      <created by zg, POWCHK disabled, PULCHK disabled
       configuration hash MD5:
       00 E9 B6 7A A2 85 ED C7 34 08 36 98 17 FE 4E 26
       data hash MD5: 16K
       9B 4B 13 A2 C6 04 78 5C B0 F2 B4 42 63 6B 61 7A>)
(   2,<2021-05-12 10:14:56.73 +0400>,<she>,<DPX200>,
      <Start of raw data processing
       efp BC_mod = 2 LB = 0.24 FT_mod = 6 PKNL = 1 PHC0 = -11133.77 PHC1 = 12.801 SI = 16K 
       data hash MD5: 16K
       C4 4D 5C 40 D5 33 28 93 58 5C 20 08 F2 89 88 0F>)
(   3,<2021-05-12 10:15:14.79 +0400>,<she>,<DPX200>,
      <pk PHC0 = 2.842553 PHC1 = -0.6000001 
       data hash MD5: 16K
       52 2C 86 28 42 8C 13 54 57 35 E5 0F AD E8 77 FE>)
(   4,<2021-05-12 10:15:17.75 +0400>,<she>,<DPX200>,
      <abs ABSG = 5 
       data hash MD5: 16K
       63 13 43 F3 51 02 ED BD 0A 65 6B 41 AA F8 C2 8A>)
$$ ##END=
$$ 
$$ hash MD5
$$ 5D 2C 13 36 67 E3 C1 67 E0 29 8F A8 9E 28 60 D8
##$RELAX= 
##$RELAX= 
##$RELAX= 
##$RELAX= 
##$RELAX= 
##$RELAX= 
$$ Bruker specific parameters
$$ --------------------------
##$DU= <F:/spectra>
##$EXPNO= 1
##$NAME= <H-F>
##$PROCNO= 1
##$TYPE= <nmr>
##$USER= <she>
##$AMP= (0..31)
100 100 100 100 100 100 100 100 100 100 100 100 100 100 100 100 100 100 
100 100 100 100 100 100 100 100 100 100 100 100 100 100 
##$AQSEQ= 0
##$AQ_mod= 1
##$AUNM= <au_zg>
##$AUTOPOS= <>
##$BF1= 200.13
##$BF2= 200.13
##$BF3= 200.13
##$BF4= 200.13
##$BF5= 200.13
##$BF6= 200.13
##$BF7= 200.13
##$BF8= 200.13
##$BYTORDA= 1
##$CFDGTYP= 0
##$CFRGTYP= 5
##$CHEMSTR= <none>
##$CNST= (0..31)
1 1 145 1 1 1 1 1 1 1 1 1 1 1 1 1 1 1 1 1 1 1 1 1 1 1 1 1 1 1 1 1 
##$CPDPRG= <>
##$CPDPRG1= <>
##$CPDPRG2= <>
##$CPDPRG3= <>
##$CPDPRG4= <mlev>
##$CPDPRG5= <mlev>
##$CPDPRG6= <mlev>
##$CPDPRG7= <mlev>
##$CPDPRG8= <mlev>
##$CPDPRGB= <>
##$CPDPRGT= <>
##$D= (0..31)
0 1.2 0 0 0 0 0 0 0 0.06 0 0.03 0 0 0 0 0.0002 0 0 0 0 0 0 0 0 0 0 0 0 
0 0 0 
##$DATE= 1620800093
##$DBL= (0..7)
120 120 120 120 120 120 120 120 
##$DBP= (0..7)
150 150 150 150 150 150 150 150 
##$DBP07= 0
##$DBPNAM0= <>
##$DBPNAM1= <>
##$DBPNAM2= <>
##$DBPNAM3= <>
##$DBPNAM4= <>
$$ [...]
##$SUBNAM3= <"">
##$SUBNAM4= <"">
##$SUBNAM5= <"">
##$SUBNAM6= <"">
##$SUBNAM7= <"">
##$SUBNAM8= <"">
##$SUBNAM9= <"">
##$SW= 16.9725357007746
##$SWIBOX= (0..15)
0 0 2 0 0 0 0 0 0 0 0 0 0 0 0 0 
##$SW_h= 3396.73913043478
##$TD= 16384
##$TD0= 1
##$TE= 0
##$TE2= 300
##$TE3= 300
##$TEG= 300
##$TL= (0..7)
0 120 120 120 120 120 120 120 
##$TP= (0..7)
150 150 150 150 150 150 150 150 
##$TP07= 0
##$TPNAME0= <>
##$TPNAME1= <>
##$TPNAME2= <>
##$TPNAME3= <>
##$TPNAME4= <>
##$TPNAME5= <>
##$TPNAME6= <>
##$TPNAME7= <>
##$TPOAL= (0..7)
0.5 0.5 0.5 0.5 0.5 0.5 0.5 0.5 
##$TPOFFS= (0..7)
0 0 0 0 0 0 0 0 
##$TUNHIN= 0
##$TUNHOUT= 0
##$TUNXOUT= 0
##$USERA1= <user>
##$USERA2= <user>
##$USERA3= <user>
##$USERA4= <user>
##$USERA5= <user>
##$V9= 5
##$VALIST= <valist>
##$VCLIST= <CCCCCCCCCCCCCCC>
##$VD= 0
##$VDLIST= <DDDDDDDDDDDDDDD>
##$VPLIST= <PPPPPPPPPPPPPPP>
##$VTLIST= <TTTTTTTTTTTTTTT>
##$WBST= 1024
##$WBSW= 4
##$XGAIN= (0..3)
0 0 0 0 
##$XL= 0
##$YL= 0
##$YMAX_a= 294915
##$YMIN_a= -291853
##$ZGOPTNS= <>
##$ZL1= 120
##$ZL2= 120
##$ZL3= 120
##$ZL4= 120
##$ABSF1= 15.99268
##$ABSF2= -0.9799843
##$ABSG= 5
##$ABSL= 3
##$ALPHA= 0
##$AQORDER= 0
##$ASSFAC= 0
##$ASSFACI= 0
##$ASSFACX= 0
##$ASSWID= 0
##$AUNMP= <proc_1d>
##$AZFE= 0.1
##$AZFW= 0.1
##$BCFW= 0
##$BC_mod= 2
##$BYTORDP= 0
##$COROFFS= 0
##$CY= -3
##$DATMOD= 1
##$DC= 0
##$DFILT= <>
##$DTYPP= 0
##$F1P= 0
##$F2P= 0
##$FCOR= 1
##$FTSIZE= 16384
##$FT_mod= 6
##$GAMMA= 0
##$GB= 0
##$INTBC= 1
##$INTSCL= 1.334414e-10
##$ISEN= 128
##$LB= 0.24
##$LEV0= 0
##$LPBIN= 0
##$MAXI= 10000
##$MC2= 0
##$MEAN= 0
##$ME_mod= 0
##$MI= 1.114404
##$NCOEF= 0
##$NC_proc= -7
##$NLEV= 6
##$NOISF1= 3.799351
##$NOISF2= 2.8
##$NSP= 0
##$NTH_PI= 0
##$NZP= 0
##$OFFSET= 15.97506
##$PC= 1
##$PHC0= -11130.93
##$PHC1= 12.201
##$PH_mod= 1
##$PKNL= yes
##$PPARMOD= 0
##$PSCAL= 0
##$PSIGN= 0
##$REVERSE= no
##$SF= 200.130007280688
##$SI= 16384
##$SIGF1= 3
##$SIGF2= 2
##$SINO= 5.538805
##$SIOLD= 16384
##$SREGLST= <1H.CDCl3>
##$SSB= 0
##$STSI= 16384
##$STSR= 0
##$SW_p= 3396.73913043479
##$SYMM= 0
##$S_DEV= 0
##$TDeff= 16384
##$TDoff= 0
##$TI= <>
##$TILT= no
##$TM1= 0
##$TM2= 0
##$TOPLEV= 0
##$USERP1= <user>
##$USERP2= <user>
##$USERP3= <user>
##$USERP4= <user>
##$USERP5= <user>
##$WDW= 1
##$XDIM= 16384
##$YMAX_p= 372876946
##$YMIN_p= -603115
$$ End of Bruker specific parameters
$$ ---------------------------------
##NTUPLES= NMR SPECTRUM
##VAR_NAME=  FREQUENCY,     SPECTRUM/REAL,   SPECTRUM/IMAG
##SYMBOL=    X,             R,               I
##VAR_TYPE=  INDEPENDENT,   DEPENDENT,       DEPENDENT
##VAR_FORM=  AFFN,          ASDF,            ASDF
##VAR_DIM=   16384,         16384,           16384
##UNITS=     HZ,            ARBITRARY UNITS, ARBITRARY UNITS
##FACTOR=    0.207333158178282, 1,           1
##FIRST=     3197.08896675995, 0,            0
##LAST=      -199.650163674843, 0,           0
##MIN=       -199.650163674843, -603115,     0
##MAX=       3197.08896675995, 372876946,    0
$$ Real data points
##PAGE= N=1
##DATA TABLE= (X++(R..R)), XYDATA
$$ [...]
$$ plain form
5506 1666980 1562019 1527317 1521387 1532970 1449749 1530722 1477115 1444054 1346523 1397380 1331300
5495 1331300 1142569 1156392 1295472 1499638 1443169 1333269 1261692 1249114 1296761 1220247 1253205
5484 1253205 1263567 1253840 1493870 1326045 1416103 1497777 1407402 1296516 1353836 1332902 1372845
5473 1372845 1336330 1181875 1002513 882178 923493 1045609 1179182 1164018 1013232 1042894
5463 1042894 1038841 916140 734362 793416 817302 683147 512032 606016 675974 679857 557794
5452 557794 528380 593976 659627 602404 562914 666530 741022 739171 724247 785226 774397 841236
5440 841236 1029685 1026312 976692 910612 821965 748817 679410 818148 767741 743426 627040
5429 627040 475283 646018 800101 718133 669154 657171 708887 716227 620726 537860 795085
$$ packed form
5506A666980j04961l4702n930J1583q3221Q0973n3607l3061r7531N0857o6080
5495A331300j88731J3823J39080K04166n6469j09900p1577j2578M7647p6514L2958
5484A253205J0362r727K40030j67825R0058Q1674r0375j10886N7320k0934L9943
5473A372845l6515j54455j79362j20335M1315J22116J33573j5164j50786K9662
5463A042894m053j22701j81778N9054K3886j34155j71115R3984O9958L883j22063
5452E57794k9414O5596O5651n7223l9490J03616P4492j851j4924O0979j0829O6839
5440H41236J88449l373m9620o6080q8647p3148o9407J38738n0407k4315j16386
5429F27040j51757J70735J54083q1968m8979j1983N1716P340r5501q2866K57225
$$ plain form
5418 795085 828939 642121 540886 403503 566664 574670 715872 802812 758903 697447 742837
5407 742837 873708 946701 927210 1045379 728776 744971 733736 926108 980743 840789 975969
5396 975969 927595 902188 787081 774599 849808 973752 975608 868301 858613 782009 784981 895995
5384 895995 822184 745843 693201 792073 853836 804012 860313 1017419 978123 993012 896407
5373 896407 968358 950027 1014824 988995 993620 1162233 1213394 1176613 1323184 1197550 991681
5362 991681 944230 873195 921776 1136985 1141150 1164891 1085065 1291035 1253323 1052644 1080100
5351 1080100 1076652 989908 940967 945586 1036745 1037145 959062 1004943 1076602 1192302 1145610 1108383
5339 1108383 1105154 1190121 1116248 1074101 1167308 1067011 1311305 1421892 1488286 1445423 1310299
$$ packed form
5418G95085L3854j86818j01235j37383J63161Q006J41202Q6940m3909o1456M5390
5407G42837J30871P2993j9491J18169l16603J6195j1235J92372N4635j39954J35180
5396I75969m8374k5407j15107j2482P5209J23944J856j07307r688p6604K972J11014
5384H95995p3811p6341n2642R8872O1763m9824N6301J57106l9296J4889r6605
5373H96407P1951j8331O4797k5829M625J68613N1161l6781J46571j25634k05869
5362I91681m7451p1035M8581K15209M165K3741p9826K05970l7712k00679K7456
5351A080100l448q6744m8941M619R1159M00p8083M5881P1659J15700m6692l7227
5339A108383l229Q4967p3873m2147R3207j00297K44294J10587O6394m2863j35124
$$ plain form
5328 1310299 1317677 1481599 1273182 1226681 1244194 1264839 1435852 1432421 1246545 1089786 1145709
5317 1145709 1255097 1240198 1223110 1288306 1106485 1172677 1277116 1408551 1301122 1430776
5307 1430776 1413165 1358061 1537601 1485450 1367611 1437724 1443382 1354158 1333245 1461127 1578463
5296 1578463 1618357 1534499 1499637 1555965 1531859 1459745 1589257 1430546 1553016 1647483 1719754
5285 1719754 1786592 1755322 1852464 1848796 1835551 1944735 1984211 1944308 1932973 2174338 2102481
5274 2102481 2082178 2180954 2285073 2262311 2343466 2386607 2376306 2578087 2443509 2506802 2490246
5263 2490246 2561042 2675180 2694111 2775376 2665489 2684613 2736923 2907683 3023983 3125106
5253 3125106 3076512 3041977 3207626 3289460 3309133 3338499 3488035 3780046 3948432 3834123
$$ packed form
5328A310299P378J63922k08417m6501J7513K0645J71013l431j85876j56759N5923
5317A145709J09388j4899j7088O5196j81821O6192J04439J31435j07429J29654
5307A430776j7611n5104J79540n2151j17839P0113N658q9224k0913J27882J17336
5296A578463L9894q3858l4862N6328k4106p2114J29512j58711J22470R4467P2271
5285A719754O6838l1270R7142l668j3245J09184L9476l9903j1335K41365p1857
5274B102481k0303R8776J04119k2762Q1155M3141j0301K01781j34578O3293j6556
5263B490246P0796J14138J8931Q1265j09887J9124N2310J70760J16300J01123
5253C125106m8594l4535J65649Q1834J9673K9366J49536K92011J68386j14309
$$ plain form
5243 3834123 3756301 3937190 4223065 4146666 4148625 4306123 4450420 4530587 4653505 4750192 4859318
5232 4859318 4970226 5152622 5260489 5457080 5431755 5405006 5831531 6054685 5980252 6254821
5222 6254821 6589714 6783962 6780747 7118545 7275230 7414300 7659562 7627214 7806426 8175306
5212 8175306 8476442 8733864 9188710 9394257 9744074 9904392 10198938 10791698 11215053 11445904
5202 11445904 11629449 12160033 12782330 13480160 13825801 14332619 15066470 15855640 16514857
5193 16514857 17137739 17975786 19178160 20391345 21511833 22948238 24637344 26316712
5185 26316712 27986759 30118589 32561769 35158680 37782703 40922078 44400306 47700149
5177 47700149 51071653 54033837 56014500 56735490 55810738 53514787 50402558 47215282
$$ packed form
5243C834123p7822J80889K85875p6399J959J57498J44297Q0167J22918R6687J09126
5232D859318J10908J82396J07867J96591k5325k6749M26525K23154p4433K74569
5222F254821L34893J94248l215L37798J56685J39070K45262l2348J79212L68880
5212H175306L01136K57422M54846K05547L49817J60318K94546N92760M23355K30851
5202A1445904J83545N30584O22297O97830L45641N06818P33851P89170O59217
5193A6514857O22882Q38047J202374J213185J120488J436405J689106J679368
5185B6316712J670047K131830K443180K596911K624023L139375L478228L299843
5177D7700149L371504K962184J980663P20990r24752k295951l112229l187276
$$ plain form
5169 47215282 44305130 41793755 40112372 38733517 37518392 36911042 36703749 36733930 36851765
5160 36851765 37410092 38336124 39553441 41060157 42748146 44934877 47658533 50619268
5152 50619268 53894751 57884968 62273415 67207195 72526456 78732119 85477140 91977019
5144 91977019 98305527 103484110 106626493 106308299 101803752 93601616 83924849 74751515
5136 74751515 66978955 60822149 55726929 51341065 47928714 45150419 42885170 40949869
5128 40949869 39219531 37897610 37209966 36673081 36352855 36711079 37215992 37811918 38623993
5119 38623993 39560987 40866695 42602763 44518590 46795779 49244567 51694005 54176394
5111 54176394 56383893 57756167 57755363 56008153 52538348 48095856 43519551 39130487 35385070
$$ packed form
5169D7215282k910152k511375j681383j378855j215125o07350k07293L0181J17835
5160C6851765N58327R26032J217317J506716J687989K186731K723656K960735
5152E0619268L275483L990217M388447M933780N319261O205663O745021O499879
5144I1977019O328508N178583L142383l18194m504547q202136r676767r173334
5136G4751515p772560o156806n095220m385864l412351k778295k265249j935301
5128D0949869j730338j321921o87644n36885l20226L58224N04913N95926Q12075
5119C8623993R36994J305708J736068J915827K277189K448788K449438K482389
5111E4176394K207499J372274q04j747210l469805m442492m576305m389064l745417
$$ plain form
5102 35385070 32153981 29297357 26989972 24952893 23166785 21546795 20261534 19020958
5094 19020958 17812817 16889454 16047355 15137274 14471487 13855679 13153792 12618104 11966731
5085 11966731 11629167 11290582 10812477 10426410 10219122 10004286 9506293 9037645 8932106
5076 8932106 8646736 8421246 8090179 7718152 7623987 7554257 7269735 7118256 7044513 6658241
5066 6658241 6583487 6618358 6469758 6294405 6045811 5864161 5732006 5664742 5634296 5348008
5056 5348008 5078477 5022126 4824739 4572055 4456838 4426332 4375969 4342184 4102999 4079322
5046 4079322 4102255 4015686 3943747 3776429 3869250 3679639 3627615 3676744 3343024 3224648 3237337
5035 3237337 3128153 3202375 3307935 3371102 3136704 3072708 3116504 3149739 3222360 3353622 3357159
$$ packed form
5102C5385070l231089k856624k307385k037079j786108j619990j285261j240576
5094A9020958j208141r23363q42099r10081o65787o15808p01887n35688o51373
5085A1966731l37564l38585m78105l86067k07288k14836m97993m68648j05539
5076H932106k85370k25490l31067l72027r4165o9730k84522j51479p3743l86272
5066F658241p4754L4871j48600j75353k48594j81650j32155o7264l0446k86288
5056E348008k69531n6351j97387k52684j15217l0506n0363l3785k39185k3677
5046D079322K2933q6569p1939j67318R2821j89611n2024M9129l33720j18376J2689
5035C237337j09184P4222J05560O3167k34398o3996M3796L3235P2621J31262L537
$$ plain form
5024 3357159 3028955 3025498 3118158 3142083 3189836 3190592 3181247 2981624 3014457 3077684 3192620 3052717
5012 3052717 2831707 2783354 2631198 2614623 2456409 2176719 2122863 2069589 1786525 1781498 1916997
5001 1916997 1979681 1750771 1787506 1669448 1717703 1730212 1688229 1618342 1544957 1661420 1659140
4990 1659140 1667722 1581740 1577632 1305895 1343483 1493734 1605731 1532834 1322435 1328982 1306012
4979 1306012 1177940 1066900 1222448 1317743 1266724 1153890 1131789 1273006 1201286 1205941 1242767
4968 1242767 1139842 1074342 1195647 1176343 1122608 1178865 1053711 1180846 1266517 1366401 1396285
4957 1396285 1256454 1313012 1503663 1568591 1232117 1012833 1106994 1039075 1134744 1133834 893539
4946 893539 902102 970209 1092973 852406 971994 1101671 1030412 1087302 1045313 1164833 1006691
$$ packed form
5024C357159l28204l457R2660K3925M7753P56r345j99623L2833O3227J14936j39903
5012C052717k21010m8353j52156j6575j58214k79690n3856n3274k83064n027J35499
5001A916997O2684k28910L6735j18058M8255J2509m1983o9887p3385J16463k280
4990A659140Q582q5982m108k71737L7588J50251J11997p2897k10399O547k2970
4979A306012j28072j11040J55548R5295n1019j12834k2101J41217p1720M655L6826
4968A242767j02925o5500J21305j9304n3735N6257j25154J27135Q5671R9884K9884
4957A396285j39831N6558J90651O4928l36474k19284R4161o7919R5669r10k40295
4946H93539Q563O8107J22764k40567J19588J29677p1259N6890m1989J19520j58142
$$ plain form
4935 1006691 786423 860657 924797 999534 1085668 991526 923208 969164 1005598 1061283 1026198
4924 1026198 992149 1047103 1093284 925423 928121 973551 1027778 1031880 1040667 1025155 884230 916300
4912 916300 927602 819834 909208 980380 924027 940196 1097666 994151 911655 928582 919919
4901 919919 945769 844394 971251 857579 708725 763452 761419 777641 987168 962084 1080014
4890 1080014 989385 961775 983001 981661 992775 1098677 1152513 1149266 1219109 1409048 1426468
4879 1426468 1361183 1236560 1004548 1131237 1072150 1000131 962448 980377 1093691 1182935 1152136
4868 1152136 1208655 1343318 1132865 1151354 1181459 1087152 1253898 1221998 1210179 1158407 1194547
4857 1194547 1207304 1355063 1678279 1814823 1869399 1734239 1587811 1772490 1785319 1512891
$$ packed form
4935A006691k20268P4234O4140P4737Q6134r4142o8318M5956L6434N5685l5085
4924A026198l4049N4954M6181j67861K698M5430N4227M102Q787j5512j40925L2070
4912I16300J1302j07768Q9374P1172n6353J6169J57470j03515q2496J6927q663
4901I19919K5850j01375J26857j13672j48854N4727k033J6222K09527k5084J17930
4890A080014r0629k7610K1226j340J1114J05902N3836l247O9843J89939J7420
4879A426468o5285j24623k32012J26689n9087p2019l7683J7929J13314Q9244l0799
4868A152136N6519J34663k10453J8489L0105r4307J66746l1900j1819n1772L6140
4857A194547J2757J47759L23216J36544N4576j35160j46428J84679J2829k72428
$$ plain form
4847 1512891 1562287 1703885 1690325 1506213 1334333 1300093 1408180 1308374 1359949 1383249 1528238
4836 1528238 1562669 1502448 1536462 1360544 1119092 1074936 1249376 1305031 1554511 1539188 1538109
4825 1538109 1659356 1584899 1561578 1603923 1665393 1859703 1831449 1812682 1945297 2035432 1935847
4814 1935847 1974924 2165024 2171167 2349228 2506564 2262161 2197649 2253228 2138843 2096802 2177100
4803 2177100 2239600 2159648 2202821 1985197 1966565 1872206 1679515 1666837 1536942 1474719 1555611
4792 1555611 1477928 1324587 1505338 1586762 1507323 1650660 1634599 1582334 1719336 1765893 1778182
4781 1778182 1597567 1439869 1556400 1610596 1547990 1365803 1330821 1440235 1291531 1380975
4771 1380975 1301764 1307292 1357105 1423004 1313139 1337976 1453278 1190264 1170034 1292309 1188697
$$ packed form
4847A512891M9396J41598j3560j84112j71880l4240J08087r9806N1575K3300J44989
4836A528238L4431o0221L4014j75918k41452m4156J74440N5655K49480j5323j079
4825A538109J21247p4457k3321M2345O1470J94310k8254j8767J32615R0135r9585
4814A935847L9077J90100O143J78061J57336k44403o4512N5579j14385m2041Q0298
4803B177100O2500p9952M3173k17624j8632r4359j92691j2678j29895o2223Q0892
4792A555611p7683j53341J80751Q1424p9439J43337j6061n2265J37002M6557J2289
4781A778182j80615j57698J16531N4196o2606j82187l4982J09414j48704Q9444
4771A380975p9211N528M9813O5899j09865K4837J15302k63014k0230J22275j03612
$$ plain form
4760 1188697 1056499 1147003 1196327 1197430 1320764 1294749 1269051 1384997 1211282 1235958 1350563
4749 1350563 1370196 1356653 1444203 1498563 1470415 1504267 1327144 1508638 1314187 1382213 1497491
4738 1497491 1523932 1444010 1273790 1408055 1143825 866206 917648 1042485 1166540 1018987
4728 1018987 885598 880373 856052 1070846 1125216 1120838 1032167 1038164 1101568 991954 1116958
4717 1116958 1168155 1021668 1024063 1014926 845335 932822 1002659 871111 883765 1123663 1099141
4706 1099141 1076779 991412 827026 960983 986063 1032015 1169765 1099194 1204810 1284708 1251441
4695 1251441 1439391 1488699 1593403 1410486 1444039 1659275 1844685 1660240 1583400 1573246
4685 1573246 1580566 1611490 1735086 1660319 1768493 1737312 1773132 1842602 1690351 1754903 1833783
$$ packed form
4760A188697j32198R0504M9324J103J23334k6015k5698J15946j73715K4676J14605
4749A350563J9633j3543Q7550N4360k8148L3852j77123J81494j94451O8026J15278
4738A497491K6441p9922j70220J34265k64230k77619N1442J24837J24055j47553
4728A018987j33389n225k4321K14794N4370m378q8671N997O3404j09614J25004
4717A116958N1197j46487K395r137j69591Q7487O9837j31548J2654K39898k4522
4706A099141k2362q5367j64386J33957K5080M5952J37750p0571J05616P9898l3267
4695A251441J87950M9308J04704j82917L3553K15236J85410j84445p6840j0154
4685A573246P320L0924J23596p4767J08174l1181L5820O9470j52251O4552P8880
$$ plain form
4674 1833783 1703116 1658178 1783558 1727940 1614883 1625962 1582776 1554655 1491202 1529201 1655283
4663 1655283 1754925 1827701 1571863 1503806 1476444 1458298 1523659 1532947 1549117 1577131 1700700
4652 1700700 1783265 1724954 1691715 1785662 1855542 1910303 1922906 1968713 2026286 2083685 2049025
4641 2049025 2139481 2227903 2236821 2226835 2228946 2341155 2252852 2273917 2485111 2462792 2425768 2500885
4629 2500885 2798484 2941915 2746294 2695988 2773349 2882255 2999166 3033816 2983451 3138771
4619 3138771 3076366 3098070 3314689 3318007 3218937 3302087 3290094 3120541 3031734 3191435 3227527
4608 3227527 3283762 3250730 3305876 3394882 3349612 3428905 3263188 3202563 3380430 3351006 3437606
4597 3437606 3480346 3671573 3838517 3846740 3873143 3840003 3985785 4131810 4019351 4042616 4130738
$$ packed form
4674A833783j30667m4938J25380n5618j13057J1079m3186k8121o3453L7999J26082
4663A655283R9642P2776k55838o8057k7362j8146O5361R288J6170K8014J23569
4652A700700Q2565n8311l3239R3947O9880N4761J2603M5807N7573N7399l4660
4641B049025R0456Q8422Q918r986K111J12209q8303K1065K11194k2319l7024P5117
4629B500885K97599J43431j95621n0306P7361J08906J16911L4650n0365J55320
4619C138771o2405K1704K16619L318r9070Q3150j1993j69553q8807J59701L6092
4608C227527N6235l3032N5146Q9006m5270P9293j65717o0625J77867k9424Q6600
4597C437606M2740J91227J66944Q223K6403l3140J45782J46025j12459K3265Q8122
$$ plain form
4586 4130738 4151939 4339042 4432878 4591256 4778750 4932451 5015140 5185333 5400075 5367978
4576 5367978 5523067 5656508 5900675 6060105 6265133 6304784 6505747 6625852 6766666 6952681
4566 6952681 7056605 7053030 7421503 7572474 7535812 7850803 8091271 8266411 8310503 8683682
4556 8683682 8925115 9068576 9181219 9341913 9591770 9914342 10048430 10400429 10711519 10915943
4546 10915943 11287980 11848558 12200687 12594283 13091306 13398917 13862126 14188006 14496105
4537 14496105 14789961 15136190 15516928 15980299 16561167 17032932 17505516 18105927 18580209
4528 18580209 19367249 20228978 21143140 22160018 23009757 23977250 25125135 26358006 27698623
4519 27698623 29124947 30536333 32247784 34185205 36321004 38532593 41104544 44084447
$$ packed form
4586D130738K1201J87103R3836J58378J87494J53701Q2689J70193K14742l2097
4576E367978J55089J33441K44167J59430K05028L9651K00963J20105J40814J86015
4566F952681J03924l575L68473J50971l6662L14991K40468J75140M4092L73179
4556H683682K41433J43461J12643J60694K49857L22572J34088L51999L11090K04424
4546A0915943L72037N60578L52129L93596M97023L07611M63209L25880L08099
4537A4496105K93856L46229L80738M63371N80868M71765M72584O00411M74282
4528A8580209P87040Q61729R14162J016878Q49739R67493J147885J232871J340617
4519B7698623J426324J411386J711451J937421K135799K211589K571951K979903
$$ plain form
4511 44084447 47466184 51149139 55247981 59828531 64873487 70394936 76710897 83013631
4503 83013631 89788303 96966827 104529449 112507712 120452642 127934661 134838916 141279727
4495 141279727 146860501 151630562 155322030 157064251 156311155 152813042 146854015 139381498
4487 139381498 131306866 123424416 115621412 107855595 100281304 92605587 84971923 77704133
4479 77704133 70801383 64669417 59412031 54727809 50673780 47319223 44521498 41754293
4471 41754293 39230886 36914130 34285862 32016646 30092515 28444006 26859753 25651471
4463 25651471 24423429 23139792 22060547 21151053 20383728 19622850 18842391 18127518 17552709
4454 17552709 16886770 16432213 15880879 15297202 14746936 14153868 13867057 13664756 13391153
$$ packed form
4511D4084447L381737L682955M098842M580550N044956N521449O315961O302734
4503H3013631O774672P178524P562622P978263P944930P482019O904255O440811
4495A41279727N580774M770061L691468J742221p53096l498113n959027p472517
4487A39381498q074632p882450p803004p765817p574291p675717p633664p267790
4479G7704133o902750o131966n257386m684222m054029l354557k797725k767205
4471D1754293k523407k316756k628268k269216j924131j648509j584253j208282
4463B5651471j228042j283637j079245r09494p67325p60878p80459p14873n74809
4454A7552709o65939m54557n51334n83677n50266n93068k86811k02301k73603
$$ plain form
4445 13391153 13082844 12878367 12521507 12256295 12020194 11509642 11263713 11039489 10670210
4436 10670210 10294642 9958742 9540495 9168902 8865639 8567798 8256596 8265637 7873243 7560013
4426 7560013 7369819 7189006 6962168 6713205 6628652 6598396 6576633 6306041 6037083 6024349
4416 6024349 5907467 5858425 5734562 5573358 5375231 5180712 5165205 5048972 5138248 4784295
4406 4784295 4569611 4632144 4644667 4595098 4420488 4231234 4183156 4200614 4258792 4211274 4284736
4395 4284736 4043699 4003769 3910481 3833358 3877994 3909103 4049978 3873457 3769438 3752430 3596933
4384 3596933 3602406 3537210 3500975 3433514 3253390 3175927 3251400 3178355 3100928 3216335 3109532
4373 3109532 3152075 3268822 3301148 3328037 3439609 3410416 3284914 3353346 3275048 3241839 3245641
$$ packed form
4445A3391153l08309k04477l56860k65212k36101n10552k45929k24224l69279
4436A0670210l75568l35900m18247l71593l03263k97841l11202R041l92394l13230
4426G560013j90194j80813k26838k48963q4553l0256k1763k70592k68958j2734
4416F024349j16882m9042j23863j61204j98127j94519j5507j16233Q9276l53953
4406D784295k14684O2533J2523m9569j74610j89254m8078J7458N8178m7518P3462
4395D284736k41037l9930r3288p7123M4636L1109J40875j76521j04019j7008j55497
4384C596933N473o5196l6235o7461j80124p7463P5473p3045p7427J15407j06803
4373C109532M2543J16747L2326K6889J11572k9193j25502O8432p8298l3209L802
$$ plain form
4362 3245641 3273800 3298743 3260844 3380367 3191568 2981395 2981204 3041315 2889768 2677377 2583066
4351 2583066 2576998 2515824 2359713 2322080 2263054 2173411 2045778 2122427 2137365 2174291 2109939
4340 2109939 2065348 2171395 2021479 2022338 2118739 2084183 2172547 2244185 2276396 2282573 2292740 2250942
4328 2250942 2231734 2181626 2220670 2270054 2321419 2427017 2331274 2211008 2256564 2125157 2066006
4317 2066006 2129169 2101184 2115498 2246508 2312855 2408729 2471461 2243642 2251575 2324675 2442244
4306 2442244 2419226 2471682 2597881 2601520 2813974 2988890 3021006 3050566 3119295 3034182 3062671
4295 3062671 2992344 3021560 3241426 3338414 3261033 3107419 3078419 3017153 3096640 2876745 2903135
4284 2903135 3052751 3167928 2944306 3016460 3060173 3168395 3217272 3199593 3238791 3406396
$$ packed form
4362C245641K8159K4943l7899J19523j88799k10173j91O0111j51547k12391r4311
4351B583066o068o1174j56111l7633n9026q9643j27633P6649J4938L6926o4352
4340B109939m4591J06047j49916Q59R6401l4556Q8364P1638L2211O177J0167m1798
4328B250942j9208n0108L9044M9384N1365J05598r5743j20266M5556j31407n9151
4317B066006O3163k7985J4314J31010O6347R5874O2732k27819P933P3100J17569
4306B442244k3018N2456J26199L639K12454J74916L2116K9560O8729q5113K8489
4295C062671p0327K9216K19866R6988p7381j53614k9000o1266P9487k19895K6390
4284B903135J49616J15177k23622P2154M3713J08222M8877j7679L9198J67605
$$ plain form
4274 3406396 3539295 3621278 3697166 3519869 3636183 3875586 4109460 4252598 4440250 4328650
4264 4328650 4482658 4704843 4820891 5012137 5173439 5358909 5713776 5927183 6206012 6376867
4254 6376867 6647060 7151223 7571578 8148321 9008368 9681551 10310160 11326312 12451728
4245 12451728 13661890 14877942 16442247 18465488 21057903 24064440 27384806 30744763
4237 30744763 34132158 37965153 41583226 42192300 37417209 30152035 24289568 19950912
4229 19950912 17040023 14609742 12725690 11301196 10071679 9385354 8569345 7744549 7211732
4220 7211732 6810608 6477629 6308864 6056670 5600032 5311694 5074465 4860185 4698348 4524839
4210 4524839 4384539 4466746 4278914 4003266 4000512 3880399 3707063 3622064 3497148 3270393
$$ packed form
4274C406396J32899Q1983P5888j77297J16314K39403K33874J43138J87652j11600
4264D328650J54008K22185J16048J91246J61302J85470L54867K13407K78829J70855
4254F376867K70193N04163M20355N76743Q60047O73183O28609J016152J125416
4245A2451728J210162J216052J564305K023241K592415L006537L320366L359957
4237C0744763L387395L832995L618073O09074m775091p265174n862467m338656
4229A9950912k910889k430281j884052j424494j229517o86325q16009q24796n32817
4220G211732m01124l32979j68765k52194m56638k88338k37229k14280j61837j73509
4210D524839j40300Q2207j87832k75648k754j20113j73336q4999j24916k26755
$$ plain form
4200 3270393 3314965 3228839 3126214 3077528 2947631 2952094 2962465 3024027 3059011 3117793 2987365
4189 2987365 2789243 2872032 2804158 2890669 2886622 2794643 2930312 2921400 2655018 2634387 2521974
4178 2521974 2536867 2556355 2408259 2387693 2300653 2462728 2608274 2422490 2566045 2557263 2331618
4167 2331618 2406776 2369478 2307863 2348257 2435920 2440683 2281011 2272958 2196488 2131404 2221107 2118151
4155 2118151 1867838 1785387 1879030 1878560 1814907 1738212 1736984 1748426 1687265 1682499 1719508 1640260
4143 1640260 1652308 1569219 1433847 1523743 1546199 1457034 1377388 1557968 1466216 1491683 1505387
4132 1505387 1413794 1453381 1405933 1469135 1676778 1672375 1636128 1679183 1743953 1829154 1878612
4121 1878612 1921841 2018810 2060826 2005455 1843092 1833311 1781403 1463784 1422809 1353078 1460121
$$ packed form
4200C270393M4572q6126j02625m8686j29897M463J0371O1562L4984N8782j30428
4189B987365j98122Q2789o7874Q6511m047r1979J35669q912k66382k0631j12413
4178B521974J4893J9488j48096k0566q7040J62075J45546j85784J43555q782k25645
4167B331618P5158l7298o1615M0394Q7663M763j59672q053p6470o5084Q9703j02956
4155B118151k50313q2451R3643m70o3653p6695j228J1442o1161m766L7009p9248
4143A640260J2048q3089j35372Q9896K2456q9165p9646J80580r1752K5467J3704
4132A505387r1593L9587m7448O3202K07643m403l6247M3055O4770Q5201M9458
4121A878612M3229R6969M2016n5371j62363r781n1908l17619m0975o9731J07043
$$ plain form
4110 1460121 1507532 1511106 1405518 1355407 1428230 1342547 1391622 1327477 1442335 1414457 1491479
4099 1491479 1521214 1435713 1490740 1592773 1681894 1708749 1639329 1641165 1752706 1637820 1626878
4088 1626878 1590958 1580645 1487153 1554788 1578212 1610654 1633876 1505927 1473447 1486894 1499759
4077 1499759 1586868 1532255 1457017 1502785 1662871 1606005 1632887 1656905 1682321 1761360 1633737
4066 1633737 1653066 1722195 1770826 1795974 1921982 1942177 2078292 2125847 2177054 2147102 2097218
4055 2097218 2139820 2253957 2283267 2178245 2112455 2161737 1965745 1850749 1881998 1811359 1829477
4044 1829477 1798636 1810061 1810574 1989424 1880491 1874834 1842812 1814307 1975392 2021551 1800378
4033 1800378 1853303 1945113 2011972 1913695 1990643 2218447 2262390 2221547 2161836 2005811 2140316
$$ packed form
4110A460121M7411L574j05588n0111P2823q5683M9075o4145J14858k7878P7022
4099A491479K9735q5501N5027J02033Q9121K6855o9420J836J11541j14886j0942
4088A626878l5920j0313r3492O7635K3424L2442K3222j27949l2480J3447J2865
4077A499759Q7109n4613p5238M5768J60086n6866K6882K4018K5416P9039j27623
4066A633737J9329O9129M8631K5148J26008K0195J36115M7555N1207k9952m9884
4055B097218M2602J14137K9310j05022o5790M9282j95992j14996L1249p0639J8118
4044A829477l0841J1425N13J78850j08933n657l2022k8505J61085M6159k21173
4033A800378N2925R1810O6859r8277P6948K27804M3943m0843n9711j56025J34505
$$ plain form
4022 2140316 2000085 1957449 1994334 1940440 1977217 2063811 2154526 2273107 2352113 2274826 2267173
4011 2267173 2318306 2280523 2275252 2216581 2053184 1995505 2131337 2142210 2025389 2214611 2041510
4000 2041510 2048024 2112176 1981860 1987042 1976104 1864991 1906900 2065036 2250250 2151679 2190314
3989 2190314 2209377 2154591 2088872 2105909 2257172 2223877 2128449 2138824 2175288 2022597 1920055
3978 1920055 1929009 2108956 2310386 2195825 2047210 1977538 1972515 1803789 1806487 1756771 1814231
3967 1814231 1872188 1844986 1905957 1952185 1848580 1921426 1930466 1963579 2177776 2203307 1947570
3956 1947570 2075411 2214019 2057351 2187959 2423846 2323284 2349121 2412782 2509967 2540063
3946 2540063 2358377 2405008 2388099 2368479 2412960 2408502 2535135 2638724 2629840 2611320 2726104
$$ packed form
4022B140316j40231m2636L6885n3894L6777Q6594R0715J18581P9006p7287p653
4011B267173N1133l7783n271n8671j63397n7679J35832J0873j16821J89222j73101
4000B041510O514O4152j30316N182j0938j11113M1909J58136J85214r8571L8635
3989B190314J9063n4786o5719J7037J51263l3295r5428J0375L6464j52691j02542
3978A920055Q954J79947K01430j14561j48615o9672n023j68726K698m9716N7460
3967A814231N7957k7202O0971M6228j03605P2846R040L3113K14197K5531k55737
3956A947570J27841J38608j56668J30608K35887j00562K5837O3661R7185L0096
3946B540063j81686M6631j6909j9620M4481m458J26633J03589q884j8520J14784
$$ plain form
3935 2726104 2751412 2607891 2630932 2632120 2762643 2765934 2651089 2684880 2656263 2723934 2921646
3924 2921646 2991691 2946182 2957028 2956697 3002204 3132407 3174141 3023307 3049555 3058905 3165497
3913 3165497 3206598 3164388 3172693 3146396 3230695 3184112 3385258 3247045 3177388 3222945 3156364
3902 3156364 2948463 3085056 3124844 3216272 3467411 3560292 3513861 3488305 3510473 3734356 3965256
3891 3965256 3788359 3809874 3775855 3744904 3668476 3876710 4270167 4218126 4198819 4278910 4418006
3880 4418006 4207032 4263076 4563820 4669742 4693481 4749506 4751626 4850093 4884028 4982045 5057325
3869 5057325 5132626 5234731 5362639 5434457 5548645 5606136 5758162 5941858 5933624 6008099 6210827
3858 6210827 6397664 6501876 6549184 6481260 6640393 6699670 7076813 7099967 7142466 7202204 7350723
$$ packed form
3935B726104K5308j43521K3041J188J30523L291j14845L3791k8617O7671J97712
3924B921646P0045m5509J0846l31M5507J30203M1734j50834K6248R350J06592
3913C165497M1101m2210Q305k6297Q4299m6583K01146j38213o9657M5557o6581
3902C156364k07901J36593L9788R1428K51139R2881m6431k5556K2168K23883K30900
3891C965256j76897K1515l4019l0951p6428K08234L93457n2041j9307Q0091J39096
3880D418006k10974N6044L00744J05922K3739N6025K120R8467L3935R8017P5280
3869E057325P5301J02105J27908P1818J14188N7491J52026J83696q234P4475K02728
3858F210827J86837J04212M7308o7924J59133N9277L77143K3154M2499N9738J48519
$$ plain form
3847 7350723 7576860 7691794 7558036 7664034 7808517 8070112 8267675 8471136 8503677 8601749
3837 8601749 8893414 9062097 9234630 9244981 9366981 9759946 10073836 10248466 10644683 10978835
3827 10978835 11355212 11640662 11665362 11856852 12376566 12808658 13093505 13337760 13606528 14214312
3817 14214312 14781288 15056700 15645839 16153062 16735551 17275439 17830757 18683495 19452152
3808 19452152 20199320 21205969 22170318 23091847 24451622 25937176 27441916 29496354 31452182
3799 31452182 33611834 36284638 39250200 42743732 46698116 51386073 56436641 61788249
3791 61788249 66997682 70240414 70072945 67121139 61834770 55682776 50843346 47465742
3783 47465742 45358999 44016146 43284361 42841043 42608762 42641528 43005472 43309684 43717320
$$ packed form
3847G350723K26137J14934j33758J05998J44483K61595J97563K03461L2541R8072
3837H601749K91665J68683J72533J0351J22000L92965L13890J74630L96217L34152
3827A0978835L76377K85450K4700J91490N19714M32092K84847K44255K68768O07784
3817A4214312N66976K75412N89139N07223N82489N39888N55318Q52738P68657
3808A9452152P47168J006649R64349R21529J359775J485554J504740K054438J955828
3799C1452182K159652K672804K965562L493532L954384M687957N050568N351608
3791F1788249N209433L242732j67469k951806n286369o151994m839430l377604
3783D7465742k106743j342853p31785m43318k32281L2766L63944L04212M07636
$$ plain form
3774 43717320 44398769 45117516 45973358 46859898 47735587 48494283 49353009 50231691 51031527
3765 51031527 51824137 52476330 53402140 54556374 55737487 57149562 58620283 60297382 62425100
3756 62425100 64617664 66786972 69531623 72725311 75457093 78536606 81268612 84009131
3748 84009131 86999486 89759179 92724138 95784187 98647030 101187327 103215888 104875479
3740 104875479 106192171 107494175 109201365 111177279 113687963 116691507 120024950 123545922
3732 123545922 127016774 130879393 135071200 139844157 145103388 150495876 155994156 161728066
3724 161728066 167533649 172514891 175386767 174759821 172588821 169391679 163916386 157878280
3716 157878280 153646719 151050494 149999817 149727579 149886163 150170785 149962981 148955816 146747610
$$ packed form
3774D3717320O81449P18747Q55842Q86540Q75689P58696Q58726Q78682P99836
3765E1031527P92610O52193R25810J154234J181113J412075J470721J677099K127718
3756F2425100K192564K169308K744651L193688K731782L079513K732006K740519
3748H4009131K990355K759693K964959L060049K862843K540297K028561J659591
3740A04875479J316692J302004J707190J975914K510684L003544L333443L520972
3732A23545922L470852L862619M191807M772957N259231N392488N498280N733910
3724A61728066N805583M981242K871876o26946k171000l197142n475293o038106
3716A57878280m231561k596225j050677k72238J58584K84622k07804j007165k208206
$$ plain form
3707 146747610 143607715 139321685 133977233 127901081 121639938 115610272 110204279 106103973
3699 106103973 102993283 100860603 99825317 99689069 100436750 101755286 103551873 105637413
3691 105637413 107360246 107934539 106467364 102566714 96439119 89551684 82685972 76730146
3683 76730146 71539903 67035721 63290915 60351699 57676006 55467464 53822886 52366079
3675 52366079 51089529 50289198 49767348 49255011 48904480 48612889 48491285 48286727 48039789
3666 48039789 47714173 47010166 46134919 45140656 43839337 42558766 41461352 40537906 39682477
3657 39682477 39066375 38713572 38379626 38225049 38061129 37705096 37165132 36644585 35907913
3648 35907913 34931235 33562046 32037242 30576467 29013395 27586640 26232752 24730978
$$ packed form
3707A46747610l139895m286030n344452o076152o261143o029666n405993m100306
3699A06103973l110690k132680j035286j36248P47681J318536J796587K085540
3691A05637413J722833N74293j467175l900650o127595o887435o865712n955826
3683G6730146n190243m504182l744806k939216k675693k208542j644578j456807
3675E2366079j276550q00331n21850n12337l50531k91591j21604k04558k46938
3666D8039789l25616p04007q75247r94263j301319j280571j097414r23446q55429
3657C9682477o16102l52803l33946j54577j63920l56033n39964n20547p36672
3648C5907913r76678j369189j524804j460775j563072j426755j353888j501774
$$ plain form
3640 24730978 23506232 22616313 21677317 20822010 20010841 19302113 18661627 18157888 17557637
3631 17557637 17185203 16684808 16292776 15900839 15610782 15171979 14757645 14450724 14091254
3622 14091254 13894039 13628220 13515415 13401235 13182264 13014068 12840976 12668949 12641155 12536623
3612 12536623 12523652 12519118 12280324 11994296 11921707 11891227 11567450 11540978 11501192 11345377 11127521
3601 11127521 10929208 10814276 10735978 10737805 10626328 10395475 10223868 10108343 9990032 9842896
3591 9842896 9741504 9806941 9748953 9474448 9248905 9368424 9236191 9097449 9071035 9050613
3581 9050613 9219242 9170144 9171625 9078551 9055246 9036969 9115412 9059557 9036187 9024217 9070989
3570 9070989 9241830 9386805 9290197 9117323 9214870 9269649 9125999 9197671 9179628 9202693 9293214
$$ packed form
3640B4730978j224746q89919r38996q55307q11169p08728o40486n03739o00251
3631A7557637l72434n00395l92032l91937k90057m38803m14334l06921l59470
3622A4091254j97215k65819j12805j14180k18971j68196j73092j72027k7794j04532
3612A2536623j2971m534k38794k86028p2589l0480l23777k6472l9786j55815k17856
3601A1127521j98313j14932p8298J827j11477k30853j71607j15525j18311j47136
3591I842896j01392O5437n7988k74505k25543J19519j32233j38742k6414k0422
3581I050613J68629m9098J481r3074k3305j8277P8443n5855k3370j1970M6772
3570I070989J70841J44975r6608j72874R7547N4779j43650P1672j8043K3065R0521
$$ plain form
3559 9293214 9445551 9408934 9464138 9673408 9697580 9824488 9797285 9948746 10081501 10383874
3549 10383874 10330858 10344676 10508400 10514302 10623924 10618070 10675000 10747761 10992558 11132942 11285194
3538 11285194 11374567 11346861 11518130 11565165 11697641 11840435 11965612 12288365 12376409 12548539
3528 12548539 12813736 12969428 12965084 13164316 13257862 13264583 13477917 13719078 13831683 13984584
3518 13984584 14259411 14373150 14726853 14952483 15075430 15190712 15333736 15585333 15962760
3509 15962760 16131730 16216617 16536188 16948301 17242166 17518062 17750861 17932542 18374066 18632035
3499 18632035 18882215 19113688 19330437 19632145 19870348 20360829 20734720 21100997 21298376
3490 21298376 21530681 21858722 22240126 22532086 22663811 22866150 23448354 23825425 24186672
$$ packed form
3559I293214J52337l6617N5204K09270K4172J26908k7203J51461J32755L02373
3549A0383874n3016J3818J63724N902J09622n854N6930P2761K44797J40384J52252
3538A1285194Q9373k7706J71269M7035J32476J42794J25177L22753Q8044J72130
3528A2548539K65197J55692m344J99232R3546O721K13334K41161J12605J52901
3518A3984584K74827J13739L53703K25630J22947J15282J43024K51597L77427
3509A5962760J68970Q4887L19571M12113K93865K75896K32799J81681M41524K57969
3499A8632035K50180K31473K16749L01708K38203M90481L73891L66277J97379
3490B1298376K32305L28041L81404K91960J31725K02339N82204L77071L61247
$$ plain form
3481 24186672 24540393 24879977 25322102 25721913 26141790 26501779 27096903 27472302 27906478
3472 27906478 28308943 28743097 29307820 29786564 30449038 30933639 31609833 31952478 32806109
3463 32806109 33589570 34294645 35108080 35985975 36924186 38005977 39056916 40206597 41368671
3454 41368671 42475634 43788144 45144829 46824261 48527882 50359091 52288683 54396294
3446 54396294 56663070 59080960 61960909 64967264 68453501 72344213 76549816 81322680
3438 81322680 86781522 93074988 99900939 107782592 116475756 126347712 137190863 149449766
3430 149449766 163378466 179652719 198444751 219729834 242883223 266813589 290642679
3423 290642679 312963311 329532525 332947943 317881487 288069212 254038655 222652080
$$ packed form
3481B4186672L53721L39584M42125L99811M19877L59989N95124L75399M34176
3472B7906478M02465M34154N64723M78744O62474M84601O76194L42645Q53631
3463C2806109P83461P05075Q13435Q77895R38211J081791J050939J149681J162074
3454D1368671J106963J312510J356685J679432J703621J831209J929592K107611
3446E4396294K266776K417890K879949L006355L486237L890712M205603M772864
3438H1322680N458842O293466O825951P881653Q693164R871956J0843151J2258903
3430A49449766J3928700J6274253J8792032K1285083K3153389K3930366K3829090
3423B90642679K2320632J6569214L415418j5066456k9812275l4030557l1386575
$$ plain form
3416 222652080 196064943 173794606 154814550 138724386 125293628 114190897 104955037
3409 104955037 97058790 90597022 85312176 80415065 76349133 72521391 69159042 66134048
3401 66134048 63401299 61006375 58931086 57228022 55776568 54577404 53522861 52487283
3393 52487283 51807404 51183873 50662063 50312202 49841108 49678211 49709317 50011132 50394641 50838329
3383 50838329 51664145 52618193 53658202 54689508 55589853 56640367 58096251 59549761 61338154
3374 61338154 63460335 65872696 68795141 72071519 75264794 78231798 80477097 81355622
3366 81355622 80541494 78046353 74515161 70623834 67182953 64239922 62006624 60347119
3358 60347119 59315694 58713853 58548864 58693130 59323557 60098720 60935190 61628021 62265638
$$ packed form
3416B22652080k6587137k2270337j8980056j6090164j3430758j1102731r235860
3409A04955037p896247o461768n284846m897111m065932l827742l362349l024994
3401F6134048k732749k394924k075289j703064j451454j199164j054543j035578
3393E2487283o79879o23531n21810l49861m71094j62897L1106L01815L83509M43688
3383E0838329Q25816R54048J040009J031306R00345J050514J455884J453510J788393
3374F1338154K122181K412361K922445L276378L193275K967004K245299Q78525
3366H1355622q14128k495141l531192l891327l440881k943031k233298j659505
3358F0347119j031425o01841j64989J44266O30427P75163Q36470O92831O37617
$$ plain form
3349 62265638 63250376 64291622 65824645 67912953 70306688 73152304 76595741 80895891
3341 80895891 86114047 91984261 98543592 105510365 112236704 118217326 122273834 122193849
3333 122193849 117379270 108776680 98861002 89500506 81472380 74821554 69528423 65409369
3325 65409369 62168012 59485076 57446175 55646362 53704702 51916651 50238311 48828508
3317 48828508 47560892 46559217 46103478 45940972 46138597 46738468 47434238 48506297 50156422
3308 50156422 52056505 54027887 56357255 58539021 60723732 62219691 62567996 61206931
3300 61206931 57912788 53784062 49068153 44540637 40636475 37095321 34292660 31731420
3292 31731420 29622533 27773519 26145188 24532418 23279670 22228159 21211732 20184104
$$ packed form
3349F2265638R84738J041246J533023K088308K393735K845616L443437M300150
3341H0895891N218156N870214O559331O966773O726339N980622M056508p9985
3333A22193849m814579q602590r915678r360496q028126o650826n293131m119054
3325F5409369l241357k682936k038901j799813j941660j788051j678340j409803
3317D8828508j267616j001675m55739j62506J97625N99871O95770J072059J650125
3308E0156422J900083J971382K329368K181766K184711J495959L48305j361065
3300F1206931l294143m128726m715909m527516l904162l541154k802661k561240
3292C1731420k108887j849014j628331j612770j252748j051511j016427j027628
$$ plain form
3284 20184104 19372835 18692180 18014660 17471435 16857821 16491077 16064547 15700168 15131189
3275 15131189 14908604 14568816 14269475 14000368 13677090 13333012 13060498 12895511 12646926
3266 12646926 12821459 12671534 12137415 11841339 11521629 11189942 11076406 10688636 10204110
3257 10204110 10091268 9933428 9589947 9420842 9239588 8972821 8825672 8802379 8698618 8600200
3247 8600200 8606787 8511279 8463697 8510738 8359770 8234859 8115006 8174379 8135670 7933108 7965046
3236 7965046 7935074 7936941 7716417 7594469 7739308 7718397 7633731 7384202 7311340 7460030 7349231
3225 7349231 7289577 7451866 7375794 7453695 7568233 7486442 7392432 7499203 7400506 7267130 7246601
3214 7246601 7189797 7124894 7097877 7094013 7166181 7310494 7181397 6952131 6998651 6974261 6786357
$$ packed form
3284B0184104q11269o80655o77520n43225o13614l66744m26530l64379n68979
3275A5131189k22585l39788k99341k69107l23278l44078k72514j64987k48585
3266A2646926J74533j49925n34119k96076l19710l31687j13536l87770m84526
3257A0204110j12842j57840l43481j69105j81254k66767j47149k3293j03761r8418
3247H600200O587r5508m7582M7041j50968j24911j19853N9373l8709k02562L1938
3236G965046k9972J867k20524j21948J44839k0911q4666k49529p2862J48690j10799
3225G349231n9654J62289p6072P7901J14538q1791r4010J06771r8697j33376k0529
3214G246601n6804o4903k7017l864P2168J44313j29097k29266M6520k4390j87904
$$ plain form
3203 6786357 6867345 6717418 6724652 6818063 6754893 6692377 6629900 6641572 6637798 6541277 6495885 6588487
3191 6588487 6544645 6456844 6450699 6799572 6670352 6573945 6704917 6809286 6832553 6831767 6859827
3180 6859827 6798014 6511530 6511570 6683746 6722106 6799786 6803577 6921046 6888372 7042135 7123620
3169 7123620 7437870 7577931 7872632 8079501 8086788 8331392 8505681 8534956 8516266 8824518
3159 8824518 9073200 9056286 9289135 9304303 9561707 9907982 10070203 10325082 10604440 10867105
3149 10867105 11272216 11519466 11921730 12345295 12967441 13478900 14147632 14913438 15547707
3140 15547707 16422358 17287707 18259376 19422121 20669838 22070124 23573838 25312017 27016736
3131 27016736 28534157 29903116 31210964 32655271 34215335 35779547 37544734 40154081
$$ packed form
3203F786357Q0988j49927P234R3411o3170o2516o2477J1672l774r6521m5392R2602
3191F588487m3842q7801o145L48873j29220r6407J30972J04369K3267p86K8060
3180F859827o1813k86484M0J72176L8360P7680L791J17469l2674J53763Q1485
3169G123620L14250J40061K94701K06869P287K44604J74289K9275j8690L08252
3159H824518K48682j6914K32849J5168K57404L46275J62221K54879K79358K62665
3149A0867105M05111K47250M02264M23565O22146N11459O68732P65806O34269
3140A5547707Q74651Q65349R71669J162745J247717J400286J503714J738179J704719
3131B7016736J517421J368959J307848J444307J560064J564212J765187K609347
$$ plain form
3123 40154081 43252958 47377057 52380940 57876755 64014021 70653182 77600280 83950587
3115 83950587 87296720 83956608 74419052 63488562 54511470 47961892 43146968 39526778
3107 39526778 36963012 34954131 33342393 32230793 31120104 30109396 29518148 28844705
3099 28844705 27609900 26135972 24466324 22585857 21107393 19850595 18620147 17703092
3091 17703092 16933259 16292264 15740692 15176880 14520891 14512454 14496120 14232009 14002455 13791421
3081 13791421 13515345 13628242 13796244 13594225 13704830 13925613 14120057 14339476 14399533 14213344
3071 14213344 13933069 13643101 13064405 12469704 11918775 11371680 10917345 10586176 10111469
3062 10111469 9956855 9806514 9606826 9520875 9442494 9355150 9234098 9099485 9021026 9088641
$$ packed form
3123D0154081L098877M124099N003883N495815O137266O639161O947098O350307
3115H3950587L346133l340112r537556j0930490q977092o549578m814924l620190
3107C9526778k563766k008881j611738j111600j110689j010708n91248o73443
3099B8844705j234805j473928j669648j880467j478464j256798j230448r17055
3091A7703092p69833o40995n51572n63812o55989q437j6334k64111k29554k11034
3081A3791421k76076J12897J68002k02019J10605K20783J94444K19419O0057j86189
3071A4213344k80275k89968n78696n94701n50929n47095m54335l31169m74707
3062A0111469j54614j50341j99688q5951p8381q7344j21052j34613p8459O7615
$$ plain form
3052 9088641 9163961 9094616 9059806 9055400 9137981 9311931 9371324 9327653 9099108 8930380 8672175
3041 8672175 8695550 8744924 8448480 8499699 8616518 8693217 8710936 8847814 8737628 8713214 8927674
3030 8927674 9152615 9343811 9487114 9752871 9875655 10064982 10008193 10231320 10550926 10567146
3020 10567146 10601103 10508064 10628756 10837883 10979061 11023799 11090381 11289289 11503061 11828841
3010 11828841 11922618 11980196 12079727 12342145 12463956 12685220 12892395 12901650 13057340 13290505
3000 13290505 13272014 13420014 13773200 13992671 14146118 14489068 14795281 14862021 15150387 15572117
2990 15572117 15961241 16292238 16683914 16918512 17161292 17684129 18188470 18493689 18862709
2981 18862709 19289446 19810784 20240385 20818715 21346294 21924896 22735701 23171547 23720818
$$ packed form
3052I088641P5320o9345l4810m406Q2581J73950N9393m3671k28545j68728k58205
3041H672175K3375M9374k96444N1219J16819P6699J7719J36878j10186k4414K14460
3030H927674K24941J91196J43303K65757J22784J89327n6789K23127L19606J6220
3020A0567146L3957r3039J20692K09127J41178M4738O6582J98908K13772L25780
3010A1828841R3777N7578R9531K62418J21811K21264K07175R255J55690K33165
3000A3290505j8491J48000L53186K19471J53447L42950L06213O6740K88366M21730
2990A5572117L89124L30997L91676K34598K42780N22837N04341L05219L69020
2981A8862709M26737N21338M29601N78330N27579N78602Q10805M35846N49271
$$ plain form
2972 23720818 24418919 25127383 25796720 26516864 27189051 27845846 28578119 29397269 30115494
2963 30115494 30840389 31697180 32747745 33615918 34471047 35254349 35978072 37098675 37960426
2954 37960426 38973458 40056658 41029001 42081926 43209349 44399393 45581692 46918914
2946 46918914 48075969 49523781 51208937 52424505 53987750 55638377 57099090 58812316
2938 58812316 60650388 62311981 64324631 66585829 68585922 70870925 73302221 75829980
2930 75829980 78351658 80947876 83417011 85907549 88312565 90515839 92754053 95024958
2922 95024958 97197019 99564364 101951571 104595842 107312852 109701340 112187214 114907624
2914 114907624 117683075 120249925 122622342 124933002 126950086 128789674 130785404 132568095
$$ packed form
2972B3720818O98101P08464O69337P20144O72187O56795P32273Q19150P18225
2963C0115494P24895Q56791J050565Q68173Q55129P83302P23723J120603Q61751
2954C7960426J013032J083200R72343J052925J127423J190044J182299J337222
2946D6918914J157055J447812J685156J215568J563245J650627J460713J713226
2938E8812316J838072J661593K012650K261198K000093K285003K431296K527759
2930G5829980K521678K596218K469135K490538K405016K203274K238214K270905
2922I5024958K172061K367345K387207K644271K717010K388488K485874K720410
2914A14907624K775451K566850K372417K310660K017084J839588J995730J782691
$$ plain form
2906 132568095 134114293 135746112 137138984 138678630 140108454 141385647 142645079 143786215
2898 143786215 144664339 145168583 145719920 145919533 145755893 145270206 144588205 143945066 143373924
2889 143373924 142528531 141784819 141165600 140577098 139949321 139552420 138926612 138472070 138133839
2880 138133839 137607319 137033027 136630277 136348324 135973127 135520666 134888788 133772388 132267160
2871 132267160 130115389 127411589 124395471 120956766 117301818 113680941 110044202 106492416
2863 106492416 103252801 100034656 96856820 93931288 90792406 87765977 84618703 81230454
2855 81230454 77695929 73930024 70118277 66299538 62717129 59002208 55738456 52903753
2847 52903753 50306012 47680460 45468917 43635872 41670074 39936301 38538531 37076366
$$ packed form
2906A32568095J546198J631819J392872J539646J429824J277193J259432J141136
2898A43786215Q78124N04244N51337J99613j63640m85687o82001o43139n71142
2889A43373924q45393p43712o19219n88502o27777l96901o25808m54542l38231
2880A38133839n26520n74292m02750k81953l75197m52461o31878j116400j505228
2871A32267160k151771k703800l016118l438705l654948l620877l636739l551786
2863A06492416l239615l218145l177836k925532l138882l026429l147274l388249
2855H1230454l534525l765905l811747l818739l582409l714921l263752k834703
2847E2903753k597741k625552k211543j833045j965798j733773j397770j462165
$$ plain form
2839 37076366 35933927 34677434 33620157 32786289 32036543 31194795 30445239 29899721 29287847
2830 29287847 28755837 28217355 27569599 27067556 26743776 26268783 25792094 25543079 24929391
2821 24929391 24686265 24723232 24361900 24007983 23711724 23317380 23235796 23157140 22874536 22781953
2811 22781953 22524829 22249879 22070456 22084196 22054614 21924499 21723961 21712276 21634446 21553391
2801 21553391 21642127 21748962 21813589 21816691 22014979 22140534 22381398 22578381 22760754 22914300
2791 22914300 23008087 23184624 23228767 23396308 23613770 24006016 24331922 24446602 24587094 24939764
2781 24939764 25126041 25382896 25860901 26227688 26512001 26946231 27399543 27865237 28208100
2772 28208100 28585951 29084183 29642730 29994515 30604172 31130661 31910852 32446847 33095464
$$ packed form
2839C7076366j142439j256493j057277q33868p49746q41748p49556n45518o11874
2830B9287847n32010n38482o47756n02043l23780m74993m76689k49015o13688
2821B4929391k43126L6967l61332l53917k96259l94344q1584p8656k82604r2583
2811B2781953k57124k74950j79423J3740k9582j30115k00538j1685p7830q1055
2801B1553391Q8736J06835O4627L102J98288J25555K40864J96983J82373J53546
2791B2914300R3787J76537M4143J67541K17462L92246L25906J14680J40492L52670
2781B4939764J86277K56855M78005L66787K84313M34230M53312M65694L42863
2772B8208100L77851M98232N58547L51785O09657N26489P80191N35995O48617
$$ plain form
2763 33095464 33833968 34579800 35315603 36011508 36597612 37512428 38462769 39336186 40334381
2754 40334381 41541514 42779097 44012836 45429921 46719068 48577068 50281618 51772262
2746 51772262 53646389 55568289 57564072 59910994 62175194 64515306 67141737 69853794
2738 69853794 72703143 75782131 79023763 82652551 86768590 91279016 95975508 101386915
2730 101386915 107404496 114218307 121730905 130043654 139407070 149880515 161346772 173692535
2722 173692535 187778596 203274393 220149974 238603786 258130495 278686697 299579206
2715 299579206 319927911 338485439 353670811 364715748 371093577 372876946 371204375
2708 371204375 367294236 362438452 357321448 352898582 348950967 345915654 343541325 341614211
$$ packed form
2763C3095464P38504P45832P35803O95905N86104R14816R50341Q73417R98195
2754D0334381J207133J237583J233739J417085J289147J858000J704550J490644
2746E1772262J874127J921900J995783K346922K264200K340112K626431K712057
2738F9853794K849349L078988L241632L628788M116039M510426M696492N411407
2730A01386915O017581O813811P512598Q312749R363416J0473445J1466257J2345763
2722A73692535J4086061J5495797J6875581J8453812J9526709K0556202K0892509
2715B99579206K0348705J8557528J5185372J1044937O377829J783369j672571
2708C71204375l910139m855784n117004m422866l947615l035313k374329j927114
$$ plain form
2700 341614211 339377004 336258443 331412305 324194288 313830864 300457118 283992048 264769922
2692 264769922 244281623 223886574 204353500 186374592 170413398 156416033 144474112
2685 144474112 133926994 124803271 116683158 109402599 102974566 97430169 92381140 87672746
2677 87672746 83499238 79737477 76380590 73500079 70898704 68179184 65893525 63829377
2669 63829377 61747665 59745664 57896302 56172626 54456061 52703651 51029518 49761223
2661 49761223 48348997 46965944 45972647 44864259 43936873 43136000 42181861 41278124 40407809
2652 40407809 39707515 38861881 38236390 37571377 36884378 36291056 35794070 35207167 34686036
2643 34686036 34181699 33689079 33426272 33137629 32791531 32461922 32258677 31914354 31564945
$$ packed form
2700C41614211k237207l118561m846138p218017j0363424j3373746j6465070j9222126
2692B64769922k0488299k0395049j9533074j7978908j5961194j3997365j1941921
2685A44474112j0547118r123723q120113p280559o428033n544397n049029m708394
2677H7672746m173508l761761l356887k880511k601375k719520k285659k064148
2669F3829377k081712k002001j849362j723676j716565j752410j674133j268295
2661D9761223j412226j383053r93297j108388r27386q00873r54139r03737q70315
2652D0407809p00294q45634o25491o65013o86999n93322m96986n86903n21131
2643C4686036n04337m92620k62807k88643l46098l29609k03245l44323l49409
$$ plain form
2634 31564945 31614388 31569030 31269641 31081476 30978240 30714226 30550716 30504223 30466871 30712696
2624 30712696 30601493 30461664 30777460 31016279 31045636 31239980 31365497 31614714 31962268 32378759
2614 32378759 32708615 33150293 33733821 34301218 34917837 35640408 36550612 37281705 38130402
2605 38130402 39058076 40275451 41281011 42597176 44013813 45359900 46996106 48609190
2597 48609190 50239082 52233279 54403117 56521236 58899194 61297733 63430729 65730548
2589 65730548 67649188 69549581 71111184 72493662 73812225 75223529 76484615 77807765
2581 77807765 79118662 80535602 82024847 83520176 85013766 86214113 87328923 88200816
2573 88200816 88939733 88939286 88921252 88645657 87987800 87489208 87122336 86671924 86472235 86347503
$$ packed form
2634C1564945M9443m5358k99389j88165j03236k64014j63510m6493l7352K45825
2624C0712696j11203j39829L15796K38819K9357J94344J25517K49217L47554M16491
2614C2378759L29856M41678N83528N67397O16619P22571R10204P31093Q48697
2605C8130402R27674J217375J005560J316165J416637J346087J636206J613084
2597D8609190J629892J994197K169838K118119K377958K398539K132996K299819
2589F5730548J918640J900393J561603J382478J318563J411304J261086J323150
2581G7807765J310897J416940J489245J495329J493590J200347J114810Q71893
2573H8200816P38917m47j8034k75595o57857m98592l66872m50412j99689j24732
$$ plain form
2563 86347503 86349723 86856105 87376824 88049330 88922834 89752835 90372852 91288883 92367020 93578043
2553 93578043 95032606 96873682 99132231 101762789 104981293 108894021 113376560 118274979
2545 118274979 124007348 130544919 137787056 145869713 154959931 164649071 175298107 186969876
2537 186969876 199246725 211951718 224753378 236916372 247765332 257058691 264389425
2530 264389425 269959213 274501639 278582433 283409147 289186026 295932048 303804402 312398823
2522 312398823 320998827 329543551 336753114 341867791 344163685 343339536 339042704 331904487
2514 331904487 322295634 310940484 299092105 287405042 275976828 265629835 256515671
2507 256515671 248282955 240866983 233739773 226709286 219242282 211024487 201757849 191501788
$$ packed form
2563H6347503K220N06382N20719O72506Q73504Q30001O20017R16031J078137J211023
2553I3578043J454563J841076K258549K630558L218504L912728M482539M898419
2545A18274979N732369O537571P242137Q082657R090218R689140J0649036J1671769
2537A86969876J2276849J2704993J2801660J2162994J0848960R293359P330734
2530B64389425N569788M542426M080794M826714N776879O746022P872354Q594421
2522C12398823Q600004Q544724P209563N114677K295894q24149m296832p138217
2514C31904487r608853j1355150j1848379j1687063j1428214j0346993r114164
2507B56515671q232716p415972p127210p030487p467004q217795r266638j0256061
$$ plain form
2499 191501788 179991566 167996823 155691104 143837233 132739168 122678126 113965315
2492 113965315 105997095 98967873 93082542 87727400 82722650 78307508 74436951 70791339
2484 70791339 67492182 64481593 61586310 59017827 56527631 54282996 52513989 50459199
2476 50459199 48710047 46982428 45375984 44107366 42898252 41537037 40104384 38992271
2468 38992271 37750406 36696788 35799738 34719657 33611707 32726534 31827284 31065334 30239808
2459 30239808 29511684 28907341 28063970 27287406 26520536 25829739 25174626 24425816 23761292
2450 23761292 22991556 22516920 21857946 21301834 20681412 20025634 19592891 19211742 18759749
2441 18759749 18273978 17971749 17532471 17009217 16717464 16347356 15696893 15313967 15062927
$$ packed form
2499A91501788j1510222j1994743j2305719j1853871j1098065j0061042q712811
2492A13965315p968220p029222n885331n355142n004750m415142l870557l645612
2484G0791339l299157l010589k895283k568483k490196k244635j769007k054790
2476E0459199j749152j727619j606444j268618j209114j361215j432653j112113
2468C8992271j241865j053618q97050j080081j107950q85173q99250p61950q25526
2459C0239808p28124o04343q43371p76564p66870o90797o55113p48810o64524
2450B3761292p69736m74636o58974n56112o20422o55778m32743l81149m51993
2441A8759749m85771l02229m39278n23254k91753l70108o50463l82926k51040
$$ plain form
2432 15062927 14734845 14125771 13659437 13504985 13215614 12917562 12671347 12534085 12352433
2423 12352433 12148804 11728876 11510245 11601484 11176544 10987440 11058315 10952644 10968516 10808973
2413 10808973 10569508 10555163 10511602 10372460 10240876 10185689 10070958 10110408 10087118 9698539
2403 9698539 9486380 9509981 9329346 9324105 9148223 8855794 8864346 8516170 8363524 8376602 8176843
2392 8176843 8219169 8076631 8063748 7861900 7752624 7673115 7592728 7579854 7422023 7267665
2382 7267665 7057747 6822700 6523255 6328245 6137549 5931829 5711383 5451873 5339855 5251863
2372 5251863 5187588 4853269 4558813 4532412 4428946 4368091 4322655 4196964 4015774 4028184
2362 4028184 4164580 4038923 3915535 3672906 3642601 3721757 3756289 3934597 3819194 3736042
$$ packed form
2432A5062927l28082o09074m66334j54452k89371k98052k46215j37262j81652
2423A2352433k03629m19928k18631R1239m24940j89104P0875j05671J5872j59543
2413A0808973k39465j4345m3561j39142j31584n5187j14731L9450k3290l88579
2403I698539k12159K3601j80635n241j75882k92429Q552l48176j52646J3078j99759
2392H176843M2326j42538j2883k01848j09276p9509q0387j2874j57831j54358
2382G267665k09918k35047k99445j95010j90696k05720k20446k59510j12018q7992
2372E251863o4275l34319k94456k6401j03466o0855m5436j25691j81190J2410
2362D028184J36396j25657j23388k42629l0305P9156L4532J78308j15403q3152
$$ plain form
2352 3736042 3689075 3552808 3499373 3521578 3577572 3409617 3483132 3519920 3411296 3275676 3097292
2341 3097292 3100964 3042831 2951271 2876256 2862905 2750633 2850674 2918631 3073260 2888566 2791303
2330 2791303 2863185 2726346 2836027 2858164 2634512 2549031 2599277 2806468 2818059 2814344 2791272
2319 2791272 2940970 2784195 2709359 2545996 2525307 2554151 2308089 2426640 2500427 2316709
2309 2316709 2261209 2326601 2204016 2345384 2332898 2177689 2175745 2415088 2260368 2182719 2178225
2298 2178225 2166352 2106211 2016681 2029566 2001939 1811047 1610686 1791140 1788384 1592601 1635962
2287 1635962 1609512 1548132 1652925 1652204 1622948 1724707 1616891 1635035 1598545 1552623 1453770
2276 1453770 1266408 1270740 1544632 1675397 1470318 1460395 1595962 1694097 1729952 1723330 1588022
$$ packed form
2352C736042m6967j36267n3435K2205N5994j67955P3515L6788j08624j35620j78384
2341C097292L672n8133r1560p5015j3351j12272J00041O7957J54629j84694r7263
2330B791303P1882j36839J09681K2137k23652q5481N0246K07191J1591l715k3072
2319B791272J49698j56775p4836j63363k0689K8844k46062J18551P3787j83718
2309B316709n5500O5392j22585J41368j2486j55209j944K39343j54720p7649m494
2298B178225j1873o0141q9530J2885k7627j90892k00361J80454k756j95783M3361
2287A635962k6450o1380J04793p21k9256J01759j07816J8144l6490m5922r8853
2276A453770j87362M332K73892J30765k05079r923J35567R8135L5855o622j35308
$$ plain form
2265 1588022 1478208 1429400 1344843 1422186 1437656 1248189 1283893 1238400 1362505 1354367 1225859
2254 1225859 1237703 1263187 1243983 1163890 1251118 1469683 1510019 1541415 1680165 1458556 1432618
2243 1432618 1455412 1615861 1642893 1604291 1721009 1942383 2044968 1881727 1816356 1818650 1791189
2232 1791189 1809384 2004084 2049162 2121094 2270562 2361717 2369919 2505764 2532225 2451028 2616339
2221 2616339 2711429 2600938 2779230 2944791 3056264 3036840 3088303 3032426 3205303 3099351
2211 3099351 3171731 3287670 3290959 3220424 3333005 3327908 3131562 3105731 2873799 2858176 2897600
2200 2897600 2809884 2667940 2584465 2580835 2534863 2580883 2562749 2536998 2563206 2485133 2609500
2189 2609500 2725669 2545969 2430668 2447857 2521046 2784187 2822514 2786557 2991160 3116043
$$ packed form
2265A588022j09814m8808q4557P7343J5470j89467L5704m5493J24105q138j28508
2254A225859J1844K5484j9204q0093Q7228K18565M0336L1396J38750k21609k5938
2243A432618K2794J60449K7032l8602J16718K21374J02585j63241o5371K294k7461
2232A791189J8195J94700M5078P1932J49468R1155Q202J35845K6461q1197J65311
2221B616339R5090j10491J78292J65561J11473j9424N1463n5877J72877j05952
2211C099351P2380J15939L289p0535J12581n097j96346k5831k31932j5623L9424
2200B897600q7716j41944q3475l630m5972M6020j8134k5751K6208p8073J24367
2189B609500J16169j79700j15301J7189P3189K63141L8327l5957K04603J24883
$$ plain form
2179 3116043 3044489 3186562 3108796 3210944 3112727 3139974 3201001 3169512 3021103 2898578 2766885
2168 2766885 2720427 2703488 2684812 2846450 2912031 2852980 2924501 3082597 3133894 3308149 3503251
2157 3503251 3613268 3981616 4266467 4352855 4633767 5078108 5337078 5202681 4677636 3984615
2147 3984615 3431049 3138625 2928878 2674234 2569884 2492615 2375170 2283259 2227663 2265769
2137 2265769 2169044 2034239 2237904 2153937 2129087 2287041 2266189 2428539 2635220 2547252
2127 2547252 2721002 2968678 3105607 3208239 3683966 4081630 4449197 4961665 5606783 6253731
2117 6253731 6833997 6518721 5364474 4500919 3548435 3135332 2890238 2646800 2306900
2108 2306900 2078725 1972595 2003720 2020867 2066050 1981248 1858684 1822143 1835090 1860384 1864415
$$ packed form
2179C116043p1554J42073p7766J02148r8217K7247O1027l1489j48409j22525j31693
2168B766885m6458j6939j8676J61638O5581n9051P1521J58096N1297J74255J95102
2157C503251J10017L68348K84851Q6388K80912M44341K58970j34397n25045o93021
2147C984615n53566k92424k09747k54644j04350p7269j17445r1911n5596L8106
2137B265769r6725j34805K03665q3967k4850J57954k0852J62350K06681q7968
2127B547252J73750K47676J36929J02632M75727L97664L67567N12468O45118O46948
2117F253731N80266l15276j154247q63555r52484m13103k45094k43438l39900
2108B306900k28175j06130L1125J7147M5183q4802j22564l6541J2947K5294M031
$$ plain form
2097 1864415 1715154 1861660 1952743 1906698 1983765 2131200 2077580 2193105 2464395 2662686
2087 2662686 2951000 3110341 3286483 3594427 3701841 3251837 2984489 2529408 2083457 2038426
2077 2038426 1895183 1623290 1535461 1408522 1357455 1459121 1304945 1151636 1263067 1041315
2067 1041315 837303 801854 792875 690793 566494 349786 376890 382426 427500 423596 432951
2056 432951 587270 369271 270119 289312 438258 369545 320459 408012 308969 384157 419612
2045 419612 381017 322265 378834 403070 435505 402004 419221 472183 487575 424982 346292 375532
2033 375532 264598 388160 528828 266758 270828 270658 172888 245481 259234 376313 455418
2022 455418 286472 316618 461657 433792 388087 365747 416507 411624 483707 485296 479439 584940
$$ packed form
2097A864415j49261J46506R1083m6045P7067J47435n3620J15525K71290J98291
2087B662686K88314J59341J76142L07944J07414m50004k67348m55081m45951m5031
2077B038426j43243k71893q7829j26939n1067J01666j54176j53309J11431k21752
2067A041315k04012l5449q979j02082j24299k16708K7104N536M5074l904R355
2056D32951J54319k17999r9152J9193J48946o8713m9086Q7553r9043P5188L5455
2045D19612l8595n8752N6569K4236L2435l3501J7217N2962J5392o2593p8690K9240
2033C75532j10934J23562J40668k62070M070j70r7770P2593J3753J17079P9105
2022D55418j68946L0146J45039k7865m5705k2340N0760m883P2083J589n857J05501
$$ plain form
2010 584940 528655 664776 709632 526581 550997 798864 663033 532939 442333 517594 607121
1999 607121 434654 310344 364528 729619 665666 505246 566277 624975 513207 355796
1989 355796 505032 385155 297670 243894 131789 113296 160005 109860 261344 244564 208209
1978 208209 182990 103311 121528 32543 60419 -786 138272 100500 40618 256688 394756
1967 394756 134968 217056 318280 330126 354453 156447 168924 315456 209367 142286 164319
1956 164319 101746 -13851 56512 -118733 -8113 80299 34789 58341 51155 -37394 92988
1945 92988 228001 117394 28511 65721 978 273519 576726 504631 494036 556136 545760
1934 545760 436693 473573 485895 490663 450818 410928 574629 534857 491221 420793 304357
$$ packed form
2010E84940n6285J36121M4856j83051K4416K47867j35831j30094r0606P5261Q9527
1999F07121j72467j24310N4184L65091o3953j60420O1031N8698j11768j57411
1989C55796J49236j19877q7485n3776j12105j8493M6709n0145J51484j6780l6355
1978B08209k5219p9679J8217q8985K7876o1205J39058l7772n9882K16070J38068
1967C94756k59788Q2088J01224J1846K4327j98006J2477J46532j06089o7081K2033
1956A64319o2573j15597P0363j75245J10620Q8412m5510K3552p186q8549J30382
1945I2988J35013j10607q8883L7210o4743K72541L03207p2095j0595O2100j0376
1934E45760j09067L6880J2322M768l9845l9890J63701l9772m3636p0428j16436
$$ plain form
1923 304357 335962 438464 362546 175622 105034 74734 253778 292807 376377 424087 286353
1912 286353 168638 32212 301887 554560 495208 481955 436979 707294 538921 411818
1902 411818 273488 321540 405377 297321 194543 85647 106821 133019 84492 57651 -43201
1891 -43201 29889 -47418 -95586 152470 231778 131817 63505 177838 402209 578524 531509
1880 531509 544832 707778 618800 649179 806465 683728 662887 543305 430773 504738 639968
1869 639968 658593 703619 533999 229576 388365 623245 491654 354250 373188 407370
1859 407370 598843 545172 325222 398064 489097 274277 288902 385573 550328 609212 452473
1848 452473 638736 611995 582365 450853 394351 674612 544321 251932 343923 410476 376831
$$ packed form
1923C04357L1605J02502p5918j86924p0588l0300J79044L9029Q3570M7710j37734
1912B86353j17715j36426K69675K52673n9352j3253m4976K70315j68373j27103
1902D11818j38330M8052Q3837j08056j02778j08896K1174K6198m8527k6841j00852
1891d3201P3090p7307m8168K48056P9308r9961o8312J14333K24371J76315m7015
1880E31509J3323J62946q8978L0379J57286j22737k0841j19582j12532P3965J35230
1869F39968J8625M5026j69620l04423J58789K34880j31591j37404J8938L4182
1859D07370J91473n3671k19950P2842R1033k14820J4625R6671J64755N8884j56739
1848D52473J86263k6741k9630j31512n6502K80261j30291k92389R1991O6553l3645
$$ plain form
1837 376831 435165 438844 273931 342417 313339 288041 215615 301714 367057 381205 370695 367640
1825 367640 328188 377674 392827 471612 357749 271333 458707 401331 375186 377505 307788
1814 307788 151837 433679 357935 162913 394931 337690 227347 342976 418813 451191
1804 451191 463468 240442 251360 448078 404726 337337 326386 287894 407298 339696 382606
1793 382606 386126 394391 424596 519898 533585 395839 610031 356997 195006 25837 201256
1782 201256 269731 328012 155636 16782 31311 71535 106807 66437 -13963 68942 -68542
1771 -68542 1712 321319 308173 115569 223398 194964 56237 187562 224672 287814 261964
1760 261964 108989 47044 168775 128393 -67473 -190134 -222791 -195654 -79265 44589
$$ packed form
1837C76831N8334L679j64913O8486k9078k5298p2426Q6099O5343J4148j0510l055
1825C67640l9452M9486J5153P8785j13863q6416J87374n7376k6145K319o9717
1814C07788j55951K81842p5744j95022K32018n7241j10343J15629P5837L2378
1804D51191J2277k23026J0918J96718m3352o7389j0951l8492J19404o7602M2910
1793C82606L520Q265L0205R5302J3687j37746K14192k53034j61991j69169J75419
1782B01256O8475N8281j72376j38854J4529M0224L5272m0370q0400Q2905j37484
1771f8542P0254L19607j3146j92604J07829k8434j38727J31325L7110O3142k5850
1760B61964j52975o1945J21731m0382j95866j22661l2657K7137J16389J23854
$$ plain form
1750 44589 -113716 -17576 144238 28178 36867 112695 198879 212704 132078 48025 52803 52411
1738 52411 108326 213471 148249 -7430 102037 41563 -8055 162199 90862 35662 116919
1727 116919 -14144 -11038 -180634 -227642 -140515 -39492 -176244 -291954 -275979 -77777 -40528
1716 -40528 -205931 -201304 -72237 -104381 -194302 -279344 -216233 -229969 -174153 -253894 -420979
1705 -420979 -435099 -214779 -338809 -327006 -192643 -189825 -232064 -223480 -319568 -341934 -245131
1694 -245131 -416550 -486092 -289706 -379415 -301014 -124311 -104013 -189848 -148334 -169877 -153853
1683 -153853 -36127 -153406 -8882 -68350 -172430 -12167 -20667 -51408 -35901 -116235 64002
1672 64002 17283 -131353 -293380 -232926 -255423 -175681 -25511 107178 48704 42317 -181371
$$ packed form
1750D4589j58305R6140J61814j16060Q689P5828Q6184J3825q0626q4053M778l92
1738E2411N5915J05145o5222j55679J09467o0474m9618J70254p1337n5200Q1257
1727A16919j31063L106j69596m7008Q7127J01023j36752j15710J5975J98202L7249
1716d0528j65403M627J29067l2144q9921q5042O3111j3736N5816p9741j67085
1705d20979j4120K20320j24030J1803J34363K818m2239Q584r6088k2366R6803
1694b45131j71419o9542J96386q9709P8401J76703K0298q5835M1514k1543J6024
1683a53853J17726j17279J44524n9468j04080J60263q500l0741J5507q0334J80237
1672F4002m6719j48636j62027O0454k2497P9742J50170J32689n8474o387k23688
$$ plain form
1661 -181371 -6494 -48020 32985 92069 -109491 -75649 -28848 9057 -29908 -141160 -291077
1650 -291077 -264414 -312024 -270032 -216376 -125343 -129204 -353666 -307169 -165395 -184537 -232645
1639 -232645 -259528 -278770 -206306 -221831 -160354 -294931 -364354 -22800 -101503 -9774 21558
1628 21558 -7191 -105573 -291669 -287313 -202635 -182946 -100141 -70645 -277984 -414486 -215738
1617 -215738 -225514 -266255 -115425 -159432 -90058 -103238 -299764 -423887 -439307 -383627 -360704
1606 -360704 -402887 -160744 -118171 -244235 -338114 -191958 14830 -140043 -266377 -161512
1596 -161512 -9197 -136384 -88270 -112315 -116561 -112172 -279878 -292500 -175244 -158846 -243752
1585 -243752 -336001 -391037 -250563 -262704 -310372 -354493 -259851 -108022 18963 108208 -84740
$$ packed form
1661a81371J74877m1526Q1005N9084k01560L3842M6801L7905l8965j11252j49917
1650b91077K6663m7610M1992N3656R1033l861k24462M6497J41774j9142m8108
1639b32645k6883j9242P2464j5525O1477j34577o9423L41554p8703R1729L1332
1628B1558k8749r8382j86096M356Q4678J9689Q2805K9496k07339j36502J98748
1617b15738r776m0741J50830m4007O9374j3180j96526j24123j5420N5680K2923
1606c60704m2183K42143M2573j26064r3879J46156K06788j54873j26334J04865
1596a61512J52315j27187M8114k4045m246M389j67706j2622J17256J6398q4906
1585b43752r2249n5036J40474j2141m7668m4121R4642J51829J26985Q9245j92948
$$ plain form
1574 -84740 -22921 -81628 -101157 -266455 -537205 -345963 -115486 74796 140056 122536 39119
1563 39119 201259 99302 96532 39956 188305 140464 -27375 -778 22889 153138 -36793
1552 -36793 -128207 -26375 -80134 -131808 22228 74051 169367 93663 54454 212255 78047
1541 78047 -156356 -164252 -107349 82382 135164 53636 -15676 82240 187832 63540 -28229
1530 -28229 11277 4759 -78200 148002 212826 106894 -84661 -142113 149084 214296 69820
1519 69820 25448 246651 358308 223145 31156 59121 268339 323274 86347 60413 79942
1508 79942 232632 127573 -142754 -47010 29310 49708 78849 75034 -33469 10998 156326
1497 156326 83438 173929 127659 -1257 32498 113645 294808 445687 484634 466231 151462
$$ packed form
1574h4740O1819n8707j9529j65298k70750J91242K30477J90282O5260j7520q3417
1563C9119J62140j01957k770n6576J48349m7841j67839K6597K3667J30249j89931
1552c6793r1414J01832n3759n1674J54036N1823R5316p5704l9209J57801j34208
1541G8047k34403p896N6903J89731N2782q1528o9312R7916J05592j24292r1769
1530b8229L9506o518q2959K26202O4824j05932j91555n7452K91197O5212j44476
1519F9820m4372K21203J11657j35163j91989K7965K09218N4935k36927k5934J9529
1508G9942J52690j05059k70327R5744P6320K0398K9141l815j08503M4467J45328
1497A56326p2888R0491m6270j28916L3755Q1147J81163J50879L8947j8403l14769
$$ plain form
1486 151462 109339 160223 122468 246270 147339 -113636 -12673 74794 66152 107313 53682
1475 53682 23505 122343 99535 29419 167929 -46787 -158969 -27717 185376 202123 93518
1464 93518 155957 199491 53962 -103445 -133101 42937 38816 -24276 4680 -43242 -53088 -102787
1452 -102787 -210716 -247951 -59790 10825 -226506 -305337 -226033 -193560 -265994 -58384 58331
1441 58331 40324 -75247 -199214 -74575 4619 -110368 -258217 -244887 -299654 -183892 -96320
1430 -96320 21972 106758 44316 38651 -16320 45362 -1142 -43713 -29077 -110776 -20572 54133
1418 54133 15514 139649 327978 226940 63172 147870 48945 7064 47184 -30677 77301
1407 77301 261312 164405 146145 274928 149615 -9890 130390 152504 141872 57836 -82517
$$ packed form
1486A51462m2123N0884l7755J23802r8931k60975J00963Q7467q642M1161n3631
1475E3682l0177R8838k2808p0116J38510k14716j12182J31252K13093J6747j08605
1464I3518O2439M3534j45529j57407k9656J76038m121o3092K8956m7922r846m9699
1452a02787j07929l7235J88161P0615k37331p8831P9304L2473p2434K07610J16715
1441E8331j8007j15571j23967J24639P9194j14987j47849J3330n4767J15762Q7572
1430i6320J18292Q4786o2442n665n4971O1682m6504m2571J4636q1699R0204P4705
1418E4133l8619J24135J88329j01038j63768Q4698r8925m1881M0120p7861J07978
1407G7301J84011r6907j8260J28783j25313j59505J40280K2114j0632q4036j40353
$$ plain form
1396 -82517 51651 -42096 -246782 -103531 -16078 -109093 83034 75635 -86768 21902 -58474
1385 -58474 -125614 -35835 -38174 -14401 -71585 -105428 -163869 -51513 -23244 -113293 30026 101881
1373 101881 -165292 -248134 -98020 -112709 -238470 -197341 -220334 -220166 -63657 -87261 -97824
1362 -97824 -75859 10797 30206 62915 74198 35025 -16723 -101905 154925 168349 21959
1351 21959 122878 203407 266722 112669 -2431 44766 87584 167700 -12705 -60396 -58283
1340 -58283 -16535 171676 193048 144459 112952 66011 -120179 -77589 -181192 -94566 66367
1329 66367 -44030 -259528 -170676 -14255 84952 115902 -107741 -120553 -236379 -293014 -206492
1318 -206492 -119512 -111204 -118130 110953 -6827 -168696 -240038 -231414 -94467 -58400 -182395
$$ packed form
1396h2517J34168r3747k04686J43251Q7453r3015J92127p399j62403J08670q0376
1385e8474o7140Q9779k339K3773n7184l3843n8441J12356K8269r0049J43319P1855
1373A01881k67173q2842J50114j4689j25761M1129k2993J68J56509k3604j0563
1362i7824K1965Q6656J9409L2709J1283l9173n1748q5182K56830J3424j46390
1351B1959J00919Q0529O3315j54053j15100M7197M2818Q0116j80405m7691K113
1340e8283M1748J88211K1372m8589l1507m6941j86190M2590j03603Q6626J60933
1329F6367j10397k15498Q8852J56421R9207L0950k23643j2812j15826n6635Q6522
1318b06492Q6980Q308o926K29083j17780j61869p1342Q624J36947L6067j23995
$$ plain form
1307 -182395 -182984 -105513 -272716 -260711 -306676 -325819 -328937 -249635 -207663 -272132 -214216 -62447
1295 -62447 61663 -73218 -70811 -9411 7306 -113501 -204005 -104812 58253 -6565 -1499
1284 -1499 -94762 161531 19852 -150934 -139195 -245590 -122413 -216641 8682 -4316 -63671
1273 -63671 -106724 -35903 6879 120145 103887 -126251 -209376 15680 106741 114172 83582
1262 83582 -88543 87725 179951 -12140 -145898 -36941 -83388 -80037 87405 -169867 -37041
1251 -37041 123120 323085 367914 71785 88759 191983 123473 43521 59521 185593 202006
1240 202006 50710 -144800 -69266 -64565 -218498 -233058 -256139 -112864 -43478 -111813 -75589
1229 -75589 -122898 -105655 -190654 -356654 -264410 13590 -215465 -232079 -209385 -299306 -196758
$$ packed form
1307a82395n89P7471j67203J2005m5965j9143l118P9302M1972o4469N7916J51769
1295f2447J24110j34881K407O1400J6717j20807r0504R9193J63065o4818N066
1284a499r3263K56293j41679j70786J1739j06395J23177r4228K25323j2998n9355
1273f3671m3053P0821M2782J13266j6258k30138q3125K25056R1061P431l0590
1262H3582j72125J76268R2226j92091j33758J08957m6447L351J67442k57272J32826
1251c7041J60161J99965M4829k96129J6974J03224o8510p9952J6000J26072J6413
1240B02006j51296j95510P5534M701j53933j4560k3081J43275O9386o8335L6224
1229g5589m7309J7243q4999j66000R2244K78000k29055j6614K2694q9921J02548
$$ plain form
1218 -196758 -120676 -27521 -86672 -35330 93693 115437 1024 -106154 -116951 -58245 -84672
1207 -84672 -250222 -237270 -243562 -127032 -227789 -295363 -268083 -372690 -320647 -287322 -148297
1196 -148297 -134001 -240075 -333931 -164130 -27523 -21556 31995 255822 143046 173464 136763
1185 136763 90648 -22812 88125 195779 177461 124120 109623 151761 263981 263303 128021
1174 128021 120184 -10038 -60247 -152755 -126217 46336 -40716 -34054 -134679 -79890 -64245
1163 -64245 124907 63580 114750 98910 190441 208149 129936 64750 -107605 45894 2221
1152 2221 -139481 -70771 -29030 -123000 -150966 -237484 45298 8412 -164012 -303688 -327868
1141 -327868 -274410 -78919 -48315 -245446 -221704 -266131 -323240 -425065 -261442 -196249 -131581
$$ packed form
1218a96758P6082R3155n9151N1342J29023K1744j14413j07178j0797N8706k6427
1207h4672j65550J2952o292J16530j00757o7574K7280j04607N2043L3325J39025
1196a48297J4296j06074r3856J69801J36607N967N3551K23827j12776L0418l6701
1185A36763m6115j13460J10937J07654j8318n3341j4497M2138J12220o78j35282
1174A28021p837j30222n0209r2508K6538J72553q7052O662j00625N4789J5645
1163f4245J89152o1327N1170j5840R1531J7708p8213o5186j72355J53499m3673
1152B221j41702O8710M1741r3970k7966q6518K82782l6886j72424j39676k4180
1141c27868N3458J95491L0604j97131K3742m4427n7109j01825J63623O5193O4668
$$ plain form
1130 -131581 -168177 -344355 -241968 -271675 -134196 54775 203874 28171 -110922 -21790
1120 -21790 -59524 38099 173838 195739 239263 294195 146776 103429 220940 183231 120719
1109 120719 23752 -22121 93709 130187 164303 326567 472379 425872 312219 427913 391877
1098 391877 357705 329998 291940 339967 350059 332180 547393 584718 420506 435690 484442
1087 484442 550291 626222 451317 334001 481251 675093 647277 422685 311925 402607
1077 402607 377769 604547 552751 557790 408160 448716 556287 400543 381089 503646 476421
1066 476421 458796 647475 531116 331136 491148 626428 512072 543113 515270 470937
1056 470937 372169 420136 515685 511708 425111 314417 491621 689465 757915 831534 879842
$$ packed form
1130a31581l6596j76178J02387k9707J37479J88971J49099j75703j39093Q9132
1120b1790l7734R7623J35739K1901M3524N4932j47419m3347J17511l7709o2512
1109A20719r6967m5873J15830L6478L4116J62264J45812m6507j13653J15694l6036
1098C91877l4172k7707l8058M8027J0092j7879K15213L7325j64212J5184M8752
1087D84442O5849P5931j74905j17316J47250J93842k7816k24592j10760R0682
1077D02607k4838K26778n1796N039j49630M0556J07571j55744j9454J22557k7225
1066D76421j7625J88679j16359j99980J60012J35280j14356L1041k7843m4333
1056D70937r8768M7967R5549l977q6597j10694J77204J97844O8450P3619M8308
$$ plain form
1045 879842 852303 818173 941961 1064346 1151955 1309554 1183311 1071717 1257999 1419261
1035 1419261 1441948 1395082 1471987 1460204 1512822 1437314 1259704 1443177 1439432 1518630 1627914
1024 1627914 1527532 1557938 1689883 1697699 1669754 1902395 1857517 1862124 2164665 2043792 2085194
1013 2085194 2407802 2251878 2316138 2192623 2359292 2429509 2481575 2583113 2757662 2990703
1003 2990703 2926435 2825111 3009377 3182989 3162284 3299993 3415169 3554296 3700391 3966250
993 3966250 4112459 4463338 4696039 4963272 5206480 5426716 5837270 6306196 6641391 6865455
983 6865455 7528755 8122860 8798896 9525137 10382113 11153569 12099905 12813695 13809699 15192721
973 15192721 16746690 18719227 20952604 23613995 27342761 31644182 36017302 40334508
$$ packed form
1045H79842k7539l4130J23788J22385Q7609J57599j26243j11594J86282J61262
1035A419261K2687m6866P6905j1783N2618p5508j77610J83473l745P9198J09284
1024A627914j00382L0406J31945P816k7945K32641m4878M607L02541j20873M1402
1013B085194L22608j55924O4260j23515J66669P0217N2066J01538J74549K33041
1003B990703o4268j01324J84266J73612k0705J37709J15176J39127J46095K65859
993C966250J46209L50879K32701K67233K43208K20236M10554M68926L35195K24064
983F865455O63300N94105O76036P26241Q56976P71456R46336P13790R96004J383022
973A5192721J553969J972537K233377K661391L728766M301421M373120M317206
$$ plain form
965 40334508 45742507 51611017 57330023 55791948 44950998 34890062 27964664 23222037
957 23222037 19664720 16875859 14789396 13268823 12101435 10888533 9966653 9223487 8790883
948 8790883 8583193 8217027 7700230 7187747 6726326 6103944 5617321 5395823 5074508 4750465
938 4750465 4528879 4391331 4304382 4000674 3757262 3650972 3633695 3351228 3246392 3128491
928 3128491 3061842 2974554 2997892 2751612 2743603 2633826 2514612 2521344 2380868 2138313 2097381
917 2097381 2146257 1951151 1838453 1786231 1842369 1617919 1562741 1474362 1567190 1375961 1324997
906 1324997 1336499 1378021 1386525 1262493 1318260 1255508 1124798 1079353 1185073 991900 1058042
895 1058042 1277635 1099165 844183 1027893 973343 1020701 938986 850419 762805 903140 790742
$$ packed form
965D0334508N407999N868510N719006j538075j0840950j0060936o925398m742627
957B3222037l557317k788861k086463j520573j167388j212902r21880p43166m32604
948H790883k07690l66166n16797n12483m61421o22382m86623k21498l21315l24043
938D750465k21586j37548q6949l03708k43412j06290j7277k82467j04836j17901
928C128491o6649q7288K3338k46280q009j09777j19214O732j40476k42555m0932
917B097381M8876j95106j12698n2222N6138k24450n5178q8379R2828j91229n0964
906A324997J1502M1522Q504j24032N5767o2752j30710m5445J05720j93173O6142
895A058042K19593j78470k54982J83710n4550M7358q1715q8567q7614J40335j12398
$$ plain form
884 790742 575329 530150 727584 903562 724472 646226 568635 481120 703688 792284 668292
873 668292 634948 599506 722176 523404 472302 692874 896002 617484 390794 563586
863 563586 607375 503797 480259 394225 519363 503463 555255 348931 137936 148823 393765
852 393765 365948 234492 289089 180669 411863 442777 350051 315831 530438 436705 290124
841 290124 462993 312022 277787 453590 320447 341094 323486 44980 23346 8233 -94635
830 -94635 35475 -51754 -107806 9930 38643 115028 124804 1692 -52525 36455 -149882
819 -149882 -87584 51451 167858 81497 216231 296097 -18086 53338 191053 159004 81304
808 81304 51007 65244 -65141 -43666 -109878 5522 -262845 -318698 -215720 -198233 -37682
$$ packed form
884G90742k15413m5179J97434J75978j79090p8246p7591q7515K22568Q8596j23992
873F68292l3344l5442J22670j98772n1102K20572K03128k78518k26690J72792
863E63586M3789j03578k3538q6034J25138j5900N1792k06324k10995J0887K44942
852C93765k7817j31456N4597j08420K31194L0914r2726l4220K14607r3733j46581
841B90124J72869j50971l4235J75803j33143K0647j7608k78506k1634j5113j02868
830i4635J30110q7229n6052J17736K8713P6385R776j23112n4217Q8980j86337
819a49882O2298J39035J16407q6361J34734P9866l14183P1424J37715l2049p7700
808H1304l0297J4237j30385K1475o6212J15400k68367n5853J02978J7487J60551
$$ plain form
797 -37682 -137987 -65540 -8709 141398 112222 41713 68841 165074 201153 171934 141068 44684
785 44684 47558 27995 100007 229222 318454 240642 253763 132387 109441 140310 129474 38024
773 38024 -193074 19162 23839 12559 20439 74161 -23400 -89959 -111952 17480 42452 31149
761 31149 125458 65052 2971 109558 282676 67499 180220 80910 195059 414450 226839
750 226839 84710 -4844 44110 -17758 -116574 -151333 119259 -38278 154288 120357 143741
739 143741 292642 -36422 16515 46862 -81235 -239535 -110913 -115393 -2201 278078 290352
728 290352 49396 75812 259534 223054 103336 2638 64791 48007 -88215 -106149 -155715
717 -155715 -248222 -156280 -82756 -146809 -80419 -30709 -253233 -285655 -233704 -252376 -277932 -141906
$$ packed form
797c7682j00305P2447N6831J50107k9176p0509K7128R6233L6079k9219l0866r6384
785D4684K874j9563P2012J29215Q9232p7812J3121j21376k2946L0869j0836r1450
773C8024k31098K12236M677j1280P880N3722r7561o6559k1993J29432K4972j1303
761C1149R4309o0406o2081J06587J73118k15177J12721r9310J14149K19391j87611
750B26839j42129q9554M8954o1868r8816l4759K70592j57537J92566l3931K3384
739A43741J48901l29064N2937L0347j28097j58300J28622m480J13192K80279J2274
728B90352k40956K6416J83722l6480j19718j00698O2153j6784j36222j7934m9566
717a55715r2507R1942P3524o4053O6390M9710k22524l2422N1951j8672k5556J36026
$$ plain form
705 -141906 -28037 68049 174590 -97156 -157557 -253238 -363200 -251394 -212042 -157895 -46590
694 -46590 -11004 -286800 -326838 -203039 -246267 -397876 -379238 -401942 -353434 -101826 -240392
683 -240392 -318799 -258348 -81741 57820 -95120 -98763 187380 280214 247774 108755 70882
672 70882 104264 211381 312892 132364 -13162 37414 379613 376473 162142 17120 220128
661 220128 254455 16371 88758 67599 108443 -25712 -246129 -250004 -124815 31411 66935
650 66935 140308 177187 146212 59728 103230 257769 272731 195748 66495 30488 18432 77882
638 77882 151620 131246 168946 191284 129360 59037 85639 292376 210528 71257 29189 -14783
626 -14783 -34862 -69421 -51649 42779 97460 605 34309 -1121 139446 281095 260417 49638
$$ packed form
705a41906J13869R6086J06541k71746o0401r5681j09962J11806L9352N4147J11305
694d6590L5586k75796m0038J23799m3228j51609J8638k2704M8508K51608j38566
683b40392p8407O0451J76607J39561j52940l643K86143R2834l2440j39019l7873
672G0882L3382J07117J01511j80528j45526N0576L42199l140k14331j45022K03008
661B20128L4327k38084P2387k1159M0844j34155k20417l875J25189J56226L5524
650F6935P3373L6879l0975q6484M3502J54539J4962p6983j29253l6007j2056N9450
638G7882P3738k0374L7700K2338o1924p0323K6602K06737q1848j39271m2068m3972
626a4783k0079l4559J7772R4428N4681r6855L3704l5430J40567J41649k0678k10779
$$ plain form
614 49638 -69558 86699 53216 139977 190919 119746 68741 117915 -56468 -185048 -77342
603 -77342 -24250 24027 -3746 -87677 -73854 -105118 -294192 -266885 -191176 -65032 -1035 141741
591 141741 -68988 -71299 -80956 -386020 -385561 -235151 -154809 -68652 -56072 -1763 123829 32309
579 32309 -132241 -99798 -261623 -185850 -18584 -38165 -67381 45570 67379 96485 110112
568 110112 -55266 27628 148084 133432 -13243 -50291 249925 351468 -76171 -117206 43175
557 43175 152510 -25176 -124925 -15614 59378 -104636 -123070 -168911 -224192 -102795 -38496
546 -38496 -227530 -169934 -143598 -101154 -52654 -142983 -308757 -118815 -25168 -339197 -337408
535 -337408 -218832 -361311 -363627 -356006 -358372 -327718 -192016 -345112 -378682 -408589 -347731 -339722
$$ packed form
614D9638j19196J56257l3483Q6761N0942p1173n1005M9174j74383j28580J07706
603g7342N3092M8277k7773q3931J3823l1264j89074K7307P5709J26144O3997J42776
591A41741k10729k311r657l05064M59J50410Q0342Q6157J2580N4309J25592r1520
579C2309j64550L2443j61825P5773J67266j9581k9216J12951K1809K9106J3627
568A10112j65378Q2894J20456j4652j46675l7048L00216J01543m27639m1035J60381
557D3175J09335j77686r9749J09311P4992j64014j8434m5841n5281J21397O4299
546c8496j89034N7596K6336M2444M8500r0329j65774J89942R3647l14029J789
535c37408J18576j42479k316P621k366L0654J35702j53096l3570k9907O0858Q009
$$ plain form
523 -339722 -537243 -569530 -364417 -217169 -459074 -475166 -556588 -508116 -300044 -388191 -505239
512 -505239 -253351 -140154 -186910 -187942 -42200 -67609 -206828 -231603 -217657 -136908 -94643
501 -94643 -262746 -152745 40193 -43087 -111302 -62660 -193910 -228278 -168244 -108059 -159167
490 -159167 -121820 -98048 -30074 -206449 -162036 16309 77063 95540 120438 53842 33483
479 33483 47727 -101344 -98168 -105838 9561 29044 15503 101266 167189 226023 182832 202919
467 202919 88770 129874 220899 151084 114016 169691 226092 127115 16266 -82945 58841
456 58841 -54175 -49514 -33786 176214 167499 12685 23554 4533 50381 18258 -13058 108448
444 108448 291402 -1801 -31925 -54956 24129 129267 99667 -65823 -155612 -45709 25536
$$ packed form
523c39722j97521l2287K05113J47248k41905j6092q1422M8472K08072q8147j17048
512e05239K51888J13197m6756j032J45742k5409j39219k4775J3946Q0749M2265
501i4643j68103J10001J92938q3280o8215M8642j31250l4368O0034O0185n1108
490a59167L7347K3772O7974j76375M4413J78345O0754J8477K4898o6596k0359
479C3483J4244j49071L176p670J15399J9483j3541Q5763O5923N8834m3191K0087
467B02919j14149M1104R1025o9815l7068N5675N6401r8977j10849r9211J41786
456E8841j13016M661J5728K10000q715j54814J0869j9021M5848l2123l1316J21506
444A08448J82954k93203l0124k3031P9085J05138k9600j65490q9789J09903P1245
$$ plain form
433 25536 -28782 -198638 -112243 65014 -34870 12743 18368 -2637 -26160 -126378 -153412 -76302
421 -76302 -189916 -159343 -146840 -228207 -357946 -339193 -225385 -286392 -313767 -368311 -193298
410 -193298 -393778 -370198 -322280 -169122 -161163 -126997 -193582 -84117 -41689 -125310 -35075
399 -35075 19203 -97316 -125696 -150557 -137022 -34508 -91169 -284389 -340472 -266839 -163757
388 -163757 -196032 -395539 -314056 -362927 -355672 -393104 -360513 -298060 -150298 -124414 -252205
377 -252205 -291398 -265807 -99259 -18075 6541 -140497 -211187 -93816 -46316 54329 -49255
366 -49255 30820 -78959 -133792 -115480 -53293 11491 -117283 -243710 -297761 -306117 -73911
355 -73911 -280980 -277347 -177578 -177576 -226213 -408590 -133033 -44502 -285515 -398248 -406914 -394314
$$ packed form
433B5536n4318j69856Q6395J77257r9884M7613N625k1005k3523j00218k7034P7110
421g6302j13614L0573J2503q1367j29739J8753J13808o1007k7375n4544J75013
410a93298k00480K3580M7918J53158P959L4166o6585J09465M2428q3621R0235
399c5075N4278j16519k8380k4861J3535J02514n6661j93220n6083P3633J03082
388a63757l2275j99507Q1483m8871P255l7432L2591O2453J47762K5884j27791
377b52205l9193K5591J66548Q1184K4616j47038p0690J17371M7500J00645j03584
366d9255Q0075j09779n4833J8312O2187O4784j28774j26427n4051q356K32206
355g3911k07069L633R9769Km8637j82377K75557Q8531k41013j12733q666J2600
$$ plain form
343 -394314 -146416 -191593 -333241 -334178 -299410 -310884 -370809 -530824 -438914 -363188 -434592 -437979
331 -437979 -138775 -226917 -230344 -237928 -220456 -255451 -305503 -355041 -343798 -345171 -251489 17275
319 17275 -30319 -41640 -107085 -150260 -147554 -54963 -163017 -149160 -40796 49631 -130875 -233101
307 -233101 -57359 -21492 -33360 -183509 -39181 291 -24365 -188388 -198030 -144464 -180935
296 -180935 -132594 -164296 -261579 -184977 -49381 -168733 -62868 85145 50278 21270 -65494
285 -65494 -39464 -30856 39595 2048 -138774 -187229 8832 -130198 -200445 -197831 -320795 -354888
273 -354888 -387853 -147598 -111425 -42937 -243608 -190244 -328358 -388784 -434960 -529642 -646240
262 -646240 -396281 -482475 -349538 -239900 -396365 -351307 -375787 -187091 -250090 -176694 -398463
$$ packed form
343c94314K47898m5177j41648r37L4768j1474n9925j60015R1910P5726p1404l387
331d37979K99204q8142l427p584J7472l4995n0052m9538J1243j373R3682K68764
319A7275m7594j1321o5445m3175K706R2591j08054J3857J08364R0427j80506j02226
307b33101J75742L5867j1868j50149J44328L9472k4656j64023r642N3566l6471
296a80935M8341l1702r7283P6602J35596j19352J05865J48013l4867k9008q6764
285f5494K6030Q608P0451l7547j40822m8455J96061j39030p0247K614j22964l4093
273c54888l2965K40255L6173O8488k00671N3364j38114o0426m6176r4682j16598
262f46240K49959q6194J32937J09638j56465M5058k4480J88696o2999P3396k21769
$$ plain form
251 -398463 -479054 -482255 -429730 -215208 -124950 -314809 -345664 -332491 -401371 -363989 -388717 -521773
239 -521773 -375408 -290075 -316125 -183698 -204039 -188390 -267597 -265080 -221006 -205463 -9798
228 -9798 -39586 -201652 -242874 -260132 -241963 -247868 -241463 -153815 -49477 -203139 -340585 -474410
216 -474410 -495899 -410300 -348201 -503366 -525329 -443892 -302393 -340421 -337785 -447080 -369232
205 -369232 -352424 -418577 -294665 -315198 -179730 -315960 -358367 -192890 -77919 -139784 -212773
194 -212773 -153912 -119609 -213931 -318248 -375676 -305271 -107915 -249349 -309842 -414025 -504653
183 -504653 -475723 -462532 -245775 -155662 -196100 -222155 -334368 -363856 -304104 -294685 -165147
172 -165147 -211240 -219211 -198977 -147616 -138997 -123256 -43961 -132972 -308713 -107524 -31774 -139100
$$ packed form
251c98463q0591l201N2525K14522R0258j89859l0855J3173o8880L7382k4728j33056
239e21773J46365Q5333k6050J32427k0341J5649p9207K517M4074J5543J95665
228i798k9788j62066m1222j7258J8169n905O405Q7648J04338j53662j37446j33825
216d74410k1489Q5599O2099j55165k1963Q1437J41499l8028K636j09295P7848
205c69232J6808o6153J23912k0533J35468j36230m2407J65477J14971o1865p2989
194b12773N8861L4303r4322j04317n7428P0405J97356j41434o0493j04183r0628
183e04653K8930J3191K16757R0113m0438k6055j12213k9488N9752R419J29538
172a65147m6093p971K0234N1361Q619J5741P9295q9011j75741K01189P5750j07326
$$ plain form
160 -139100 12457 -120218 -295990 -257237 -139717 -40518 -153533 -147147 -160587 -173853 -227044
149 -227044 -197659 -26967 24432 -131732 -379736 -240054 -121403 -192867 -257800 -370458 -302064
138 -302064 -220848 -326104 -282838 -294352 -257002 -51087 -217268 -188640 -129262 -76418 -88186
127 -88186 -148297 -226168 -161576 -227742 -266968 -383499 -492737 -443544 -351089 -178012 -255583
116 -255583 -194254 -240073 -319625 -362744 -350798 -444280 -370782 -117797 -233851 -222489 -158130
105 -158130 -316503 -388047 -395203 -383873 -326645 -376884 -404357 -305015 -116468 -219269 -347821
94 -347821 -264661 -238926 -305689 -342081 -336509 -367996 -366039 -414590 -430435 -492841 -425955 -287726
82 -287726 -393513 -432451 -350524 -406847 -476300 -441094 -258979 -286733 -318654 -353434 -322994 -312695
$$ packed form
160a39100J51557j32675j75772L8753J17520R9199j13015O386j3440j3266n3191
149b27044K9385J70692N1399j56164k48004J39682J18651p1464o4933j12658O8394
138c02064Q1216j05256M3266j1514L7350K05915j66181K8628N9378N2844j1768
127h8186o0111p7871O4592o6166l9226j16531j09238M9193R2455J73077p7571
116b55583O1329m5819p9552m3119J1946r3482P3498K52985j16054J1362O4359
105a58130j58373p1544p156J1330N7228n0239k7473R9342J88547j02801j28552
94c47821Q3160K5735o6763l6392N572l1487J957m8551j5845o2406O6886J38229
82b87726j05787l8938Q1927n6323o9453L5206J82115k7754l1921l4780L0440J0299
$$ plain form
70 -312695 -229965 -235907 -329030 -388625 -501638 -594072 -449210 -322988 -400241 -397313 -452481 -359664
58 -359664 -329846 -386309 -358385 -273779 -289076 -237723 -175724 -245665 -161434 -137978 -200828 -102395
46 -102395 -186493 -380852 -353561 -365686 -255380 -387397 -457633 -261475 -265424 -317131 -393692
35 -393692 -355256 -291825 -347919 -224394 -214119 -305935 -316652 -402871 -353691 -328156 -324141 -267557
23 -267557 -232944 -270321 -223084 -214130 -298788 -189297 -246754 -313025 -307233 -247725 -250015 -247931 -311533
10 -311533 -338932 -371169 -420305 -416201 -288236 -353406 -419505 -413901 -346382 -236583
0 -236583
$$ packed form
70c12695Q2730n942r3123n9595j13013r2434J44862J26222p7253K928n5168R2817
58c59664K9818n6463K7924Q4606j5297N1353O1999o9941Q4231K3456o2850R8433
46a02395q4098j94359K7291j2125J10306j32017p0236J96158l949n1707p6561
35c93692L8436O3431n6094J23525J0275r1816j0717q6219M9180K5535M015N6584
23b67557L4613l7377M7237Q954q4658J09491n7457o6271N792N9508k290K084o3602
10c11533k7399l2237m9136M104J27965o5170o6099N604O7519J09799
0b36583
$$ Imaginary data points
##PAGE= N=2
##DATA TABLE= (X++(I..I)), XYDATA
$$ plain form
16383 -4193380 -4079273 -3910015 -3933753 -3929119 -3885634 -3690831 -3435968 -3336293 -3389518 -3365896 -3326539
16372 -3326539 -3356667 -3404802 -3331253 -3354649 -3368810 -3294578 -3233875 -3130186 -3083829 -3080752 -2948020
16361 -2948020 -2905609 -2998101 -2799882 -2788426 -2827667 -2686978 -2683994 -2587394 -2527927 -2587722 -2459553
16350 -2459553 -2374010 -2330799 -2143508 -1984106 -2093710 -2046321 -2058474 -2006731 -2000900 -1879453 -1784908
16339 -1784908 -1854492 -1807050 -1783450 -1751216 -1649744 -1643200 -1736415 -1721772 -1572950 -1483358 -1472055
16328 -1472055 -1434942 -1422516 -1387772 -1362924 -1371306 -1150221 -1181592 -1128626 -1110295 -1066668 -913774
16317 -913774 -981214 -906462 -826126 -762420 -685752 -775411 -834639 -624684 -669559 -655637 -630904
16306 -630904 -689127 -608281 -596095 -568243 -493078 -471252 -383481 -271367 -257830 -278883 -278984 -211470
$$ packed form
16383d193380J14107J69258k3738M634M3485J94803K54863R9675n3225K3622L9357
16372c326539l0128m8135P3549k3396j4161P4232O0703J03689M6357L077J32732
16361b948020M2411r2492J98219J1456l9241J40689K984R6600N9467n9795J28169
16350b459553Q5543M3211J87291J59402j09604M7389j2153N1743N831J21447R4545
16339a784908o9584M7442K3600L2234J01472O544r3215J4643J48822Q9592J1303
16328a472055L7113J2426L4744K4848q382K21085l1371N2966J8331M3627J52894
16317i13774o7440P4752Q0336O3706P6668q9659n9228K09955m4875J3922K4733
16306f30904n8223Q0846J2186K7852P5165K1826Q7771J12114J3537k1053j01O7514
$$ plain form
16294 -211470 -210845 -179381 -174439 -73724 15889 84863 95888 129274 256376 315456 221191 193587
16282 193587 310970 356848 387538 420738 447452 439086 583508 596999 480615 546811 654993
16271 654993 512573 554178 565025 580606 660979 657229 715133 874300 961924 1001663 908277
16260 908277 950922 936641 959468 913937 939446 1040123 1194858 1311829 1411748 1206716 1173767
16249 1173767 1348759 1440940 1518941 1528519 1533519 1607567 1699314 1543054 1591772 1624335 1636562
16238 1636562 1611730 1718562 1882472 1859960 1796403 1851214 1947590 1979956 2003447 2135020 2026649
16227 2026649 2132766 2101091 2098543 2127345 2157968 2158426 2281182 2161219 2240808 2453783 2358648
16216 2358648 2206005 2135819 2152836 2332436 2313964 2131613 2186001 2189089 2205320 2129693 2205675
$$ packed form
16294b11470O25L1464M942J00715Q9613O8974J1025L3386J27102N9080r4265k7604
16282A93587J17383M5878L0690L3200K6714q366J44422J3491j16384O6196J08182
16271F54993j42420M1605J0847J5581Q0373l750N7904J59167Q7624L9739r3386
16260I08277M2645j4281K2827m5531K5509J00677J54735J16971R9919k05032l2949
16249A173767J74992R2181P8001R578N000P4048R1747j56260M8718L2563J2227
16238A636562k4832J06832J63910k2512o3557N4811R6376L2366K3491J31573j08371
16227B026649J06117l1675k548K8802L0623M58J22756j19963P9589K12975r5135
16216B358648j52643p0186J7017J79600j8472j82351N4388L088J6231p5627P5982
$$ plain form
16205 2205675 2167834 2342004 2292561 2299224 2313418 2351913 2479358 2560304 2580082 2618326 2640465
16194 2640465 2566903 2728534 2594262 2547645 2615119 2600047 2639301 2552153 2558674 2781431 2645980
16183 2645980 2492464 2547237 2565956 2523698 2409033 2434309 2502366 2522050 2615911 2633140 2585787
16172 2585787 2688400 2904353 2753634 2682571 2869436 3071996 3001315 2762173 2919443 2878702
16162 2878702 2858661 2879477 2790567 2719141 2670160 2830402 2957923 2843437 2909656 3018275
16152 3018275 3197738 3243807 3119087 3129441 3130961 3170573 3228342 3139898 3117708 3218792 3192505
16141 3192505 3277575 3430267 3346544 3513090 3574635 3483199 3382957 3325705 3197647 3195250 3298282
16130 3298282 3351724 3293925 3266294 3260317 3053764 3056143 2972654 3191146 3204132 3272567 3303542
$$ packed form
16205B205675l7841J74170m9443O663J4194L8495J27445Q0946J9778L8244K2139
16194B640465p3562J61631j34272m6617O7474j5072L9254q7148O521K22757j35451
16183B645980j53516N4773J8719m2258j14665K5276O8057J9684R3861J7229m7353
16172B585787J02613K15953j50719p1063J86865K02560p0681k39142J57270m0741
16162B878702k0041K0816q8910p1426m8981J60242J27521j14486O6219J08619
16152C018275J79463M6069j24720J0354J520L9612N7769q8444k2190J01084k6287
16141C192505Q5070J52692q3723J66546O1545r1436j00242n7252j28058k397J03032
16130C298282N3442n7799k7631n977k06553K379q3489K18492J2986O8435L0975
$$ plain form
16119 3303542 3318380 3416310 3352786 3202094 3395040 3480180 3398549 3310710 3290561 3455346 3447187
16108 3447187 3413100 3345033 3374241 3396650 3193437 3185784 3304121 3415857 3336073 3197666 3313651
16097 3313651 3202026 3152000 3256234 3234811 3266099 3283365 3242248 3326272 3314744 3119487 3190542
16086 3190542 3381213 3322204 3409289 3480733 3285390 3372034 3541576 3495866 3338003 3398590
16076 3398590 3450148 3331492 3292824 3269705 3288530 3277573 3275797 3335072 3208876 3098223 3222229
16065 3222229 3322489 3345174 3274761 3330776 3258156 3304094 3461531 3493939 3371616 3402274 3394210
$$ packed form
16119C303542J4838R7930o3524j50692J92946Q5140q1631q7839k0149J64785q159
16108C447187l4087o8067K9208K2409k03213p653J18337J11736p9784j38407J15985
16097C313651j11625n0026J04234k1423L1288J7266m1117Q4024j1528j95257P1055
16086C190542J90671n9009Q7085P1444j95343Q6644J69542m5710j57863O0587
16076C398590N1558j18656l8668k3119J8825j0957j776N9275j26196j10653J24006
16065C222229J00260K2685p0413N6015p2620M5938J57437L2408j22323L0658q064
$$ [...]
##END NTUPLES=NMR SPECTRUM
##END=
