##TITLE=1H_EC-3246(2)
 CDCl3, 8 sc, 
 9.04.2021
##JCAMPDX= 6.0         $$ Bruker NMR JCAMP-DX V2.0
##DATA TYPE= NMR SPECTRUM
##DATA CLASS= NTUPLES
##ORIGIN= UXNMR, Bruker Analytische Messtechnik GmbH
##OWNER= root
$$ XWIN-NMR		Version 3.5
$$ Fri Apr  9 10:46:09 2021 Russian Standard Time (UT+4h)  she@DPX200
##.OBSERVE FREQUENCY= 200.131506
##.OBSERVE NUCLEUS= ^1H
##.ACQUISITION MODE= SIMULTANEOUS
##.ACQUISITION SCHEME= undefined
##.AVERAGES= 8
##.DIGITISER RES= 18
##SPECTROMETER/DATA SYSTEM= spect
##.PULSE SEQUENCE= zg30
##.SOLVENT NAME= CDCl3
##.SHIFT REFERENCE= (INTERNAL, CDCl3, 0, 15.974)
##AUDIT TRAIL= $$ (NUMBER, WHEN, WHO, WHERE, WHAT)
$$ ##TITLE= Audit trail, XWIN-NMR		Version 3.5
$$ ##JCAMPDX= 5.01
$$ ##ORIGIN= Bruker BioSpin GmbH
$$ ##OWNER= she
$$ F:/spectra/data/she/nmr/H-F/1/pdata/1/auditp.txt
$$ ##AUDIT TRAIL=  $$ (NUMBER, WHEN, WHO, WHERE, WHAT)
(   1,<2021-04-09 10:44:55.40 +0400>,<she>,<DPX200>,
      <created by zg, POWCHK disabled, PULCHK disabled
       configuration hash MD5:
       00 E9 B6 7A A2 85 ED C7 34 08 36 98 17 FE 4E 26
       data hash MD5: 16K
       E1 7D 17 BA 31 7F 8C AB 0F 8F 54 1C 90 79 23 79>)
(   2,<2021-04-09 10:44:58.67 +0400>,<she>,<DPX200>,
      <Start of raw data processing
       efp BC_mod = 2 LB = 0.24 FT_mod = 6 PKNL = 1 PHC0 = -11118.52 PHC1 = 10.20092 SI = 16K 
       data hash MD5: 16K
       39 AF 5F 93 B4 9D A7 FC DC 14 0E 6B 11 F1 79 EB>)
(   3,<2021-04-09 10:45:17.37 +0400>,<she>,<DPX200>,
      <pk PHC0 = -0.9374833 PHC1 = 0.8 
       data hash MD5: 16K
       FD 5B B4 46 79 43 43 96 4D 1A BB 23 27 97 7B 66>)
(   4,<2021-04-09 10:45:20.70 +0400>,<she>,<DPX200>,
      <abs ABSG = 5 
       data hash MD5: 16K
       78 84 8F 7B 75 59 1F C6 1B 99 13 36 0E 2C AD 4A>)
$$ ##END=
$$ 
$$ hash MD5
$$ 38 6D 60 5D B9 F8 4E E5 FA 3A A2 CB 5F 9C B7 FC
##$RELAX= 
##$RELAX= 
##$RELAX= 
##$RELAX= 
##$RELAX= 
##$RELAX= 
$$ Bruker specific parameters
$$ --------------------------
##$DU= <F:/spectra>
##$EXPNO= 1
##$NAME= <H-F>
##$PROCNO= 1
##$TYPE= <nmr>
##$USER= <she>
##$AMP= (0..31)
100 100 100 100 100 100 100 100 100 100 100 100 100 100 100 100 100 100 
100 100 100 100 100 100 100 100 100 100 100 100 100 100 
##$AQSEQ= 0
##$AQ_mod= 1
##$AUNM= <au_zg>
##$AUTOPOS= <>
##$BF1= 200.13
##$BF2= 200.13
##$BF3= 200.13
##$BF4= 200.13
##$BF5= 200.13
##$BF6= 200.13
##$BF7= 200.13
##$BF8= 200.13
##$BYTORDA= 1
##$CFDGTYP= 0
##$CFRGTYP= 5
##$CHEMSTR= <none>
##$CNST= (0..31)
1 1 145 1 1 1 1 1 1 1 1 1 1 1 1 1 1 1 1 1 1 1 1 1 1 1 1 1 1 1 1 1 
##$CPDPRG= <>
##$CPDPRG1= <>
##$CPDPRG2= <>
##$CPDPRG3= <>
##$CPDPRG4= <mlev>
##$CPDPRG5= <mlev>
##$CPDPRG6= <mlev>
##$CPDPRG7= <mlev>
##$CPDPRG8= <mlev>
##$CPDPRGB= <>
##$CPDPRGT= <>
##$D= (0..31)
0 1.2 0 0 0 0 0 0 0 0.06 0 0.03 0 0 0 0 0.0002 0 0 0 0 0 0 0 0 0 0 0 0 
0 0 0 
##$DATE= 1617950694
##$DBL= (0..7)
120 120 120 120 120 120 120 120 
##$DBP= (0..7)
150 150 150 150 150 150 150 150 
##$DBP07= 0
##$DBPNAM0= <>
##$DBPNAM1= <>
##$DBPNAM2= <>
##$DBPNAM3= <>
##$DBPNAM4= <>
$$ [...]
##$SUBNAM3= <"">
##$SUBNAM4= <"">
##$SUBNAM5= <"">
##$SUBNAM6= <"">
##$SUBNAM7= <"">
##$SUBNAM8= <"">
##$SUBNAM9= <"">
##$SW= 16.9725357007746
##$SWIBOX= (0..15)
0 0 2 0 0 0 0 0 0 0 0 0 0 0 0 0 
##$SW_h= 3396.73913043478
##$TD= 16384
##$TD0= 1
##$TE= 0
##$TE2= 300
##$TE3= 300
##$TEG= 300
##$TL= (0..7)
0 120 120 120 120 120 120 120 
##$TP= (0..7)
150 150 150 150 150 150 150 150 
##$TP07= 0
##$TPNAME0= <>
##$TPNAME1= <>
##$TPNAME2= <>
##$TPNAME3= <>
##$TPNAME4= <>
##$TPNAME5= <>
##$TPNAME6= <>
##$TPNAME7= <>
##$TPOAL= (0..7)
0.5 0.5 0.5 0.5 0.5 0.5 0.5 0.5 
##$TPOFFS= (0..7)
0 0 0 0 0 0 0 0 
##$TUNHIN= 0
##$TUNHOUT= 0
##$TUNXOUT= 0
##$USERA1= <user>
##$USERA2= <user>
##$USERA3= <user>
##$USERA4= <user>
##$USERA5= <user>
##$V9= 5
##$VALIST= <valist>
##$VCLIST= <CCCCCCCCCCCCCCC>
##$VD= 0
##$VDLIST= <DDDDDDDDDDDDDDD>
##$VPLIST= <PPPPPPPPPPPPPPP>
##$VTLIST= <TTTTTTTTTTTTTTT>
##$WBST= 1024
##$WBSW= 4
##$XGAIN= (0..3)
0 0 0 0 
##$XL= 0
##$YL= 0
##$YMAX_a= 297663
##$YMIN_a= -260898
##$ZGOPTNS= <>
##$ZL1= 120
##$ZL2= 120
##$ZL3= 120
##$ZL4= 120
##$ABSF1= 15.98853
##$ABSF2= -0.9841337
##$ABSG= 5
##$ABSL= 3
##$ALPHA= 0
##$AQORDER= 0
##$ASSFAC= 0
##$ASSFACI= 0
##$ASSFACX= 0
##$ASSWID= 0
##$AUNMP= <proc_1d>
##$AZFE= 0.1
##$AZFW= 0.1
##$BCFW= 0
##$BC_mod= 2
##$BYTORDP= 0
##$COROFFS= 0
##$CY= -3
##$DATMOD= 1
##$DC= 0
##$DFILT= <>
##$DTYPP= 0
##$F1P= 0
##$F2P= 0
##$FCOR= 1
##$FTSIZE= 16384
##$FT_mod= 6
##$GAMMA= 0
##$GB= 0
##$INTBC= 1
##$INTSCL= 3.559346e-10
##$ISEN= 128
##$LB= 0.24
##$LEV0= 0
##$LPBIN= 0
##$MAXI= 10000
##$MC2= 0
##$MEAN= 0
##$ME_mod= 0
##$MI= 1.114404
##$NCOEF= 0
##$NC_proc= -7
##$NLEV= 6
##$NOISF1= 3.799351
##$NOISF2= 2.8
##$NSP= 0
##$NTH_PI= 0
##$NZP= 0
##$OFFSET= 15.97403
##$PC= 1
##$PHC0= -11119.46
##$PHC1= 11.00092
##$PH_mod= 1
##$PKNL= yes
##$PPARMOD= 0
##$PSCAL= 0
##$PSIGN= 0
##$REVERSE= no
##$SF= 200.130007487577
##$SI= 16384
##$SIGF1= 3
##$SIGF2= 2
##$SINO= 5.538805
##$SIOLD= 16384
##$SREGLST= <1H.CDCl3>
##$SSB= 0
##$STSI= 16384
##$STSR= 0
##$SW_p= 3396.73913043479
##$SYMM= 0
##$S_DEV= 0
##$TDeff= 16384
##$TDoff= 0
##$TI= <>
##$TILT= no
##$TM1= 0
##$TM2= 0
##$TOPLEV= 0
##$USERP1= <user>
##$USERP2= <user>
##$USERP3= <user>
##$USERP4= <user>
##$USERP5= <user>
##$WDW= 1
##$XDIM= 16384
##$YMAX_p= 332831091
##$YMIN_p= -636715
$$ End of Bruker specific parameters
$$ ---------------------------------
##NTUPLES= NMR SPECTRUM
##VAR_NAME=  FREQUENCY,     SPECTRUM/REAL,   SPECTRUM/IMAG
##SYMBOL=    X,             R,               I
##VAR_TYPE=  INDEPENDENT,   DEPENDENT,       DEPENDENT
##VAR_FORM=  AFFN,          ASDF,            ASDF
##VAR_DIM=   16384,         16384,           16384
##UNITS=     HZ,            ARBITRARY UNITS, ARBITRARY UNITS
##FACTOR=    0.207333158178282, 1,           1
##FIRST=     3196.88265165023, 0,            0
##LAST=      -199.856478784557, 0,           0
##MIN=       -199.856478784557, -636715,     0
##MAX=       3196.88265165023, 332831091,    0
$$ Real data points
##PAGE= N=1
##DATA TABLE= (X++(R..R)), XYDATA
$$ [...]
7791 27823411 28650452 29599118 31030324 32813332 34585531 36617968 39182770 41796667
7783 41796667 44426849 46472718 47374267 47519933 46887155 45919990 44802955 43818492 42987795
7774 42987795 41409760 38710066 35116820 31528394 28324943 25681872 23720453 22155194
7766 22155194 20678312 19482610 18755521 17954803 17311920 16759758 16429972 16294107 16316610
7757 16316610 16362077 16471394 16983186 17200097 17674788 18230689 18689994 19373945 20127794 20815413
7747 20815413 21467314 21778536 21394493 20535487 19704375 18788472 18164425 17380192 15892328
7738 15892328 14249164 12638111 11138837 10074111 9410995 8647252 7884226 7539485 7446438
7729 7446438 7188720 6947815 6701112 6498074 6287809 6086057 5942607 5711737 5612489 5370975
7719 5370975 4962098 4824616 4647300 4420087 4075280 3786144 3751154 3442751 3688380 3738499
7709 3738499 3572085 3418810 3388870 3244253 3076786 3071860 2984830 2794601 2768734 2856177 2746172
7698 2746172 2568260 2282417 2414734 2317570 2293008 2060380 2188994 2189581 2122398 1934863 1809569
7687 1809569 1847191 1524288 1748376 1827052 1669380 1657834 1721193 1686084 1570069 1605393 1505391
7676 1505391 1335457 1248366 1306511 1462622 1271926 1287299 1409682 1414447 1388570 1254373 1317620
7665 1317620 1328908 1243324 1160240 1282957 1297716 1181275 1301763 1272595 1285827 1225812 1162075
7654 1162075 1254535 1138715 1159005 1119427 1179633 1347539 1365421 1243870 1091383 1059041 1111406
7643 1111406 1200003 1177073 1205054 1153236 856251 1010776 1178583 1010857 1002633 836513 624370
7632 624370 731571 854708 569617 514599 731763 688235 639943 707616 751056 643052 559135
7621 559135 556050 534742 663079 628463 572057 458616 453691 408824 290254 210744 230418
7610 230418 477849 619463 576418 473247 404365 555980 630148 524704 591144 631222 664104
7599 664104 587729 705742 556629 493083 400738 462803 537936 486757 510052 365353 199636
7588 199636 214335 307361 337014 295829 524520 724632 512468 298748 422159 450514 304859
7577 304859 262347 227092 357011 634748 453273 504366 502626 385483 342330 129746 237779
7566 237779 295570 252228 100261 97539 234388 273103 269000 481078 324806 330463 151319
7555 151319 195204 281297 145892 73445 256623 328275 356294 429979 324590 281981 299155
7544 299155 227625 138133 73858 54441 202425 297858 164642 237162 155431 25759 212326
7533 212326 153634 -163734 13929 147659 44440 200280 344343 85439 338717 369530
7523 369530 181288 161799 249420 229166 158315 204765 135530 282391 229579 250355 302977
7512 302977 132004 210310 213255 200007 205872 433650 384953 242212 305761 -18203 202717
7501 202717 244355 298630 434625 605088 398224 395454 226891 325084 583100 726684 479936
7490 479936 595405 574493 398806 565379 563231 485541 433703 625861 461985 624013 804509
7479 804509 602015 764289 844946 791890 889695 1026984 975186 1184271 1300828 1298509 1543553
7468 1543553 1369953 1090607 953991 880760 941282 1060757 754621 800304 738591 486691
7458 486691 482040 271544 84926 161750 338014 431400 396595 282986 240953 293403 264523
7447 264523 204481 245251 319060 287707 176519 262373 111171 250109 442061 593869 684309
7436 684309 456478 392654 345519 413859 520419 284357 172987 256369 205860 55696 -72223
7425 -72223 -8275 1718 78995 237092 291755 240099 253653 283804 390471 182626 32402
7414 32402 -115301 -145580 -148614 12027 63605 128221 356550 197715 263738 119102 1292
7403 1292 32225 171203 156074 86120 239259 154192 127811 279724 325207 201732 190659
7392 190659 -64125 63405 246522 14496 -137244 -359727 -300141 -30325 -132105 -121480
7382 -121480 -105963 -110025 -27783 31172 -50437 -28196 44215 88371 213527 326070 373026
7371 373026 275249 209331 222776 105086 -31999 -69161 -63749 -32074 -28489 114948 -108520
7360 -108520 -219313 -173281 -82417 66754 -164015 -223249 -4949 45315 -3403 8668 29907
7349 29907 -3027 8762 8357 -37224 117279 145567 -125843 -242322 -226048 -162256 -140502 -45040
7337 -45040 -140286 -31303 89759 14237 -14468 -70890 120478 65952 -8801 -15418 -101480
7326 -101480 -8174 -163611 -133771 -137559 -53559 38089 -57969 -158333 -108381 -180603 -426014
7315 -426014 -343772 -276773 -158711 79366 -170115 -267709 -215641 -206521 -195359 -146620 56017
7304 56017 -52825 -132993 -74501 -83051 -86373 37356 -161433 -99176 6538 -52764 65040
7293 65040 26066 115394 72829 -206873 5372 79996 -210196 -57532 -166087 -237779 -168085
7282 -168085 -296874 -296491 -305319 -141596 -44933 116297 -6180 130260 92243 -58657 -51831
7271 -51831 -89560 -145646 -209236 28489 -1449 -73116 -33008 -111303 -197580 -208755 -388781
7260 -388781 -128473 64205 102147 189329 52117 85981 88067 111878 -19267 -202640 -203072
7249 -203072 -427667 -259252 -165259 -256906 -93937 -128844 -75481 -47858 -18228 -61486 32360
7238 32360 -107311 -348130 -226125 -128810 -275795 -190304 -173367 -104754 97678 189607 -80543
7227 -80543 -113074 -139584 -21845 43499 -258428 -351677 -218159 -112630 -156298 -72626 -88021
7216 -88021 -81558 -35671 -9733 -60676 -16532 -35185 -10395 63015 100998 218516 61548 -202863
7204 -202863 -212972 -275545 -250321 50489 81751 47859 -5632 -129276 -9984 -67090 46064
7193 46064 -88179 -17135 58093 179662 230309 255124 277828 -61997 -17147 79444 4996
7182 4996 60216 295388 184010 40968 9104 -55920 8600 -181685 43443 160903 167164
7171 167164 135061 -122835 -99523 40874 -5525 50504 121115 248539 361970 274794 187196
7160 187196 244981 159767 103100 -4498 -34975 70558 -136043 -72978 -9324 -88792 -190709
7149 -190709 -225679 -208565 -108809 -78717 -175916 -58784 -17826 -81888 -14642 -72883 -101530
7138 -101530 -168285 -150472 -133938 -137623 -206355 -295859 -182019 -209282 -217235 -140147 -65218 1165
7126 1165 39943 58101 -38337 -59689 -98798 -31045 170562 -17979 -47666 -44784 -49126 -85487
7114 -85487 -47909 -101799 -143856 1928 -9328 55751 -83207 -167574 -99922 -122374 -204468
7103 -204468 -73714 88993 120274 -74689 -60010 -68270 -64179 17371 -117552 -158217 -140573
7092 -140573 -177911 -189392 -110417 -143754 -69337 12761 -69076 -27626 -15157 194411 19474
7081 19474 -55340 -38189 -143365 -238480 -477201 -270700 -166080 -222604 -92062 -87804 4098
7070 4098 -79768 -160427 -55889 -56151 -255465 -217339 -163298 -79069 -200813 -190841 27818 91964
7058 91964 -17564 -194513 -184271 -266342 -170963 -191410 -393031 -247864 23332 -52849 20221
7047 20221 100286 -26975 -283536 -258385 -126739 -3545 -195342 -125839 -65465 -148406 -194462
7036 -194462 -73794 80852 -43479 -150124 -67732 -53082 -99086 -37948 170112 95737 60388
7025 60388 -91168 -335891 -270721 -173637 -53468 -164726 -206968 -156197 3023 -16482 110414
7014 110414 132253 189091 61570 47714 267118 278529 181616 63084 55965 311594 272503
7003 272503 221133 245263 412516 338224 447385 347527 186977 319930 131704 135890 163042
6992 163042 57392 -10732 -70948 -37606 -8255 -183807 -215578 -1173 -141605 -222817 -113554
6981 -113554 -125842 -120657 -188054 -145426 -111598 -82974 44616 140467 -11611 -105292 -189850
6970 -189850 -118780 -176677 -168006 -143384 143092 78973 -112774 179735 92749 -163974 -125444
6959 -125444 -96673 -124353 -295357 -152260 19184 150614 52633 -76927 -16186 -8128 -68630
6948 -68630 -74532 25793 -92043 -83354 154344 63817 -35747 88367 151411 216151 210058 227631
6936 227631 141306 176333 331439 271817 229005 337262 583714 583212 623121 517278 575528
6925 575528 531270 452075 388351 557600 715454 707226 604058 557061 599341 534590 525908
6914 525908 468572 417878 367819 365113 338118 143771 94356 268663 223736 89716 14107
6903 14107 -64358 82531 29619 38530 251026 243048 127627 139660 271903 181434 95567
6892 95567 160248 235896 156549 169539 139345 -43439 -143086 -87648 -4425 35860 -167669
6881 -167669 -37926 -34852 -151290 -86858 11675 -38696 -74084 -200812 -82526 -9944 100030
6870 100030 1618 4220 1249 122125 117275 183014 355024 172289 45839 -13371 -28012
6859 -28012 48805 -46692 36831 -26686 126230 141717 -1818 9303 -30888 -134319 -92378
6848 -92378 9911 -64295 -128482 41327 151313 184464 129724 -10249 76254 -38237 -41219
6837 -41219 23801 70341 26967 88064 206093 -15016 148675 277628 218566 352449 395107
6826 395107 293898 154453 288759 210530 310968 434142 279745 384157 411304 503859
6816 503859 696076 561577 409099 345163 437623 350769 293814 43678 -26754 59641 82161
6805 82161 -8844 201699 66481 -722 348495 435663 297081 327635 51407 -144299 30996
6794 30996 -54081 -72142 -56138 -74495 -90860 35929 182338 229846 86443 -2361 -68825
6783 -68825 9315 139623 130042 157074 54575 139614 218748 282456 294290 375188 497147
6772 497147 506305 520721 379020 242775 327246 319387 364328 348941 381919 351375 198980
6761 198980 156184 -36585 -162503 7873 245890 194455 145970 148791 154804 76276 959
6750 959 -21143 -139647 58485 224062 282204 337267 230954 300354 207419 84508 222845
6739 222845 291294 182571 145361 121877 172130 288573 113873 251970 365975 278687 237020
6728 237020 215826 230786 303921 256505 181156 120594 202467 178847 74593 251052 202593
6717 202593 206421 376822 117925 -3835 289743 160424 246862 240285 62590 100102 -43995
6706 -43995 -21096 154454 177349 -5644 107601 59496 -109506 34097 11866 138866 232703
6695 232703 111099 -14808 279014 184677 96759 209163 943 298487 395701 280784
6685 280784 305663 167735 170258 196810 200321 201323 286638 218329 117642 210046 153358 -100215
6673 -100215 1520 115838 12839 -11615 32938 -182001 -116637 -194097 -174041 57971 129689
6662 129689 271191 141217 203969 192637 191049 -57898 73404 59953 -119008 93571 156382
6651 156382 262531 216670 220655 158036 174724 328416 128812 76243 204034 -51973 129375
6640 129375 205796 94314 72616 121618 -109192 -27954 78840 82202 68889 29561 -57194
6629 -57194 29096 85237 -59221 -57164 -144641 -108189 -26640 83408 31931 38879 34067 -16549
6617 -16549 -127847 -194401 -368153 -239046 -160709 252166 331697 162745 48339 -11298 149930
6606 149930 159274 191519 155716 240073 90902 88973 108841 118378 82610 -7948 -31937 -136707
6594 -136707 -149393 110771 229368 231270 196910 248018 378651 201073 301439 334795 281124
6583 281124 212407 239520 245453 199486 113876 190336 376488 518045 571659 395606 277486
6572 277486 276722 398201 227743 250185 403129 271391 278430 270578 36089 37570 137453 192113
6560 192113 252083 111858 -129776 88788 338995 219610 52160 -51336 -225915 -121324
6550 -121324 94933 122330 118705 61540 70872 138058 27932 -130030 -20318 96023 -139743
6539 -139743 -106146 94213 116988 97465 -31570 235742 281476 187212 163976 208406 147100
6528 147100 117263 130581 228693 152331 110683 79059 43227 72962 -43698 16124 182251
6517 182251 149903 148875 202872 108084 57861 83123 30194 149860 160441 173116 129260 202012
6505 202012 249942 113272 -3674 66628 66485 84199 230979 246714 148599 55874 54130 136479
6493 136479 54611 20976 -47516 -171313 -55429 54423 193373 -30337 -50717 108926
6483 108926 113140 64363 37203 -15586 78861 147942 185496 120100 34497 208916 68429
6472 68429 -164365 -17464 95973 -62472 -58865 -154046 -26446 168433 237036 332443 258684
6461 258684 200430 11611 5899 194983 117078 -115934 4012 7679 124675 103478 156960
6450 156960 358337 132055 305284 194012 39885 121339 51575 8602 -83016 -20683 -74809
6439 -74809 187226 341395 436406 253244 290910 351514 216311 -18102 -43690 -82170 -203954
6428 -203954 -105321 126631 118306 91560 226862 336743 10304 77217 81509 61177 354275
6417 354275 363907 266773 325235 312169 237925 371421 313965 392467 427531 462483 231471
6406 231471 121119 4850 -83695 -152251 -190362 -43251 162002 241274 247899 281889 141968
6395 141968 160819 269553 344789 494139 549265 365550 438817 349176 322417 459832 541396
6384 541396 337286 287341 440175 298698 394286 489761 616530 607925 639712 436936 429926
6373 429926 582217 525028 489861 634905 689938 808570 741007 605858 716262 779728 576639
6362 576639 674986 498869 466799 650223 555975 486191 533262 688268 838575 1045573 1242899
6351 1242899 1113092 1126054 1249887 1229145 1375743 1456251 1449797 1469138 1587653 1446597 1581952
6340 1581952 1492312 1511837 1543634 1332180 1331465 1455601 1635647 1538212 1404071 1094207 943932
6329 943932 1145380 904544 903133 924575 863064 934219 799159 784794 685556 562160 416972
6318 416972 587314 654929 498359 492577 698338 765868 752421 873605 918401 568293 671469
6307 671469 776970 722137 892347 959539 810611 879357 1031882 1005159 1026999 1089372 991656
6296 991656 1106053 924869 966005 1162386 1026838 752001 606502 851279 798263 877882
6286 877882 887922 662005 760559 819101 556362 566539 427724 451179 562168 547724 474541
6275 474541 507990 456850 325769 396816 414406 415503 477775 304239 167963 256818 265170
6264 265170 304925 527468 421648 435474 697432 327244 252513 322616 267766 405008 394865
6253 394865 406655 442095 414133 395856 435787 365837 337877 338645 615560 410780 554113
6242 554113 676621 406011 381005 434193 207043 276030 279119 172239 535637 695924 528335
6231 528335 526731 350129 389015 521162 536091 414595 401333 371615 290726 312170 360407
6220 360407 446103 579680 331759 303691 548651 395933 359240 361392 542163 313902 222110
6209 222110 334111 292705 311743 462159 484067 469584 396923 434670 552085 432193 255176
6198 255176 369442 421076 441265 440957 496641 380741 589043 689173 536649 518918 685671
6187 685671 683615 610872 540723 640771 845569 701361 561942 513623 476453 402746 445045
6176 445045 395614 450851 451690 354858 342801 381369 422127 467619 581255 698963 736849 709828
6164 709828 586660 545519 482930 407138 403024 433915 466004 539557 552983 380345 348778
6153 348778 449759 463040 413168 410240 436010 418597 542721 459675 314181 502949 346611
6142 346611 287635 350387 284729 303748 314611 379668 389193 438806 565218 648469 678261 433930
6130 433930 553846 514683 436745 324133 381877 415083 466359 592184 423688 520387 715672
6119 715672 663994 593946 730653 482538 440375 665877 615575 549964 547076 561374 448375
6108 448375 290939 239283 197193 368563 323518 312609 513822 620886 700803 743302 556999
6097 556999 609385 580586 559951 575986 642491 840471 788220 688062 772902 783864 547069
6086 547069 651497 827104 767763 746988 903977 864791 712036 819042 765072 522603
6076 522603 609627 882896 780584 844297 923232 843769 868484 1014137 987154 1095051 1022058
6065 1022058 813287 842188 845987 980208 1079901 1019598 785267 929123 821466 620768
6055 620768 952749 1014701 983467 850083 724539 695844 792076 847934 696552 736317 619092
6044 619092 495106 593828 823184 766243 732483 781200 690283 693383 728679 594721 543768
6033 543768 229227 267631 534170 632926 828752 886630 781059 722365 851765 783259 681312
6022 681312 758374 943645 917180 783554 735525 904322 1018346 958689 998603 766748 485980
6011 485980 573963 646187 702580 691303 490442 651927 680412 774465 722652 667176 624551
6000 624551 601261 530496 569090 684905 436809 624504 590569 677569 795970 585864 324186
5989 324186 391484 486581 496825 410901 257368 302777 428070 473408 556604 487977 301670
5978 301670 362778 670016 575243 471097 516352 269273 501352 529518 438684 464040 419241
5967 419241 455777 422069 491785 464146 580284 508358 555543 533931 663687 783928 824714
5956 824714 757199 648700 599002 709189 582232 500813 508325 469310 508706 509447 587457 570170
5944 570170 693582 493139 459235 338782 476162 634020 613315 527882 597279 715004
5934 715004 420070 303714 689701 709973 732971 689429 709428 825350 753614 763482 833888
5923 833888 720387 584955 504952 642810 581339 504759 661994 900858 887147 913219 979670
5912 979670 877091 755731 737657 868546 822268 766733 888994 948016 871584 954252 934693
5901 934693 914817 832538 945691 911699 971037 901513 935653 1087566 954856 883317 1036937
5890 1036937 1063616 988259 929446 927595 1048217 1060263 1087484 1239762 1151622 1106072 1286308
5879 1286308 1431699 1427075 1325788 1159668 1009123 1146698 1412771 1558226 1602403 1532394
5869 1532394 1647403 1604345 1696328 1778125 1818549 1775897 1775399 1886397 1700258 1774486 1847143
5858 1847143 1954060 2095484 1797475 1733992 1782606 1519467 1520871 1491963 1308610 1406577 1446619
5847 1446619 1276408 1440532 1484057 1579299 1650284 1602927 1514764 1556273 1374232 1381830 1529921
5836 1529921 1486679 1367619 1390730 1403115 1353303 1607515 1664084 1489950 1293852 1433009
5826 1433009 1614490 1647370 1592696 1606744 1728191 1653278 1625472 1639557 1873078 1677237 1706532
5815 1706532 1793220 1853158 2038999 1844070 1669118 1702477 1886104 1862103 2038260 1805474
5805 1805474 2024460 2151910 2204076 2352061 2207497 2320433 2245772 2233684 2279061 2348136
5795 2348136 2441318 2730611 2806168 2813583 2818463 2622618 2689266 3007452 3034705 3130536 3093354
5784 3093354 2944372 3278204 3468777 3336398 3139742 3099072 3120657 3242820 3434663 3601978
5774 3601978 3705123 3810978 3880963 3814082 3813829 3924838 4062144 4042648 4109993 4080785 4279326
5763 4279326 4665048 4736351 4762115 4795109 4988542 4983169 4987631 5177996 5501251 5552489 5660431
5752 5660431 5804651 5669614 5950057 6008510 5955669 6412635 6699376 6771102 6972695 7031028
5742 7031028 7010403 7432687 7643428 7897228 8219722 8447609 8674372 9087195 9286787 9567178
5732 9567178 9942270 10289704 10474617 10947883 11566788 11782160 12267169 12665377 13204187 13827685
5722 13827685 14294425 14604182 15262230 15871646 16484743 17358028 18095127 18834507 19704546
5713 19704546 20716745 21492733 22388173 23462311 24584545 25708560 26893681 28122563
5705 28122563 29327519 30381822 31407744 32614103 33583736 34577718 35404454 36262104 36823851
5696 36823851 37256126 37412020 37447894 37468258 37366258 36713600 36055925 35118172 34103180 33171368
5686 33171368 31741852 30774695 29668475 28457595 27211350 26069653 24836927 23744742
5678 23744742 22527692 21507273 20675330 19756913 18903050 17729769 16846536 16219767 15705197
5669 15705197 15079381 14197042 13629709 13030275 12386673 12020017 11621673 11066650 10797699
5660 10797699 10484594 10019493 9641356 9283919 9033822 8810847 8643340 8144482 7842698
5651 7842698 7647271 7452776 7221240 6969635 6782400 6558265 6268237 6084456 5941575 5683801
5641 5683801 5577587 5478428 5335235 5385564 5127655 4966336 4935818 4695652 4584733 4367023
5631 4367023 4132682 4056546 3976133 4009306 4040874 3808776 3719548 3637521 3653175 3701291 3565584
5620 3565584 3545495 3479667 3382635 3244731 3106749 2955143 2876570 2871226 2644661 2839864 2889115
5609 2889115 2753807 2767856 2613016 2465415 2467094 2410745 2251019 2222791 2284840 2205480 2114106
5598 2114106 2086556 1973301 2141515 2112595 1842557 1845742 1823923 1900080 1799516 1754634 1815693
5587 1815693 1741930 1781077 1615295 1736461 1797293 1652570 1546696 1486211 1578847 1664137 1481063
5576 1481063 1672178 1640138 1436204 1509656 1501766 1337155 1309651 1428906 1292009 1346155 1318771
5565 1318771 1281873 1290445 1266611 1441595 1393727 1298873 1254376 1275449 1359626 1102246 1228454
5554 1228454 1302452 1169361 1367223 1213826 977744 1041403 1263917 1192188 1145144 1062472
5544 1062472 980672 1272430 1144899 1145371 1292242 1253582 1106227 1019538 1091350 919635 909441
5533 909441 1173420 907548 859427 1059447 969117 939537 1072856 1043235 1053177 992728 1096495
5522 1096495 1078709 1154521 1084578 1182799 1193514 1292876 1235421 1134319 986710 970179 1110782
5511 1110782 936759 1010842 927499 1010715 1180506 1087833 1038725 1179107 1030860 1036504 958927
5500 958927 1065162 1143685 1085919 886334 941120 1225990 1326796 1307954 1165120 1178567 1347877
5489 1347877 1480622 1473256 1619042 1832358 1792960 1699541 1626430 1612803 1560753 1566339 1695326
5478 1695326 1467758 1318840 1145608 1058723 1141158 998870 1102265 1004973 853630 946823
5468 946823 901669 780167 1004209 1009898 1094645 1211802 1052915 866149 777573 979108 1030088
5457 1030088 1068193 1008333 875453 818900 885087 915928 759712 794597 736804 869938 865071
5446 865071 772897 888619 933899 881807 848225 792207 860786 1079494 942690 875914 829892
5435 829892 708507 669778 779314 774138 809761 871459 813732 838996 871430 514212 575764
5424 575764 879067 802079 764392 642651 636800 816788 756706 725233 867784 861395 957291
5413 957291 982449 853764 841849 871336 856042 928297 938186 1028912 1084927 1201757 967949
5402 967949 771271 816691 933969 835413 985360 1136694 925882 841824 767265 905642
5392 905642 1068484 1041374 791664 765394 844064 944365 1153311 1053190 1139295 1084971 836209
5381 836209 821194 853542 880554 810296 849333 838515 1040190 1124504 1001157 948568 901142
5370 901142 936211 807696 881845 855391 943785 1030583 954203 1054029 1168753 1149686 1120708
5359 1120708 1136097 1128798 1090376 819350 921520 1233271 1249463 1280692 1432354 1190564 1163231
5348 1163231 1267609 1096762 1191013 1330141 1175731 1237087 1138595 1130682 1166715 1369222 1285969
5337 1285969 1182107 1125146 1052769 1087856 1185588 1150421 1202340 1339696 1442043 1362212 1343058
5326 1343058 1404873 1306455 1388016 1282368 1204160 1320260 1173845 1272580 1403049 1364676 1482544
5315 1482544 1429821 1428391 1595447 1571396 1627978 1624267 1426945 1512028 1533119 1462464 1571687
5304 1571687 1566833 1645450 1769478 1622646 1645675 1595201 1559576 1701563 1747284 1672554 1708827
5293 1708827 1662012 1727547 1974222 2032183 1866068 2025244 2133961 2137048 2115563 2252350 2320763
5282 2320763 2243861 2346245 2415874 2378238 2360391 2448160 2487659 2591337 2678861 2532842 2675156
5271 2675156 2508118 2611795 2816340 2752719 2648680 2992345 2875531 2846035 2874582 2960047
5261 2960047 3071551 3072883 3223952 3387997 3479284 3403864 3629749 3538059 3693526 3722792 3666867
5250 3666867 3862258 4065140 4045843 4051100 4082917 4290223 4418628 4555182 4491118 4340391
5240 4340391 4515597 4887349 5012529 5200952 5272510 5280467 5385290 5319911 5454521 5611841
5230 5611841 5787160 5957956 6147758 6142330 6069114 6331570 6453150 6520410 6816986 7127512
5220 7127512 7331693 7668123 7705030 7955857 8491323 8689806 8975213 9171848 9430382 9693817
5210 9693817 10026311 10280939 10610770 10960623 11358460 11795973 12217239 12510995 12893791 13355290
5200 13355290 13866750 14763625 15569773 16323692 17377193 18297902 19452249 20950083 22348748
5191 22348748 23929581 25929318 28100479 30192008 32955032 35836633 39150040 42725934
5183 42725934 46074883 48642093 50631200 51425605 50863461 48861264 45876800 42884457
5175 42884457 40002837 37590623 35630105 34167472 33039593 32394286 32168103 31932768 32075196
5166 32075196 32517584 33031352 34014868 35268710 36599547 38713758 40991317 43272290 46141299
5157 46141299 49456924 53330205 57686830 63112613 69007490 75414678 82234546 88735329
5149 88735329 93745493 96093202 95467476 91573373 85000001 76885934 68343666 60561536
5141 60561536 54111180 48870654 44764799 41695942 39078389 36985606 35306997 34063429
5133 34063429 33087246 32273408 31904280 31835976 31600294 31882688 32258330 32847544 33782883 34952104
5123 34952104 36617740 38317759 40347185 42995003 45533778 47916276 50277272 51508263
5115 51508263 51461269 50063266 47257864 43466272 39389067 35208736 31237562 28060804
5107 28060804 25294537 23252515 21491039 19711464 18473600 17356877 16198788 15508822
5099 15508822 14457315 13633341 13148414 12502561 11819720 11254919 10587503 10167159 9855616
5090 9855616 9316014 8913708 8532494 8139724 7787575 7661969 7444727 7106944 6854647 6772688
5080 6772688 6508804 6209908 6021494 5939710 6033050 5686857 5449523 5738805 5479893 5349011
5070 5349011 5348392 5083020 4937015 5150298 4810754 4744164 4745496 4296267 4244628 4219078 4139477
5059 4139477 4028087 3946532 3674437 3634220 3725575 3445066 3525352 3264856 2984366 3010984
5049 3010984 2965429 2781801 2867345 3074876 2955689 2784311 2843998 2753201 2640583 2569733
5039 2569733 2602970 2672188 2776363 2696245 2820818 2793002 2705629 2816151 2781937 2816032 2917636
5028 2917636 2953363 2937868 2913020 2903163 3014482 3122022 3036342 2728943 2487723 2450542 2485385
5017 2485385 2157663 1923997 1814799 1797215 1754246 1871750 1880465 1722987 1640200 1533569
5007 1533569 1623724 1591419 1495312 1441889 1473040 1572263 1429972 1406720 1321086 1481763 1607480
4996 1607480 1526187 1292812 1324781 1300207 1279598 1596399 1439625 1228690 1343045 1345806 1311559
4985 1311559 1339169 1350079 1469587 1346114 1253221 1377251 1441431 1194446 1204149 1267889 1114820
4974 1114820 1383651 1155862 999937 1113276 1112255 1035301 1058078 1083566 1085917 1022329 1034492
4963 1034492 962009 920548 996635 1123345 1164607 1166216 1237672 1214249 1146238 1019166 1269533
4952 1269533 1089836 1094836 1245056 957727 905312 983293 858755 833670 1071049 817187
4942 817187 873155 838586 818365 986045 1126624 834152 816244 902170 716770 747687 607230
4931 607230 722933 885624 735369 702780 1063268 999854 980543 930524 622870 710814 928685
4920 928685 962362 1046148 1039818 907186 762172 745479 693372 768343 910946 712000 770634
4909 770634 848410 719717 881897 912771 920799 939957 1007848 894683 828970 776499 738479
4898 738479 954492 993338 1072646 1088071 1198812 1139303 1042670 1124154 1341416 1419977 1209787
4887 1209787 1080688 954470 955413 1087311 1130141 1069335 1052386 1183674 1052408 803427 947996
4876 947996 1048308 1176406 880438 982797 1153870 1275589 1246549 1079349 1191089 1192803
4866 1192803 1119709 1087009 1132634 1132579 1306915 1413580 1319415 1421827 1166989 1058671 1070413
4855 1070413 1289055 1366822 1293780 1281640 1175440 1202732 1329837 1178840 990973 1269597
4845 1269597 1306904 1149330 1106493 1112303 1289688 1360567 1434220 1410476 1314685 1373246 1329265
4834 1329265 1463289 1314633 1362217 1355402 1352114 1519934 1588196 1821314 1918444 1864634 1923533
4823 1923533 1881747 1879930 2007792 2046072 1995997 1986574 2124061 1980568 1706196 1841926 2048977
4812 2048977 1756596 1774115 1949893 1735208 1704644 1684416 1521620 1790555 1861391 1575147
4802 1575147 1555523 1389348 1151361 1209352 1042969 1286966 1323050 1003136 1196907 1376546
4792 1376546 1399524 1236021 1342410 1259840 1472638 1532564 1460466 1450284 1560013 1405586
4782 1405586 1405182 1497401 1451966 1333626 1510848 1501996 1362025 1411717 1343818 1383215 1415638
4771 1415638 1353971 1036216 1118170 1087065 1126966 1559131 1428881 1438569 1411473 1287383 1130182
4760 1130182 1181877 1116585 1292677 1277323 962500 997981 948661 775581 810070 820764 754986
4749 754986 768185 853212 1020250 887257 921788 832461 884676 893737 1019444 1137759 1081597
4738 1081597 945384 911562 976774 1045674 1050883 1238968 1077216 1137013 1187776 1047111 1028473
4727 1028473 842471 966865 954540 950893 1027077 968196 1051889 1070488 1144600 1119708 1094089
4716 1094089 1133924 1169198 1175856 1185915 1146436 1167969 1006537 1177966 1362632 1351984 1491644
4705 1491644 1417246 1497299 1435325 1452593 1495495 1572471 1508877 1500497 1691074 1715329 1495310
4694 1495310 1634613 1862596 1852621 1820261 1783359 1697555 1755948 1812416 1698514 1727496 1721588
4683 1721588 1575136 1724617 1509414 1400748 1559249 1321463 1270837 1250413 1148015 1282192
4673 1282192 1428528 1455124 1603866 1719876 1652134 1471173 1580072 1672202 1835205 1896510
4663 1896510 1738331 1768934 1668981 1705389 1951721 1940259 2009913 2010918 2183356 2322696 2171935
4652 2171935 2079761 2201894 2094093 2164919 2368089 2223394 2195538 2379127 2397629 2584795
4642 2584795 2564647 2747518 2763107 2525221 2585497 2717321 2899677 2969987 2812570 2881345
4632 2881345 3109258 3034979 3149928 3442184 3212995 3168994 3152550 3332230 3466893 3311977
4622 3311977 3262857 3056294 2943175 3153164 3158200 3205430 3234539 3377603 3465815 3384712 3429878
4611 3429878 3452186 3563305 3464497 3575166 3619139 3751311 3748366 3736926 3772490 3836420 3844814
4600 3844814 3922597 4171455 4304100 4257825 4256466 4509109 4717117 4680795 4659634 4936148 5097183
4589 5097183 5013470 5412710 5267301 5587787 5669322 5529409 5918197 5988154 6065556 6379341
4579 6379341 6332655 6461278 6723003 6634638 6523500 6660964 6809203 7098595 7290147 7482441
4569 7482441 7606174 7810520 7907227 8093666 8322836 8680059 8941652 9080228 9218784 9477399
4559 9477399 9798820 9972776 10176672 10290059 10673102 10717000 10974562 10965031 10981022 11124064
4549 11124064 11303398 11646015 11959875 12077782 12389900 12825547 12905656 13312725 13761976 14116010
4539 14116010 14924572 15775772 16187638 16914409 17669709 18421154 19429014 20380540 21312736
4530 21312736 22378586 23540010 24793530 26177315 27455448 28796398 30388468 32212524
4522 32212524 33996864 35932317 37795660 39709139 41795464 44287015 47148739 50262679
4514 50262679 53831580 58059047 63107086 68700788 74976287 81706286 88922594 96741616
4506 96741616 104698900 112706786 120180886 127277066 134130713 139882472 144918035 148324480
4498 148324480 149477846 148297201 144391899 138656392 131525099 123668364 116056546 108730060
4490 108730060 101334832 94307775 87176790 79958393 72787169 66030270 59801614 54120726
4482 54120726 49222059 45015129 41411584 38226505 35199436 32951843 30713738 28742098
4474 28742098 27114055 25536490 24134569 22988912 21977610 20993717 20143643 19319368 18565910
4465 18565910 17743679 17021797 16491654 15829148 15503363 14982271 14540623 14178174 13872958
4456 13872958 13756095 13202621 12579153 12075296 11726584 11320075 11052101 10725549 10326598
4447 10326598 9993493 9490232 9154548 8790394 8379335 8047317 7813736 7633332 7314171
4438 7314171 7118387 6840220 6748772 6625213 6330453 6265402 6215520 6067960 6025777 5815323
4428 5815323 5786151 5931389 5834748 5775614 5657504 5295934 5332160 5004041 5001246 4962785 4886437
4417 4886437 4845569 4583740 4341054 4338466 4479211 4267672 4335150 4408110 4360159 4292092 4014974
4406 4014974 4015231 3975320 3971660 4030651 3906374 3832948 3592425 3529648 3512101 3304470 3212113
4395 3212113 3147395 3427350 3292205 3139134 3175126 3250715 3060243 3220837 3265908 3351611
4385 3351611 3376817 3046427 3068696 3032711 3220297 3168119 3221184 3426169 3310749 3377067 3462104
4374 3462104 3228623 3031062 3090207 3065918 3031316 3069193 3038931 3205905 3038848 2885781
4364 2885781 2974566 2903442 2789908 2790547 2694563 2684768 2708162 2699578 2642262 2591588 2551450 2491671
4352 2491671 2572059 2576250 2349472 2474549 2419161 2460917 2547036 2430637 2494926 2610370 2570009
4341 2570009 2583121 2573508 2550648 2541311 2577077 2502954 2506498 2482452 2411899 2345433 2437273 2286858
4329 2286858 2541545 2869516 2852398 2797608 2835569 2820211 2864413 2941561 2896616 2886450 3113992
4318 3113992 3088812 2936956 3123983 3090554 3147561 3149871 3157557 3354043 3651898 3433440 3348122
4307 3348122 3538180 3499941 3490217 3511522 3499807 3713203 3696461 3791595 3874997 3838521 3809170
4296 3809170 3959659 3999074 4016502 4079221 4169169 4285326 4428042 4534577 4876647 4948232
4286 4948232 5189585 5308655 5355170 5378916 5371401 5635507 5858824 6073536 6445807 6839353
4276 6839353 6944034 7457587 7747682 8185633 8632646 9062969 9718989 10678071 11328490 12180297
4266 12180297 13621150 15062473 16699723 18741088 21184924 23996090 27470328 31145700
4258 31145700 35852448 39273199 39938333 38566729 36670228 34549916 32694501 30822769
4250 30822769 27292238 22749102 18600584 15481428 13183310 11680924 10535364 9821612
4242 9821612 9084085 8548139 7864743 7345123 6890332 6513771 6129013 5887928 5751397 5554979
4232 5554979 5266296 5095899 4826867 4612362 4413724 4290530 4195144 4060778 4014460 4018987
4222 4018987 3890803 3540692 3489180 3554337 3332964 3300993 3213158 3182517 3146447 2913992 2816418
4211 2816418 2851486 2839320 2892840 2935853 2838948 2711811 2483062 2676972 2764061 2674959 2612393
4200 2612393 2645010 2598008 2593067 2522939 2436876 2469132 2493444 2569141 2371187 2380514 2457896 2538790
4188 2538790 2448853 2328510 2291870 2221492 2165944 2198666 2185945 2196339 2521521 2451761 2419189
4177 2419189 2657341 2573711 2401313 2385711 2379358 2423041 2412880 2338841 2113700 2171315 2246213
4166 2246213 2003106 1926222 2104216 2083144 2122266 2129877 1936978 1877888 1808450 1684660 1802420
4155 1802420 1728358 1515307 1651504 1603631 1620394 1670699 1673938 1679319 1677471 1626413 1469627
4144 1469627 1539130 1609654 1651567 1536581 1528410 1491677 1493561 1567796 1555545 1633672 1583575 1437922
4132 1437922 1562883 1417411 1586846 1725323 1655282 1624904 1600247 1428258 1358831 1560832
4122 1560832 1387241 1411904 1427241 1348431 1358632 1394168 1306385 1361575 1549979 1514578 1547352
4111 1547352 1561802 1477335 1332162 1145031 1351555 1396831 1400951 1486044 1238133 1278178 1293070
4100 1293070 1450900 1476068 1549734 1638758 1620890 1518461 1598829 1583060 1474854 1629522 1495289
4089 1495289 1412336 1429691 1419310 1546063 1512626 1487687 1659222 1580919 1836162 1766281 1628846
4078 1628846 1799014 1831329 1827163 1977641 1822004 1735860 1788399 1770485 1856319 2032061 1891389
4067 1891389 1873007 1876513 1753627 1869686 2033119 2005819 2107652 2104851 2097628 2171211 2112959
4056 2112959 1946129 2108813 2260527 2147637 2003591 1902089 1856354 1837707 1935064 1881032
4046 1881032 1975467 2231902 2268018 2213332 2262140 2165625 2031050 1927237 1957099 2071495 2199037
4035 2199037 2246447 2401294 2447915 2271583 2183226 2327021 2372961 2296704 2266547 2306033 2493260
4024 2493260 2553139 2461533 2378169 2179825 2300834 2373199 2433287 2374568 2353732 2335335 2378467
4013 2378467 2395287 2292249 2362728 2258759 2125569 2086426 2090259 2179644 2040159 2196173 2267865
4002 2267865 2012449 1975051 2120989 2166743 2212137 2082932 2017375 2081817 1951328 2098833
3992 2098833 2287169 2126606 2056003 2191528 2188203 2247777 2157807 2363901 2349075 2319489 2305805
3981 2305805 2326204 2259673 2109018 1911092 1918717 1916087 2037138 2129989 2257091 2289149 2190889
3970 2190889 2293380 2209025 2336305 2265361 2141478 2285477 2324090 2211946 2123773 2041592
3960 2041592 2171340 2233366 2379255 2447068 2491186 2405929 2423343 2455907 2390754 2298322 2360186
3949 2360186 2505766 2373467 2403946 2335593 2290535 2406463 2589095 2411442 2500517 2763661
3939 2763661 2784779 2892378 2626878 2543435 2730360 2777462 2925128 2894973 2724501 2723019 2950960
3928 2950960 2879254 2883802 3046361 3060440 3083584 3105782 3069044 3146155 3321600 3297199 3086312
3917 3086312 3284383 3286650 3410345 3447245 3162798 3311602 3585434 3515130 3487325 3531722 3437770
3906 3437770 3609822 3741952 3682333 3774045 3758634 3751726 4016722 3923945 3891195 3800950 3958913
3895 3958913 4229668 4244862 4058936 4380118 4562499 4717542 4703364 4548522 4645916 4733602
3885 4733602 4692442 4994786 5027658 4962663 5156372 5316944 5094628 5164645 5290252 5300531
3875 5300531 5613773 5706280 5733905 5800702 5917467 6096768 6086289 6337706 6471800 6353462
3865 6353462 6602272 6658324 6771009 6915500 6945620 7010596 7224694 7143569 7173608 7342665
3855 7342665 7065399 7276328 7292689 7333764 7564094 7622065 7759036 7966158 8253441 8445612
3845 8445612 8509203 8649744 9001243 9288429 9583420 9693807 9854098 9699412 10209640 10457609
3835 10457609 10813692 11183980 11330224 11494765 11925401 12345074 12678977 13072751 13322747
3826 13322747 13683378 13985155 14346553 14389653 14844002 15588317 16123388 16693832 17184235 17808309
3816 17808309 18609934 19525148 20445785 21407601 22550690 23484685 24883936 26265240 27727804
3807 27727804 29939240 32133331 34793656 38375635 42407108 47149076 52311238 57022568
3799 57022568 60790182 62701405 62776501 60238477 56204903 51410879 46721529 42810142
3791 42810142 39855909 38441459 37602530 37099841 37002387 36944711 36814896 37121787 37384212
3782 37384212 37706076 38299535 38961880 39385949 39951055 40668819 41363535 42445997 43357754
3773 43357754 44183426 45009614 45871254 46402852 47000972 48000187 48812088 50015766 51399942
3764 51399942 52829035 54774560 56593369 58786221 61435131 63796312 66273194 68965232
3756 68965232 71468155 74049143 76967243 79792699 82582265 85194291 87831472 90335960
3748 90335960 92661595 94843150 96387216 97991551 99664815 101544359 103809712 106322908
3740 106322908 109584099 112963419 116787218 121242206 126038609 131578292 137981271 144165245
3732 144165245 150540735 156006205 159208835 160536710 159506708 155747233 150887059 146170547
3724 146170547 141539864 137823061 135736322 134884834 134921390 135578969 136444802 137448806 137473545
3715 137473545 136832995 134966592 131589787 127054024 121907229 116138027 110109589 104294077
3707 104294077 99140356 95296724 92281953 90661417 90141883 90558642 91976535 94008152
3699 94008152 96420226 98798847 100013587 99824443 97592929 93343006 87708449 81469782
3691 81469782 75327417 69986403 65466246 61744678 58915825 56992186 55301900 53968377
3683 53968377 53079028 52651613 52446064 52329974 52547721 52882332 53741889 54470906 55171590
3674 55171590 56000593 56559009 56791108 56686750 56154007 55046177 53761724 52285073 50446203
3665 50446203 48643221 46484830 44627744 43041525 41317056 39609619 38186905 36539960
3657 36539960 34907424 33371339 31662771 30056280 28466203 26853685 25323937 24147010
3649 24147010 22850977 21709531 20845640 20235474 19516297 19011127 18348880 17813859 17400281
3640 17400281 16889102 16517657 15875836 15413506 15152467 14782617 14349466 14212390 13987018
3631 13987018 13459860 13310016 13051416 12712244 12615430 12438315 12224829 12010898 11761503 11453586
3621 11453586 11493769 11369312 11413692 11442374 11197600 10821732 10741524 10564927 10200461 10154706
3611 10154706 10095976 10069849 10029316 9844822 9958579 9680900 9419085 9409414 9206590 9115782
3601 9115782 9010947 8943285 8978159 8989874 8804914 8810135 9050710 8825870 8652930 8873003
3591 8873003 8994515 8546166 8597831 8662916 8582509 8779845 8615947 8429594 8590672 8367218
3581 8367218 8149550 8275831 8082526 8192937 8401473 8378732 8364787 8393333 8309865 8236218
3571 8236218 8473154 8178603 8149860 8407364 8479457 8652597 8637305 8584647 8644517 8728355 8520595
3560 8520595 8644239 8652812 8512379 8201121 8438243 8498034 8429280 8571138 8680714 8681621 8658123
3549 8658123 8654715 8621410 8726460 8749403 8806419 8764282 8879674 9344272 9256688 9207544 9534690
3538 9534690 9788372 9764312 9844322 9611414 9714622 9894085 9818543 10099615 10355800 10476252
3528 10476252 10581717 10617122 10651485 10811635 11119568 11231806 11350845 11526285 11647768 11779544
3518 11779544 11791641 11969243 12184228 12272116 12245300 12708285 12909522 13001935 13205039 13430252
3508 13430252 13554490 13558420 13759858 13850747 14174634 14409785 14480931 14771169 14878053 14969777
3498 14969777 15319897 15639498 15793031 16189706 16277337 16608298 17168389 17477869 17847841 17964564
3488 17964564 17883987 18449019 18563081 18701835 19047066 19394193 19480377 19749080 20082308 20337225
3478 20337225 20794657 21087893 21452792 22022796 22553167 23077979 23700628 24217754 24676546
3469 24676546 25426176 26278045 27209395 28155330 29215833 30407852 32035533 33253978 34319167
3460 34319167 35971818 37531746 39272257 40866868 42195257 43650361 45588248 47048212
3452 47048212 49012613 51066224 53213367 55683181 58531429 61557489 65206663 69204382
3444 69204382 73734664 79208098 84955699 91223797 98280232 106111153 114850125 125095710
3436 125095710 136828361 150243079 166487307 185761406 208379333 234134441 261197919
3429 261197919 287074243 308496220 320215573 317550495 300290456 271497738 237654960
3422 237654960 204701197 175588544 152083123 133573806 119321049 108237608 99791791
3415 99791791 92554363 86391127 81190500 76324120 72084260 68420431 64884180 62016371
3407 62016371 59593856 57150997 55003507 53141755 51543990 50224961 48953825 47841193
3399 47841193 47226663 46566504 46123225 45872505 45679206 45527938 45539538 45580170 45587294 45611715
3389 45611715 45775736 45603206 45648903 45596659 45737343 45995470 46334694 46991299 48405694 49900280
3379 49900280 51663051 54075110 56655358 59849388 63383084 67004929 70410100 72746297
3371 72746297 74117700 74281807 72883655 70312579 67219738 64249343 61445999 59451184
3363 59451184 57987423 56644031 55798954 54879175 53872851 53155154 52483669 52196880 52395727
3354 52395727 52561435 53033653 53944862 55099768 56746304 58877271 61392278 64851990 68802710
3345 68802710 73535561 79524047 86231262 93815059 101207033 107384878 111589021 112524127
3337 112524127 109797309 103900641 95927637 87176788 78882622 71661012 65839748 60808727
3329 60808727 56553551 53214559 49958820 47317278 45312820 43349500 42076318 41126537
3321 41126537 40050091 39624849 39441645 39419569 39752863 39963411 40481858 41654849 43244955
3312 43244955 44856220 46832140 49274526 51752681 54082481 55570279 56129771 55517056
3304 55517056 53295356 49892948 45718166 41281008 37277772 33714192 30787096 28451163
3296 28451163 26378818 24690219 23277212 22167354 21152824 20073229 19168254 18357163
3288 18357163 17784818 17171402 16631334 16224581 15603832 14991959 14567412 14166026 13868133
3279 13868133 13534478 13280919 12974346 12609212 12358479 11952962 11836379 11754790 11533997 11451833
3269 11451833 11252254 11084980 10729017 10575277 10368731 10091773 10086655 9919096 9733869 9666157
3259 9666157 9492389 9458591 9402261 9237831 9224920 9110059 8958096 8817920 8599749 8569332
3249 8569332 8355298 8447256 8546590 8283624 8273616 8104692 8117601 8092586 7975870 7895001 7873343
3238 7873343 7862627 7530428 7707199 7577500 7606653 7750239 7517012 7548706 7493084 7581988
3228 7581988 7518778 7707424 7726630 7636064 7545081 7570213 7745110 7745698 7794273 7658017 7480744
3217 7480744 7454281 7520266 7356226 7522796 7564221 7578338 7545698 7545486 7393865 7293775 7444493
3206 7444493 7429426 7507260 7633862 7723912 7626565 7808222 7882796 7632195 7509551 7659101
3196 7659101 7608289 7684235 7817100 7801133 7886348 7974424 8069432 8122986 7994341 8131268 8326026
3185 8326026 8257708 8414662 8611214 8455284 8377318 8455936 8574786 8677901 8778697 8770809
3175 8770809 8880186 8845540 9183204 9343642 9348214 9554124 9770669 9639329 9665311 9850500
3165 9850500 10199157 10579019 10626367 10909890 10902568 11036837 11470082 11682959 12152641 12808901
3155 12808901 13246346 13681368 14093599 14869111 15425946 16018281 17026502 17737177 18377106
3146 18377106 19377510 20595170 22052575 23350204 24533219 25509503 26584006 27286642
3138 27286642 28000443 28620984 29350101 30081814 31117487 32376265 34297775 36661796 39283283
3129 39283283 42733169 46896566 52124927 58783987 66644523 75143773 83948785 90964112
3121 90964112 94639861 93244476 86670259 76986741 66431037 56793925 49488370 44550168
3113 44550168 41155742 38656936 36897065 35315687 33698801 32032767 30109441 28126282
3105 28126282 26448433 24624616 23147052 21780233 20351561 19495749 18691172 17789987 17294048
3096 17294048 16979210 16581939 16216344 15831358 15732662 15687188 15338277 15189674 15281207 15340577
3086 15340577 15558939 15797044 15920726 16014332 15644545 15390126 14944569 14368280 13824949 13113980
3076 13113980 12764892 12007892 11525792 11250284 10948217 10790268 10560168 10553356 10298251 10137157
3066 10137157 10143813 9967237 10004252 10051946 10009020 10131386 10146757 10137521 10372640 10775397 10976258
3055 10976258 11432250 11676458 12097179 12661475 12871665 12876293 12230147 11575277 11045805 10388973
3045 10388973 9932965 9986905 9813655 9824759 9867832 9719409 9932568 10001310 10184280 10119998
3035 10119998 9937198 10339928 10406407 10636774 10963306 11006051 11353896 11472685 11547140 11575267
3025 11575267 11771071 11810484 11760326 11890733 11995807 12073081 12154723 12398324 12579377 12702636
3015 12702636 12683211 12956693 13315417 13688407 14050906 14150252 14243057 14444214 14713796 15006838
3005 15006838 15060755 15030832 15283361 15424756 15645678 15980867 15885781 16122716 16282289 16587715
2995 16587715 17266510 17436925 17752319 18135781 18253099 18650722 19138670 19614227 20078438
2986 20078438 20623985 20923848 21432842 21882264 22355654 23115586 23732391 24370794 24879740
2977 24879740 25523025 26124157 26556976 27123749 27756129 28422555 29042650 29727816 30476292
2968 30476292 31292109 32077229 32967942 33521238 34254401 34938288 35724381 36579788 37549498
2959 37549498 38499152 39230253 40112035 41229101 42063920 43062039 44103105 45039796 46143203
2950 46143203 47304354 48645738 49976576 51145459 52454043 54113718 55389339 56950473
2942 56950473 58416180 59802587 61575989 63409397 65252198 67104110 69290285 71577026
2934 71577026 73744313 75731497 77665137 79664820 81439260 83158699 84800496 86824119
2926 86824119 88567269 90381484 92313423 94343972 96512869 98721372 100862973 103305285
2918 103305285 105485236 107796270 110005108 112030955 113965071 115765691 117594599 119292479
2910 119292479 120668150 122063114 123623520 124705230 125885726 127144905 128412658 129792024
2902 129792024 130685649 131815209 132672796 133345330 133739199 133629674 133469116 133295623 133141417
2893 133141417 132779396 132398952 132078199 131923053 131638356 131678878 131739869 131906715 132239514 132447984
2883 132447984 132753225 133048873 133542573 134196815 134542917 134410296 133950774 132930099 131088895
2874 131088895 128529842 125577609 122466213 119120420 115448554 111908420 108499352 105233628
2866 105233628 102169898 99269686 96544519 93659913 90645881 87393985 83880141 80293505
2858 80293505 76421434 72529754 68774643 64771397 60981007 57754672 54526782 51435496
2850 51435496 48992136 46795471 44554569 42746729 40899202 39088462 37903204 36443080
2842 36443080 35180024 34080942 32969884 31930809 31162304 30546708 29677740 28965845 28249672
2833 28249672 27828971 27455588 26899342 26260345 25716568 25365700 24879566 24697843 24231386
2824 24231386 23814911 23702989 23282458 23075953 23105318 22749205 22665991 22517576 22207142 21764027
2814 21764027 21716502 21469073 21513815 21584015 21387213 21453458 21343873 21223823 21339626 21560232
2804 21560232 21405097 21393986 21532256 21656781 21906928 22008406 21973124 22078050 22144587 22383791
2794 22383791 22580926 22512356 22624023 22851879 23028314 23137452 23388469 23589374 23712229 23975766
2784 23975766 24292851 24458995 24796202 25145577 25424057 25791129 26018702 26334220 26902463
2775 26902463 27187201 27230272 27646795 28163993 28354043 28770190 29321140 29872513 30347057 30781154
2765 30781154 31144536 31595347 32258880 32996993 33683488 34461138 35169800 35779146 36919561
2756 36919561 37807433 38987998 40173806 41272317 42574785 44209083 45962272 47809623
2748 47809623 49795295 51506914 53581432 56042038 58251887 60449065 62686236 65130458
2740 65130458 67790501 70738193 73610916 77119991 80760590 84578754 89126834 94119604
2732 94119604 99608656 105556167 112231555 119713688 128076362 137197096 147332473 158538212
2724 158538212 171321319 185509819 201267066 218828121 237574465 257137981 276513284
2717 276513284 294711234 310594384 322301895 329750275 332831091 332151583 328682264 323704355
2709 323704355 318269120 313308690 309441779 306654024 305046753 303764524 302744351 301220840
2701 301220840 298740101 294056700 286624508 276088698 262321514 245639203 227282006
2694 227282006 208127829 189619211 172568121 157113492 143598745 132285962 122490202
2687 122490202 113843498 106561417 99925019 94064177 88762631 84340053 80194665 76561120
2679 76561120 73177931 69946777 67270077 64572329 62029434 59909745 57877609 56118097
2671 56118097 54430867 52556860 50804910 49337112 47889023 46470594 45255067 43800699
2663 43800699 42892527 41856143 40762780 39844213 38959467 38351394 37557402 36877521 36179497
2654 36179497 35531674 34938700 34443822 33792385 33478446 33064866 32451046 32099920 31788469
2645 31788469 31363193 31061469 30972984 30660221 30398406 30388556 30080555 29907925 29813050 29553931
2635 29553931 29358299 29287943 29035966 29023465 29100061 29020130 29125828 29109037 29058177 29327841
2625 29327841 29679496 29792684 30040715 30322553 30496002 30851915 31206345 31468351 32076375
2616 32076375 32576004 33146159 33849185 34585378 35101754 35928073 37051136 38128946 39326210
2607 39326210 40583660 41609360 42857683 44356631 45753778 47113671 48757908 50715022
2599 50715022 52706024 54945537 57344868 59804524 62310515 64634871 67110056 69326040
2591 69326040 71045479 72680980 73916381 75045478 76341626 77584718 78784984 80093363
2583 80093363 81806735 83483546 85062262 86724180 88027897 89114686 89758162 90032093
2575 90032093 90078745 89913616 89226286 88320830 87438181 86446746 85944394 85467803 85179656 85255166
2565 85255166 85194132 85540302 85972177 86304260 86479941 86868184 87057512 87614494 88238517 88953612
2555 88953612 90111234 91682838 93441226 95884606 98634749 102091485 106079848 110485754
2547 110485754 115806927 121560863 127846470 135313044 143490836 152604553 162700189 173633580
2539 173633580 185026497 196811836 208296992 218644477 227625911 234339973 239459541
2532 239459541 243172734 246422556 249757075 253844942 259272432 265955485 273607415 282014758
2524 282014758 290560040 298555662 304614123 308680124 309420973 306971948 301457728 293150367
2516 293150367 283003840 271808672 260455290 249382268 239358840 230760196 223095650
2509 223095650 216518974 210497884 204712793 198882334 192488861 184622856 175598081 165609036
2501 165609036 154490638 143319533 132009439 121353625 111642491 102963796 95383607
2494 95383607 88880584 83074606 77901208 73426085 69244929 65659885 62709358 59682216
2486 59682216 56869974 54247325 51835369 49553124 47315697 45461735 43756202 42109780
2478 42109780 40483193 38867489 37567255 36498506 35537210 34501133 33282077 32271860
2470 32271860 31069751 30160087 29265007 28522643 27812740 27194842 26315835 25475550 24931882
2461 24931882 24140821 23504405 22879264 22190345 21760515 21257098 20519753 20133063 19608982
2452 19608982 19128120 18679748 18229514 17615696 17194546 16800867 16317546 15918701 15759179
2443 15759179 15189412 14814426 14592799 14113012 13839989 13444695 13091280 12923211 12660123
2434 12660123 12230772 11745623 11608033 11526653 11122429 10807246 10415824 10462902 10185539 9798634
2424 9798634 9557697 9449942 9433054 9523617 9266088 9100569 9051700 8682809 8441916 8360059
2414 8360059 8318749 8368723 8363566 8122112 8140736 8064908 8077122 8104286 7990253 7837887 7522477
2403 7522477 7519838 7446267 7323386 7237589 7096530 7049988 6918682 6869186 6781771 6741418 6606822
2392 6606822 6593589 6626687 6273948 6048341 6084622 5956045 5771613 5589714 5305034 5130729
2382 5130729 5015629 4993142 4885416 4838127 4864474 4566453 4406071 4355608 4443581 4105124
2372 4105124 3983535 3712148 3632387 3741187 3595657 3710643 3780149 3635951 3717821 3710111
2362 3710111 3548105 3468462 3580614 3376848 3285488 3162658 3008771 3307888 3268311 3341022
2352 3341022 3385798 3297909 3282672 3153282 2992753 3172995 3234025 2932041 2999656 2999557 3024097
2341 3024097 3102513 3013436 2883438 2703083 2853178 2888305 2498388 2657614 2805545 2572919
2331 2572919 2829984 2765480 2770172 2704413 2833786 2596729 2449338 2459901 2376533 2414457 2555573
2320 2555573 2595816 2525209 2597240 2417399 2509253 2442736 2416986 2207544 2222975 2320490 2332684
2309 2332684 2282244 2245182 2089654 2018786 2091613 2050587 2044563 2118835 2067552 1879958 1823553
2298 1823553 1774030 1886450 1966529 1983683 2063678 2300729 2092143 2043525 2135933 2129809 2113617
2287 2113617 1955504 1895503 1901979 2023271 1953103 2016936 2010135 1847174 1910829 1833215 1807401
2276 1807401 2045448 2094489 2154546 2058707 1882347 1939079 1897649 1884697 1940432 2074056 2017532
2265 2017532 1995169 1956421 2069903 1856893 1769577 1650742 1755459 1989102 1826396 1682764
2255 1682764 1567665 1458170 1642100 1842554 1682987 1744910 1748314 1602293 1788226 1716859
2245 1716859 1653984 1631603 1798016 1837671 1703886 1660956 1859462 2098724 1857291 2012522
2235 2012522 2082295 2068062 2142197 2139742 2232256 2463802 2412743 2273153 2228475 2174666 2248338
2224 2248338 2473077 2565270 2482890 2585817 2627882 2622001 2795359 2980734 2917013 2854164 2862439
2213 2862439 2900921 2805115 2877130 2823459 2843153 2992962 2897799 2779101 2620683 2668167 2848643
2202 2848643 2868046 2759763 2738147 2679388 2644149 2865381 2948624 2619101 2640611 2485414 2572070
2191 2572070 2581180 2259004 2342221 2310398 2246913 2420232 2570596 2549117 2705391 2693580 2569559
2180 2569559 2729552 2824769 2806759 2936273 3221133 3220003 3186104 3264663 3219171 3068702 3297754
2169 3297754 3462309 3578223 3794059 4219062 4652823 4978794 5106239 5302628 5162901 5053321
2159 5053321 4826227 4158029 3676470 3401990 3082442 3014715 2937076 2898712 2663408 2598865
2149 2598865 2660192 2618841 2432097 2443247 2554867 2718121 2775607 2724785 2733260 2906561 3110889
2138 3110889 3028288 3382364 3585905 4065694 4388792 5002677 5735878 6551058 7025163 7214535
2128 7214535 7054323 6544211 6221693 5667846 4876455 4247001 3636941 3163091 2918193 2695906
2118 2695906 2436994 2092320 2088542 1964195 2058497 2188512 2071789 2139706 2007972 1968610
2108 1968610 1936745 1950223 1859074 2108402 2180631 2203762 2411076 2544023 2818678 3017616
2098 3017616 3353446 3556438 3699243 3708325 3637057 3563570 3423676 3161762 2544230 2175491
2088 2175491 1863173 1900236 1741598 1460701 1364313 1482193 1394028 1432581 1361675 1181245
2078 1181245 1284611 1233480 1077661 977002 1082894 1000511 982598 907525 873693 1048905
2068 1048905 868313 653336 872387 726529 752289 1013658 884324 769858 799410 776862
2058 776862 838840 646025 508594 594098 581889 532228 619318 694634 837633 895835 826582
2047 826582 638791 813990 797207 769679 592888 579048 481090 429245 597803 526442 454899
2036 454899 645504 403937 232825 406284 475936 686612 526695 304246 420817 425894
2026 425894 230965 245228 376884 425395 451158 389137 354741 423528 346918 565562 545470
2015 545470 450821 338648 361743 531579 361437 310461 450969 314013 406609 401275 395272
2004 395272 324560 200844 281090 566234 486193 280589 300665 337109 291654 361338 437252
1993 437252 252163 413445 484471 258764 370129 179004 239420 267459 259525 280009 359894
1982 359894 435957 339264 305433 453074 477368 421793 385485 374774 299370 330002 243475
1971 243475 208825 352964 403157 531874 498386 503376 121294 50415 177556 134835 55058
1960 55058 185194 353152 173010 120557 448784 441227 430314 312510 285022 258875 223859
1949 223859 79240 219197 367121 370001 300980 303209 423560 328021 242549 245684 203650
1938 203650 369476 326458 96900 131989 207401 110563 174663 150357 394356 305357 346306
1927 346306 394991 392287 483487 571452 452120 620679 591560 413861 701090 703297 645753
1916 645753 505429 468458 575658 517691 202627 240358 320769 368219 516776 592450 276778
1905 276778 382890 518983 521171 477686 351748 526308 697328 331679 303367 342924 390979
1894 390979 504086 548736 477788 332198 378860 716632 730120 835399 890509 766527 804438
1883 804438 1017240 883130 800028 1067761 992183 1006509 1053715 821663 849075 969764 987801
1872 987801 1075584 911297 866220 899162 634976 730797 677204 412822 411542 454118 273995
1861 273995 137677 297648 318540 352978 474902 520949 506785 543688 413785 506461 474041
1850 474041 286842 200408 210251 400203 582490 664258 671720 601716 733418 869863 687495
1839 687495 598032 653064 607435 752610 606526 498501 648327 472653 336203 397149
1829 397149 461925 533859 592349 557995 512300 269706 322859 216314 224860 125110 262117
1818 262117 430671 230259 110439 186225 348409 462384 384250 304703 334047 302814 254415
1807 254415 282666 151056 3895 40480 78002 138471 -41897 139890 150201 125770 150220
1796 150220 162334 -36571 24750 104245 66184 216972 329799 452681 566140 305598
1786 305598 154229 310267 208566 -59589 109090 172886 133845 127103 9627 -72519 56527
1775 56527 74469 222366 116889 -106327 67833 95365 60951 54473 87722 26575 -45356
1764 -45356 35980 100378 134880 -15813 119430 205068 69436 -21996 139259 202673 -64407
1753 -64407 136095 306293 115147 149549 60164 -41176 162828 292960 -8450 -334493
1743 -334493 -99551 -22703 -35382 -254471 -207990 24935 31894 -58909 22964 170305 76669
1732 76669 54217 -135620 -111814 106803 -101858 68223 174837 13544 -53386 39021 14276
1721 14276 -32892 -56197 -105070 -175258 -204153 -281485 -183198 -71687 -67398 -215479 -319371
1710 -319371 -208277 -163019 -84548 -127259 -106915 -145265 -84655 -136644 -21646 -10363 88960
1699 88960 -28036 83236 246159 -69492 99739 31223 -17890 -89574 -78651 -107452 -83612
1688 -83612 -7501 -30870 51806 -14178 -110469 -62985 16504 -23552 71538 58037 -176103 -148905
1676 -148905 -91564 -100181 -155819 -214856 -280395 -76548 -5788 -205822 -308451 -238061 -218114
1665 -218114 -34240 -133757 4628 87681 -27777 -24836 18532 -112702 -299082 -268059 -365263
1654 -365263 -158813 74325 -40697 -201053 -33430 -157799 -339049 -357559 -490882 -380316
1644 -380316 -114519 -79192 -54122 -22776 -85222 -65143 52444 -14159 99801 259703 141678
1633 141678 136923 -53523 -88357 -77095 -55107 -63054 -147445 -66845 70779 -3364 -143956
1622 -143956 -32484 78997 -106153 -120150 -123876 -323883 -281681 -235663 -75000 -289267 -253465
1611 -253465 -209470 -187345 -190992 -131594 -34400 -31691 -32753 19015 66157 -72130 -290201 -203556
1599 -203556 -263541 -157899 -33412 73410 -7057 113063 114999 -102621 -1986 -2618 -24900
1588 -24900 -84192 -185005 -201809 -105608 -254997 -225459 -123405 -53182 16018 -63703 -33411
1577 -33411 -159767 -132670 -60523 34931 110415 113356 -43903 -215370 -175508 -101378 -180839
1566 -180839 -35062 37512 137202 -16787 -114397 -50062 -73366 -145201 -262433 -165258 -151231
1555 -151231 -139229 -233028 -165549 -226658 -176730 -118955 13113 -25825 -59012 65417 -18825
1544 -18825 2682 -25077 -170344 107019 120881 122573 95008 -38386 -235234 -10407 158040
1533 158040 21824 12724 -14138 56453 192260 221653 -28712 -34024 216635 265476 121202
1522 121202 -29935 78778 438296 399403 122998 224169 237952 263407 238705 381565
1512 381565 226299 149594 214559 152111 176580 220062 100127 169517 367028 226622 106245
1501 106245 224208 146324 321705 325979 283100 321663 -1217 9267 193843 262900 192307
1490 192307 368065 321129 303099 469047 141202 73875 83050 56729 187296 179871 89767
1479 89767 316561 377700 229831 360879 191890 118749 217665 236053 164957 85404 124898
1468 124898 214499 237604 182062 -119660 -67255 39493 -30503 221679 243369 99560 108384
1457 108384 104408 148302 99197 117680 166511 187582 114578 190467 87316 17187 -29811 168498
1445 168498 355941 216961 42414 119996 156859 227361 179107 64787 108428 57983 75310
1434 75310 57248 14708 54743 111835 60533 127563 134159 202360 192097 18783 -122327 -87165
1422 -87165 68546 127824 8539 -38660 -164505 30514 308859 145968 191377 -38260
1412 -38260 -48048 -130777 -181534 -172916 -76453 13571 -36009 -42015 -100010 21377 46573 -14558
1400 -14558 34791 -48240 -27945 -38912 133348 135408 212132 145647 -10298 46429 -44715 -140732
1388 -140732 -92770 -16561 -238164 -155068 -91188 -168300 -184527 -192462 -390114 -162954 -51845
1377 -51845 -80979 -131467 -239919 -289495 -200519 -230147 -182711 -107355 47561 11800 95543
1366 95543 -54480 -176015 173559 152145 -48294 -68645 -97141 -147827 -10810 171486 120524
1355 120524 37440 -197066 -184677 -343518 -496992 -636715 -370616 -185301 -194769 -121170 -350360
1344 -350360 -223093 -73674 -269843 -240421 8825 -116940 -67821 -237095 -115355 -10654
1334 -10654 -128292 -376102 -280078 -228898 -129374 53747 -71874 -52356 76161 -211731 -182693
1323 -182693 -41981 -244276 -409976 -367591 -113595 8259 -37060 11452 -62522 -42346 -5406
1312 -5406 -206909 -149106 -36910 -161311 -115049 36376 -7882 -55216 -208404 -295994 -201877
1301 -201877 -166472 -258631 -89939 -62142 -201049 -33395 31980 2618 10968 9573 -86284
1290 -86284 -175997 -128134 -159398 -173682 -128150 -122253 -86867 132083 8815 -12860 123436
1279 123436 -33677 -122447 -96269 -66352 42500 30174 -56623 27731 -51308 -178814 -175556
1268 -175556 -175406 -65379 -28350 -37698 -116760 34960 160525 51458 106789 151859 -17919
1257 -17919 105234 230438 108569 148835 224184 377604 423093 453641 403380 467917 458744
1246 458744 182849 104569 111354 -76770 19646 131321 -17394 33235 -83826 -79383 5073
1235 5073 40396 -92426 -158738 -89007 -100846 114913 131050 -12185 52497 72029 -50888
1224 -50888 -55706 128712 5930 79779 -28385 -152230 26772 181722 193218 159591 64382
1213 64382 -186911 20057 76653 105706 212298 315149 182063 373980 512949 128172
1203 128172 4216 38859 4683 60071 -195127 -113341 188928 153158 116536 -80880 -28178
1192 -28178 -4574 340083 161837 -27351 64355 36913 176197 128518 -28453 -13011 -56134
1181 -56134 -261712 -114259 5749 79609 91524 86411 -7346 63791 29567 -96690 60720
1170 60720 129521 334227 189467 133344 78980 -9792 11529 24974 189682 248337 106920
1159 106920 66791 166317 187425 -21122 26337 222409 178688 238599 124129 173248 225054
1148 225054 71897 -147255 -112501 104524 214816 169974 -11289 90022 159575 70929
1138 70929 185850 227422 307729 194451 166533 213233 247389 129186 223589 113424 243897
1127 243897 71165 -29985 332449 231381 126653 196091 333487 612971 606164 546857
1117 546857 465167 378452 274502 106375 283002 269040 229047 304677 332041 249940 348461
1106 348461 475886 551426 594383 325202 137190 343237 415158 309507 324566 150590
1096 150590 429968 710392 565055 487002 560707 522212 426854 721950 564369 548283 761046
1085 761046 703116 800242 737983 762076 706032 829750 625655 606570 701960 646525 729503
1074 729503 702287 785679 815901 842371 763281 889619 950477 982564 986233 785177 850895
1063 850895 1045950 1096172 1114398 1209891 1220394 1087339 1138032 1016276 1098233 1329857 1421348
1052 1421348 1485077 1491918 1595675 1743490 1763134 1809213 1737940 1676343 1626454 1615636 1405519
1041 1405519 1762077 1589583 1602124 1773523 1794261 1844530 1829220 1751828 1665675 1744502 1839147
1030 1839147 1872974 2008025 2124268 2286694 2261580 2085644 2057486 2110693 2223459 2326702
1020 2326702 2327868 2315957 2224002 2361231 2417977 2432516 2490371 2657504 2526164 2776023 3006830
1009 3006830 2820859 2957089 2952720 3120809 3397912 3528930 3723653 4048443 4223260 4611231
999 4611231 5020366 5341171 5731800 6106949 6398913 6589243 6673625 6819457 7111127 7485903
989 7485903 7829447 8301597 8693856 9332385 9777478 10433518 11208585 12368410 13674337
980 13674337 14699818 15702687 16576537 17692375 19230905 20953361 23245002 25783298
972 25783298 28957640 32877917 38124888 44888451 52806055 61460113 70270929 78996968
964 78996968 82516326 75051736 60999796 46905628 36275733 29439267 24657364 21078948
956 21078948 18727556 17350763 15865183 14631790 13803462 13072756 12293506 11811329 11457456
947 11457456 10566447 9536701 8830749 8114119 7456599 7090925 6607905 6427806 5996533
938 5996533 5528781 5462634 5243933 5084469 4911480 4644285 4579980 4375411 4271882 4024398
928 4024398 3882460 3752305 3521450 3514125 3448042 3266593 3138345 2907297 2889373 2896517 2700519
917 2700519 2508606 2530255 2500610 2427554 2207852 2086745 2027106 1914540 1883217 1915073 1775896
906 1775896 1395026 1270628 1324671 1474986 1289128 1253131 1345897 1372996 1448690 1403797 1358310
895 1358310 1290057 1336781 1285418 1166820 1165441 1115922 1100646 1166268 1012531 1075191 1288150
884 1288150 1131925 1161232 1129287 1075541 990584 970944 1023801 1001304 759858 725302 672946
873 672946 806083 727591 638303 703364 587441 482837 377466 317658 450093 492775 502705
862 502705 501372 583051 456431 579231 448354 340225 370146 520985 394047 470920 623757
851 623757 418702 382661 435077 273454 329515 369435 512427 515269 394941 379603 318815
840 318815 290868 183971 109291 236004 344061 310290 189750 275621 263507 285857 283796
829 283796 81069 113487 55302 -25590 -47555 124902 87342 104214 189414 162559 61820
818 61820 162083 406969 374587 162021 100862 291013 229509 72363 108148 107690 -44805
807 -44805 39760 121478 89304 2910 137737 211095 46541 274201 232074 70687 55863
796 55863 -55205 4112 158905 241695 399457 288887 298114 153616 187421 83446 118469
785 118469 54983 111609 166413 95505 150298 64765 137073 151263 116750 179509 95827 63084
773 63084 229357 337348 245454 247828 -1584 -47615 86873 168954 223782 250225 117509
762 117509 183795 247772 82839 -116026 -14765 -58015 141174 66738 -55824 86804 183158
751 183158 21333 -157661 -135913 -179311 -52336 -41793 -24159 -22191 111815 106884 143339
740 143339 -21676 -104404 -38912 66514 75762 -72498 158158 147027 -92480 -122961 -74953
729 -74953 -58616 -59607 -134855 -56967 75505 -55266 75762 -3575 -120333 -105348 -109606 16504
717 16504 -40001 104932 282903 122155 129346 -193730 -266317 18244 9749 -167658 -175981
706 -175981 -143758 -133418 23521 -134523 -124303 -75823 -185931 -233974 6467 -49487 31707
695 31707 98534 -45323 -15252 229801 269508 158138 162054 115803 78304 -143234 -34091
684 -34091 -72949 174511 264935 415972 607092 487543 462133 408891 82617 117050 223245
673 223245 193212 282536 268198 -52537 -84476 5014 72593 135444 190222 -15634 51343
662 51343 7453 -2206 84972 -99397 -114623 -45673 -45790 -246363 28609 135369 -16822 84849
650 84849 40931 -211196 -84978 -32216 -46498 90327 19757 -16551 8112 -187649 -275575
639 -275575 -50774 -46624 -43459 -50228 -138223 -243142 -131820 -152569 -91013 13862 -107178
628 -107178 -90425 -44105 -344742 -464543 -256796 -237617 -225872 -265109 -301992 -366536 -215853
617 -215853 -161068 -241073 -285599 -194070 -152205 42917 81432 -115864 40584 -59892 -221091
606 -221091 -83577 -137376 -34878 51295 -14150 -47965 -71947 -85574 -38338 -15722 -126959
595 -126959 -157766 -150737 -73204 -91611 83580 198144 6708 -14722 -119810 -118133 -301249
584 -301249 -125658 70858 -178827 -114943 22285 -51654 -19959 -244754 -253403 861 -201192
573 -201192 -210171 -173772 -273027 -215720 -270012 -149182 -91543 -130595 -41391 -195963 -254215 -269052
561 -269052 -183410 -135326 -100664 -77804 11456 -107563 -43480 227946 123784 234307 158256
550 158256 -54939 5663 -1257 -113406 18503 -21647 -8907 -2633 -202713 -143923 -50740
539 -50740 146454 -102273 -149241 -107185 -240901 -108317 70921 34437 -108790 -322433 -200032
528 -200032 -102298 -222675 -122034 -132665 8558 15847 -34587 -229013 -171683 -160771 -56521
517 -56521 -177821 -126363 -129488 -61848 -133159 -121211 4565 -22845 -32249 -59397 -64061 -12335
505 -12335 60773 107093 -104545 -302932 -338404 -211568 -38639 -219210 -68538 -155931 -237769
494 -237769 -73602 -111053 -139425 -189723 -114340 17231 44737 49989 -14367 16332 -25840 -249465
482 -249465 -277195 -183394 -435188 -219440 -197693 -298627 -154511 -128784 -16933 94895 -165843
471 -165843 -294680 -69497 3045 -116100 -97178 -68463 -282840 -203677 -151098 -139516 84337
460 84337 101891 316406 241592 -44845 -14984 209095 31286 11650 -80675 -183741 -117207
449 -117207 -180684 -130845 -109363 -107448 12644 -134878 -133769 -199414 -249033 23815 -137532
438 -137532 -204659 30388 17380 52892 -27400 -135614 7125 -73550 -301949 -262781 -108151
427 -108151 -115310 -3165 -11858 -143408 -192521 14290 -75979 -218191 -164943 -182620 -115088
416 -115088 104254 80907 1043 -119237 -71459 -153879 -236845 -199588 -223801 -80644 -60945
405 -60945 -149626 21030 40562 -84870 119939 29787 -82367 -82526 -108456 29362 68914
394 68914 182281 260718 8582 -27593 -3477 -6079 -232271 -258298 -164393 48985 -12288
383 -12288 -188273 -8061 -157430 -187247 -177846 -96345 29990 -128590 -249965 -248136 -152012
372 -152012 -169384 -61672 106810 -62214 -145564 49453 167106 11928 41281 45360 87757
361 87757 89648 -32763 -51031 77933 -81130 -194036 -204409 -111239 -122559 -142334 82491
350 82491 -9182 -104560 -210270 -32327 91750 -19863 67635 -9901 -250668 -169206 3482
339 3482 -22366 159761 91494 -79612 -64306 -111961 19627 144199 178288 -37467 -143176
328 -143176 30126 -136039 -222425 -213517 -74989 25123 77588 64775 110801 45459 -204152
317 -204152 -181862 -347323 -255652 -236821 -131414 -119702 -291527 -138803 -102775 -149674 -174808
306 -174808 -217633 -62285 -79236 -320342 -174436 -167669 -190652 -129058 -183734 -24473 110695
295 110695 -66918 -109310 -45495 -112861 -167714 -212298 -63242 -29802 -151880 -31927 -221991
284 -221991 -232410 -233352 -251050 -136333 -221107 -272269 -179264 -76196 -35954 63775 36584 -24423
272 -24423 10025 -7373 -53345 -91189 -221981 -184443 -178754 -27549 -105140 -246030 -207915 -366421
260 -366421 -197576 -135225 27996 -99049 -169064 -40392 -187066 -137077 -40675 57099 168365
249 168365 180444 -73102 -17185 33692 38993 -48052 -56813 -175933 -217284 -283376 -370004 -198483
237 -198483 -199762 -288992 -216336 -21602 -141412 -118914 -159998 -182930 166486 116691 -118756
226 -118756 -155592 -256137 -128417 -42428 -278662 -196884 -157049 -104300 -139958 -266403 -388963
215 -388963 -243047 -392487 -376092 -280173 -301456 -79398 -105941 -130458 -34567 -108564 -130771
204 -130771 -60463 -62774 -57515 -83716 8159 -19679 -68783 -39632 267 -248931 -183700 -125167
192 -125167 -210828 -95784 -70371 -234331 -181804 -142198 -95450 -54526 -22990 -127897 -46757
181 -46757 4940 53398 43249 -54346 -29107 -135026 -423434 -347963 -214310 -194473 -203057 -221696
169 -221696 -196000 -171928 -234410 -258634 -310173 -198112 -60951 -42431 -28898 -61028 -33166
158 -33166 -57283 -168723 -253381 -166638 -385747 -316353 -271270 -210367 -23098 -98906 -286849
147 -286849 -317289 -236991 -78583 -123007 -239067 -231278 -207116 -224306 -218228 -202999 -107278 -63799
135 -63799 -135486 -208817 -151464 -142790 -128653 -42486 -100883 -215447 -74583 -93665 -187427 -239723
123 -239723 -309550 -216966 -188840 -362910 -362449 -258629 -274048 -222928 -153198 -159806 -150894 -240981
111 -240981 -71850 -87669 -136410 -235870 -245700 -227284 -288367 -215289 -79208 -155300 -116586 -34171
99 -34171 -170829 -105570 -186239 -146345 -180200 -195319 -143398 -149862 -199258 -327022 -356313 -213048
87 -213048 -157642 -184474 -270105 -422281 -394611 -170803 -229032 -109494 -204776 -153766 -27117
76 -27117 -162482 -229666 -277330 -169006 -264546 -347796 -283128 -289979 -225608 -205958 -199480 -264925
64 -264925 -295713 -197578 -230551 -173739 -148122 -85167 -135955 -189016 -89261 -149165 -99785 -93717
52 -93717 -228924 -237895 -354956 -297386 -256674 -305145 -198686 -181464 -117341 -244551 -276286 -248292
40 -248292 -129395 -173833 -237163 -258263 -203159 -207204 -266494 -310162 -393527 -372243 -156459 -226199
28 -226199 -391948 -277608 -301894 -244347 -123075 -212332 -290912 -233535 -289458 -288126 -219637 -304332
16 -304332 -298965 -212944 -210141 -148584 -272163 -168534 -43883 -173350 -154194 -169504 -103874 -207707
4 -207707 -158813 -274203 -433786 -366585
0 -366585
$$ Imaginary data points
##PAGE= N=2
##DATA TABLE= (X++(I..I)), XYDATA
16383 -3681235 -3652840 -3694143 -3588890 -3439443 -3431577 -3488297 -3465490 -3391383 -3494679 -3443270 -3334829
16372 -3334829 -3232581 -3225247 -3158013 -3169394 -3049330 -3064574 -3041526 -3038313 -2923870 -2859390 -2812029
16361 -2812029 -2918689 -2848461 -2824177 -2670077 -2522817 -2489007 -2518330 -2481791 -2453039 -2514461 -2619617
16350 -2619617 -2460337 -2267687 -2338240 -2202743 -2279514 -2203962 -2132589 -2036295 -1935357 -1948403
16340 -1948403 -1863935 -1761703 -1760909 -1718888 -1698984 -1686490 -1662658 -1572246 -1556820 -1625947 -1524561
16329 -1524561 -1463577 -1372923 -1242727 -1478975 -1424390 -1109245 -1246348 -1161037 -1087309 -1053932
16319 -1053932 -983512 -1086199 -1087977 -997241 -864684 -919236 -863385 -746573 -825668 -860555 -708988
16308 -708988 -687963 -515395 -366717 -409023 -428417 -506564 -533513 -378605 -364690 -445164 -231670
16297 -231670 -222921 -146869 -113771 -130540 -46068 63576 86249 78699 -54555 -105820 204358
16286 204358 274655 306379 328676 291801 333564 430345 458518 587160 492965 539261 443497
16275 443497 648737 755644 883106 953967 772849 645061 872022 783054 784544 1119495
16265 1119495 1136600 1029498 931759 994389 988790 947963 1036872 1027879 1109343 1140499 1005299
16254 1005299 1083813 1125952 965291 1186938 1223961 1187728 1363854 1272683 1209834 1291460 1403660
16243 1403660 1378772 1288879 1443452 1461188 1489543 1496483 1401435 1471982 1524473 1594829 1581388
16232 1581388 1632895 1627171 1785649 1646470 1727060 1735372 1520223 1607983 1610515 1754721 1853110
16221 1853110 1876508 1981660 1986788 2169280 1986366 1828962 2096867 2023243 2108521 2092448
16211 2092448 1919865 2049447 2107180 2193003 2112471 2046592 2209479 2304290 2076112 2235180
16201 2235180 2349130 2198100 2297226 2403946 2499228 2589232 2361288 2467381 2486607 2279087
16191 2279087 2306524 2355769 2444413 2457266 2626786 2706914 2526102 2431704 2510278 2477951 2439965
16180 2439965 2431870 2366242 2502423 2560681 2602199 2716316 2612852 2581885 2515706 2475120 2684831
16169 2684831 2593494 2670686 2858620 2760934 2642977 2803224 2845000 2582997 2619777 2728177
16159 2728177 2680548 2806190 2742959 2727874 3016330 2955029 3005467 3072760 2790497 2746147 2930243
16148 2930243 2928425 2918012 2983032 2892523 2951095 2961759 2914274 2969520 2992825 2820630 2891998
16137 2891998 2840016 2724304 2840863 3059021 3064352 2925790 3091013 3098568 2952004 2993927
16127 2993927 2966609 2988660 2911791 2908008 2913246 2862925 2916838 2996980 3035057 3017323 3067213 3025989
16115 3025989 3138227 3319926 3362201 3359508 3285131 3130117 3114144 3407558 3334482 3215294
16105 3215294 3153841 3075186 3280592 3189098 3203097 3253390 3290448 3250914 3283366 3252781 3149535
16094 3149535 3108552 3134142 3158461 3237161 3107441 3118536 3153518 3209571 3188740 3249961 3227403
16083 3227403 3227283 3300120 3157885 3138195 3211897 3287413 3382223 3331176 3103850 3106427 3274586
16072 3274586 3132532 3144119 3206978 3171876 3074221 3169752 3234817 3310057 3178761 2991448 3103900
16061 3103900 3114398 3116648 3293274 3165516 3067865 3113096 3010304 2958950 3085361 3316277
16051 3316277 3242585 3202832 3217606 2944214 3014248 3248537 3177276 3174515 3234878 3319168 3339692
16040 3339692 3401911 3207695 3308639 3400164 3187976 3363895 3445429 3266533 3329581 3228753
16030 3228753 3341897 3261747 3265198 3341949 3141656 3084660 3161426 3158371 3136957 3188523 3248803
16019 3248803 3356122 3467384 3528271 3421705 3260042 3483912 3519776 3403963 3373255 3330968
16009 3330968 3443335 3493425 3478639 3209950 3114887 3150797 3199081 3225203 3317229 3407525 3258685
15998 3258685 3198532 3170746 3154539 3192568 3241695 3243545 3315993 3254296 3184749 3440182 3451478
15987 3451478 3325718 3394625 3321865 3097034 3191107 3261455 3219546 3250526 3231797 3267238 3180032
15976 3180032 3232822 3327069 3329535 3369875 3173356 3223147 3089068 3225675 3325446 3362313 3359792
15965 3359792 3362369 3480047 3336304 3308540 3208030 3180595 3372087 3168659 3361769 3566021
15955 3566021 3266151 3269834 3497741 3332898 3134774 3233710 3066294 3259604 3426089 3230781
15945 3230781 3411011 3357482 3101393 3225062 3088846 3318551 3372301 3351861 3111829 3197202
15935 3197202 3238165 3229702 3226778 3284383 3301299 3256905 3368543 3294048 3249952 3174885 3166128 3168366
15923 3168366 3332349 3296668 3412094 3526857 3444667 3505988 3251262 3053142 3167775 3139138
15913 3139138 3270883 3327695 3044391 3175983 3196495 3195077 3422233 3412699 3194463 3391435
15903 3391435 3342202 3119698 3292075 3205146 3411619 3377274 3273590 3137883 3177595 3135371
15893 3135371 3125048 3296271 3286318 3495496 3323835 3306602 3284362 3255000 3263941 3218913 3393344
15882 3393344 3294540 3236002 3422565 3204883 3186918 3237743 3183386 3076617 3301194 3318436
15872 3318436 3123782 3378903 3379914 3349293 3330604 3092448 3223860 3273131 3195187 3269954 3383768
15861 3383768 3285557 3354330 3204259 3169886 3438281 3405172 3346945 3384590 3357245 3269757 3350792
15850 3350792 3373181 3429719 3299319 3207909 3251998 3666478 3561131 3327502 3183599 3247971
15840 3247971 3178468 3299799 3253346 3397863 3273565 3162372 3221690 3365433 3485821 3412879
15830 3412879 3373890 3197158 3163087 3255678 3324307 3494385 3590335 3415751 3238954 3303305
15820 3303305 3371589 3170641 2943607 3155787 3219106 3186083 3262468 3475130 3469704 3739613
15810 3739613 3813534 3738970 3524765 3404476 3343481 3280677 3392239 3372825 3553121 3347488
15800 3347488 3238957 3390960 3512453 3376816 3441415 3529725 3333856 3464205 3365390 3320244
15790 3320244 3436794 3213115 3179195 3254236 3366843 3315837 3366988 3314407 3339686 3394675 3253919
15779 3253919 3267553 3380211 3271355 3372900 3237727 3327612 3480426 3412810 3402443 3683301
15769 3683301 3528203 3361271 3462151 3477030 3353797 3363470 3480003 3515346 3348144 3228966
15759 3228966 3144589 3193847 3278413 3290581 3307700 3355297 3257685 3246066 3256666 3150591 3252294
15748 3252294 3216657 3175844 3565050 3502236 3247921 3396988 3351199 3330500 3368029 3268924 3310639
15737 3310639 3286757 3282017 3497415 3497436 3341254 3291706 3333736 3418806 3478695 3418769 3241818
15726 3241818 3341709 3383352 3388446 3504994 3435863 3315654 3411825 3336069 3482955 3528041 3306512
15715 3306512 3258305 3296340 3283209 3375365 3405688 3305748 3336166 3314830 3215532 3121698 3278090
15704 3278090 3337207 3404834 3315143 3306131 3419439 3594615 3452844 3567582 3449631 3339806
15694 3339806 3463120 3449020 3487827 3498658 3558858 3432088 3383069 3513477 3385027 3385891 3417541
15683 3417541 3250309 3236333 3300666 3411997 3339078 3458069 3497337 3465752 3367400 3094345
15673 3094345 3276284 3326823 3243270 3378284 3291080 3389711 3457681 3425947 3229324 3125793
15663 3125793 3214823 3215497 3438968 3283323 3289677 3404580 3397946 3128122 3174877 3218313 3168001
15652 3168001 3389250 3504168 3526153 3446484 3374509 3189621 3279514 3359757 3341581 3346935 3360857
15641 3360857 3625086 3553544 3396223 3242968 3160262 3104995 3329169 3361334 3272462 3300341
15631 3300341 3551928 3483560 3238949 3230612 3172049 3288171 3275567 3186050 3282868 3419034 3355673
15620 3355673 3313158 3395032 3345997 3374402 3362669 3356333 3279062 3243412 3294561 3327766 3233998
15609 3233998 3258515 3189065 3255444 3363823 3300819 3353843 3382182 3590183 3674449 3634374 3506477
15598 3506477 3472068 3428928 3469932 3160929 3167771 3335862 3304303 3335981 3513695 3337210 3384561
15587 3384561 3503846 3330849 3370463 3485779 3338005 3156852 3225393 3248168 3321931 3411820
15577 3411820 3461539 3379657 3431577 3552735 3576736 3340992 3318459 3403582 3416291 3554938 3412440
15566 3412440 3312106 3286418 3382660 3622226 3709396 3438604 3587215 3623751 3583530 3597199
15556 3597199 3401415 3327702 3479267 3512177 3459015 3350308 3295828 3451482 3345165 3174115
15546 3174115 3137307 3245785 3442833 3561440 3467637 3276469 3348636 3279834 3222903 3308468
15536 3308468 3210928 3358728 3389859 3100643 3347470 3428667 3304221 3258006 3463514 3440538
15526 3440538 3356141 3267115 3312448 3226648 3285650 3266813 3194880 3275596 3368666 3565854 3439954
15515 3439954 3439735 3571179 3588746 3378179 3567297 3496281 3248772 3180216 3121792 3235503 3325438
15504 3325438 3191998 3166375 3279034 3309738 3278499 3518415 3498175 3551072 3379983 3300297
15494 3300297 3422048 3482073 3410016 3321630 3212590 3272649 3359282 3243678 3396218 3481627
15484 3481627 3462533 3500314 3400135 3426751 3208145 3168176 3282058 3433203 3467509 3427797
15474 3427797 3507827 3432163 3430466 3572523 3530735 3452200 3422070 3522467 3637748 3462806 3400575
15463 3400575 3490998 3497785 3524932 3366868 3267523 3204086 3396887 3507015 3432437 3347407 3243932
15452 3243932 3319841 3360681 3307840 3390662 3465342 3420314 3473578 3403759 3432306 3429801 3496067
15441 3496067 3574888 3630181 3638396 3580652 3544693 3581015 3397773 3257237 3218108 3317806 3497947
15430 3497947 3322942 3236045 3059257 3154147 3574963 3627797 3669805 3692142 3774225 3661145
15420 3661145 3579082 3508056 3369451 3243124 3399603 3550561 3495646 3521338 3468060 3457563
15410 3457563 3622404 3325902 3327339 3532461 3519788 3524102 3511188 3483976 3593619 3471042 3338797
15399 3338797 3352804 3319028 3446576 3514207 3554880 3752969 3559024 3515420 3714524 3651235
15389 3651235 3367120 3392979 3471335 3466470 3483970 3300562 3187694 3257093 3467397 3378937 3243698
15378 3243698 3240825 3386380 3388751 3288384 3528987 3432054 3163880 3325160 3377939 3476611 3686119
15367 3686119 3575163 3467252 3578694 3538440 3512204 3477738 3651116 3629754 3532960 3564965
15357 3564965 3580056 3464886 3396520 3575392 3576137 3534575 3711160 3559682 3442267 3455445 3563289
15346 3563289 3433382 3374220 3492690 3640141 3278513 3279194 3381212 3515895 3676585 3490222
15336 3490222 3535993 3557153 3567002 3513913 3692771 3563881 3587419 3497376 3314379 3407804 3541691
15325 3541691 3689300 3661527 3622182 3538600 3519126 3426960 3424970 3435532 3427801 3443310 3325572
15314 3325572 3478706 3425044 3491913 3500869 3388382 3279945 3434315 3401906 3382503 3676016
15304 3676016 3576463 3469417 3483272 3516721 3514783 3398129 3293782 3520793 3586630 3333903
15294 3333903 3321424 3598202 3448059 3421567 3455420 3445737 3461538 3410731 3303775 3366382 3341654
15283 3341654 3297193 3536812 3599136 3590592 3615318 3601283 3429456 3452450 3517668 3491347 3505816
15272 3505816 3319994 3442619 3369553 3302909 3376526 3697413 3553255 3251404 3506562 3489225
15262 3489225 3340113 3415177 3479335 3564847 3775223 3669336 3742420 3694522 3652510 3502250
15252 3502250 3408821 3490497 3617859 3609563 3419314 3268743 3526202 3542078 3444084 3593242
15242 3593242 3624321 3716707 3748295 3498774 3362879 3403421 3391935 3479660 3651676 3320822
15232 3320822 3536013 3639748 3421359 3522091 3590155 3425583 3678049 3775563 3529921 3582934
15222 3582934 3609926 3379457 3354556 3281772 3307492 3445626 3365278 3409943 3528255 3617941 3675103
15211 3675103 3597059 3476575 3520251 3464357 3552148 3523157 3594838 3518847 3300445 3486441 3545792
15200 3545792 3537907 3762742 3409495 3437451 3318794 3356697 3632439 3624669 3579840 3554084 3478894
15189 3478894 3365105 3623911 3654358 3547972 3587072 3626528 3568890 3454391 3556127 3582616
15179 3582616 3561024 3540522 3512071 3652833 3816431 3743963 3522685 3617365 3663685 3636646 3570349
15168 3570349 3593048 3605836 3590472 3571730 3322277 3534632 3517052 3660380 3671988 3674996 3667803
15157 3667803 3599652 3632297 3422683 3521762 3596732 3616240 3633411 3614984 3585299 3639433 3445860
15146 3445860 3322896 3394252 3444520 3429012 3618123 3670103 3727118 3739855 3385711 3405096 3615591
15135 3615591 3696725 3749136 3725276 3387100 3341320 3558860 3580430 3466066 3521018 3465278 3490555
15124 3490555 3545901 3691404 3590009 3551190 3538634 3499301 3570862 3599791 3560382 3647812 3809644
15113 3809644 3798823 3891467 3723061 3587715 3571484 3367400 3380959 3583806 3548299 3655497
15103 3655497 3683521 3588947 3551051 3790727 3736992 3672002 3484266 3290184 3511180 3508105 3455904
15092 3455904 3468608 3459733 3625884 3732892 3696615 3579215 3481608 3396150 3292389 3383104 3372341
15081 3372341 3374873 3612767 3685465 3742282 3892936 3588930 3520498 3555308 3391398 3184430
15071 3184430 3170313 3299303 3335170 3514633 3390990 3321495 3474379 3680085 3744130 3908495
15061 3908495 3752004 3516557 3499626 3491630 3618155 3701387 3670824 3767145 3574238 3540472 3664073
15050 3664073 3710735 3539482 3465613 3432127 3363951 3307192 3358745 3443979 3314913 3377388 3359176
15039 3359176 3447466 3656457 3528660 3532631 3573076 3456190 3649927 3612788 3523174 3643971
15029 3643971 3637598 3468296 3421278 3506268 3554777 3592259 3515245 3533235 3422814 3321982 3519434
15018 3519434 3539352 3379031 3432441 3445447 3384331 3496087 3507574 3546446 3628818 3744282 3591855
15007 3591855 3552434 3540084 3521582 3683021 3805962 3705922 3629705 3508602 3504371 3454122 3604418
14996 3604418 3645316 3608035 3719772 3750038 3750921 3646815 3512036 3530258 3627212 3476931 3565347
14985 3565347 3721247 3827472 3883037 3717397 3715114 3751889 3546284 3501336 3314811 3334988
14975 3334988 3593561 3548898 3448345 3623467 3514938 3368699 3561772 3500200 3655115 3746704
14965 3746704 3482433 3445496 3451400 3508026 3431810 3433733 3358715 3561975 3847249 3818948 3757008
14954 3757008 3610415 3719579 3713482 3788041 3676518 3608412 3657895 3776060 3753386 3719412 3624916
14943 3624916 3692232 3794502 3603521 3660349 3697130 3513474 3507010 3535665 3439441 3718155 3778254
14932 3778254 3646021 3669514 3456227 3418979 3628715 3593553 3549848 3434155 3395402 3547154
14922 3547154 3541067 3377123 3547523 3580027 3709493 3672553 3529391 3592510 3592039 3674877 3606750
14911 3606750 3519537 3731379 3773578 3603929 3673621 3580277 3521074 3445058 3439015 3609949 3600102
14900 3600102 3614457 3562760 3392347 3513187 3607367 3504455 3592499 3794319 3809763 3737661
14890 3737661 3736159 3873173 3893854 3881438 3698768 3719140 3691790 3590147 3604465 3518305 3510814
14879 3510814 3652838 3827892 3644335 3459597 3514875 3543282 3625851 3639016 3651022 3668949
14869 3668949 3827716 3722981 3671305 3644906 3556983 3626599 3834093 3746026 3706435 3879008
14859 3879008 3871596 3887694 3867176 3773099 3891450 3634180 3599445 3673264 3639514 3847165 3903489
14848 3903489 3854867 3799432 3697208 3671844 3750957 3572841 3557146 3722191 3794629 3610978
14838 3610978 3628885 3730701 3765901 3812533 3968402 3752283 3726347 3695634 3640709 3655628 3669809
14827 3669809 3709017 3963324 3804345 3492640 3374204 3342278 3414572 3723063 3889772 3778234
14817 3778234 3853368 3885907 3689110 3833381 3752186 3652632 3840584 3712643 3476071 3544182
14807 3544182 3553548 3512484 3765978 3660464 3522692 3732340 3687931 3747297 3657257 3632655 3736600
14796 3736600 3726507 3726568 3886785 3770316 3583634 3523080 3485334 3428779 3658131 3686129 3522464
14785 3522464 3600413 3610212 3540133 3586683 3778867 3514991 3503815 3598103 3548330 3624068 3706784
14774 3706784 3590025 3853831 3795836 3689765 3796931 3774559 3564540 3793553 3812291 3557863
14764 3557863 3728840 3595041 3672859 3746689 3668683 3711553 3635627 3613395 3507059 3521286 3700652
14753 3700652 3544528 3454968 3613058 3536709 3617520 3665155 3513041 3618421 3603377 3462805
14743 3462805 3455584 3593731 3852857 3586234 3528117 3677512 3569139 3567606 3783189 3751516
14733 3751516 3818365 3682392 3682489 3847296 3718902 3669142 3555741 3678282 3819705 3847739 3773503
14722 3773503 3850524 3823014 3596607 3516436 3741355 3812101 3881025 3801764 3454532 3657193
14712 3657193 3602403 3734604 3621212 3681828 3514711 3575427 3665604 3570877 3648962 3719516 3569774
14701 3569774 3571275 3489280 3376197 3569125 3711701 3620747 3495802 3447225 3389076 3382443 3726101
14690 3726101 3461218 3612147 3808053 3569610 3693095 3703344 3618941 3559415 3803462 3693104
14680 3693104 3744997 3340189 3346868 3488537 3555006 3488171 3451711 3361896 3332894 3512353 3658904
14669 3658904 3614843 3661338 3606565 3642931 3736903 3684733 3616846 3763310 3547708 3694099 3849821
14658 3849821 3690312 3766106 3769310 3557721 3595532 3801716 3718714 3590543 3763079 3722838
14648 3722838 3826293 3862545 3701378 3568357 3470649 3342351 3712763 3837289 3716212 3778127
14638 3778127 3645410 3481712 3751398 3781606 3628497 3742021 3531853 3513488 3734092 3709105
14628 3709105 3713820 3734795 3631463 3626235 3622744 3664520 3770040 3822439 3719562 3786317 3975035
14617 3975035 3850385 3702202 3883953 3970955 3979949 3881632 3891376 3788775 3806654 3583925 3535897
14606 3535897 3356301 3582055 3620891 3741476 3691467 3467854 3753826 3992378 3835099 3601498
14596 3601498 3530347 3663579 3752692 3501494 3675620 3581398 3672139 3688077 3825733 3984855
14586 3984855 3735224 3588971 3868938 3974976 3977151 3926409 3711244 3757679 3826587 3792871
14576 3792871 3678192 3541945 3514803 3631088 3788486 3978959 3873567 3912286 3754209 3590819
14566 3590819 3558845 3735868 3732328 3699444 3548950 3506284 3639423 3675297 3985114 4012424 3973831
14555 3973831 3804706 3631659 3594902 3530638 3672743 3647670 3866697 4012128 3989792 3960269
14545 3960269 3904159 3778491 3809347 3822854 3640737 3765102 3660507 3806748 3962620 3934301
14535 3934301 4008026 3922343 3862070 3832892 3820667 3755441 3722535 3866770 3780083 3750328 3811704
14524 3811704 3696990 3463413 3685133 3680570 3514810 3703894 3806634 3692806 3827007 3566265
14514 3566265 3516028 3684931 3588529 3759602 3799527 3753461 3718923 3737165 3728593 3701796 3810739
14503 3810739 3786364 3555336 3630414 3813283 3846217 3798299 3833819 3880387 4016066 3995465 3905770
14492 3905770 3888855 3938577 3826853 3792118 3773661 3730709 3789566 3968734 3748669 3719413 3729940
14481 3729940 3876745 3893502 3796229 3872162 3821289 3697849 3993547 3850839 3952538 4031478
14471 4031478 3935649 4016096 3914190 3524601 3397767 3468868 3464013 3880028 3755345 3808360
14461 3808360 3696696 3473615 3500640 3671877 3635986 3773514 3707671 3653824 3698011 3673998
14451 3673998 3506831 3337497 3496310 3665743 3650442 3777471 3706044 3714273 3779518 3804394
14441 3804394 3781408 3805062 3806759 3747961 3868134 3812896 3519487 3507987 3645240 3630285 3735700
14430 3735700 3734921 3851067 3764361 3766422 3812906 3634738 3577833 3640642 3638771 3649616 3809991
14419 3809991 3898224 3841386 3636680 3516526 3597680 3760628 3668005 3739705 3696761 3707804 3707259
14408 3707259 3782728 3760286 3735745 3688041 3854613 3709786 3865692 3974556 3820169 3962137
14398 3962137 3990917 3823794 3823903 3834897 4060933 4074210 3940408 4016491 3987407 4005926 3674467
14387 3674467 3672545 3702574 3747897 3992833 3899727 3874040 3703134 3684747 3957272 3967324 3780566
14376 3780566 3727732 3605377 3736173 4065796 3959207 3683389 3693694 3760791 3756140 3766452
14366 3766452 3668224 3923425 3928625 3875235 3740836 3882637 3839874 3650747 3703081 3656775 3543712
14355 3543712 3891232 3841624 3796598 3860159 3633516 3562652 3582737 3589461 4043294 3949004 3757516
14344 3757516 3696754 3647990 3782836 3906116 3951117 3822748 3771211 3756657 3697283 3861843
14334 3861843 3889538 3891729 3960205 3861260 3794356 3945802 3864656 3819125 4041081 3680373 3612247
14323 3612247 3889844 3853392 3772091 3714186 3774205 3733039 4014590 3879865 3939506 3800188
14313 3800188 3627714 3770548 3896359 3558308 3465393 3716439 3668784 3766669 3861601 3910329
14303 3910329 4013722 3989512 3590417 3953088 3883172 3785829 3807107 3633555 3673235 3916777
14293 3916777 3967067 3748558 3794654 3857530 3731125 4024716 4177934 4014223 4106347 3898849
14283 3898849 3772880 3859303 3559107 3619089 3759715 3926343 3827841 3781607 3747236 3855399
14273 3855399 3937987 3721200 3925181 4210129 4098090 3974562 3935533 3860858 3822596 3860273
14263 3860273 3797969 3834926 3956491 3965038 3999331 3907223 3906516 4027356 3867059 3875941 4020748
14252 4020748 3953197 3897784 3958761 3946566 3940003 4009682 3989497 3908597 4024307 4017943 3938644
14241 3938644 4079252 4107802 4055272 4076807 3939305 3715655 3808105 3651267 3806338 4174903
14231 4174903 3793606 3722793 3756913 3785878 3910423 3884787 3933448 4197329 4087852 4146317
14221 4146317 4094341 3967523 3832687 3936301 3807967 3781277 3911459 3853143 3819379 3711724
14211 3711724 3729733 3730198 3808863 3726458 3972611 4149878 3908598 3853882 3929120 4015873 3810338
14200 3810338 3894571 3864594 3632344 3725631 3821507 3904776 3948830 4019503 4048350 4062731 4064617
14189 4064617 4009337 3975208 4228619 4041910 4057721 3841464 3902027 3935213 3870500 3889451 3892192
14178 3892192 3923038 3835369 3881101 4100808 4151565 3969026 3889407 3751586 3822856 3901887 3642745
14167 3642745 3640834 3799560 3925202 3940855 3934567 3875806 3826557 4000455 4001071 3945512 4043043
14156 4043043 3879929 3948526 3760944 3678072 3753086 3780920 3848859 4099385 4132716 4002601
14146 4002601 4039651 3966540 3888561 3943817 3935507 3895138 3900259 4015704 3883890 3952840 4000038
14135 4000038 3920627 3855169 3921146 3779768 3838757 3957237 3871547 3899406 4036487 4008274 4060878
14124 4060878 3841440 3812503 4047525 3886410 4077768 4239176 4203476 4135770 4015698 3984170
14114 3984170 4000236 3948919 4029610 4073192 4127841 4039092 4103551 4027992 3984939 3772016 3959670
14103 3959670 4055899 3868216 3856333 3919129 3947482 4068448 3935459 4009407 3909851 4029267
14093 4029267 3805718 3815362 3857611 3722992 3667992 3691770 4008470 3964326 3823064 3732502 3782713
14082 3782713 3927229 3995452 3988870 3966194 3847138 3865843 3953134 3816761 3744991 3670322 3708485
14071 3708485 3773054 3810856 3789785 3944629 4030056 4060619 4066182 4220265 3953049 3731865 3925511
14060 3925511 3894926 3891681 3892446 3832954 3808876 3609473 3495836 3644164 3831795 3883188 3858080
14049 3858080 4091766 4047689 4002140 3943124 3925688 4177146 4079862 3904913 3868626 3836510 3744198
14038 3744198 3797073 3946401 3774549 3909011 4047664 4100543 4213220 4140964 4007932 4109984
14028 4109984 4064281 3974177 3778140 3827948 3953778 3753169 3961592 4024870 3911424 3649709
14018 3649709 3663768 4146254 4055354 3964697 3865089 3929699 3944482 3841846 3961860 4043141 3939406
14007 3939406 3774327 3796587 3939194 3938377 3961553 4028693 4116381 4169061 4203423 4066924 4193952
13996 4193952 4088079 4090813 4036539 4003646 3959241 4040804 4006587 3921322 3893821 3867342 4022698
13985 4022698 3983787 4038097 4096633 3885328 3776617 3788180 3807628 3853869 4050017 4069554 3844215
13974 3844215 4007676 4222240 4072367 3949745 3932609 4038596 4022030 4007064 4142323 4197059
13964 4197059 3919301 3795763 3979435 4066557 4118446 4021216 4091976 4089572 4099250 4118237 4175913
13953 4175913 4049365 3811097 3883983 4144013 4211342 4174800 4331171 4290872 4312078 4321654 4350943
13942 4350943 4434156 4214850 4151519 4026237 3975931 3987324 4062864 4115314 3874706 4026665
13932 4026665 4199803 4079473 4113956 4028987 4052298 4024677 3884976 3774291 3939750 3950371
13922 3950371 4023530 4025783 4097978 3855326 3859906 4137704 4089578 4074404 3995235 4030485 4036959
13911 4036959 3856981 3960586 3910864 3856274 3806149 3899818 4036938 3941514 3789186 3991876
13901 3991876 4039255 3945423 4002184 4026999 4089157 4227032 4172236 4026199 3930538 3926965 4114580
13890 4114580 4045317 3873814 3962435 4111599 3904498 3928576 3812447 3757332 4038454 4004821
13880 4004821 3986869 3942017 3865606 4098695 4212402 4127818 4241201 4175809 4010720 3987003
13870 3987003 3882186 3827138 3892392 3992260 4102473 4063308 3952456 3997240 4107993 4158049
13860 4158049 3897902 3804694 4003432 4000276 4021957 4146280 4021815 3957436 3990299 3981913 4034170
$$ [...]
##END NTUPLES=NMR SPECTRUM
##END=
