##TITLE=1H_EC-3245(3)
 CDCl3, 8 sc, 
 9.06.2021
##JCAMPDX= 6.0         $$ Bruker NMR JCAMP-DX V2.0
##DATA TYPE= NMR SPECTRUM
##DATA CLASS= NTUPLES
##ORIGIN= UXNMR, Bruker Analytische Messtechnik GmbH
##OWNER= root
$$ XWIN-NMR		Version 3.5
$$ Wed Jun  9 09:42:39 2021 Russian Standard Time (UT+4h)  she@DPX200
##.OBSERVE FREQUENCY= 200.131506
##.OBSERVE NUCLEUS= ^1H
##.ACQUISITION MODE= SIMULTANEOUS
##.ACQUISITION SCHEME= undefined
##.AVERAGES= 8
##.DIGITISER RES= 18
##SPECTROMETER/DATA SYSTEM= spect
##.PULSE SEQUENCE= zg30
##.SOLVENT NAME= CDCl3
##.SHIFT REFERENCE= (INTERNAL, CDCl3, 0, 17.5032)
##AUDIT TRAIL= $$ (NUMBER, WHEN, WHO, WHERE, WHAT)
$$ ##TITLE= Audit trail, XWIN-NMR		Version 3.5
$$ ##JCAMPDX= 5.01
$$ ##ORIGIN= Bruker BioSpin GmbH
$$ ##OWNER= she
$$ F:/spectra/data/she/nmr/H-F/1/pdata/1/auditp.txt
$$ ##AUDIT TRAIL=  $$ (NUMBER, WHEN, WHO, WHERE, WHAT)
(   1,<2021-06-09 09:41:15.67 +0400>,<she>,<DPX200>,
      <created by zg, POWCHK disabled, PULCHK disabled
       configuration hash MD5:
       00 E9 B6 7A A2 85 ED C7 34 08 36 98 17 FE 4E 26
       data hash MD5: 16K
       65 3B 64 7D 1F F3 BC 34 19 34 F0 E5 3D 0A 0C 20>)
(   2,<2021-06-09 09:41:18.37 +0400>,<she>,<DPX200>,
      <Start of raw data processing
       efp BC_mod = 2 LB = 0.24 FT_mod = 6 PKNL = 1 PHC0 = -11642.74 PHC1 = 12.20101 SI = 16K 
       data hash MD5: 16K
       A3 4D D9 6E 21 CF D8 18 31 82 E9 BE D2 04 82 73>)
(   3,<2021-06-09 09:41:43.10 +0400>,<she>,<DPX200>,
      <pk PHC0 = 157.989 PHC1 = -1.6 
       data hash MD5: 16K
       60 41 9D 85 E6 05 2B F9 A7 E0 E4 46 8E D9 83 1B>)
(   4,<2021-06-09 09:41:46.90 +0400>,<she>,<DPX200>,
      <abs ABSG = 5 
       data hash MD5: 16K
       DA D2 EB 51 C0 DF BA D0 A7 D2 08 30 0B 8E 38 99>)
$$ ##END=
$$ 
$$ hash MD5
$$ 6E BC 61 15 86 BB F8 C8 DF AF C3 7B 9A F6 6D 32
##$RELAX= 
##$RELAX= 
##$RELAX= 
##$RELAX= 
##$RELAX= 
##$RELAX= 
$$ Bruker specific parameters
$$ --------------------------
##$DU= <F:/spectra>
##$EXPNO= 1
##$NAME= <H-F>
##$PROCNO= 1
##$TYPE= <nmr>
##$USER= <she>
##$AMP= (0..31)
100 100 100 100 100 100 100 100 100 100 100 100 100 100 100 100 100 100 
100 100 100 100 100 100 100 100 100 100 100 100 100 100 
##$AQSEQ= 0
##$AQ_mod= 1
##$AUNM= <au_zg>
##$AUTOPOS= <>
##$BF1= 200.13
##$BF2= 200.13
##$BF3= 200.13
##$BF4= 200.13
##$BF5= 200.13
##$BF6= 200.13
##$BF7= 200.13
##$BF8= 200.13
##$BYTORDA= 1
##$CFDGTYP= 0
##$CFRGTYP= 5
##$CHEMSTR= <none>
##$CNST= (0..31)
1 1 145 1 1 1 1 1 1 1 1 1 1 1 1 1 1 1 1 1 1 1 1 1 1 1 1 1 1 1 1 1 
##$CPDPRG= <>
##$CPDPRG1= <>
##$CPDPRG2= <>
##$CPDPRG3= <>
##$CPDPRG4= <mlev>
##$CPDPRG5= <mlev>
##$CPDPRG6= <mlev>
##$CPDPRG7= <mlev>
##$CPDPRG8= <mlev>
##$CPDPRGB= <>
##$CPDPRGT= <>
##$D= (0..31)
0 1.2 0 0 0 0 0 0 0 0.06 0 0.03 0 0 0 0 0.0002 0 0 0 0 0 0 0 0 0 0 0 0 
0 0 0 
##$DATE= 1623217275
##$DBL= (0..7)
120 120 120 120 120 120 120 120 
##$DBP= (0..7)
150 150 150 150 150 150 150 150 
##$DBP07= 0
##$DBPNAM0= <>
##$DBPNAM1= <>
##$DBPNAM2= <>
##$DBPNAM3= <>
##$DBPNAM4= <>
$$ [...]
##$SUBNAM3= <"">
##$SUBNAM4= <"">
##$SUBNAM5= <"">
##$SUBNAM6= <"">
##$SUBNAM7= <"">
##$SUBNAM8= <"">
##$SUBNAM9= <"">
##$SW= 20.0188882624521
##$SWIBOX= (0..15)
0 0 2 0 0 0 0 0 0 0 0 0 0 0 0 0 
##$SW_h= 4006.41025641026
##$TD= 16384
##$TD0= 1
##$TE= 0
##$TE2= 300
##$TE3= 300
##$TEG= 300
##$TL= (0..7)
0 120 120 120 120 120 120 120 
##$TP= (0..7)
150 150 150 150 150 150 150 150 
##$TP07= 0
##$TPNAME0= <>
##$TPNAME1= <>
##$TPNAME2= <>
##$TPNAME3= <>
##$TPNAME4= <>
##$TPNAME5= <>
##$TPNAME6= <>
##$TPNAME7= <>
##$TPOAL= (0..7)
0.5 0.5 0.5 0.5 0.5 0.5 0.5 0.5 
##$TPOFFS= (0..7)
0 0 0 0 0 0 0 0 
##$TUNHIN= 0
##$TUNHOUT= 0
##$TUNXOUT= 0
##$USERA1= <user>
##$USERA2= <user>
##$USERA3= <user>
##$USERA4= <user>
##$USERA5= <user>
##$V9= 5
##$VALIST= <valist>
##$VCLIST= <CCCCCCCCCCCCCCC>
##$VD= 0
##$VDLIST= <DDDDDDDDDDDDDDD>
##$VPLIST= <PPPPPPPPPPPPPPP>
##$VTLIST= <TTTTTTTTTTTTTTT>
##$WBST= 1024
##$WBSW= 4
##$XGAIN= (0..3)
0 0 0 0 
##$XL= 0
##$YL= 0
##$YMAX_a= 247614
##$YMIN_a= -163814
##$ZGOPTNS= <>
##$ZL1= 120
##$ZL2= 120
##$ZL3= 120
##$ZL4= 120
##$ABSF1= 17.55454
##$ABSF2= -2.464499
##$ABSG= 5
##$ABSL= 3
##$ALPHA= 0
##$AQORDER= 0
##$ASSFAC= 0
##$ASSFACI= 0
##$ASSFACX= 0
##$ASSWID= 0
##$AUNMP= <proc_1d>
##$AZFE= 0.1
##$AZFW= 0.1
##$BCFW= 0
##$BC_mod= 2
##$BYTORDP= 0
##$COROFFS= 0
##$CY= -3
##$DATMOD= 1
##$DC= 0
##$DFILT= <>
##$DTYPP= 0
##$F1P= 0
##$F2P= 0
##$FCOR= 1
##$FTSIZE= 16384
##$FT_mod= 6
##$GAMMA= 0
##$GB= 0
##$INTBC= 1
##$INTSCL= 1.334414e-10
##$ISEN= 128
##$LB= 0.24
##$LEV0= 0
##$LPBIN= 0
##$MAXI= 10000
##$MC2= 0
##$MEAN= 0
##$ME_mod= 0
##$MI= 1.114404
##$NCOEF= 0
##$NC_proc= -7
##$NLEV= 6
##$NOISF1= 3.799351
##$NOISF2= 2.8
##$NSP= 0
##$NTH_PI= 0
##$NZP= 0
##$OFFSET= 17.50322
##$PC= 1
##$PHC0= -11484.75
##$PHC1= 10.60101
##$PH_mod= 1
##$PKNL= yes
##$PPARMOD= 0
##$PSCAL= 0
##$PSIGN= 0
##$REVERSE= no
##$SF= 200.130006286643
##$SI= 16384
##$SIGF1= 3
##$SIGF2= 2
##$SINO= 5.538805
##$SIOLD= 16384
##$SREGLST= <1H.CDCl3>
##$SSB= 0
##$STSI= 16384
##$STSR= 0
##$SW_p= 4006.41025641026
##$SYMM= 0
##$S_DEV= 0
##$TDeff= 16384
##$TDoff= 0
##$TI= <>
##$TILT= no
##$TM1= 0
##$TM2= 0
##$TOPLEV= 0
##$USERP1= <user>
##$USERP2= <user>
##$USERP3= <user>
##$USERP4= <user>
##$USERP5= <user>
##$WDW= 1
##$XDIM= 16384
##$YMAX_p= 313724298
##$YMIN_p= -5908086
$$ End of Bruker specific parameters
$$ ---------------------------------
##NTUPLES= NMR SPECTRUM
##VAR_NAME=  FREQUENCY,     SPECTRUM/REAL,   SPECTRUM/IMAG
##SYMBOL=    X,             R,               I
##VAR_TYPE=  INDEPENDENT,   DEPENDENT,       DEPENDENT
##VAR_FORM=  AFFN,          ASDF,            ASDF
##VAR_DIM=   16384,         16384,           16384
##UNITS=     HZ,            ARBITRARY UNITS, ARBITRARY UNITS
##FACTOR=    0.24454680195387, 1,            1
##FIRST=     3502.91944948351, 0,            0
##LAST=      -503.490806926745, 0,           0
##MIN=       -503.490806926745, -5908086,    0
##MAX=       3502.91944948351, 313724298,    0
$$ Real data points
##PAGE= N=1
##DATA TABLE= (X++(R..R)), XYDATA
$$ [...]
6308c19821M7572J75790q57310J222118O95672j128438n12894M68341j56482k83776
6298f49228l42285J91953O05923M99187P48461m16465j06278j36867o23466N78973
6288C49908l99309J04320N97104k97885N08587o78818q72656P22053N51097n51073
6278C3328L17073K85369m36512J13696J67551O53612l47137r68672j42372j38031
6268d62095N54421o83174L22538J130351J058661j095984k15214M33790p32550
6259C10744k92333P5778J79243N42K94966P32150n59030k7373m30458R6141O08777
6248I89147K41689L51698l96225P6055l77307K84478j430595O88294M24675l68242
6238D83667N61601k78980m84219k5418P97122o1326m74070j54646J84794P7419
$$ y = [-319821, -272249, -96459, -953769, 268349, 964021, -164417, -677311, -208970, -365452, -649228, -991513, -799560, -193637, 305550, 1054011, 637546, 531268, 394401, -229065, 349908, -49401, 54919, 652023, 354138, 862725, 183907, -688749, 33304, 584401, 33328, 350401, 635770, 199258, 312954, 480505, 1134117, 786980, -181692, -324064, -462095, 92326, -590848, -268310, 862041, 1920702, 824718, 609504, 1043294, 310744, 18411, 94189, 273432, 273974, 568940, 1301090, 742060, 714687, 284229, 380370, 989147, 1230836, 1582534, 1186309, 1262364, 885057, 1169535, -261060, 427234, 851909, 483667, 1045268, 766288, 282069, 256651, 1053773, 992447, 518377, 363731, 548525, 625944]
6228F25944J99660m34517Q46086k83557q85852K85947L62612l5460o14871K27807
6218B93799m0320R0035n93151J22751J20361j45178J169695p28999P02980K20754
6208A212727K24725K02479r16305L92306q49110K48843M38734Q2777M44973j102768
6198C79381N51257P48615l58546o01455L22259N03643n16700k31016J82768L60005
6188A340211n3156O26903o36771k36844M02601J24285j2828N9898K69631l39164
6178A544766K57156K43486j195071j72988O23341j6391p21290k78435K98787o1375
6168E21986J17694q3553R95457Q52008m03058l93222N71355k85344J66680M23112
6158B483115m7973j5021j43752m91718j13951P82713r00564O42070J83385p97287
$$ y = [625944, 825604, 391087, 1237173, 953616, 67764, 353711, 716323, 680863, 65992, 293799, 253479, 343514, -249637, -126886, -6525, -151703, 1017992, 288993, 991973, 1212727, 1437452, 1639931, 723626, 1115932, 266822, 515665, 954399, 1037176, 1482149, 379381, 930638, 1679253, 1320707, 719252, 1041511, 1545154, 1028454, 797438, 980206, 1340211, 1287055, 1913958, 1277187, 1040343, 1442944, 1567229, 1554401, 1614299, 1883930, 1544766, 1801922, 2045408, 850337, 677349, 1300690, 1284299, 563009, 284574, 583361, 521986, 639680, 556127, 1551584, 2403592, 2000534, 1607312, 2178667, 1893323, 2060003, 2483115, 2435142, 2420121, 2276369, 1784651, 1670700, 2453413, 1552849, 2194919, 2378304, 1581017]
6148A581017N82262K3904K02641R06022l21672L09436L88428N67459K52812l73737
6138D118572o90016Q23744J55325n69840k17249j91639M78815R10701m46594N92500
6128D964319Q5863j97345J91583K08616N14776P4866J97263N88511N30725j55852
6118G003325M03654P55260k7923p31737J108921J165625M80882m99909J002333
6109A0660431O96539P6330o44666M31084J678031J246176j83692O94169J084537
6100A5738939Q78623r8432R62415J694689J291832J207166J600631P87518M56063
6091B4519444J287507Q74969J323567J463433R37525P39732K016879J053611J093366
6082C5310033J305136K10529M59821K4865n44993r36016j198869l71357j184344
$$ y = [1581017, 2163279, 2187183, 2389824, 3295846, 2974174, 3283610, 3672038, 4239497, 4492309, 4118572, 3428556, 4252300, 4407625, 3837785, 3620536, 3428897, 3907712, 4818413, 4371819, 4964319, 5050182, 4852837, 5044420, 5253036, 5767812, 5842678, 6039941, 6628452, 7159177, 7003325, 7406979, 8162239, 8134316, 7402579, 8511500, 9677125, 10158007, 9658098, 10660431, 11356970, 11433300, 10788634, 11219718, 12897749, 14143925, 13960233, 14654402, 15738939, 16617562, 16519130, 17481545, 19176234, 20468066, 21675232, 23275863, 24063381, 24519444, 25806951, 26681920, 28005487, 29468920, 30406445, 31146177, 33163056, 34216667, 35310033, 36615169, 36825698, 37285519, 37310384, 36765391, 35829375, 34630506, 34259149, 33074805]
6073C3074805j226097j055438k190637j811419r63509q26757j633595j721166
6065B1646187j009054o88946j122013j640412j544188o30490j122106p12207l9987
6056A3136784p16111l31923j029665l32637k59820j106570L2520j61086q12138
6047H419354M06601M34p90765J36314j156461n1234j952j452287J71449P25656
6037F407109j086107K27505l44623j211449M77128o92120K19400N80592l26986
6028D250449r04903j32760Q17001K76601j035265q78186J11119P56478O2795o5499
6018C257830K0069K86603k25430M34203L12689j84089m79733n01913o83349L5004
6008B271884l85003o15387o2835L92387N20426m32669n55493N98308J0607o36435
$$ y = [33074805, 31848708, 30793270, 28602633, 26791214, 25827705, 25000948, 23367353, 21646187, 20637133, 19948187, 18826174, 17185762, 15641574, 15011084, 13888978, 13176771, 13136784, 12420673, 12088750, 11059085, 10726448, 10466628, 9360058, 9392578, 9231492, 8419354, 8825955, 8826389, 8035624, 8171938, 7015477, 6964243, 6962291, 5510004, 5681453, 6407109, 5321002, 5548507, 5203884, 3992435, 4469563, 3777443, 3996843, 4577435, 4250449, 3345546, 3212786, 4029787, 4306388, 3271123, 2392937, 2504056, 3260534, 3323329, 3257830, 3277899, 3564502, 3339072, 3773275, 4085964, 3901875, 3422142, 2920229, 2236880, 2271884, 1886881, 1271494, 1208659, 1601046, 2121472, 1688803, 1133310, 1731618, 1742225, 1105790]
5998A105790o0148K99017k43189j77151R86717n75816k96907O1585n5755K43311
5988A287454j40640q54302L06325M64659j165304M90301J041352j21556j79077
5979A129212p22774j2196R06283L17080q28258n96637L18654M49005l55825L92786
5969I97330k36216J56013K09054j077663Q12291J35638m48647m03843K19518L94747
5959G58222M6659L79242P3074o14575K79710J38042r15940M07412P58171l76002
5949I34015l92189R7781N57866q59574m09903L33643M94944n26847l91063M68948
5939C07621Q49510N5377p66181J164961k12012m04287j37982n7043K88541k57075
5929H31430n17514O30575N4905m96468n11364Q59061j92136n410k77785J47637
$$ y = [1105790, 1045642, 1344659, 1101470, 924319, 1911036, 1335220, 1038313, 1099898, 1044143, 1287454, 1146814, 292512, 598837, 1063496, -101808, 388493, 1429845, 1308289, 1129212, 406438, 394242, 1300525, 1617605, 789347, 192710, 511364, 960369, 604544, 997330, 761114, 917127, 1126181, 48518, 860809, 996447, 547800, 143957, 363475, 758222, 804881, 1184123, 1257197, 642622, 922332, 1060374, 144434, 551846, 1310017, 934015, 541826, 639607, 1197473, 337899, -72004, 261639, 756583, 229736, -161327, 307621, 1157131, 1212508, 446327, 1611288, 1399276, 994989, 857007, 799964, 1088505, 831430, 313916, 944491, 999396, 502928, -8436, 850625, 658489, 653079, 375294, 522931]
5919E22931R80513m94556j008389J76885N13140n24804k83154J208949L85422
5910A476937j8865k34982m87584J14450j12318j171706P67961P82389j019872
5901I6410J15098J72270J27606J71026j899n16937K15767K94542j166747K41752
5891b51112k81557q2424J258694K82265j1477n37622N21445l06718J8072m57484
5881A52082n42671J015194l05728n94770Q23371K57379j259172R5949K48483j36018
5871b45901K80819K24366n83201M06319P49459m14303J73995N10447N94208m14502
5861A281706m83075j33460K0829J69269k82803l26557J53433P8494n81372O5120
5851c8416J569972j70276q78485k24338N73614m49126j48551k53979J316762r19478
$$ y = [522931, 1503444, 1008888, 499, 177384, 690524, 165720, -117434, 1091515, 1476937, 1458072, 1223090, 735506, 849956, 737638, -434068, 333893, 1116282, 96410, 211508, 383778, 511384, 682410, 680511, 163574, 379341, 673883, -492864, -251112, -532669, -615093, 643601, 925866, 914389, 376767, 898212, 591494, 609566, 152082, -390589, 624605, 318877, -275893, 547478, 804857, -454315, -358366, -109883, -245901, 34918, 259284, -323917, 82402, 831861, 417558, 591553, 1102000, 1696208, 1281706, 798631, 665171, 686000, 855269, 572466, 245909, 399342, 477836, -103536, -38416, 1531556, 1361280, 482795, 258457, 832071, 382945, 234394, -19585, 1297177, 377699]
5841C77699l98946k0824N42949J15934j114753L47125N46838J56232m70732j57583
5831g6061M68470k79881K94139k09738P37761J90705j050633L37484L67120r8672
5821F80694r30951K7572O71172L55903j131986J24381M23071L30260k99935l81289
5811a31108L96961M8737n89831p4023P06840M22497n51901O8061J69695k68759
5801A97169m90404K73974q9520J90697r01200m1884R58742J74733J70453K39439
5791F82199K39902n79147l55163M97960J49868P82747q3712m09129p37032m79973
5781b91480Q22688j58050K89781O16441m5023O0518J56384j84325k215p90147
5771D74572o5552P30049o83641M4964N69811M90385m25843m13505l14192q6622
$$ y = [377699, -21247, -42071, 500878, 616812, -497941, -150816, 396022, 552254, 81522, -76061, 392409, 112528, 406667, 196929, 934690, 1125395, 74762, 412246, 779366, 680694, -250257, -222685, 448487, 804390, -327596, -203215, 219856, 550116, 250181, -131108, 265853, 314590, -275241, -349264, 357576, 780073, 228172, 296233, 465928, 197169, -293235, -19261, -108781, 81916, -819284, -861168, 97574, 272307, 442760, 682199, 922101, 342954, -12209, 485751, 635619, 1418366, 1334654, 925525, 188493, -291480, 531208, 373158, 662939, 1279380, 1234357, 1294875, 1451259, 1266934, 1264719, 474572, 409020, 1139069, 455428, 500392, 1070203, 1560588, 1134745, 721240, 407048, 320426]
5761C20426O48683J02759l55435j82239l65157O6053K83956J68139k63469N91053
5751A014769q3243k86289K7782m18737J08034K96567K17875l05915K71079L38761
5741A180683J23155J84934P9317j51693m20981n57094J61365Q6623R9935K15955
5731A002199j90771l79845m22555M0112M99279L34756l72456m19144P41920k69075
5721E64420j03038N50979L24887o2976l20726j02308R49378N87091q65689K87557
5711A809575O25140n89721k19873Q4145L96677k55662o60578L26053N19603q19676
5701A215683l51126J067839L06213l14484J41525K30287L96992j84888N36645
5692C044686p47209o94838Q89086M08591O7348n176m85434L15683L31762j72276
$$ y = [320426, 969109, 1071868, 716433, 534194, 169037, 235090, 519046, 687185, 423716, 1014769, 931526, 645237, 673019, 254282, 362316, 658883, 876758, 570843, 841922, 1180683, 1303838, 1488772, 1568089, 1416396, 995415, 438321, 599686, 686309, 786244, 1002199, 811428, 431583, 9028, 49140, 548419, 883175, 510719, 91575, 833495, 564420, 461382, 1012361, 1337248, 1274272, 953546, 851238, 1800616, 2387707, 1522018, 1809575, 2434715, 1844994, 1625121, 1709266, 2105943, 1850281, 1189703, 1515756, 2035359, 1215683, 864557, 1932396, 2238609, 1924125, 2065650, 2295937, 2692929, 2508041, 3044686, 2297477, 1602639, 2491725, 2900316, 2967664, 2962488, 2477054, 2792737, 3124499, 2952223]
5682B952223J0644j2803k00232K91670P09675l72816j84204l32652J92098J78011
5672C231614Q3507n0669J29999k69173O75630L60523Q87200l86257Q89635R96571
5662F548580r42998J43680K92494M04533m75686q00677J013226J378723q80022
5653F681853q60235M92431L02704K53316Q21023l27388J78378P86203J04293L14544
5643H747122J500987L01057o5849M67934J11219J349947J219207P50113J045278
5634A5427015J143589J318166J176877K534323Q40084J292125K016653K114582
5626B7863414L443035K444590K833005L711899L893644J664879O96001K42339
5618D6792806j965538j209064l661731l468026j794383k384116j21577K67274
$$ y = [2952223, 2962867, 2950064, 2749832, 3041502, 3751177, 3378361, 3194157, 2861505, 3053603, 3231614, 3315121, 3264452, 3394451, 3125278, 3800908, 4161431, 5048631, 4662374, 5552009, 6548580, 5605582, 5749262, 6041756, 6446289, 5970603, 5169926, 6183152, 7561875, 6681853, 5821618, 6314049, 6616753, 6870069, 7691092, 7363704, 7542082, 8328285, 8432578, 8747122, 10248109, 10549166, 10483317, 10951251, 11062470, 12412417, 13631624, 14381737, 15427015, 16570604, 17888770, 19065647, 21599970, 22440054, 23732179, 25748832, 27863414, 31306449, 33751039, 36584044, 40295943, 44189587, 45854466, 46550467, 46792806, 44827268, 43618204, 39956473, 36488447, 34694064, 32309948, 32188371, 32455645]
5610C2455645k55030K50268P49272Q45986J745240J347531K378227J636596K802227
5601D3955962L743829K602693N407052N472373N643715O864826O937830N664574
5593H6292854K527262p24782m169276p201705r398333q291349o462917m879563
5585D7692191m118086l526849j966790k088418j413336n75182j457860j72448
5577C2373222r39539j9602J453356P53778J605074N81585J763920L008599K788105
5568D3368498K420861J683039J276107j039741k792779k565530m364622m388509
5560C3597324m424033k777611k657438k782528k274292j693147j697443o66497
5552A4624335l82203j859394q38853l26379r50894n57173l30301p09740L99355
$$ y = [32455645, 32200615, 32450883, 33200155, 34046141, 35791381, 37138912, 39517139, 41153735, 43955962, 47699791, 50302484, 55709536, 61181909, 66825624, 73690450, 80628280, 86292854, 88820116, 88095334, 83926058, 76724353, 67326020, 59034671, 52571754, 47692191, 43574105, 40047256, 38080466, 35992048, 34578712, 34003530, 32545670, 32373222, 31433683, 31414081, 32867437, 33621215, 35226289, 35807874, 37571794, 40580393, 43368498, 45789359, 47472398, 48748505, 47708764, 44915985, 42350455, 37985833, 33597324, 29173291, 26395680, 23738242, 20955714, 18681422, 16988275, 15290832, 14624335, 14242132, 12382738, 11543885, 11217506, 10266612, 9709439, 9379138, 8669398, 9068753]
5543I068753p64928j76949o51856K81147J45633n38593j98189j077792p26105
5534E361121o67144J62932n0175k48955M49483p15013L57262L69861p05288l7731
5524D276353N99496K74628l53933K4885p47242n98457J87412m49548L58951q7309
5514C485236j112395o9525J22007Q02742k78334o63477m8390R36134l17594p86715
5504B069689J305255l35591K20304m63095n75505l76281k88866j50309K1947N33809
5494A961357l02854n52920N06032L39622l31234r20748J018042J63268k58558
5485A622007P3912K2755J0446o06123K82914N44883m17820o2967K41614m05690
5475A305931P03500j61403l94161p3961l15753k98579M65405K54152k94495m73427
$$ y = [9068753, 8303825, 8126876, 7475020, 7756167, 7901800, 7363207, 7165018, 6087226, 5361121, 4693977, 4856909, 4806734, 4557779, 5007262, 4292249, 4649511, 5019372, 4314084, 4276353, 4875849, 5150477, 4796544, 4821429, 4074187, 3475730, 3663142, 3213594, 3572545, 3485236, 2372841, 2303316, 2425323, 3228065, 2949731, 2286254, 2237864, 3173998, 2856404, 2069689, 3374944, 3039353, 3259657, 2796562, 2221057, 1844776, 1555910, 1405601, 1427548, 1961357, 1658503, 1105583, 1611615, 1951237, 1620003, 699255, 1717297, 1880565, 1622007, 1695919, 1718674, 1729120, 1122997, 1405911, 1950794, 1532974, 1470007, 1711621, 1305931, 2009431, 1848028, 1453867, 1379906, 1064153, 765574, 1230979, 1485131, 1190636, 717209]
5465G17209l04599J16612J83796L70953J49898n28727J048765J08106k08454m40540
5455A213019m81683K48811l66419M73230O1565K8071m71868k82259J034236k90667
5445A166036k15676m80206k26621j74003L47258J053836l39200k37759N55344
5436A449009o86245M9777O4111l63452m9731m69605M95142M54223r74382M82751
5426D51598k05292q9217o66534J5362P68866n58408Q20721m72112j18364O16975
5416E63595p87813Q73805k81641j89588K23322L92398O95256m64419j208250l11586
5406d94921K52399J70571R332K41692N24458j58569o33839p42032P42422p1814
5396a60301q40226Q33698k44705Q9839P49951l4636P73461k04741J33120p6869
$$ y = [717209, 412610, 529222, 713018, 1083971, 1233869, 705142, 1753907, 1862013, 1653559, 1213019, 731336, 980147, 613728, 1086958, 1148523, 1176594, 704726, 422467, 1456703, 1166036, 950360, 470154, 243533, 69530, 416788, 1470624, 1131424, 893665, 1449009, 762764, 812541, 876652, 513200, 463469, -6136, 489006, 943229, -31153, 451598, 246306, 157089, -509445, -494083, 274783, -283625, 537096, 64984, -53380, 563595, -224218, 649587, 367946, 178358, 401680, 794078, 1489334, 1024915, -183335, -494921, -242522, -71951, -62619, 179073, 703531, 544962, -88877, -830909, -88487, -160301, -1000527, -166829, -411534, -321695, 428256, 393620, 1167081, 962340, 1095460, 1018591]
5386A018591m39130L36894p30162l57090Q88230l50019l46289M71855m0334n05766
5376e3220L6880o5941k41096m082M53418m48550N30520K14177k89250k63766K17099
5365H6189j84299J06464P935Q011K56565n01101n1549L49027m9562N03098m06242
5354A24536j37714p48493M71368Q30887k7808l28349m77919K15849N6943n6759
5344g7459Q86784p0515k85938l85364k81158J284433M86096o90947J43664j08126
5334I01470l12984k18104o829j09244N38591J28506q57870M77018l54699K68169
5324D54024N34199r91582l34571O35780J3194K12346j60807p48578n2478J51032
5314b87441k12054J742816l98411n34714L80694J19198J63470q67957J078258
$$ y = [1018591, 579461, 916355, 186193, -170897, 717333, 367314, 21025, 492880, 452546, -53220, -16340, -82281, -323377, -327459, 125959, -322591, 207929, 422106, 132856, -130910, 86189, -98110, 8354, 16289, 24300, 280865, -220236, -271785, 77242, 27680, 530778, 124536, -13178, -761671, -290303, 540584, 512776, 184427, -293492, -77643, -20700, -77459, 809325, 738810, 452872, 67508, -213650, 1070783, 1556879, 865932, 1009596, 901470, 588486, 370382, 363553, 254309, 792900, 921406, 63536, 540554, 185855, 454024, 988223, -3359, -337930, 297850, 311044, 523390, 362583, -385995, -438473, -287441, -499495, 1243321, 844910, 310196, 690890, 810088, 973558, 105601, 1183859]
5305A183859P15459r03116l7515L75390O81875r60924P5746N02860q635L20443
5295A945442l64934j63504J77585q05183K19402n20055k95954P60506O21733n35632
5285A039406o15116J59526j36497J03805l09766L27758J97929n08252M74011N61504
5275A294308p77012O2594k08527O94718J70600J0277J27837q66572k79789L79362
5265F07796q89397M61665N28922o50147j17256N81692M17185M1840k60447m25732
5255B96121J39186L70500j94890m33277L83207K53415m37506l56663J234441N6990
5245A311524k20908l30041q1289k71974m98491L74232M1155L0468J58756k37615
5235B75817R4763l69842j24444K29350O05967m05716K15513M53753n81556M4588
$$ y = [1183859, 1899318, 996202, 958687, 1334077, 2015952, 1055028, 1130774, 1633634, 1624999, 1945442, 1580508, 1417004, 1594589, 789406, 1008808, 488753, 192799, 953305, 1575038, 1039406, 424290, 583816, 447319, 551124, 241358, 569116, 767045, 258793, 732804, 1294308, 517296, 579890, 371363, 1066081, 1236681, 1246958, 1374795, 508223, 228434, 607796, -281601, 180064, 708986, 58839, -58417, 523275, 940460, 982300, 721853, 296121, 435307, 805807, 610917, 177640, 560847, 814262, 376756, 20093, 1254534, 1311524, 1090616, 760575, 679286, 407312, -91179, 283053, 324208, 354676, 513432, 275817, 370580, 738, -123706, 105644, 711611, 305895, 521408, 975161, 393605, 438193]
5225D38193p2074K93217k82433m89564O76309k84423j82451P1018N8571N8762
5215B85125L38268l4635K22349k36385L0098k27014O30865O2932j00692L61667
5205A332578J16681p53959l72806Q97020n36510j77001r7700R500l15438j59331
5195e6966K98323P39895p28861m1191J35062k51138K97798J10578j14621k52806
5185A36073j32923k5307N84654k0274j97999R56139l61076j56910K31176m86686
5175E26867l32290P97493o9420N24029N13602k25582l74227K28631k26504q69523
5165D93076k87748l9193K66284L89569K0011R63231n98796j42625l6242l14014
5155G13553J32868Q24495l65233L49664L25502k90902r3776N43822Q4340j330187
$$ y = [438193, 366119, 659336, 376903, -112661, 563648, 279225, 96774, 167792, 226363, 285125, 623393, 588758, 811107, 574722, 604820, 377806, 1008671, 1071603, 970911, 1332578, 1449259, 695300, 322494, 1219514, 683004, 506003, 408303, 417803, 102365, -56966, 241357, 981252, 252391, 211200, 346262, 95124, 392922, 503500, 388879, 136073, 3150, -22157, 562497, 542223, 344224, 1300363, 939287, 782377, 1013553, 526867, 194577, 992070, 922650, 1446679, 1960281, 1734699, 1360472, 1589103, 1362599, 493076, 205328, 166135, 432419, 821988, 841999, 1805230, 1206434, 1063809, 1027567, 713553, 846421, 1670916, 1305683, 1655347, 1980849, 1689947, 1596171, 2139993, 2224333, 894146]
5145H94146N32361K91519n49449L84028j35875r8199J44671m44170O4875M4439
5135A128346M85123O93411q6886o92532Q0318J078436q48931o11445Q09824m79215
5125A556449L51319M58946j42979o84940P36218o72035L38560k41984K48021O39634
5115B587209O491n39591q3364P15926n43854L93013N87361j095673O03040N93519
5105C224077J22757j070028P70506K0346j65634N14430n26516P63338P5707p5677
5095C653306k49191l55426j12567J524953P67836l02097L35548J209546l13288
5086F158620k15650J04086j98837p6725j067518N68698j39756O2522J95299p02956
5076D687783J465974o93893m98350J095074l95348J042869K34332q3124m04372
$$ y = [894146, 1426507, 1718026, 1168577, 1552605, 1416730, 1318531, 1463202, 1019032, 1083907, 1128346, 1613469, 2306880, 2219994, 1527462, 1607780, 2686216, 1837285, 1225840, 2035664, 1556449, 1907768, 2366714, 2223735, 1538795, 2275013, 1602978, 1941538, 1699554, 1947575, 2587209, 2593700, 2054109, 1970745, 2686671, 2142817, 2535830, 3123191, 2027518, 2630558, 3224077, 3346834, 2276806, 3047312, 3067658, 2902024, 3416454, 2889938, 3653276, 3728983, 3653306, 3404115, 3048689, 2936122, 4461075, 5228911, 4926814, 5262362, 6471908, 6158620, 5942970, 6047056, 5848219, 5771494, 4703976, 5272674, 5132918, 5195440, 5390739, 4687783, 6153757, 5459864, 4961514, 6056588, 5661240, 6704109, 6938441, 6855317, 6450945]
5067F450945L4011J06333M57949P62306m75083Q597Q38536J539454M12621l8714
5057A0096955K87011O37697k36244m07030j07223n42775O91599M38556k52444
5048A0606102R40901k00794l39448O72646M96731J61034J195323P29216M08450
5039A4670161l91831Q01717M23659M06112J207572J197367J077769N35676J270979
5030B1199181J551105J203376J768616J470274K035587K541665K754451K236835
5022C6761090L560382L565735M202781M269804M993037P206726O768398P804760
5014G9132713Q002668Q483807O939905O730906P916707N869333M263399K751762
5006A30091200L07590k733610n947803o826862q311757p557191q337308q541110
$$ y = [6450945, 6484956, 6591289, 7049238, 7811544, 7336461, 7345058, 8183594, 9723048, 10135669, 10096955, 10383966, 11021663, 10785419, 10378389, 10271166, 9728391, 10419990, 10858546, 10606102, 11547003, 11346209, 11006761, 11679407, 12176138, 12337172, 13532495, 14261711, 14670161, 14278330, 15080047, 15503706, 15909818, 17117390, 18314757, 19392526, 19928202, 21199181, 22750286, 23953662, 25722278, 27192552, 29228139, 31769804, 34524255, 36761090, 40321472, 43887207, 48089988, 52359792, 57352829, 64559555, 71327953, 79132713, 87135381, 95619188, 102559093, 109289999, 117206706, 123076039, 127339438, 130091200, 130398790, 127665180, 121717377, 114890515, 106578758, 99021567, 90684259, 82143149]
4998H2143149p363044p184330o852397o832642o181683l891344m095084l986975
4990C5755650l080720l118052j939922j862848j618839j166549j823853r16736
4982B0228131j438922j211385o66419j260683Q0619j667555l71547j28682j070193
4973A2493364m44494k33216n3479o80439Q244k53248n70309j056771o39236m8374
4963H522042j407823k03542M19786P6145J02274l81550j219250J04721R60149
4954F972952m71466o92711k51918J72965p86411n31161L68232m31942J25499k28854
4944D245185P2141Q12029n41035n50555l83265k9844P387O61195r4434j18745
4934D080059P77595M96853p86696k81360O06901m28807n39561n44106J20074O23638
$$ y = [82143149, 74780105, 67595775, 60743378, 53910736, 47729053, 43837709, 39742625, 35755650, 32674930, 29556878, 27616956, 25754108, 24135269, 22968720, 21144867, 20228131, 18789209, 17577824, 16911405, 15650722, 15731341, 14063786, 13692239, 13563557, 12493364, 12048870, 11815654, 11762175, 11081736, 11089980, 10836732, 10266423, 9209652, 8570416, 8522042, 7114219, 6910677, 7330463, 7406608, 7508882, 7127332, 5908082, 6012803, 6972952, 6501486, 5808775, 5556857, 5729822, 4943411, 4412250, 4780482, 4348540, 4474039, 4245185, 4317326, 5129355, 4588320, 4037765, 3654500, 3624656, 3632043, 4293238, 4198804, 4080059, 4857654, 5354507, 4567811, 4286451, 4893352, 4464545, 3924984, 3380878, 3500952, 4124590]
4924D124590n17361K27347o87162k40652K38283O6299O11378m29695k13975K29221
4914C408273m26957O19351j04808l08964J69438J62034j039133j4012J560612
4905D025834m6371m75477q357K90222N73082Q4231m22299r47314J3539P70118
4895C857208J47612j063940n02486O65385L09635k00625J15891P70881j080156
4886C019405J60022O28598Q48027K10348L59858Q25234l15135M74898L14275R03229
4876G428759R38927j57747J277548J128342J426223J036728R74077L046570K178162
4867A9277589K952093M020607J911799K488149m75625l365314n496787m293842
4859A7018669k959225k385459n07864j739600k210240n48817p79243r81178k97441
$$ y = [4124590, 3607229, 3834576, 3147414, 2906762, 3145045, 3211344, 3822722, 3393027, 3179052, 3408273, 2981316, 3600667, 3495859, 3186895, 3356333, 3518367, 2479234, 2465222, 4025834, 3979463, 3503986, 3495629, 3785851, 4358933, 4443164, 4020865, 3073551, 3087090, 3857208, 4004820, 2940880, 2438394, 3103779, 3413414, 3212789, 3328680, 4099561, 3019405, 3179427, 3808025, 4656052, 4866400, 5226258, 6051492, 5736357, 6211255, 6525530, 7428759, 8367686, 8209939, 9487487, 10615829, 12042052, 13078780, 14052857, 17099427, 19277589, 22229682, 26250289, 28162088, 30650237, 30174612, 26809298, 21312511, 17018669, 14059444, 11673985, 11166121, 9426521, 7216281, 6667464, 5888221, 4907043, 4609602]
4850D609602L86719j07254o53395l23744L7649P44018p94421J67044l60203r10682
4840B795333J54914j90803P09121k68325o16926L16291O64132n84515n83143R03227
4830C299306j77579n46006o04749o40417J008751r6146l1042K55947p1267q98132
4820A498666J8926O66388j092502O72190J174061o23472k52949L48508k25238
4811B184578m50999p23292M21789o3147j39892l09501J88494P3430k38384j2714
4801I30362l14175L50403k165m29625K71748K72594k29398L45986O65130j85783
4791A675077O0288n16151M72881j9954r53472M45476n5730O3253J47368j82857
4781A136179o47223R5151r3951K93190j13276R6466N42369o66154K93348J56J15107
$$ y = [4609602, 4996321, 4889067, 4235672, 3911928, 3949577, 4693595, 3899174, 4066218, 3706015, 2795333, 2950247, 2759444, 3468565, 3200240, 2583314, 2899605, 3563737, 2979222, 2396079, 3299306, 3121727, 2575721, 1970972, 1330555, 2339306, 2243160, 2212118, 2468065, 2396798, 1498666, 1517592, 2183980, 1091478, 1763668, 2937729, 2314257, 2061308, 2409816, 2184578, 1733579, 1010287, 1432076, 1368929, 1229037, 919536, 1108030, 1181460, 943076, 930362, 616187, 966590, 964425, 534800, 806548, 1079142, 849744, 1195730, 1860860, 1675077, 1735365, 1219214, 1692095, 1672141, 718669, 1164145, 1108415, 1171668, 1319036, 1136179, 488956, 584107, 490156, 783346, 670070, 766536, 1308905, 642751, 936099, 936255, 1051362]
4770A051362O65062o45805j93950j0186o91744J027055O34649m0837k61059N62924
4760B097471m35647l51086P7786l70419Q5070R6664r10206J134692J015989j231771
4750A208543J97865L9772o44568N66513m06225k2657J4014k64429J99390K65268
4740A153486K27985r34083k4766J002897J12149k53830O37699O62091k68924l82548
4730A932156K21971r26526J44503N40771p32941N64067M6860l93243m10988n86577
4720D00053N46670P36707l44027n47317P31715k8093p03385J195332m22688L26039
4710A891006k98491k90989N44932R5568N7565r11433P81002o37761j03113l10146
4700H18140m86078O36338K69513l72355r25620O15074J235070n63883O14063R9298
$$ y = [1051362, 1716424, 1070619, 876669, 866483, 174739, 1201794, 1836443, 1795606, 1534547, 2097471, 1661824, 1310738, 1388524, 1018105, 1103175, 1199839, 289633, 1424325, 2440314, 1208543, 1406408, 1446180, 801612, 1368125, 961900, 939243, 953257, 688828, 888218, 1153486, 1381471, 447388, 422622, 1425519, 1537668, 1283838, 1921537, 2583628, 2314704, 1932156, 2154127, 1227601, 1372104, 1912875, 1179934, 1744001, 1790861, 1397618, 986630, 400053, 946723, 1683430, 1339403, 792086, 1523801, 1495708, 792323, 1987655, 1564967, 1891006, 1592515, 1301526, 1846458, 1942026, 1999591, 1088158, 1869160, 1231399, 1128286, 818140, 332062, 968400, 1237913, 865558, -60062, 555012, 1790082, 1226199, 1840262, 1939560]
4690A939560j64205P35811J16378o12205Q84058p85117n90262K15394p36485j67913
4680H35014m63357L71628j22003k23823P13371k17220m72029j60519J241651j74
4670A502539k02321K25317k11895j81456m56388J92748M78025N63789q81770j93462
4660H35126j8697K48219K09405p87986R86245L80321r94979L37984J29855N46189
4650A871682J6325o48145Q7319J26335J99332n5097q4492O62983o00391q41381
4640G34470O37924K0430O9664p48298K23200M53215N7751l83288o28816J511318
4630A947570j07725j606368J356319j61657l80605o89250M07992L00643r423M19603
4620A477099K29693n64036n59709R71325m42186K31817L73591k68916q7367Q46464
$$ y = [1939560, 1775355, 2511166, 2627544, 2015339, 2899397, 2114280, 1524018, 1739412, 1002927, 835014, 371657, 743285, 621282, 397459, 1110830, 893610, 421581, 261062, 1502713, 1502539, 1300218, 1525535, 1313640, 1132184, 675796, 868544, 1346569, 1910358, 1028588, 835126, 816429, 1064648, 1274053, 486067, 1472312, 1852633, 857654, 1195638, 1325493, 1871682, 1888007, 1239862, 1327181, 1453516, 1652848, 1597751, 1513259, 2176242, 1575851, 734470, 1372394, 1392824, 1462488, 714190, 937390, 1390605, 1448356, 1065068, 436252, 1947570, 1839845, 233477, 1589796, 1428139, 1047534, 358284, 766276, 1066919, 1057496, 1477099, 1706792, 1142756, 583047, 1554372, 1112186, 1344003, 1717594, 1448678, 1361311, 2207775]
4610B207775n16154L30956L51740m48628J40277P41930o16343l94872k6402j39983
4600A630296l5559J64863Q47710n56810p47618L84519l78044M72732o05549K98295
4590A474835J95417o55134J158017l7576q07086L80661L7831J07539O35985M7910
4580B538399k3655m44522k62263n8222J36937J63932m94222L34097J29407O82337
4570B702225q35037k27644J10048l63053J070570m40130p66187Q96150R0272q08920
4560A428294L0159P65219Q4168K3031J014662p18469k84697k8613p64475Q63071
4550B412350Q24860L12964K37593p99471K43789n35177J51953n85079o59030R67126
4540B571878L33485r4501M19583R27682j98936n19112M86684M09813o09110j9441
$$ y = [2207775, 1691621, 2022577, 2374317, 1925689, 2065966, 2807896, 2191553, 1796681, 1770279, 1630296, 1594737, 1759600, 2607310, 2050500, 1302882, 1687401, 1309357, 1782089, 1176540, 1474835, 1670252, 1015118, 2173135, 2135559, 1328473, 1709134, 1746965, 1854504, 2490489, 2538399, 2514744, 2070222, 1807959, 1749737, 1886674, 2050606, 1556384, 1890481, 2019888, 2702225, 1867188, 1639544, 1749592, 1386539, 2457109, 2016979, 1250792, 2146942, 2237214, 1428294, 1458453, 2223672, 2307840, 2330871, 3345533, 2627064, 2342367, 2313754, 1549279, 2412350, 3237210, 3550174, 3787767, 2988296, 3232085, 2696908, 2848861, 2263782, 1604752, 2571878, 2905363, 2810862, 3230445, 4158127, 3959191, 3440079, 3926763, 4336576, 3727466, 3708025]
4530C708025L43043N36973l3273K40610k91862m10961J87682m69246n25211M57330
4520C743110M75494n88515J195594M56390m43243N22360j64210J114011N81025
4511F892016j11048o89799K35083M02689K67762k21139l47518M29926J159M69694
4501G328825M29817P92840O38956l03942p92602J161738K92896o25429J039390
4492I962489L53539Q22063J040343j24879P02683l94781Q73311P55899J247551
4483A5238218J318057N07364J246650J056164K144723K118310J346627L376827
4475B8352940K679158L182580M455829O098717O216433M275566K014950j734241
4467E5541932m455297o130766o353582m565850l494402k127329j212937n28583
$$ y = [3708025, 4051068, 4588041, 4554768, 4795378, 4503516, 4092555, 4280237, 3810991, 3285780, 3743110, 4218604, 3630089, 4825683, 5282073, 4838830, 5361190, 5196980, 6310991, 6892016, 6780968, 6091169, 6326252, 6728941, 6996703, 6775564, 6428046, 6857972, 6859131, 7328825, 7758642, 8551482, 9190438, 8886496, 8093894, 9255632, 9548528, 8923099, 9962489, 10316028, 11138091, 12178434, 12053555, 12756238, 12361457, 13234768, 13990667, 15238218, 16556275, 17063639, 18310289, 19366453, 21511176, 23629486, 24976113, 28352940, 31032098, 34214678, 38670507, 44769224, 50985657, 55261223, 57276173, 55541932, 51086635, 44955869, 38602287, 34036437, 30542035, 28414706, 27201769, 26673186]
4459B6673186j042874l52516L13239l60472j62020R2694L68243J557320M54781
4450B7541581q90466J077080J436005P1169Q30771R85023R39144O73310O92654
4441C3356271J894592J080541R24070O48972L26794R33555J225564J221976J533159
4432D3145494P92667K232484J254275R6850J038491K541496K337134K520539L218875
4423E9178305L759888L286285L184742M093886M538006M079370K835667M678917
4415H9635066N106116L530631M697292L886986N959144O174590O060480O773059
4407A31823364N566474K856169O18675k027481k379781k990057j575100r81829
4399A30910434M2777p42394m18786J34942q53970O35801n21584P98571N20826
$$ y = [26673186, 25630312, 25277796, 25591035, 25230563, 25068543, 25161237, 25529480, 27086800, 27541581, 26651115, 27728195, 29164200, 29235369, 30066140, 31051163, 31990307, 32663617, 33356271, 35250863, 36331404, 37255474, 37904446, 38231240, 39164795, 40390359, 41612335, 43145494, 43938161, 46170645, 47424920, 47521770, 48560261, 51101757, 53438891, 55959430, 59178305, 62938193, 66224478, 69409220, 73503106, 78041112, 82120482, 84956149, 89635066, 94741182, 98271813, 102969105, 106856091, 112815235, 118989825, 125050305, 131823364, 137389838, 140246007, 140864682, 138837201, 136457420, 133467363, 131892263, 130910434, 130953211, 130210817, 129792031, 129926973, 129073003, 129708804, 129187220, 129985791, 130506617]
4390A30506617R92705L17137o25136m26565k682096l960772o362162o753066n685125
4381A05321537n759615m911432m518942k385413j026525j24280K320893K434507
4373I1350730L52797O69917j665028m687728n827261o653086p301863n637474
4365F0601004n756302m472566l162012k878666k164513p43315j498788j197193
4357C8727649j97060l98387k67958n4747q65717j581559P8666l61761j432436
4348C3646690j914331k149721j517716j211929j704511l16779k06739j688231
4340B2936733j048953n99049J57514m84026j388242p09651K5605k53479j441656
4331A7194796j472692l30182j93936j208499o87549O01945j516207q93829j025778
$$ y = [130506617, 131499322, 131816459, 131191323, 130764758, 128082662, 124121890, 117759728, 111006662, 105321537, 99561922, 94650490, 90131548, 87746135, 86719610, 86595330, 88916223, 91350730, 91703527, 92373444, 90708416, 86020688, 80193427, 73540341, 66238478, 60601004, 54844702, 50372136, 47210124, 44331458, 42166945, 41423630, 39924842, 38727649, 38530589, 38132202, 37864244, 37809497, 36943780, 35362221, 35440887, 35079126, 33646690, 31732359, 29582638, 28064922, 26852993, 25148482, 24831703, 24624964, 22936733, 21887780, 21288731, 21446245, 20962219, 19573977, 18864326, 18889931, 18636452, 17194796, 15722104, 15391922, 15197986, 13989487, 13301938, 13903883, 12387676, 11493847, 10468069]
4322A0468069L41702M37388p20442j224872N40051R99059j110708M9261J70481
4313I949989k13706n08005N5020j022098N40354j55272o84387J0369N63129K85617
4303H821010N4536j381490j194908K08750J04625p9367J01677K53632K7721N73866
4293G490052R27129r22576r30516O35202l6111q34676n7134L03185O91976K30523
4283G497054n58325L99361n29007n84769k3072j02845P03574K82988j54778m67809
4273F462372L27283O33625q75812P2895K18537l56383q68727J15262q2015K25112
4263E872149J56629p1913l79359J70485J240434p20998m52538k22264o0345P9198
4253E611478k26869J26392R52567J54982L24628p24937M37057j90009o89443J414069
$$ y = [10468069, 10809771, 11247159, 10526717, 9301845, 9841896, 10840955, 9730247, 9779508, 9949989, 9736283, 9228278, 9283298, 8261200, 8801554, 8646282, 7961895, 7972264, 8535393, 8821010, 8875546, 7494056, 6299148, 6507898, 6612523, 6533156, 6634833, 6888465, 6916186, 7490052, 8417181, 7494605, 6564089, 7199291, 7163180, 6328504, 6271370, 6574555, 7266531, 7497054, 6938729, 7338090, 6809083, 6224314, 6201242, 6098397, 6801971, 7084959, 6930181, 6462372, 6789655, 7423280, 6547468, 6620363, 6838900, 6482517, 5613790, 5729052, 5647037, 5872149, 6028778, 5956865, 5577506, 5747991, 6988425, 6267427, 5814889, 5592625, 5532280, 5611478, 5384609, 5511001, 6463568, 6618550, 6943178, 6218241, 6655298, 6465289, 5775846, 7189915]
4243G189915k00093N17853L75928n44597P21904o222j35472K74734m83979L4066
4233G744037M45622n83675R437O66521l01832O30113O6633L9324K5401p34578
4223H007003J224006j24206L5713P69287J49316P10197L46711p41685K36883M19729
4213A1032954N88534O55700Q5768k06108N85218O41256o73407R4378j24463M39587
4203A3119417r0703P79851J107514M5087K97248k93072j55905M49559L63866P75283
4193A6398145o30275J562058M51212M43567J350304k79084J342468J66344O43828
4184B1448567J174828R23063O93707o75465O48069J453089R12795P30190P07870
4175B8016713J639557J482037M49554K599157J913068J011519J310761J480099
$$ y = [7189915, 6989822, 7507675, 7883603, 7339006, 8060910, 8054688, 7919216, 8193950, 7709971, 7744037, 8189659, 7605984, 7615421, 8281942, 7980110, 8610223, 8676856, 8716180, 8741581, 8007003, 9231009, 9106803, 9142516, 9911803, 10061119, 10771316, 11118027, 10376342, 10613225, 11032954, 11621488, 12277188, 12362956, 12156848, 12742066, 13383322, 12709915, 12804293, 12679830, 13119417, 13028714, 13808565, 14916079, 14961166, 15258414, 14965342, 14809437, 15258996, 15622862, 16398145, 15767870, 17329928, 17781140, 18224707, 19575011, 19295927, 20638395, 20804739, 21448567, 22623395, 23546458, 24240165, 23564700, 24212769, 25665858, 26578653, 27308843, 28016713, 29656270, 31138307, 31587861, 34187018, 36100086, 37111605, 38422366, 39902465]
4167C9902465K161538K408318L389474L043599L919527M608548L885615N396850
4159F8715934O424550O833068P693473Q920265R954163J1753734J2873813J5304600
4151A48473600J9376690K1510267K5368914K5006065K0035257J1015680n934938
4144B64851535k1811895l1678733l1264616k6876624k2552724j5234103j2634488
4137A02798352j1636702p948786o249664n946015m574986l292131l533882l560393
4129E6055793k594482k207760j785882k495379k397381j517744j700925p03532
4121D0652708j496095j589201m90772j105082j904432r61924Q69864j42425j556315
4112C2276326o67622L95354j43323K95992P72741L16665K14320J082173J059201
$$ y = [39902465, 42064003, 44472321, 47861795, 50905394, 54824921, 59433469, 63319084, 68715934, 75140484, 81973552, 89667025, 98587290, 108541453, 120295187, 133169000, 148473600, 167850290, 189360557, 214729471, 239735536, 259770793, 270786473, 264851535, 243039640, 211360907, 180096291, 153219667, 130666943, 115432840, 102798352, 91161650, 83212864, 76963200, 71017185, 66442199, 63150068, 59616186, 56055793, 53461311, 51253551, 49467669, 46972290, 44574909, 43057165, 41356240, 40652708, 39156613, 37567412, 37076640, 35971558, 34067126, 33105202, 33975066, 33832641, 32276326, 31608704, 32004058, 31860735, 32156727, 32929468, 33246133, 33460453, 34542626, 35601827]
4103C5601827L28571L15385J49873n48654O49927L1579L33797R33355Q1196Q03997
4093C8680853K027016J643171J950876K757816L076579L877404L589507K922528
4085F0525750K883339J298702o95509k983740k658105l106198l188993j599196
4077E0476050j858452r01108j529643j694042o4526j81799L68333J384872J495961
4068D7495646J479993K121748K837497L359973K934090M564346N763946P354859
4060G7912098P434422N942740N248866J540340k605367n865163r758136r541122
4052G0308678p488758o124884m728442m565364l533718k492565j188370p31117
4044C9455460j870216o91439j294467P074J070012p2732J35517Q47242J393029
$$ y = [35601827, 35930398, 36245783, 36395656, 35847002, 36496929, 36528508, 36862305, 37795660, 37876856, 38680853, 40707869, 42351040, 44301916, 47059732, 50136311, 54013715, 57603222, 60525750, 63409089, 64707791, 64012282, 61028542, 58370437, 55264239, 52075246, 50476050, 48617598, 47716490, 46186847, 44492805, 44428279, 44246480, 44614813, 45999685, 47495646, 48975639, 51097387, 53934884, 57294857, 60228947, 64793293, 70557239, 77912098, 85346520, 91289260, 96538126, 98078466, 95473099, 89607936, 79849800, 70308678, 62819920, 56695036, 51966594, 47401230, 43867512, 41374947, 40186577, 39455460, 37585244, 36893805, 35599338, 35606412, 36676424, 36603692, 36739209, 37586451, 38979480]
4035C8979480J324946K898801J881799K607101K091751K65616j69954k802855
4027D7076685l705515m211409m350094l251018l626824k119571k220395j668360
4019B1923499j670359l15814j195406r60428q39714j588784o14693q45748j37743
4010A3754810M85514j291574o36620K75109j350623m31121j27236j353918j78609
4001I145732m1257r34926J06934Q13434o38586N63111M02826L1120o42437l88226
3991H417725l5436j006664l4900M08557o5354l95688r84738K92626Q09048l34665
3981G070511L40484J40073o31197o47232R51839L7716r42481J48080K44819M17416
3971G130028m73124m45230k60008o49897L52401l51771J1762L84768M01140l53045
$$ y = [38979480, 40304426, 43203227, 45085026, 47692127, 49783878, 50049494, 49879540, 47076685, 43371170, 39159761, 34809667, 31558649, 27931825, 25812254, 23591859, 21923499, 20253140, 19937326, 18741920, 17781492, 16941778, 15352994, 14738301, 13892553, 13754810, 14240324, 12948750, 12312130, 12587239, 11236616, 10805495, 10678259, 9324341, 9145732, 9104475, 8169549, 8276483, 9089917, 8451331, 9014442, 9417268, 9448388, 8805951, 8417725, 8382289, 7375625, 7340725, 7749282, 7683928, 7288240, 6303502, 6596128, 7405176, 7070511, 7410995, 7551068, 6919871, 6272639, 7224478, 7262194, 6319713, 6467793, 6712612, 7130028, 6656904, 6211674, 5951666, 5301769, 5654170, 5302399, 5314161, 5698929, 6100069, 5747024]
3961E747024K43844J92058J29685L24881Q29209q13248q28552J136649J81214
3952G142764k87206m27106L15062M39222r93283M80904P32457m52858M32422L093
3942G385471n75244P37722J30173K72766L3544M5301R1870P63891j9518n63569
3932H302407P72163l3734O38588M4246J38589M87674n4362L76331M51946r1463
3922A1032385M50955j33229J132035P5390J01094J403266k1535J255055J597654
3913A6893070K074996J798464J174617J701234P04121J498459J312618N13692
3905B7671271K108826J454904K721678L404697L363160N170230P367945P051082
3897F0313793O433653M000923n53730o677119q764512q792250o725183m309001
$$ y = [5747024, 5990868, 6182926, 6312611, 6637492, 7466701, 6653453, 5824901, 6961550, 7142764, 6855558, 6428452, 6743514, 7182736, 6189453, 6670357, 7402814, 6949956, 7382378, 7385471, 6810227, 7547949, 7678122, 7950888, 7984432, 8029733, 8121603, 8885494, 8865976, 8302407, 9074570, 9040836, 9679424, 9723670, 9862259, 10349933, 10295571, 10671902, 11123848, 11032385, 11483340, 11350111, 12482146, 12557536, 12658630, 14061896, 14040361, 15295416, 16893070, 18968066, 20766530, 21941147, 23642381, 24346502, 25844961, 27157579, 27671271, 29780097, 31235001, 33956679, 37361376, 40724536, 45894766, 53262711, 60313793, 66747446, 70748369, 70194639, 63517520, 54753008, 45960758, 39235575, 34926574]
3889C4926574k989034j892623j194709q63193j652176k212806k015408q81105
3881B1225520k427979q76291j400161j505316l01096p86164j87233q86200p32372
3872A2122708M31468l57524j84944r14918K11565N92750o8843j56080n32777O42977
3862A1786382L61990l49325j34532j123002k6373n97191n68024p17722j253053
3853G379150j41927K21351n25473K31323k1629n11767P2235M53612N06823N92101
3843H255799j560082q26437J038600p53889L57973p97691p83244J00712K31746
3834E263487J84587J31533J078898k59504j09455O46408k40557l74691n43507
3825E777199P56284q91301k92807M99449l25933K93642j78190M45802l45788o81803
$$ y = [34926574, 31937540, 30044917, 28850208, 27987015, 26334839, 24122033, 22106625, 21225520, 18797541, 17921250, 16521089, 15015773, 14714677, 13928513, 13741280, 12855080, 12122708, 12554176, 12196652, 12011708, 11096790, 11308355, 11901105, 11832262, 11676182, 11143405, 11786382, 12148372, 11799047, 11664515, 10541513, 10515140, 9917949, 9349925, 8632203, 7379150, 7237223, 7458574, 6933101, 7164424, 7142795, 6631028, 6703263, 7156875, 7663698, 8255799, 6695717, 5869280, 6907880, 6153991, 6511964, 5714273, 4931029, 5031741, 5263487, 5448074, 5579607, 6658505, 6399001, 6289546, 6935954, 6695397, 6320706, 5777199, 6533483, 5642182, 5349375, 5848824, 5522891, 5816533, 5638343, 6084145, 5738357, 5056554]
3815E056554P92823M08195j41181J27314j49043O21393L86501j004997J44953
3806F242512P86698J099224j64851K71412j35757L32310O89449J84428K21304
3797I526729l88650m97034m55394J241720O83469r72370M72611Q38859O368R0848
3787A0547156p59408k47825Q43586J13850L02053k27530j75281J119092p45311
3778A0770382Q82058R1177K83873K53770L61943P98673k70896J156466K46443
3769A4573889N37770o34566O46120J303953k29355Q93399M47236P49165P65311
3760A9052922N54492R54043L22884O71139O72476J091998O81029R09585J647748
3751B6558316N71420K88663L26440J094157J909871J627354J299850J704892R31660
$$ y = [5056554, 5849377, 6257572, 6116391, 6243705, 6094662, 6716055, 7102556, 6097559, 6242512, 7029210, 8128434, 7963583, 8234995, 8099238, 8431548, 9120997, 9305425, 9526729, 9138079, 8641045, 8185651, 9427371, 10110840, 9138470, 9611081, 10449940, 10456308, 10547156, 9787748, 9539923, 10383509, 10497359, 10799412, 10571882, 10396601, 11515693, 10770382, 11652440, 11743617, 12027490, 12281260, 12643203, 13441876, 13170980, 14327446, 14573889, 15111659, 14477093, 15123213, 16427166, 16197811, 17091210, 17538446, 18287611, 19052922, 19607414, 20561457, 20884341, 21555480, 22227956, 23319954, 24000983, 24910568, 26558316, 27129736, 27418399, 27744839, 28838996, 30748867, 32376221, 33676071, 35380963, 36312623]
3742C6312623J150766J304755J227654J938424K164239J410944J293502J731925
3734D8534832K413217K340891K048966J851341K190224K658098K405853K128449
3726F6571871L713385K554896K015185K550378L033868K604064J674025L286929
3718H8004601K668950L220300L187879J848295J596179K317571J164726J111344
3710A05119845K553899J588373J408714J851335Q14375R49324Q23253J143766
3702A16252884J59032q36118k48000K382r46517j077545j026703q38683j323300
3693A10117432j358112n82868j190562j352633j119719j499301j590282j279004
3685A00144951q16137k48605j463092p80644n6789j132246p69682n74946j959344
$$ y = [36312623, 37463389, 38768144, 39995798, 41934222, 44098461, 45509405, 46802907, 48534832, 50948049, 53288940, 55337906, 57189247, 59379471, 62037569, 64443422, 66571871, 70285256, 72840152, 74855337, 77405715, 80439583, 83043647, 84717672, 88004601, 90673551, 93893851, 97081730, 98930025, 100526204, 102843775, 104008501, 105119845, 107673744, 109262117, 110670831, 112522166, 113336541, 114285865, 115109118, 116252884, 116411916, 115575798, 115327798, 115330180, 114383663, 113306118, 112279415, 111440732, 110117432, 108759320, 108176452, 106985890, 105633257, 104513538, 103014237, 101423955, 100144951, 99328814, 99080209, 97617117, 96836473, 96779684, 95647438, 94877756, 94302810, 92343466]
3676I2343466l197108l037448k789215m048819k952005k466158k930831l120281
3668F7801601k585045j522465k745859l148278k903098k855977l215464l305733
3660D5519682k808385k656421l706435k445519j325235j613431j422343k040586
3652B7501327p88269j068878j107002j111619j086025q80964j148776R70139M89171
3643B1769104j715730m39715p95835O06850n7368r78892j63844k50512m17796
3634A7556262k61260j8226p91489N13316p08052j0953M56606L65147n84407j484029
3624A5032915Q20732L2385M24326l4460j152262K56045k34342R90365K96326J18736
3614A6550766R30086m51833K85485n67596O5641N35156M83777J88274k58782L57282
$$ y = [92343466, 89146358, 86108910, 83319695, 79270876, 76318871, 73852713, 70921882, 67801601, 65216556, 63694091, 60948232, 57799954, 54896856, 52040879, 48825415, 45519682, 42711297, 40054876, 36348441, 33902922, 32577687, 30964256, 29541913, 27501327, 26713058, 25644180, 24537178, 23425559, 22339534, 21458570, 20309794, 21279933, 21769104, 20053374, 19613659, 18817824, 19424674, 19367306, 18388414, 18224570, 17974058, 17556262, 17295002, 17276776, 16485287, 16998603, 16290551, 16279598, 16736204, 17101351, 16516944, 15032915, 15853647, 15886032, 16310358, 16275898, 15123636, 15379681, 15145339, 16135704, 16432030, 16550766, 17480852, 17029019, 17314504, 16746908, 16812549, 17347705, 17831482, 18019756, 17760974, 18118256]
3604A8118256O4100L48236k83966O17815L27386L08730l81841k14909J843048
3595B0746855L83409k56251P789Q24466J669803m38698N29948O4406J290798Q72141
3585B5694666J20102R73446L10549J625339L25596J424494R82936p3673J255243
3576C2638698J028933J042068J259183J756865J023583P81008J211552J587470
3568D2329360K005325K074512J459860K097005K766103K073775K568972L443210
3560F0818122L470261K976256M531357N286558N276010N954014O688358P483792
3552A02484728Q493117J0268174J1052237J2716105J4526953J5665283J6752208
3545A91958805J9674548K1560355K0930468J9959101J7772172J2516855O545051
$$ y = [18118256, 18182356, 18530592, 18246626, 18864441, 19191827, 19500557, 19118716, 18903807, 20746855, 21130264, 20874013, 20881802, 21706268, 23376071, 22937373, 23467321, 23531727, 24822525, 25694666, 25814768, 26788214, 27098763, 28724102, 29049698, 30474192, 31457128, 31383455, 32638698, 33667631, 34709699, 35968882, 37725747, 38749330, 39530338, 40741890, 42329360, 44334685, 46409197, 47869057, 49966062, 52732165, 54805940, 57374912, 60818122, 64288383, 67264639, 71795996, 77082554, 82358564, 88312578, 95000936, 102484728, 110977845, 121246019, 132298256, 145014361, 159541314, 175206597, 191958805, 211633353, 233193708, 254124176, 274083277, 291855449, 304372304, 310917355]
3538C10917355K806943k267150l933617m555270n159134k936501k190206k050574
3530B90631846k217374k645212m439675p777820j0519498j4141190j8631974k0685324
3522B09573779k0485195j9367372j8052891j5243400j2580731j1671855j0207213
3515A01965122p675411n858219o675468o225560n241698m536748l163730l084452
3507E9503836k929627k523681k804875k578640k506557j621105k051025j710452
3499D0777874j796961n86049n71257r37967j480323j334398j143533j297565o71003
3490C0958818o65475r1244k01406p17336j006r62770n26085R0196r90513r10765
3480B5982414L67486q38276j080226P40458j03090j240786o33737O00068k54781
$$ y = [310917355, 313724298, 311457148, 307523531, 302968261, 297809127, 294872626, 292682420, 290631846, 288414472, 285769260, 281329585, 273551765, 263032267, 248891077, 230259103, 209573779, 189088584, 169721212, 151668321, 136424921, 123844190, 112172335, 101965122, 94289711, 88431492, 81756024, 75530464, 70288766, 65752018, 62588288, 59503836, 56574209, 54050528, 51245653, 48667013, 46160456, 44539351, 42488326, 40777874, 38980913, 38394864, 37823607, 36885640, 35405317, 34070919, 32927386, 31629821, 30958818, 30293343, 30202099, 30000693, 29283357, 29282351, 28319581, 27793496, 27883692, 26893179, 25982414, 26349900, 25511624, 24431398, 25171856, 25068766, 23827980, 23194243, 23794311, 23539530]
3471B3539530j07856k24056K11728k03068M83751j42163m95142J322285j872K12778
3461B4595915M98064l30641P53061L69871L68487j78575P03265P73409L62241
3452B7915097P53497R29446J692929J555729J356019R30666R10566J718914K360014
3443D0122877J965696J745482J873804K749474J061719J391731K659745J314705
3435E4885233Q13272R59094J469961J371435J262755J758795K063752J532758
3427F6117055Q54212J043451Q81375J26105O36095K00131l02262M14820n16372
3418F9454610m13337M33947P25470P34824O78721J479994J382784J117823N74031
3409G6168867K087362J517737K416692M258275L892974M651549M965559O092245
$$ y = [23539530, 23431674, 23207618, 23419346, 23216278, 23700029, 23557866, 23062724, 24385009, 24383137, 24595915, 25093979, 24763338, 25516399, 25886270, 26254757, 26076182, 26779447, 27552856, 27915097, 28668594, 29598040, 31290969, 32846698, 34202717, 35133383, 36043949, 37762863, 40122877, 42088573, 43834055, 45707859, 48457333, 49519052, 50910783, 53570528, 54885233, 55698505, 56657599, 58127560, 59498995, 60761750, 62520545, 64584297, 66117055, 66971267, 68014718, 68896093, 69022198, 69658293, 69858424, 69556162, 69970982, 69454610, 69041273, 69475220, 70200690, 70935514, 71614235, 73094229, 74477013, 75594836, 76168867, 78256229, 79773966, 82190658, 86448933, 90341907, 94993456, 99959015, 106051260]
3401A06051260P388162Q427285R542155J0118749J1935039J2435874J2609074
3394A78507598J2677565J1491972J0092618O684782M959271N917560M542785M975085
3386B39849236O783873Q724062Q049248P879861P342788M817084K246703j279499
3378B84413356n460578q302323r264538j2084742j2842348r938967r673991q358200
3370B08487669q135219p936433o916443p996288r489238j0350815j0253389j2267091
3362A35142753j1853638j1012234j0969292r514601p544796o561161m949019n525934
3354F7212078m768494l999343l792645k506735l056435k875145j823454j060120
3346D3329707k488345j796748j425191j990047j243795j485585j054636j263427
$$ y = [106051260, 113439422, 121866707, 131408862, 141527611, 153462650, 165898524, 178507598, 191185163, 202677135, 212769753, 219454535, 224413806, 230331366, 234874151, 239849236, 246633109, 255357171, 263406419, 271286280, 278629068, 283446152, 285692855, 284413356, 278952778, 270650455, 261385917, 249301175, 236458827, 226519860, 216845869, 208487669, 200352450, 192416017, 185499574, 177503286, 168014048, 157663233, 147409844, 135142753, 123289115, 112276881, 101307589, 91792988, 84248192, 77687031, 72738012, 67212078, 62443584, 58444241, 54651596, 52144861, 49088426, 46213281, 44389827, 43329707, 40841362, 39044614, 37619423, 35629376, 34385581, 32899996, 31845360, 30581933]
3338C0581933j329613r43033p71070j238677k15541j50880j693491r09053k18115
3329B3112460q61432k07462j397663r10660m88951p29298m22676K81107r08323
3320A7467102m94590p93072j37680j93548o96603k93156J33500j320291j000693
3311A2670969K27134q52762m23883n84591j58868Q8017j02679p17412K95524j069051
3301I372398N93424L81388j325979L76684R36149j132995n75190K93749j091861
3292G827767k760M94583n20083o8207m15494Q1367Q69011j086718j3270J63021
3282G329217p54869M14732r56326M59365K36259n54767j84473P68110k34759r11571
3272E610918O1753q80771L35345O53227N9621j54143k26608R9694M1664q44778
$$ y = [30581933, 29252320, 28309287, 27538217, 26299540, 26083999, 25933119, 24239628, 23330575, 23112460, 22251028, 22043566, 20645903, 19735243, 19246292, 18516994, 18094318, 18375425, 17467102, 16972512, 16179440, 16041760, 15848212, 15151609, 14858453, 14991953, 13671662, 12670969, 12898103, 12045341, 11621458, 11036867, 10877999, 10966016, 10863337, 10145925, 10441449, 9372398, 9965822, 10347210, 9021231, 9397915, 10334064, 9201069, 8625879, 8919628, 7827767, 7825007, 8319590, 7799507, 7731300, 7315806, 7397173, 8266184, 7179466, 7166196, 7329217, 6574348, 6989080, 6032754, 6492119, 6728378, 6173611, 5989138, 6757248, 6522489, 5610918, 5672671, 4791900, 5127245, 5780472, 5840093, 5685950, 5459342, 5559036, 5600700, 4755922]
3262D755922k94461K29881m42475p64988O06474K07637p88193k22416j53744K69015
3252C402652j027948m83568J268322j080316k4856K21612n1699P8304Q5616o9023
3242B319096L79114J87251j42266R7665j39938o79306N60572M91848q92079K22654
3232B404611q51263O6004Q64130J46343l86962l34653L31378J5928m06812L32507
3222B181211L72732n05417m88563j21932M40097M507L64123m75496o93532J013684
3212B091414m36978M6450P74692j52023n623r00600p68616O27257J17740j71497
3202A222216L92162L93033P20270l00575l52971K77590l6309j88950o07447m019
3192A515000J93373k03458p15120Q7676O07820M34244r75574r4647K31660m3889
$$ y = [4755922, 4461461, 4691342, 4248867, 3483879, 4090353, 4297990, 3509797, 3287381, 3133637, 3402652, 2374704, 1891136, 3159458, 2079142, 2054286, 2275898, 2224199, 2302503, 2388119, 2319096, 2698210, 2885461, 2743195, 2840860, 2700922, 2021616, 2582188, 3074036, 2181957, 2404611, 1553348, 1619352, 2483482, 2629825, 2242863, 1908210, 2239588, 2255516, 1848704, 2181211, 2553943, 2048526, 1559963, 1438031, 1878128, 1882635, 2246758, 1771262, 1077730, 2091414, 1654436, 1700886, 2475578, 2323555, 2317932, 1417332, 648716, 1275973, 1393713, 1222216, 1614378, 2007411, 2727681, 2427106, 2074135, 2351725, 2315416, 2126466, 1519019, 1515000, 1708373, 1504915, 789795, 877471, 1485291, 1919535, 943961, 849314, 1080974, 1037085]
3182A037085L08399L95947J79896K12359M81351p50340k62447j141310k12332
3173B48608O08946j68004J242947p95042m0617J42852k91360L42930j078771M04043
3163F16532M95315K20115L60254K65759N99285p50530J47515M22497r59827J47272
3153A564187Q3490o03708O13910r8009M23621j61007p30492K6376L7502o15216
3143E40654q39327L17551P24702N32273M14664j44674N29600j72400O31146r18651
3133A615538q38478J444221l98240l30421L36372N03917o10802l12757O8929L55843
3123A834122j025069j70316J303295J135472o42454l38925J32764q15307j38958
3114A274624j69814K96014M97431j0101j28427O80184M44555M4087l27571j059022
$$ y = [1037085, 1345484, 1741431, 1921327, 2133686, 2615037, 1864697, 1602250, 460940, 248608, 857554, 689550, 1932497, 1137455, 1096838, 1239690, 948330, 1291260, 212489, 616532, 1111847, 1331962, 1692216, 1957975, 2557260, 1806730, 1954245, 2376742, 1416915, 1564187, 1647677, 1043969, 1657879, 1559870, 1983491, 1822484, 1091992, 1118368, 1155870, 540654, -298673, 18878, 743580, 1275853, 1690517, 1545843, 2075443, 1903043, 2534189, 1615538, 777060, 2221281, 1823041, 1492620, 1828992, 2332909, 1722107, 1409350, 1478279, 1834122, 809053, 638737, 1942032, 3077504, 2435050, 2096125, 2228889, 1413582, 1274624, 1104810, 1400824, 1898255, 1888154, 1759727, 2439911, 2884466, 2928553, 2600982, 1541960]
3104A541960J188313r12116j45171O25152r9289N37747r77153J38501J11739j69041
3094A840642r973R15576M67418p05544L44303O32791l17652m97858N10974P63833
3084C944510J025862j09888K73581p95299q93698p40513l50317M45322j58664
3075B640896j045679m24614O57645l76716L60074l12585O40796R10189J8546r15427
3065B153125N99301n0506j041747Q83010M07319J99455k88627k83794J315843
3056C893379J824299p7282J59682N42345j273144m89281q91913p05353M36902
3047C419634j268186n41615J29727k82100L70421J06928n25100J67799M43402
3038B020910o66536J60619l36791k55697R11396R231l68181M50474K08467n40549
$$ y = [1541960, 2730273, 1818157, 1672986, 2298138, 2198849, 2736596, 1759443, 1897944, 2009683, 1840642, 1830669, 2746245, 3213663, 2508119, 2852422, 3485213, 3167561, 2669703, 3180677, 3944510, 4970372, 4860484, 5134065, 4338766, 3445068, 2704555, 2354238, 2799560, 2640896, 1595217, 1170603, 1828248, 1451532, 1811606, 1499021, 2139817, 3050006, 3068552, 2153125, 2752426, 2701920, 1660173, 2543183, 2950502, 3149957, 2861330, 2577536, 3893379, 5717678, 5640396, 5800078, 6342423, 5069279, 4579998, 3688085, 2982732, 3419634, 2151448, 1609833, 1739560, 1457460, 1827881, 1934809, 1409709, 1577508, 2020910, 1354374, 1514993, 1178202, 922505, 1833901, 1843132, 1474951, 1925425, 2133892, 1593343]
3028A593343J11553m0851M87688O72360n67345m92800O04265p31415r33031K08604
3018I12371n33353M3025L94618K74984J49514j166695k05932L37337o5922L96268
3008E36215o08993R24423L19281q31823P36779r14936j24243J40365K03934j75311
2998B05691l76556k79932j88766j42288J14461l79203R85039P00962p8384O77704
2988A238728n67781n08476J53196P86852P4031j065569r80968P98138j649L3339
2978d0159J81426L43060N00261N8863p96727m80152O82607l57997o90390K54720
2968c44488l56337N36568K38308j1882K52788J84619m17528J34769k35178p44974
2958g63335N88303P6632O05441j41325n04985R10861j80742n85884n38737O00574
$$ y = [1593343, 1704896, 1664045, 2151733, 2824093, 2256748, 1763948, 2368213, 1636798, 703767, 912371, 379018, 422043, 816661, 1091645, 1241159, 74464, -131468, 205869, 139947, 536215, -72778, 851645, 1170926, 339103, 1075882, 160946, 36703, 177068, 381002, 205691, -170865, -450797, -639563, -781851, -667390, -1046593, -61554, 639408, 561024, 1238728, 670947, 162471, 315667, 1102519, 1176550, 110981, -869987, -71849, -73498, -40159, 141267, 484327, 984588, 1043451, 246724, -233428, 449179, 91182, -599208, -344488, -700825, -164257, 74051, 62169, 314957, 499576, 82048, 216817, -18361, -763335, -175032, -98400, 507041, 365716, -139269, 771592, 590850, 4966, -533771, 66803]
2948F6803R14332j42786n03349k64064L03603m73792j37571o9683m20637J0524
2938g16620K8897Q95228j69994m35533L8843N89614J037526o76365l41881Q16780
2928A066495r08919q10306M40879J44769l82325J56204Q2547N50884r53995L92225
2918b21542m89113N75968L5995l05927L9465N28718m0969j254271O08868R28137
2908D05329M9640p17075P89501l22531m12485n07223P77142j88908k89978N84850
2898A68262q46017l32302Q65370M1487M9651M28119k40508j237133M23902J40454
2888e38715J056164M28159q67480p85086J166427k77536r57821J09517o6560p0790
2878h03721J80285J85135K64136J34019K59209k96254L48251N20969l03345j49330
$$ y = [66803, 981135, 838349, 335000, 70936, 374539, -99253, -236824, -306507, -727144, -716620, -687723, 207505, 37511, -398022, -359179, 230435, 1267961, 591596, 249715, 1066495, 157576, -652730, -211851, -67082, -449407, -293203, -210656, 340228, -613767, -221542, -710655, -134687, -98692, -404619, -365154, 163564, 122595, -1131676, -522808, 405329, 454969, -262106, 527395, 204864, -207621, -714844, 62298, -126610, -416588, 168262, -677755, -1010057, -144687, -103200, -53549, 374570, 134062, -1103071, -679169, -538715, 517449, 945608, 78128, -706958, 459469, 181933, -775888, -666371, -732931, -803721, -623436, -438301, -174165, -40146, 219063, -77191, 271060, 792029, 488684, 339354]
2868C39354K08608n94272K76618M0129l09106K39684j95724p93519R37633l09937
2858a60532M74629j30451n10701P08387m25042k84218J29332N39683r13583O900
2848e65596M62937N13229L98708n63383p43961o1620N06937l77201R7540Q37613
2838E05203n65688J2198q2527N22071K61789j70798M46426J42414o32067p03366
2828b64345J61265O94945M5795L59538P0031J098556l66501j216022m23722m62554
2818c03014K4706O22011n28987p84467K42818J023967m63358k94281J70518k26554
2808e16641K23196R59941M11459l89434n70730l49014M64304j21682k84956R12896
2798G39339l97089J97898k32338k19756N15960L15123p40177l29729N18281R60013
$$ y = [339354, 547962, -46310, 230308, 270437, -38669, 201015, 5291, -788228, 149405, -160532, 314097, 183646, -327055, 381332, -43710, -327928, -198596, 341087, -572496, -565596, -102659, 410570, 809278, 245895, -498066, -559686, -52749, -429950, -332410, 505203, -60485, -48287, -130814, 391257, 653046, 482248, 928674, 1071088, 439021, -264345, -103080, 591865, 637660, 997198, 1067229, 2165785, 1799284, 583262, 159540, -303014, -278308, 343703, -185284, -969751, -726933, 297034, -166324, -460605, -290087, -516641, -293445, 666496, 1077955, 688521, 117791, -231223, 233081, 111399, -173557, 739339, 342250, 540148, 307810, 88054, 604014, 919137, 178960, -150769, 367512, 1327525]
2788A327525m1962p62029l73003m82808M1151J63205J061916k23427j013922K95154
2778h200R24444R4096j11266J14489J29364q70472M72338o29518j68338K95205
2768B42142k25765M01436l96466n78271J77672N14518l88255p41263n63759L8155
2758a519856M96529n6255N10311L9765Q93749j05665n79670J8066n6528O30089
2748B70535K16202j06245L07321K45637l31291p96217J0839j83471L36950k46240
2738b75980m99549P33083p31352O60918n36179P5502M76969L52414k34813q04573
2728g83560O79371L92956j53867r7572m43361L94432k47503K97468O93701m75000
2718B57065o11623q85729O23434M48968p52589j39048K33596L62549p19425j237868
$$ y = [1327525, 1285563, 523534, 150531, -332277, -291126, -127921, 933995, 710568, -303354, -8200, 916244, 1010340, 899074, 1013563, 1142927, 272455, 744793, 115275, -53063, 242142, 16377, 417813, 21347, -556924, -379252, 135266, -252989, -994252, -1558011, -1519856, -1023327, -1079582, -569271, -529506, 364243, 258578, -321092, -303026, -359554, 270535, 486737, 380492, 687813, 933450, 602159, -194058, -183219, -366690, -29740, -275980, -775529, -42446, -773798, -112880, -649059, -573557, -96588, 255826, 21013, -783560, -104189, 288767, 134900, 37328, -406033, -11601, -259104, 38364, 732065, 257065, -354558, -1240287, -616853, -167885, -920474, -1059522, -825926, -463377, -1182802, -2420670]
2708b420670J384070J360551p65394m68040M57544O80156K49649j151871n2449
2699g26454K83815k68136l60757J024516L21190j27215J8659O01597n04797j056486
2689g94068O01380r8205k26812M01699l18616j81731J36883L37326K95766M75267
2679F28889l24717m07468N48721J60238m38837m80579O93826L65961k53980m03161
2669H8893r32349O62509M74842m9439Q9574n54000L92744o16672Q81485L04667
2659G42254q03177m22209L33831J059358j0946O9489r52068p18713j41640k40112
2649a083933J43603R73409Q7776p26145M9807J69997p4133M63043N30893n97196
2639f2879N25117M65996l93314q85348l60356R92604K68233j428895p4018J113717
$$ y = [-2420670, -1036600, 323951, -441443, -909483, -451939, 228217, 477866, -674005, -726454, -442639, -710775, -1071532, -47016, 274174, 146959, 165618, 767215, 262418, -794068, -192688, -290893, -517705, -116006, -434622, -616353, -479470, -142144, 153622, 628889, 304172, -103296, 445425, 605663, 166826, -313753, 380073, 746034, 492054, 88893, -843456, -180947, 293895, 244456, 334030, -219970, 172774, -443898, 437587, 742254, -60923, -483132, -149301, 910057, 899111, 968600, 16532, -702181, -843821, -1083933, -940330, 33079, 120855, -605290, -555483, -385486, -459619, 3424, 534317, -62879, 462238, 928234, 534920, -350428, -710784, 281820, 550053, -878842, -952860, 160857]
2629A60857L7753p13179K34433q41861J97225K00749J56156J67863r43052O82941
2619f60115k11672r5139k01211R87199J60015l27469L00128L44063q83159n6859
2609f44219N62136j70287P91040n17381K12953J87621o15278M14820m43736j021625
2599a243956L13792M13205P0785j253736O84607R74971J71402p51750K45742J198500
2589H23562q59436m28429N64040k55829J43089p87377L00157R59617l90886m49597
2579c81089j1888R45674j197379J24345O90756Q5290J21274n43701L53062n36459
2569c50115k43629P73351n51455P35368L90261j90339n58645J45637k28675k31479
2559c09720N52476r98132k27802P14707l09797k27348J88857K56042o54658M793
$$ y = [160857, 198610, -514569, -280136, -1121997, -924772, -724023, -567867, -400004, -1343056, -660115, -871787, -966926, -1168137, -180938, -20923, -348392, -48264, 295799, -587360, -644219, -82083, -252370, 538670, 21289, 234242, 421863, -193415, 221405, -222331, -1243956, -930164, -516959, -446174, -1699910, -1015303, -40332, 131070, -620680, -374938, 823562, -35874, -464303, 99737, -156092, -13003, -800380, -500223, 459394, 68508, -381089, -392977, 552697, -644682, -520337, 170419, 255709, 376983, -166718, 186344, -350115, -593744, 179607, -371848, 363520, 753781, 563442, 4797, 150434, -78241, -309720, 242756, -755376, -983178, -268471, -578268, -805616, -616759, -360717, -1015375, -1010582]
2549a010582Q15898N57202j76788L29029j67474J4841j189642J87804R03396m14891
2539a51207Q43718p0090p59646l17469L45705J91958m86307j054383k26245K17079
2529a466887M96031K93683Q31182K54961L80781n13349q51022m73624j35548Q20903
2519c62889M85324p79895K98912K19548K31247r7717O75369n03245n39725Q1095
2509b91976J62230L42245q98660M01840j0969J20279n46542j851O69420j14002
2499a67986M70562L44966k68991k49447m19166J7728o18657N75601M35200m796
2489A15014k4302m81190M54049m45408n54546O4728K37935M35444l13561k26553
2479g38390K393j01256L39533K58482O01037n04799K48730p88282p1808N26131
$$ y = [-1010582, -194684, 362518, 185730, 514759, 347285, 362126, -827516, -639712, 263684, -151207, 692511, 622421, -137225, -454694, -108989, 82969, -403338, -1457721, -1683966, -1466887, -970856, -677173, 154009, 408970, 789751, 276402, -574620, -1048244, -1183792, -362889, 122435, -657460, -358548, -139000, 92247, -5470, 669899, 166654, -373071, -291976, -129746, 212499, -686161, -284321, -295290, -175011, -721553, -723404, -53984, -167986, 302576, 647542, 378551, 129104, -290062, -272334, -890991, -315390, 119810, 115014, 90712, -390478, 63571, -381837, -936383, -871655, -633720, -198276, -511837, -738390, -735997, -837253, -497720, -239238, 361799, -143000, 105730, -682552, -754360, -228229]
2469b28229j341207R21100N84762q18690L2448p20456J33865R14621j45415N35306
2459a31895k58967K0853K32587j68156L51976o4485O82414j287313R2184J97306
2449c33496q18022P71845q28812J092862J40054m90879Q08937O07129l2120r92150
2439g4652L83782k94897m98152p7328l39589J070186K9944r80893J69075m6466
2429f58990N90765J46390R1312m43939J22628L0026k34608j0973r0326N79892
2419A22177l06715j07590L0921k43020K0408P12302K74465P70583p92505j006167
2409e25141M27216L65858l54493j08727N9249M1941L39453N0734j064560J141058
2399C72588j16199n75885O6678n43229R46383k13802q51115P94948Q06488k46242
$$ y = [-228229, -1569436, -648336, -63574, -882264, -849816, -1570272, -1436407, -521786, -667201, -131895, -390862, -370009, -137422, -305578, 46398, -18087, 664327, -622986, -530802, -333496, -1151518, -379673, -1208485, -115623, 24431, -466448, 342489, 949618, 917498, -74652, 309130, 14233, -483919, -561247, -900836, 169350, 199294, -781599, -612524, -658990, -68225, 78165, 169477, -274462, -151834, -121808, -356416, -367389, -457715, 122177, -184538, -292128, -261207, -504227, -483819, 228483, 502948, 1273531, 481026, -525141, -97925, 267933, -86560, -195287, -136038, -94097, 245356, 296090, -768470, 372588, 256389, -319496, -252818, -796047, 150336, -63466, -914581, -119633, 686855, 440613]
2389D40613n19428J03742j0307o04621j073692K16781J385813j77605j35522j043032
2379a417258M37185R6535j35950R11437p14535J40316J597790l49787j093548
2370e27815J006255n97934l92279R409P32844j77535j68969J77015J42840n14619
2360c10788n34976P54840j31303L14255k38669P48152J07284n10209k24144o3898
2350h9456L56348k95375K18171O76643r41455k9003O7673P41994n24585p61198
2340e80243j23825L14083N95027n25067k9540j49065l37895K63965l53059l77230
2330a302849J56517P30557L17634m73884M18672m2138l61199K85521L95952k48536
2320a23753j33898j95524j54556K33808K3168o8325m69246L43148q51322M02301
$$ y = [440613, -78815, 24927, 14620, -590001, -1663693, -1446912, -61099, -238704, -374226, -1417258, -980073, -883538, -1019488, -108051, -822586, -682270, 915520, 565733, -527815, 478440, -119494, -511773, -502364, 230480, 52945, -116024, 60991, 203831, -310788, -845764, -90924, -222227, 92028, -146641, 601511, 708795, 198586, -25558, -89456, 266892, -28483, 189688, 866331, -75124, -104127, -36454, 705540, 180955, -580243, -704068, -389985, 205042, -320025, -349565, -498630, -836525, -572560, -925619, -1302849, -1146332, -415775, -98141, -572025, -153353, -195491, -556690, -271169, 124783, -123753, -257651, -453175, -607731, -373923, -350755, -419080, -888326, -545178, -1396500, -994199]
2310i94199L8711K27431J152180l53550L97150L83155J19255r07060R23675O70726
2300A657474J9662j15898k40366o80791j88731J05785p6325Q73214j83198l94916
2290G75910R6529m81756M53074n39571p74333R75622k13784J91514r80863M95969
2280a689J025744n15541p71368n25431R24348m54406k65206P77689k6540l5432
2270A32168l46568J50690k23381J50110P40051k69407m61318M31930R69193j002875
2260B70593m388K41084r68022L50234Q5684l15999K06659J65907R0742r0316O32190
2249F64368J76185N05144k00486O27177o01918r42116L56953l42918P90300j239608
2239b06919q5846M4709Q7451Q40709n11844N6268j95260j59242Q90157R2281j087051
$$ y = [-994199, -955488, -728057, 424123, 70573, 467723, 850878, 970133, 63073, 986748, 1657474, 1677136, 1561238, 1320872, 640081, 451350, 557135, 480810, 1354024, 1170826, 775910, 872439, 390683, 843757, 304186, -470147, 505475, 291691, 483205, -497658, -1689, 1024055, 508514, -262854, -788285, 136063, -318343, -583549, 194140, 167600, 132168, -214400, -63710, -287091, -136981, 603070, 333663, -127655, 304275, 1273468, 270593, 266205, 507289, -460733, -110499, -24815, -340814, -134155, 31752, 122494, 32178, 664368, 840553, 1345697, 1145211, 1772388, 1170470, 228354, 585307, 242389, 1032689, -206919, -292765, -248056, -160605, 680104, 168260, 224528, 29268, -129974, 760183, 852464, -234587]
2228b34587N2930M92113l35787K34589o02412j8181P65985j262127Q01951O19680
2218E14154n02223K36362n67173o1306l39652Q44076M68865r35082O10737j45130
2208A23628j73811J46707j61285k18595k28446M04530L39136j58924q55495n1452
2198h34007O32529n38355J59489l21693l50722O68491N69714K27821m14114L67028
2188A66181j99746j5685M18354J59522Q08189l10825q82644K58246L73778l51004
2178D24366n14966N0513J005935k92322L63420J6086L09702M61489r49958l16681
2168E57584N98016l20351o01826J16550J48574M56605J86018l09069n16460n87822
2158b72181N68721P125M45789N26079j353156Q10582j29003n20023N83083l40908
$$ y = [-234587, -181657, 310456, -25331, 209258, -393154, -411335, 354650, -907477, -105526, 514154, 11931, 248293, -318880, -380186, -719838, 124238, 593103, -341979, 268758, 123628, -50183, 96524, -64761, -283356, -511802, -107272, 231864, 72940, -782555, -834007, -201478, -739833, -580344, -902037, -1252759, -584268, -14554, 213267, -200847, 166181, -33565, -49250, 369104, 528626, 1336815, 1025990, 143346, 401592, 775370, 424366, -90600, -40087, 965848, 673526, 1036946, 1053032, 1362734, 1824223, 874265, 557584, 1155600, 835249, 233423, 349973, 498547, 955152, 1141170, 832101, 315641, -272181, 296540, 303665, 749454, 1275533, -77623, 732959, 603956, 83933, 667016, 326108]
2148C26108k80413o265R29713J11246J97029p22634M13702Q39610j001975J56010
2138I62131K2208l06951M71262J47732q34473J57295P11549q0702R6903R13446
2128B260400r17372j97140K85262J33031P17172K57486m71310J05461L32457J39610
2118B645057o42007L99122l31242K48021K95701J60192k42541R95905m90615n64569
2108B473024r2972J1500N50852k83788M40168J04174k06007L17770k82363M84295
2098C516653Q85416j30606K25214m38870K26139P7901K91677P51965O88888o8867
2088F025510M23152m74812O14739J03094n96593l8716P1453R82069R60689J68674
2078H239259R46832R58799N13125Q18965J479588J982305J830859J495182J667684
$$ y = [326108, 45695, 39430, 969143, 1080389, 1277418, 554784, 968486, 1808096, 806121, 962131, 984339, 677388, 1148650, 1296382, 461909, 619204, 1330753, 1250051, 1346954, 2260400, 1343028, 1145888, 1431150, 1564181, 2281353, 2538839, 2067529, 2172990, 2505447, 2645057, 2003050, 2402172, 2070930, 2318951, 2614652, 2774844, 2532303, 3528208, 3037593, 2473024, 2380052, 2391552, 2942404, 2658616, 3098784, 3202958, 2996951, 3314721, 3032358, 3516653, 4402069, 4271463, 4496677, 4057807, 4283946, 4361847, 4653524, 5405489, 6094377, 6025510, 6448662, 5973850, 6588589, 6691683, 6095090, 6056374, 6127827, 7109896, 8070585, 8239259, 9186091, 10144890, 10658015, 11476980, 12956568, 14938873, 16769732, 18264914, 19932598]
2069A9932598J459796J437416K686003L404620M285644M824319N163857Q333844
2061E1528097J0873337J0909717Q065855O751225o545543j3697284j3233614j3173235
2053D1478555q185923n492006m006743k523433j706534k346875m10358j534214
2045A5272469j032931o13590r48422k274328p12028n22851k89213o07947p07024
2036G564135k25036J33438l55760p84712j488874N70209M00427j266816m62713
2027D084298O6136M630N03684L75501j228616m65442M2888k13850p18331N82731
2017C033629k36870r207m19400M3793k43495L0094M30195o09337Q7794P86879
2007B894075k36344m39414J55449N9947j002098l41813L26185J73472o2727l5015
$$ y = [19932598, 21392394, 22829810, 25515813, 28920433, 33206077, 38030396, 43194253, 51528097, 62401434, 73311151, 81377006, 88128231, 81582688, 67885404, 54651790, 41478555, 33292632, 27800626, 23793883, 21270450, 19563916, 17217041, 16806683, 15272469, 14239538, 13625948, 12677526, 10403198, 9691170, 9168319, 8879106, 8271159, 7564135, 7339099, 7472537, 7116777, 6332065, 4843191, 5413400, 5813827, 4547011, 4084298, 4150434, 4155064, 4658748, 5034249, 3805633, 3340191, 3383079, 3169229, 2450898, 3033629, 2796759, 2787552, 2368152, 2411945, 2168450, 2198544, 2628739, 2019402, 2107196, 2894075, 2657731, 2218317, 2373766, 2433713, 1431615, 1089802, 1415987, 1589459, 1526732, 1491717]
1997A491717R71660Q5404p13127k94944j79685N63761j6674m12485l27097m53610
1987G14920O94870l20163J7858K78997o1470Q64153l73021o9350l8231p00722
1977A007841L15976k53842l92324K75887j18951M023k90272M95894l79278j87000
1967D77954K83913l69253o07850M52732O20515q95127L0050j94752j44329N30202
1957A84055p4287j95911j57788M43404m1375J1277J56712n17706j80278o54869
1947a026766N20524M19863j97824j0599O6107J42260j97151o1559J66795L7577
1937a40773j60642K7151J88368M50935n19345n13665R27347M98261l97729l19926
1927C9982k4158L53154j05380k59770N64513n56736m95019M6716O95745k93536
$$ y = [1491717, 2463377, 2548781, 1835654, 1540710, 1361025, 1924786, 1908112, 1495627, 1168530, 714920, 1409790, 1089627, 1107485, 1386482, 1325012, 2189165, 1816144, 1746794, 1708563, 1007841, 1323817, 1069975, 677651, 953538, 834587, 838610, 548338, 1044232, 664954, 477954, 761867, 392614, -215236, 237496, 858011, -37116, -7066, -201818, -346147, 184055, 109768, -86143, -243931, 199473, 158098, 169375, 326087, -191619, -371897, -1026766, -506242, -86379, -284203, -294802, -228695, -86435, -283586, -345145, -178350, -140773, -301415, -274264, -85896, 365039, -154306, -667971, 259376, 757637, 359908, 39982, 15824, 368978, 263598, 3828, 568341, 11605, -483414, -436698, 259047, -34489]
1917c4489m82645n33723P37561J87301o95369O77510O05855j133343R27892K69778
1907E26328p07727M53061L0065n76471j46930L02453J44348k24011j00830j55052
1897d54766Q88928K16706q34583l12830L76290Q04201J81186l9784J79014N81117
1887A585479l61439J94983j139860q10235K48491k15460M41636r7582Q1077O75593
1877F02683O00160k18320p71147N5084k64860k02432k94622Q80048L60105q38000
1867i1301k99288P49958j15268L03076M61905p10255L9467L20700o12865j59367
1857a13238K8808Q42588k10953q23709J02294q15211k23749j77250n00975N86721
1847a304674l7048O38408j23760o52035J90958M01169J486105p82805l94565L36752
$$ y = [-34489, -517134, -1050857, -313296, -125995, -821364, -143854, 462001, -671342, 256550, 526328, -181399, 271662, 301727, -274744, -421674, -119221, 25127, -198884, -299714, -454766, 434162, 650868, -183715, -496545, -120255, 683946, 865132, 825348, 1004362, 1585479, 1224040, 1419023, 279163, -531072, -282581, -498041, -56405, -153987, -72910, 602683, 1202843, 984523, 213376, 268460, 3600, -198832, -493454, 386594, 746699, -91301, -390589, 359369, 244101, 547177, 1009082, 298827, 338294, 658994, 46129, -113238, -84430, 758158, 547205, -276504, -174210, -989421, -1213170, -1390420, -1891395, -1304674, -1341722, -703314, -827074, -1479109, -1288151, -886982, 599123, -183682, -578247, -241495]
1837b41495j53129L07319o78287P12571P92191l45771o97186L90752Q15527q01401
1827A01091o27607L0848R55082j17660j37280K58938k72522R4840J95733k76470
1817B04993L16553Q47199q28990m70301l57553p965N12240l65701n60669L50003
1807c60191Q43941J93467m30994j43480o7111P16006q30578o17059R52455N71130
1797H27586q12894p51752J43459R85217o37847J12793m90785L9531K57166r0135
1787d17661P06921L87351l3463n0911P62194o03134q81762k98731K8223J19130
1777b81843K14105p52273L71850N15384O1977m36759m28849R62455j2477n89786
1767c76216K32150J0917K7343k5402L97487p88817Q94996m3524n43101O66761
$$ y = [-241495, -394624, -87305, -765592, -53021, 739170, 393399, -303787, 86965, 902492, 101091, -526516, -495668, 459414, 341754, 204474, 463412, 190890, 285730, 481463, 204993, 521546, 1368745, 539755, 69454, -288099, -296064, 216176, -149525, -710194, -360191, 483750, 677217, 246223, 102743, 35632, 751638, -78940, -695999, 256456, 827586, 14692, -737060, -593601, 391616, -246231, -133438, -624223, -584692, -327526, -417661, 289260, 676611, 643148, 592237, 1354431, 751297, -130465, -429196, -400973, -281843, -67738, -820011, -448161, 67223, 129200, -307559, -736408, 226047, 213570, -376216, -144066, -133149, -105806, -131208, 266279, -522538, 372458, 328934, -214167, 452594]
1757D52594M89201j057440j9417j27301K4296O44191n04111R77501L24309l51026
1747H52797Q40007n03371p47960q9661J39216P850l45096J3163p45661L25147
1737b53569m51521j045751J370139M3610j01780o5458P71153P66756o87280K32185
1727E78484K35372q11890L69012m82052p82917K75495k0584j16127o66329N71851
1717h49685P2481j76362P03032r0453o6786K17460N1426K58726r4092K92546n81238
1706b62945J61976O42185l25690m57844L03490M26159r28914K50401R1615o56473
1696g56040p4075p79439N64568P02182r55622Q83213R94790m93868k5048J39034
1686A99695k32146J47218N17511o86924m40491P33894Q461M34867p69124l73981
$$ y = [452594, 941795, -115645, -135062, -262363, -238067, 406124, -97987, 879514, 1203823, 852797, 1692804, 1189433, 441473, 351812, 491028, 498878, 153782, 166945, -578716, -253569, -705090, -1750841, -380702, -337092, -438872, -504330, 266823, 1033579, 346299, 578484, 813856, 1966, 370978, -111074, -893991, -618496, -639080, -755207, -1421536, -849685, -777204, -953566, -250534, -340987, -407773, -190313, -138887, 119839, 25747, 318293, -262945, -100969, 541216, 215526, -242318, 61172, 487331, -441583, -191182, -99567, -756040, -830115, -1609554, -1044986, -342804, -1298426, -415213, 579577, 85709, 60661, 199695, -32451, 114767, 632278, -54646, -495137, 238757, 247218, 682085, -87039, -461020]
1676d61020J004163p93251p3916j07612l3879P54530p8913k1780o66664k9010
1666e07352R5523k87907Q059M23355K6442m62395N62630n7365l50407K91686l04290
1655e62021N6890M87530n43984m19348k95320K72765M34763K47664J85062Q3415
1645e2584m28718m38356M76025N48072N05829m51896q67049J118013j68699j20651
1635A19986l54705N45324O4533j8227o0898n3848L75820k3331k13335M73232r11829
1624e7278L1917m72419p6579L88454l10679O06764j029413J018586J72540J86680
1614D58573n3302j545963M98280J7070P75556K73979m90184M03171Q2672m06503
1604A3349P74446J69322q15132j78705q3682J13356R7943K94120m15728L06477
$$ y = [-461020, 543143, -250108, -324024, -431636, -465515, 289015, 210102, 188322, -478342, -507352, -411829, -699736, -691677, -268322, -241880, -704275, -141645, -199010, -549417, -257731, -562021, -505131, -17601, -561585, -980933, -1276253, -1003488, -568725, -321061, -135999, -52584, -481302, -919658, -443633, 104439, 610268, 158372, -708677, 409336, 240637, 119986, -234719, 310605, 375138, 356911, 296013, 242165, 617985, 594654, 381319, 854551, -57278, -25361, -497780, -574359, -185905, -496584, 110180, -919233, 99353, 271893, 458573, 405271, -1140692, -642412, -625342, 150214, 424193, -65991, 337180, 419852, 13349, 787795, 957117, 141985, -36720, -120402, -7046, 90897, 385017, -30711, 275766]
1594B75766m87116o10980M69058P49171N3270R0249P93541n26193k69571l6867
1584E00328j32099P69395n17996o24288J74001R8363p26077K25393O55496M10864
1574H33380k13838q49405q23495M21104L35825j69236K94595K85972j69294k14429
1564b68821P45271K55634m81096N53583k92205j37492m25428k29795K7925L23133
1554G0709M0442q88383O04653M9132n55934j84932l42818J050183J53447o52299
1544f55800n98310O89253P57787k46582O21516l92562k57760Q9512k18073l89049
1534f00068K51946o19441N07419P31260j272949q9363l16232J055277r6570o99731
1524a148452O85776N22850l74744n04666N33927j86300N52672M91687l47223L68953
$$ y = [275766, -211350, -822330, -353272, 395899, 449169, 539418, 1332959, 806766, 537195, 500328, 368229, 1137624, 619628, -4660, 169341, 267704, -458373, -232980, 422516, 833380, 619542, -229863, -1053358, -632254, -296429, -465665, -171070, 114902, -54392, -268821, 476450, 732084, 250988, 804571, 512366, 374874, -50554, -280349, -252424, 70709, 111151, -777232, -172579, -123447, -679381, -864313, -1207131, -156948, -3501, -655800, -1254110, -564857, 192930, -53652, 567864, 175302, -82458, 7054, -211019, -600068, -348122, -967563, -460144, 271116, -1001833, -1091196, -1407428, -352151, -448721, -1148452, -462676, 60174, -314570, -819236, -285309, -471609, 81063, 572750, 225527, 594480]
1514E94480j81629l91197l85087K45941K94278L04918q6242N32876l55473o92232
1504a19367j15842M66718q3575j218923K34531p1636O5591J120296k74163R73161
1494I76791J07074j146820L3697J04483l52007l5585m13790m21187J348665k87696
1484h6375L39589K36030K09093m08138J38794L82205q12128N0321j78241K76417
1474A47567N79412m09524J77673n73942J31262M07035p48946k96044N09830k01132
1464b76809P6026j03510Q51302r5246J66304J50127p24322M55832L07833j93473
1454F14064K25311n00039P6412j25306J58607p73927L81177k59711J15585J98776
1444A10949q01752j06793M48344j80957k30450K57479n97226Q73856N3523j22627
$$ y = [594480, 412851, 21654, -363433, -117492, 176786, 481704, 395462, 928338, 572865, -119367, -235209, 231509, 147934, -1070989, -836458, -908094, -842503, 277793, 3630, 976791, 1083865, -62955, -29258, 75225, -276782, -312367, -726157, -1147344, 201321, -86375, 253214, 489244, 698337, 290199, 428993, 811198, -930, 49391, -128850, 147567, 726979, 317455, 495128, -78814, 52448, 459483, -289463, -585507, -75677, -276809, -200783, -304293, 547009, 451763, 618067, 768194, 43872, 499704, 807537, 614064, 839375, 339336, 415748, 290442, 449049, -324878, 56299, -203412, -87827, 110949, -690803, -797596, -349252, -530209, -760659, -503180, -1100406, -226550, -173027, -295654]
1434b95654K99543k5846n34275J354914l44950q35110N88034K64778k30415n61914
1424c20895O686J47138n8206M6662j016119K63177N06406k08594J41787N80393
1414H8435L47997j094515q2075J309210j74047l03219k33801k21964P4204l99255
1404f89030K84216M28682o2213N55865n44191K72209J13603J73789q52218m09562
1394g28850J65126O15130R21577p25000q31797l07503J173648k82999Q278L37268
1384C44878k44142P20740n93080m17609M56518P3409n52575l58885L61303M78325
1374B68882l34925M43723K54090o48581J95278j083345M36173K97917J96454J95855
1364B21521m97019K81677j3089j91192J48444Q6169L93657m77222o53480K23577
$$ y = [-295654, 3889, -21957, -556232, 798682, 453732, -381378, 206656, 471434, 241019, -320895, -314209, -167071, -225277, -178615, -1194734, -931557, -425151, -633745, -491958, 88435, 436432, -658083, -740158, 569052, 395005, 91786, -142015, -363979, -289775, -689030, -404814, 23868, -38345, 517520, -26671, 245538, 359141, 532930, -319288, -728850, -563724, 51406, 972983, 247983, -583814, -891317, 282331, -668, 7610, 344878, 100736, 821476, 228396, -189213, 267305, 340714, -211861, -570746, -209443, 268882, -66043, 377680, 631770, -16811, 178467, -904878, -468705, -170788, 25666, 221521, -275498, 6179, -6910, -198102, -49658, 36511, 430168, -47054, -700534, -476957]
1354d76957K89757O722q73175l58800O40470l12563j08163K06035N25063l5652
1344d97263q00490M58309P13562j5697O36209j92844r9181L56159p35541O5341
1334a11436O89151j093264N86530l88374P4948N03601k11550j9554O74125n16925
1324A87252q4187M14539m71995o66712j25167j38276q87643J110870l154P89125
1314A24652O6070j76603l12181J31759n62620J38900O36875l76470o63839Q69443
1304a24014m10328o43167N88892k24916j39788j70513j1189M55324L47632N99647
1294B67580m09753m31247J088213J910q41983L19144n27416N11468l80782k03937
1284f06803Q07599j3507m80515k02292J61608N3821o07703N00764o71583K88506
$$ y = [-476957, -187200, -180478, -1053653, -1412453, -771983, -1084546, -1192709, -986674, -461611, -497263, -1297753, -839444, -125882, -141579, 494630, 301786, 202605, 558764, -176777, -111436, 577715, -515549, 70981, -317393, -242445, 261156, 49606, 30052, 704177, 187252, 103065, 517604, 45609, -621103, -746270, -884546, -1772189, -661319, -664473, 124652, 190722, 14119, -298062, -166303, -728923, -590023, 46852, -329618, -993457, -124014, -534342, -1177509, -588617, -813533, -953321, -1123834, -1135023, -679699, -332067, 267580, -142173, -573420, 514793, 516703, -325280, -6136, -533552, -22084, -402866, -606803, 200796, 187289, -293226, -495518, -333910, -280089, -887792, -387028, -1058611, -770105]
1274g70105N51741p75763J271271K84358j65638L47440N45821o52961m07250j03622
1264A25292j88184p50584l93731m86593N31257M97060m70925M71198O73939K99237
1254C07966p01196L82745J257933r68818M7936N45995m97266o29576M9421M92552
1244B87692k80315J56898l9317K04960O9786r22408j09560r4252N74274J59546
1234G304o33823O91697L56019n36664m56326j2837n85545M23779N26534m3126
1224b62988J52111m62226j30831Q73846J180195p52570o13307K57731J13042j73373
1214A81630O2766n88931L96205j03373J6768l67179K86435J098450l23575n21189
1204A38007K28430J497k8629n14485L69760J96849m11792l79694l32528O21785
$$ y = [-770105, -218364, -994127, 277144, 561502, 395864, 743304, 1289125, 636164, 228914, 125292, -62892, -813476, -1207207, -1693800, -1162543, -665483, -1136408, -665210, 8729, 307966, -393230, -10485, 1247448, 278630, 326566, 872561, 375295, -254281, -204860, 287692, 7377, 164275, 124958, 329918, 399704, -522704, -632264, -726516, -152242, 7304, -626519, 65178, 421197, -115467, -571793, -584630, -1170175, -746396, -219862, -262988, -110877, -573103, -703934, 169912, 1350107, 597537, -15770, 241961, 355003, 181630, 244396, -344535, 51670, -51703, -34935, -402114, -115679, 982771, 659196, 138007, 366437, 367934, 339305, -175180, 194580, 391429, -20363, -400057, -732585, -110800]
1194a10800l28697N41846L66197j90443N54556r25714n83273Q58777J13060m12523
1184a17014p84362R77863N85563j1474m42615M45344L29214j133648k03591Q02271
1174D47551R3402n27154J81020K7544l06362o6188L5409m28181j7165K01773L66993
1163H642k56530P82646J47100n86504j25611P09905K37199n59753m12944O9144
1153A3294J47974k86971o04729K79830O75114m5621m12107j30158P3726q4790
1143c74438M10622l35491k13045K85418K7011J72854L62027m71567L46340L65286
1133E75017n81713J38744j53920O3002M93737k15810J86946l33833m76572k97030
1123f01432l4067O39136j24797l13000j13680L4517M01981q05925N89255L71286
$$ y = [-110800, -439497, 102349, 468546, 278103, 832659, -93055, -676328, 182449, 295509, -117014, -901376, 76487, 662050, 650576, 207961, 653305, 982519, -151129, -354720, 447551, 540953, 13799, 194819, 222363, -83999, -150187, -114778, -542959, -560124, -358351, 8642, -247888, 534758, 681858, 95354, -30257, 679648, 916847, 357094, -55850, 13294, 161268, -125703, -730432, -450602, 224512, 178891, -233216, -363374, -289648, -374438, 36184, -299307, -512352, -226934, -199923, -27069, 334958, -136609, 209731, 575017, -6696, 132048, -21872, 41130, 534867, 319057, 506003, 172170, -304402, -601432, -635499, 3637, -121160, -434160, -547840, -513323, -111342, -917267, -328012, 43274]
1113D3274l25965j51555j95005N46168o0319M67893j134024n28946J127600J27262
1103h3617j07868r7069Q31690j222695o64594l068M94652J065031Q6637p16189
1093d17090K32568m65743l0704K04036l21804O55794J5279l6335n47019l97059
1083a108077L26015l4805L43020L26991j24979j77197k04979r4949K38169Q55641
1073C44850k73111J37839p7226l36002J061152q72673m23472L10896J17802K28161
1063B18216o2873j83740J90306p85396L08424m27631n13453M06084q1432M4269
1053h87226M24257R07368m03934j102505J10082P12321o81645m36118K92689J177507
1043A12796m03723l46290K74540l42406o45040k17073J594905L8522j518038L99971
$$ y = [43274, -282691, -434246, -629251, -83083, -143402, 324491, -809533, -1338479, -210879, -83617, -191485, -288554, 543136, -679559, -1344153, -1347221, -852569, 212462, 299099, -417090, -184522, -650265, -680969, -476933, -798737, -142943, -127664, -163999, -711018, -1108077, -782062, -816867, -473847, -146856, -271835, -449032, -654011, -748960, -510791, 344850, 71739, 209578, 132352, -203650, 857502, -15171, -438643, -127747, -9945, 218216, 155343, -28397, 161909, -623487, -315063, -742694, -1256147, -850063, -931495, -887226, -462969, 444399, 40465, -1062040, -951958, -239637, -921282, -1357400, -1064711, 112796, -290927, -637217, -362677, -705083, -1350123, -1567196, 27709, 66231, -1451807, -1051836]
1033a051836M74567M33440p20556q556P85963p7920k99894k19967M83068J021039
1023H19348j332580p8385L40379j02783J29482J27133q19647N9899O28365l87191
1013f15980l02116L71356P63582m32759j3638k47901J196555l19461n26516R80815
1003H53937p16851R8265j99670q41178Q46529O6218j83194N05360J50320M50576
993A030312J3323j173434m64982M59385n9102K46480K73386J76127j001926J30003
983c70428J501938q68896l96795j43418k04315N67008j91158k25800L78692R8140
973A44968j051394J022791o7131j189144R67389o26074N05674M30146J04438L55353
963E97016p49599M20466o2371k46807q3166J8016n42487L55242P66904j76138
$$ y = [-1051836, -577269, -143829, -864385, -872941, -86978, -164898, -464792, -684759, -201691, 819348, -513232, -591617, -251238, -354021, -224539, -97406, -917053, -857154, -228789, -615980, -918096, -546740, 216842, -215917, -229555, -477456, 719099, 399638, -126878, 853937, 137086, 235351, 35681, -805497, 41032, 107250, -75944, 429416, 579736, 1030312, 1043635, -129799, -594781, -135396, -194498, 51982, 325368, 501495, -500431, -370428, 1131510, 262614, -134181, -277599, -481914, 85094, -106064, -331864, 46828, 144968, -906426, 116365, 49234, -1139910, -172521, -798595, -292921, 137225, 241663, 597016, -152583, 267883, 205512, -41295, -124461, -106445, -648932, -293690, 473214, 297076]
953B97076m87162J11063K674K14016p47341K0330O82527k82752P5748k41324L24948
942c0197P1791n78822Q5224J4404J36035K83143O90414J55013l55439m17216j94052
931a39702k37598n1493Q48433m96554j197473L08116R32143l98325M7393K81562
921a03498M89928o2516n54752Q63869J19639K44321R2165p97643k00005J87924
911B79432J26993p85933L13277N87666J1224j140077k21267R40212J19053M31436
901F62016L00038p19850K62036k39888p7228J73682M770k72316O34229j42466
891E85023m49572K21880L7146p09600l26932R03384k89884k03362M30904l88610
881a89623o3562j73847p1848L49800l93130P930M51891k02060O89260r09107p96737
$$ y = [297076, -190086, -79023, -76349, 137667, -609674, -589344, 93183, -189569, -113821, -355145, -30197, 41594, -537228, -452004, -437600, -301565, -18422, 671992, 827005, 471566, 54350, -139702, -377300, -428793, 419640, -76914, -1274387, -966271, -34128, -432453, -385060, -103498, 386430, 323914, -230838, 633031, 752670, 996991, 1089156, 291513, 91508, 279432, 406425, -379508, -66231, 521435, 532659, -607418, -828685, 111527, 230580, 662016, 962054, 242204, 504240, 264352, 187124, 360806, 365576, 93260, 727489, 585023, 135451, 357331, 394477, -315123, -642055, 261329, -28555, -231917, 198987, -189623, -253185, -427032, -498880, -149080, -542210, -534280, -82389, -284449, 404811, -504296, -1301033]
870a301033R63462l80093J22417M62136j34142N41418l35164o42148O63893k54214
860b93468K50776l5362J15855K71022J34836m69067l17685l3092O0559L73345
850E7719M0253L11187j14804L16521k24213O90869R9762q28114j63232M98320
840F84268K15776r55271K62192K334L76261j056075l61589M24359j098050N35323
830i70472m46570J306326O84263N9145K71512Q8529k15551j291435j71943R24582
820B38386j33831k7580R59484K58485K68427r97122o50611O57358q11699l28167
810e66870J82676O3607O47211P30555j12547r19412k70779p09611L48480N20838
800h5852m23204o6437Q28684p85590N86010j642L64366M30730l66186q30105J5274
$$ y = [-1301033, -337571, -717664, -595247, -133111, -267253, 274165, -60999, -703147, -39254, -293468, -42692, -78054, 37801, 308823, 443659, -25408, -343093, -376185, -315626, 57719, 97972, 409159, 294355, 610876, 386663, 1077532, 1177294, 349180, 185948, 684268, 900044, -55227, 206965, 209299, 585560, -470515, -832104, -407745, -1505795, -970472, -1417042, -110716, 573547, 632692, 904204, 992733, 777182, -514253, -686196, 238386, 104555, 76975, 1036459, 1294944, 1563371, 566249, -84362, 572996, -238703, -566870, -384194, -320587, 326624, 1057179, 944632, 25220, -245559, -955170, -606690, -85852, -509056, -575493, 253191, -532399, 53611, 51969, 416335, 847065, 480879, -349226, -333952]
789c33952R00712j48676m5005J42429j66109j024340k3972O49591M50541j99246
779B01973n18057M14384N2984j41422J04409K42232k99550r64975L66485J008974
769D67437l72937k55406M77832j9017q1585R6410p92161K12887N57940m54924
759a63524j31804L21841j04282k5307K96314j17271J51012k18609M7645l74142
749c18127m14472Q98431O32017K26520k80060J23072J87098m45465k80186J25596
739D54424k3078o71198k78315P32907q6028M12822j36981n36650R93075M47282
729A308260K82920k90332o83361J10577K61073p5n49895L06054j024064n3826
719c32669O26492n66675j46576J17244p29035J50233M91656J450478N63207m94459
$$ y = [-333952, 566760, 418084, 373079, 515508, 349399, -674941, -698913, -49322, 401219, 201973, -316084, 98300, 151284, 9862, 114271, 356503, 56953, -908022, -541537, 467437, 94500, -160906, 316926, 297909, 216324, 312734, -479427, -266540, 291400, -163524, -295328, 26513, -77769, -103076, 193238, 75967, 226979, 8370, 56015, -318127, -732599, 165832, 797849, 1024369, 744309, 867381, 1054479, 609014, 328828, 454424, 431346, -239852, -518167, 214740, 128712, 541534, 404553, -132097, 860978, 1308260, 1591180, 1300848, 617487, 728064, 989137, 989062, 439167, 745221, -278843, -332669, 293823, -272852, -419428, -302184, -1031219, -880986, -389330, 1061148, 1624355, 1129896]
709A129896k51101p43994l86918n88940j993Q79921K07354l57905k57539L77675
699F456J06530n66550J34385o5589O08322N40698P70096q08772K0921p79582Q30685
688G97600P22048j121334j18862K05514p2241j64923p1758M13539k57314l19835
678A2434k01399K48885J05085O94277p00523k16143K02263Q76704l34834M4702
668G31451m76663P9881l6381k34002J00248j314233N13892J33541p7880M77822
658a02324j22400N061K45088n70467J41872j1874O3736L93323o74695p4765P28592
647B1147L37766l19375q76365O01240p5716q6481K67375R319k86061k76264K64548
636d18867L60510Q2113k97305P56721M99809j48402n58609m09452M01574K00560
$$ y = [1129896, 878795, 134801, -252117, -841057, -843050, 36871, 244225, -113680, -371219, 6456, 112986, -453564, -319179, -384768, 223554, 764252, 1534348, 725576, 746497, -33085, 797600, 1519648, 398314, 279452, 484966, 412725, 247802, 176044, 589583, 332269, 12434, -188965, 59920, 165005, 859282, 158759, -57384, 144879, 1021583, 686749, 731451, 254788, 334669, 298288, 64286, 164534, -1149699, -635807, -502266, -580146, -102324, -224724, -219663, 25425, -545042, -403170, -415044, -351308, 42015, -632680, -707445, 21147, 358913, 39538, -836827, -235587, -311303, -397784, -130409, -121090, -407151, -683415, -418867, -58357, 23756, -273549, 483172, 982981, 834579, 275970, -133482, 268092, 468652]
626D68652Q7003l66269J30648j30924n12283n25805R74341o52323l40138N97317
$$ y = [468652, 555655, 189386, 320034, 189110, -323173, -848978, 125363, -526960, -867098, -269781]
$$ [...]
##END NTUPLES=NMR SPECTRUM
##END=
