##TITLE=1H_EC-3245(1)xnk
 DMSO,8 sc, 
 3.03.2021
##JCAMPDX= 6.0         $$ Bruker NMR JCAMP-DX V2.0
##DATA TYPE= NMR SPECTRUM
##DATA CLASS= NTUPLES
##ORIGIN= UXNMR, Bruker Analytische Messtechnik GmbH
##OWNER= root
$$ XWIN-NMR		Version 3.5
$$ Wed Mar  3 09:54:05 2021 Russian Standard Time (UT+4h)  she@DPX200
##.OBSERVE FREQUENCY= 200.1315066352
##.OBSERVE NUCLEUS= ^1H
##.ACQUISITION MODE= SIMULTANEOUS
##.ACQUISITION SCHEME= undefined
##.AVERAGES= 8
##.DIGITISER RES= 18
##SPECTROMETER/DATA SYSTEM= spect
##.PULSE SEQUENCE= zg30
##.SOLVENT NAME= DMSO
##.SHIFT REFERENCE= (INTERNAL, DMSO, 0, 15.9968)
##AUDIT TRAIL= $$ (NUMBER, WHEN, WHO, WHERE, WHAT)
$$ ##TITLE= Audit trail, XWIN-NMR		Version 3.5
$$ ##JCAMPDX= 5.01
$$ ##ORIGIN= Bruker BioSpin GmbH
$$ ##OWNER= she
$$ F:/spectra/data/she/nmr/H-F/1/pdata/1/auditp.txt
$$ ##AUDIT TRAIL=  $$ (NUMBER, WHEN, WHO, WHERE, WHAT)
(   1,<2021-03-03 09:52:48.82 +0400>,<she>,<DPX200>,
      <created by zg, POWCHK disabled, PULCHK disabled
       configuration hash MD5:
       00 E9 B6 7A A2 85 ED C7 34 08 36 98 17 FE 4E 26
       data hash MD5: 16K
       4A 30 5D 38 43 39 AE DA 06 56 42 63 AF C0 0D 20>)
(   2,<2021-03-03 09:52:51.20 +0400>,<she>,<DPX200>,
      <Start of raw data processing
       efp BC_mod = 2 LB = 0.24 FT_mod = 6 PKNL = 1 PHC0 = -10755.62 PHC1 = 8.80094 SI = 16K 
       data hash MD5: 16K
       65 0B 3E DF DA A5 F3 E7 8E 66 E6 E4 B9 ED 9E 7C>)
(   3,<2021-03-03 09:53:06.70 +0400>,<she>,<DPX200>,
      <pk PHC0 = -11.37482 PHC1 = 5.8 
       data hash MD5: 16K
       BA 04 DD B3 63 21 8B 20 F4 35 3A BE 70 E8 5C 56>)
(   4,<2021-03-03 09:53:09.84 +0400>,<she>,<DPX200>,
      <abs ABSG = 5 
       data hash MD5: 16K
       A2 AE C8 51 CE 02 C9 66 87 3D 12 D9 06 C3 2C 17>)
$$ ##END=
$$ 
$$ hash MD5
$$ 93 86 46 60 00 C7 CE 0D 02 8A E0 DF 0F AA D9 CD
##$RELAX= 
##$RELAX= 
##$RELAX= 
##$RELAX= 
##$RELAX= 
##$RELAX= 
$$ Bruker specific parameters
$$ --------------------------
##$DU= <F:/spectra>
##$EXPNO= 1
##$NAME= <H-F>
##$PROCNO= 1
##$TYPE= <nmr>
##$USER= <she>
##$AMP= (0..31)
100 100 100 100 100 100 100 100 100 100 100 100 100 100 100 100 100 100 
100 100 100 100 100 100 100 100 100 100 100 100 100 100 
##$AQSEQ= 0
##$AQ_mod= 1
##$AUNM= <au_zg>
##$AUTOPOS= <>
##$BF1= 200.13
##$BF2= 200.13
##$BF3= 200.13
##$BF4= 200.13
##$BF5= 200.13
##$BF6= 200.13
##$BF7= 200.13
##$BF8= 200.13
##$BYTORDA= 1
##$CFDGTYP= 0
##$CFRGTYP= 5
##$CHEMSTR= <none>
##$CNST= (0..31)
1 1 145 1 1 1 1 1 1 1 1 1 1 1 1 1 1 1 1 1 1 1 1 1 1 1 1 1 1 1 1 1 
##$CPDPRG= <>
##$CPDPRG1= <>
##$CPDPRG2= <>
##$CPDPRG3= <>
##$CPDPRG4= <mlev>
##$CPDPRG5= <mlev>
##$CPDPRG6= <mlev>
##$CPDPRG7= <mlev>
##$CPDPRG8= <mlev>
##$CPDPRGB= <>
##$CPDPRGT= <>
##$D= (0..31)
0 1.2 0 0 0 0 0 0 0 0.06 0 0.03 0 0 0 0 0.0002 0 0 0 0 0 0 0 0 0 0 0 0 
0 0 0 
##$DATE= 1614750768
##$DBL= (0..7)
120 120 120 120 120 120 120 120 
##$DBP= (0..7)
150 150 150 150 150 150 150 150 
##$DBP07= 0
##$DBPNAM0= <>
##$DBPNAM1= <>
##$DBPNAM2= <>
##$DBPNAM3= <>
##$DBPNAM4= <>
$$ [...]
##$SUBNAM3= <"">
##$SUBNAM4= <"">
##$SUBNAM5= <"">
##$SUBNAM6= <"">
##$SUBNAM7= <"">
##$SUBNAM8= <"">
##$SUBNAM9= <"">
##$SW= 16.9725356469052
##$SWIBOX= (0..15)
0 0 2 0 0 0 0 0 0 0 0 0 0 0 0 0 
##$SW_h= 3396.73913043478
##$TD= 16384
##$TD0= 1
##$TE= 0
##$TE2= 300
##$TE3= 300
##$TEG= 300
##$TL= (0..7)
0 120 120 120 120 120 120 120 
##$TP= (0..7)
150 150 150 150 150 150 150 150 
##$TP07= 0
##$TPNAME0= <>
##$TPNAME1= <>
##$TPNAME2= <>
##$TPNAME3= <>
##$TPNAME4= <>
##$TPNAME5= <>
##$TPNAME6= <>
##$TPNAME7= <>
##$TPOAL= (0..7)
0.5 0.5 0.5 0.5 0.5 0.5 0.5 0.5 
##$TPOFFS= (0..7)
0 0 0 0 0 0 0 0 
##$TUNHIN= 0
##$TUNHOUT= 0
##$TUNXOUT= 0
##$USERA1= <user>
##$USERA2= <user>
##$USERA3= <user>
##$USERA4= <user>
##$USERA5= <user>
##$V9= 5
##$VALIST= <valist>
##$VCLIST= <CCCCCCCCCCCCCCC>
##$VD= 0
##$VDLIST= <DDDDDDDDDDDDDDD>
##$VPLIST= <PPPPPPPPPPPPPPP>
##$VTLIST= <TTTTTTTTTTTTTTT>
##$WBST= 1024
##$WBSW= 4
##$XGAIN= (0..3)
0 0 0 0 
##$XL= 0
##$YL= 0
##$YMAX_a= 152285
##$YMIN_a= -168776
##$ZGOPTNS= <>
##$ZL1= 120
##$ZL2= 120
##$ZL3= 120
##$ZL4= 120
##$ABSF1= 15.9761
##$ABSF2= -0.996562
##$ABSG= 5
##$ABSL= 3
##$ALPHA= 0
##$AQORDER= 0
##$ASSFAC= 0
##$ASSFACI= 0
##$ASSFACX= 0
##$ASSWID= 0
##$AUNMP= <proc_1d>
##$AZFE= 0.1
##$AZFW= 0.1
##$BCFW= 0
##$BC_mod= 2
##$BYTORDP= 0
##$COROFFS= 0
##$CY= -3
##$DATMOD= 1
##$DC= 0
##$DFILT= <>
##$DTYPP= 0
##$F1P= 0
##$F2P= 0
##$FCOR= 1
##$FTSIZE= 16384
##$FT_mod= 6
##$GAMMA= 0
##$GB= 0
##$INTBC= 1
##$INTSCL= 2.992141e-10
##$ISEN= 128
##$LB= 0.24
##$LEV0= 0
##$LPBIN= 0
##$MAXI= 10000
##$MC2= 0
##$MEAN= 0
##$ME_mod= 0
##$MI= 1.114404
##$NCOEF= 0
##$NC_proc= -8
##$NLEV= 6
##$NOISF1= 3.799351
##$NOISF2= 2.8
##$NSP= 0
##$NTH_PI= 0
##$NZP= 0
##$OFFSET= 15.99682
##$PC= 1
##$PHC0= -10767
##$PHC1= 14.60094
##$PH_mod= 1
##$PKNL= yes
##$PPARMOD= 0
##$PSCAL= 0
##$PSIGN= 0
##$REVERSE= no
##$SF= 200.130003561588
##$SI= 16384
##$SIGF1= 3
##$SIGF2= 2
##$SINO= 5.538805
##$SIOLD= 16384
##$SREGLST= <1H.CDCl3>
##$SSB= 0
##$STSI= 16384
##$STSR= 0
##$SW_p= 3396.73913043478
##$SYMM= 0
##$S_DEV= 0
##$TDeff= 16384
##$TDoff= 0
##$TI= <>
##$TILT= no
##$TM1= 0
##$TM2= 0
##$TOPLEV= 0
##$USERP1= <user>
##$USERP2= <user>
##$USERP3= <user>
##$USERP4= <user>
##$USERP5= <user>
##$WDW= 1
##$XDIM= 16384
##$YMAX_p= 330051044
##$YMIN_p= -1171494
$$ End of Bruker specific parameters
$$ ---------------------------------
##NTUPLES= NMR SPECTRUM
##VAR_NAME=  FREQUENCY,     SPECTRUM/REAL,   SPECTRUM/IMAG
##SYMBOL=    X,             R,               I
##VAR_TYPE=  INDEPENDENT,   DEPENDENT,       DEPENDENT
##VAR_FORM=  AFFN,          ASDF,            ASDF
##VAR_DIM=   16384,         16384,           16384
##UNITS=     HZ,            ARBITRARY UNITS, ARBITRARY UNITS
##FACTOR=    0.207333158178281, 1,           1
##FIRST=     3201.44373359838, 0,            0
##LAST=      -195.295396836398, 0,           0
##MIN=       -195.295396836398, -1171494,    0
##MAX=       3201.44373359838, 330051044,    0
$$ Real data points
##PAGE= N=1
##DATA TABLE= (X++(R..R)), XYDATA
$$ [...]
5423B461492J35118O9541J03182L42813L86119o7227j96401l12171K20837N16907
5413C660210k34878l15961J4186j19349L86691L62606k07376K47242J76702K97027
5403D267100M8049l66331J00307j54919j54826J74345J67800j75035J85257q0433
5393D011314O01252P1206L44579K9281l7816J08147r6075N35343k79927r8589
5383E188715j50275J28826L64507K2028N9864N99012K7236j70484K24688j76932
5373F117185L98141P53516L11472J26526K49208N49018q5551J58623j07929P55360
5363I225569N05056O55655P7314j78618R85244K63480L99355J130773R59777L69704
5353A4393309N90491N33993P55205R70851N16149N05850O27608O51690P29133
$$ plain form
5423 2461492 2596610 2666151 2769333 3112146 3498265 3431038 3234637 2922466 3143303 3660210
5413 3660210 3425332 3109371 3123557 3004208 3390899 3753505 3546129 3793371 3970073 4267100
5403 4267100 4315149 3948818 4049125 3894206 3739380 3913725 4081525 3906490 4091747 4011314
5393 4011314 4612566 4683772 5028351 5057632 5019816 5127963 5031888 5567231 5287304 5188715
5383 5188715 5038440 5167266 5531773 5553801 5613665 6212677 6239913 6069429 6294117 6117185
5373 6117185 6515326 7268842 7580314 7706840 7956048 8505066 8419515 8578138 8470209 9225569
5363 9225569 9730625 10386280 10463594 10284976 11270220 11533700 11933055 13063828 14023605 14393309
5353 14393309 14983800 15517793 16272998 17243849 17759998 18265848 18893456 19545146 20274279
5344B0274279O4916k78006P57595K10386l05985O20997M26558j33120o18228K21649
5334B1241041L88248l21205R0474Q3827j4003K5880m45821r2041l83483m70128
5324B0102789n40412l72520n60603p68407p37415l81307n70691j60958k62973
5315A5747503p24160l99128l44522Q5671j36403j65221k43126l35186j85397n31436
5305A2768595j21955L71095Q2096M17192r7110J15628N02361J33677P24505P77796
5295A5673880L46603J6395L9127M01235J059405R25893K27969J51099J083169
5286A9924775O78737R68719J330073J115381J117713J025060J058095R98724R91556
5277B9208833N96503P61586R01620L48820M93412k28960k8072M89058j04435J78209
$$ plain form
5344 20274279 20339195 20061189 20818784 21029170 20723185 21344182 21770740 21637620 21019392 21241041
5334 21241041 21629289 21308084 21398558 21482385 21468382 21494262 21048441 20956400 20572917 20102789
5324 20102789 19562377 19189857 18629254 17860847 17123432 16742125 16171434 16010476 15747503
5315 15747503 15023343 14624215 14279693 14365364 14228961 14063740 13820614 13485428 13300031 12768595
5305 12768595 12646640 13017735 13099831 13517023 13419913 13535541 14037902 14171579 14896084 15673880
5295 15673880 16020483 16036878 16076005 16477240 17536645 18462538 18690507 18841606 19924775
5286 19924775 20603512 21572231 22902304 24017685 25135398 26160458 27218553 28217277 29208833
5277 29208833 29805336 30566922 31468542 31817362 32310774 32081814 32053742 32542800 32438365 32616574
5267C2616574m5748m00738m79665o58543k32637k33206l49395r56215n95704l2206
5257B8632517p75746q52437r39949j187322j012600j020212j080751j277702j440687
5248A9045111o27087k71327j045074j106453j44471q19852n27775r31965r63833
5239A2607274n11791n2740m82488l75670j98557l50919l13810j14536L8032n59677
5229I685118p61135k43992k15419m67097j01782R0015L9423N7532n5027q3291
5219G944345j95662J46513M79045k30038o66065k58903J87516l27683o66617L11525
5209F723976L09565j57387l22778J79394K01940n16291J82165j05056J54133M49200
5199G098861j41161j78144J59016M5208l54029L78445k46297k90177J24774N66559
$$ plain form
5267 32616574 32570826 32170088 31690423 31031880 30799243 30566037 30216642 29260427 28664723 28632517
5257 28632517 27856771 27004334 26064385 24877063 23864463 22844251 21763500 20485798 19045111
5248 19045111 18418024 18146697 17101623 15995170 15850699 15030847 14503072 13571107 12607274
5239 12607274 12095483 12042743 11560255 11184585 10986028 10635109 10321299 10206763 10244795 9685118
5229 9685118 8923983 8679991 8464572 7997475 7895693 7985708 8025131 8082663 8027636 7944345
5219 7944345 7748683 7895196 8374241 8144203 7478138 7219235 7406751 7079068 6412451 6723976
5209 6723976 7033541 6876154 6553376 6732770 6934710 6418419 6600584 6495528 6649661 7098861
5199 7098861 6957700 6779556 6938572 6983780 6629751 7008196 6761899 6471722 6596496 7163055
5189G163055O23334k31231M3432J67044J20152J15944j66618K36902l40375K63981
5179G995620q4713p7260O52365l56359K33417k44434o7964M17055M53582L59264
5169I280573K33576k48193K86709O1924j67317k97871O68764K62648M02864j22362
5159A0361315O2378J33902j3552L94618L21960M38534O5140K11150K4753K9091
5149A2029289K6546P2145P79243J52366L10636Q88208O7989Q14099N36686K9142
5139A5706349K52528L94717K71253J021313L87058K12596P63334L39018L80845
5130A9729011Q15586Q17302R32845P52210P15958N93127R36789J343565J092387
5121B7728780R32442J519447J157223J444258J162475J408846J559953J145854
$$ plain form
5189 7163055 7786389 7555158 7598590 7765634 7885786 8001730 7835112 8072014 7731639 7995620
5179 7995620 7910907 7833647 8486012 8129653 8363070 8118636 8050672 8467727 8921309 9280573
5169 9280573 9514149 9265956 9552665 9614589 9447272 9149401 9818165 10080813 10483677 10361315
5159 10361315 10423693 10557595 10544043 10938661 11260621 11699155 11764295 11975445 12000198 12029289
5149 12029289 12055835 12127980 12907223 13059589 13370225 14258433 14326422 15140521 15677207 15706349
5139 15706349 15958877 16353594 16624847 17646160 18033218 18245814 19009148 19348166 19729011
5130 19729011 20544597 21361899 22294744 23046954 23762912 24356039 25292828 26636393 27728780
5121 27728780 28661222 30180669 31337892 32782150 33944625 35353471 36913424 38059278
5113C8059278J327006J502709J515731J089726J345081J371325P34787K04171
5105D7149814O57779K55909q2654j60228l72126N66952K51550J87032N93454R9746
5095D9147228L05897N68058R25638J214250R36992J416099K089066J770197K178478
5086F0551903J803311J762682K635230K518570K757878K294726K587175K075843
5078G8987318J530938J817089P17467L77397l81191o33084p02063j270042j757789
5069G8686040j394276j224269j827000j383386r17780j388699j399515n43032
5061F8608083m78694q26028o22721l07327l31872r40236k88915m13569m64711
5052F3934010r1892o10746m55978n00765n29630q76108m52373k92556l21448p04282
$$ plain form
5113 38059278 39386284 40888993 42404724 43494450 44839531 46210856 46945643 47149814
5105 47149814 47807593 48063502 47980848 47820620 47448494 48015446 48266996 48454028 49047482 49147228
5095 49147228 49453125 50021183 50946821 52161071 53098063 54514162 56603228 58373425 60551903
5086 60551903 62355214 64117896 66753126 69271696 72029574 74324300 76911475 78987318
5078 78987318 80518256 82335345 83052812 83430209 83049018 82415934 81713871 80443829 78686040
5069 78686040 77291764 76067495 74240495 72857109 71939329 70550630 69151115 68608083
5061 68608083 68129389 67303361 66680640 66373313 66041441 65101205 64812290 64398721 63934010
5052 63934010 63842118 63231372 62775394 62274629 61744999 60868891 60416518 60123962 59802514 59098232
5042E9098232j131973j267599j208325j125753j680241j478172r95109o23488
5034D9587572j327072q49148r85536j091855p23171n10592j105724j337416o92154
5025D0964904o01450j041145j087358k82736j450091n94151q70361j387468p25766
5016C2924378n88765j654752j196299m31191n02013m68737j028870n81295p71632
5007B5700824l02789n53331r5392k22214k26298p47902k96542j24288O5414N68720
4997B3766202J31149J25030l21778K68695N34502m96072K21284l18374n55823
4988B3354815j68743m95680m84499m10607J33307n33202o96241j72976o12564
4979A9913610m87509r3863m52783l79983m34474m76419k64307o52834j5052K22853
$$ plain form
5042 59098232 57966259 56698660 55490335 54364582 52684341 51206169 50211060 49587572
5034 49587572 48260500 47411352 46425816 45333961 44610790 44100198 42994474 41657058 40964904
5025 40964904 40363454 39322309 38234951 37952215 36502124 35907973 35037612 33650144 32924378
5016 32924378 32335613 30680861 29484562 29053371 28551358 28082621 27053751 26472456 25700824
5007 25700824 25398035 24844704 24749312 24527098 24300800 23552898 23256356 23132068 23197482 23766202
4997 23766202 23897351 24022381 23700603 23969298 24503800 24007728 24229012 23910638 23354815
4988 23354815 23186072 22690392 22205893 21795286 21928593 21395391 20699150 20526174 19913610
4979 19913610 19426101 19332238 18879455 18499472 18064998 17588579 17324272 16671438 16656386 16879239
4969A6879239J7118J56867K04806q2166n10490N97377j64410K62721R85650k55095
4959A8091617j84722k60853O9327j94229k24255K4024o63369m09908n44329k50640
4949A5452663l40946l25041r90032m74037q30768m82404p8275l90932k57952o36168
4939A0646108m94827l19744m28440q30251l64253J9910k15860j60036N1167l14880
4929G588894j61478j66244p63420r3839K65173l29353r0334K7038O491j98354
4919F084574o82464p6347J59077K49792m92738j20489L03128r7923m43272l20012
4909D563326p5178J4751J4411K08516J30398k0814K45223q21025k12022k6281
4899D021305J03871k26039R4357M11771m38124k78191Q2375K65130J50007m75117
$$ plain form
4969 16879239 16896357 17053224 17258030 17175864 16665374 17262751 17098341 17361062 18346712 18091617
4959 18091617 17906895 17646042 17715369 17521140 17296885 17320909 16657540 16247632 15703303 15452663
4949 15452663 15111717 14786676 13796644 13322607 12491839 12009435 11931160 11540228 11282276 10646108
4939 10646108 10151281 9831537 9403097 8572846 8208593 8228503 8012643 7852607 7903774 7588894
4929 7588894 7427416 7261172 6497752 6403913 6669086 6339733 6249399 6276437 6282928 6084574
4919 6084574 5402110 5325763 5484840 5734632 5241894 5121405 5424533 5326610 4883338 4563326
4909 4563326 4488148 4502899 4517310 4725826 4856224 4835410 5080633 4259608 4047586 4021305
4899 4021305 4125176 3899137 3993494 4405265 3967141 3688950 3771325 4036455 4186462 3711345
4889C711345L076k45812m65424L33025J05093k07613J43414L84441J23675k36783
4879C648437l59105k99010j97608N76345k76869o8720K03670J64009p3017k7604
4869C290528j28125j50785j13786k19665k6243K54213j04213n77076J7960M18062
4859B660870K51056L67723J87639l78876p8192L6538L04606k7574k41710k55643
4849B826437k52712N9947r864N7542K62884k12127n4550j27004Q9301L40437L69293
4838C349584m51870k46029L60953M5932j40922Q1025j88707j92039N05979O5419
4828C189325J0512k19373k90616K67890J73289J66811m94492l29594L26128N4571
4818B854451j66295m15161j98782J73127K60623M02176j73584k80658J8018K95228
$$ plain form
4889 3711345 3714421 3468609 3003185 3336210 3441303 3233690 3377104 3761545 3885220 3648437
4879 3648437 3289332 2990322 2792714 3369059 3092190 3023470 3227140 3391149 3318132 3290528
4869 3290528 3162403 3011618 2897832 2678167 2651924 2906137 2801924 2224848 2242808 2660870
4859 2660870 2911926 3279649 3467288 3088412 3010220 3046758 3351364 3323790 3082080 2826437
4849 2826437 2573725 2633672 2623808 2681350 2944234 2732107 2677557 2550553 2639854 2980291 3349584
4838 3349584 2897714 2651685 3012638 3058570 2917648 2998673 2809966 2617927 3123906 3189325
4828 3189325 3199837 2980464 2689848 2957738 3131027 3297838 2803346 2473752 2799880 2854451
4818 2854451 2688156 2272995 2074213 2247340 2507963 2910139 2736555 2455897 2473915 2769143
4808B769143m29718k9862p6877q3429J00794L077l46851j92184J87892M14883
4798B316868k54364m82668N9590q6754L48057n5322K01585J68647K68903k50053
4788B234489k19383J64025r33K61795j4138o8939L9372L53293j4636m59133m19331
4777A856481K17323K94693K15328R3787q7430m74076N3384Q2858l03951L07878
4767B256275j09280K13089M28746k42231j83831r8540m11997N9121K82138J09436
4757B302926j16729L56501L60744n34484k64142j48448Q4807M36200K6454j50035
4747B353794j83055k11393j1583J05787l06624J98252N04064j21470n5903Q7918
4737B359787k79962N61120O516n65223l71977J52895N97498j6448l58245K43547
$$ plain form
4808 2769143 2339425 2309563 2232686 2149257 2250051 2253128 1906277 1714093 1901985 2316868
4798 2316868 2062504 1579836 1639426 1552672 1900729 1845407 2046992 2215639 2484542 2234489
4788 2234489 2015106 2179131 2178198 2439993 2425855 2356916 2396288 2749581 2734945 2275812 1856481
4777 1856481 2073804 2368497 2583825 2677612 2590182 2116106 2169490 2252348 1948397 2256275
4767 2256275 2146995 2360084 2788830 2546599 2362768 2264228 1852231 1911352 2193490 2302926
4757 2302926 2186197 2542698 2903442 2368958 2104816 1956368 2041175 2477375 2503829 2353794
4747 2353794 2170739 1959346 1947763 2053550 1746926 1945178 2449242 2327772 2271869 2359787
4737 2359787 2079825 2640945 2647461 2082238 1710261 1863156 2460654 2444206 2085961 2329508
4727B329508r0262l25013L28011L08322k22176N6960J62554L21671m57290j56295
4717B255990K92405l67161J69391N17973j85562K32267K18622l34560K15604N92589
4707C607558n62744j84975k01132k2237k81827p3382J26605L2028K43015k52680
4697B430229j42981M38443L64628r9187j14843K84530M9743j13127J74153K89763
4687C561351n50320j50789K45730J60154o03912m06721N93888j19609P2371J06972
4677B909115n2144n03824L89452K44209L44289N556j39184j71942L0487K97851
4667C353865k30566q1433M21395M52445M34412o20117o6293j01562N45957k20464
4657C887639k47723L4210L78124l64458p3778N30004M61314m2119l40076J95938
$$ plain form
4727 2329508 2239246 1914233 2242244 2550566 2328390 2385350 2547904 2869575 2412285 2255990
4717 2255990 2548395 2181234 2350625 2868598 2683036 2915303 3133925 2799365 3014969 3607558
4707 3607558 3044814 2859839 2658707 2636470 2354643 2281261 2407866 2439894 2682909 2430229
4697 2430229 2287248 2725691 3090319 2991132 2876289 3160819 3210562 3097435 3271588 3561351
4687 3561351 3011031 2860242 3105972 3266126 2662214 2255493 2849381 2729772 2802143 2909115
4677 2909115 2856971 2353147 2742599 2986808 3331097 3336653 3197469 3025527 3056014 3353865
4667 3353865 3123299 3041866 3463261 3915706 4350118 3730001 3663708 3562146 4108103 3887639
4657 3887639 3639916 3674126 4052250 3687792 3614014 4144018 4605332 4563213 4223137 4419075
4647D419075K12754P7200k57261R1892L99677L4877q259M19000j09439j38615
4637E140901J54139p0235p1274l4186l39346M18148l70918Q2098J76484j84580
4627D901231L22562L67594J98100J80384K03195P463M00861m31709N96886N40814
4617G287381J95970L8668q3639O11421J44996o7323J15295K32131j21822K05239
4607H558317K14588P11989K61030P70663L85893k79475L28814O42743J31539L81360
4597A2107461L27218M90834K04353j56084L33446J46866L94653R77584J58424
4588A4984755j09787N82553K83367M11691K96512m961L96235L71260O04129P93828
4578A8609582L27390M08133L58411J56859K88003L13090K46268L68008N64549
$$ plain form
4647 4419075 4631829 4709029 4451768 4543660 4943337 4978214 4969955 5388955 5279516 5140901
4637 5140901 5295040 5224805 5153531 5119345 4779999 5198147 4827229 4909327 5085811 4901231
4627 4901231 5223793 5591387 5789487 5969871 6173066 6180529 6581390 6149681 6746567 7287381
4617 7287381 7483351 7522019 7438380 8049801 8194797 8127474 8242769 8474900 8353078 8558317
4607 8558317 8772905 9484894 9745924 10516587 10902480 10623005 10951819 11594562 11726101 12107461
4597 12107461 12434679 12925513 13129866 12973782 13307228 13454094 13848747 14826331 14984755
4588 14984755 14874968 15457521 15740888 16152579 16449091 16444130 16840365 17211625 17815754 18609582
4578 18609582 18936972 19345105 19703516 19860375 20148378 20461468 20707736 21075744 21640293
4569B1640293P6846k88176L73971L59586l42011m61598O1036k63303l66473l0272
4559B0759899K70485K93291j81928k46518m2171L06783K87664j56513j26017j34099
4549B1030876l1756N86346O10637p9627K71316o7964K57381K86694k81692L22260
4539B2904471O53352n8756K7967j8563O969K36526K89276O14420l92772l6685
4529B4226205M86139J29786k30294P1620K51251R27718M43342K6170q06N59296
4519B6890427N15606L48735Q30566l26274K66896j69225O3338M05104k91334l38303
4509B8195536n14034Q2351m17470l97344o19430j10370l17408n16519j80528n51088
4499B4653696k93897l77504r14651n36826k27863l37706p97127l03834p4165n75609
$$ plain form
4569 21640293 21717139 21428963 21802934 22162520 21820509 21358911 21419947 21156644 20790171 20759899
4559 20759899 21030384 21323675 21141747 20895229 20853058 21159841 21447505 21290992 21164975 21030876
4549 21030876 20999120 21585466 22196103 22116476 22387792 22319828 22577209 22863903 22582211 22904471
4539 22904471 23557823 23499067 23527034 23508471 23515440 23751966 24041242 24655662 24262890 24226205
4529 24226205 24712344 24842130 24611836 24683456 24934707 25862425 26305767 26331937 26331131 26890427
4519 26890427 27406033 27754768 28585334 28259060 28525956 28356731 28420069 28825173 28533839 28195536
4509 28195536 27681502 27763853 27346383 26949039 26329609 26219239 25901831 25385312 25204784 24653696
4499 24653696 24359799 23982295 23067644 22530818 22302955 21965249 21168122 20864288 20790123 20214514
4489B0214514m29220p27570q56543k19424K47956p20434J2935k65461q85281l91814
4479A5979658j98280o65319o91396j51104p71550m20694N4380l47867o28k74399
4469A2512801m58548k11768J5576j2140m7008j75878n53603j67568N1888K04662
4459A1158414j69123k48406j42402l53436P5671r0376K71093p9907j83822N46489
4449A0784195l23082J6395j78004q2626L54508L78865l40419j5204k84201O4968
4439A0375395K07649K6196K15820J25403l07758R8531K66395k87785M39330J80973
4429A1340149N878k08360L68733J05254J09930K39055L26869J24993R4553N43252
4419A3050306M3118J97034O9558n4435J60385J676M81766L54274J26024j67193
$$ plain form
4489 20214514 19785294 19057724 18201181 17981757 18229713 17509279 17522214 17256753 16371472 15979658
4479 15979658 15781378 15116059 14424663 14273559 13502009 13081315 13135695 12787828 12787200 12512801
4469 12512801 12054253 11842485 11858061 11845921 11798913 11623035 11069432 10901864 10953752 11158414
4459 11158414 10989291 10740885 10598483 10245047 10320718 10230342 10501435 10421528 10237706 10784195
4449 10784195 10461113 10477508 10299504 10216878 10571386 10950251 10609832 10594628 10310427 10375395
4439 10375395 10583044 10609240 10825060 10950463 10642705 10741236 11007631 10719846 11159176 11340149
4429 11340149 11346027 11137667 11506400 11611654 11721584 11960639 12287508 12412501 12507054 13050306
4419 13050306 13093424 13290458 13360016 13305581 13465966 13467642 13949408 14303682 14429706 14262513
4409A4262513M51287L75953L56728K46646j35736Q17988O36443L6131J70068K89175
4399A7507196M64711K87838J36328l036R64318K95617P8710P03211P0057j42669
4389B0362281L67071M02700M1336P93135Q68485M64149N00728K80049M98130j02657
4379B4475407N90132R19785Q97364O03657L96956N67796Q08071J014731J215638
4370C1489537P26062J29511M93584J203366J321099Q77157J130795Q02141R12296
4361C9085548J554255J247566J056658J644529J606278J349415J987818J868268
4353E1400335J961477J570574J972432K900654K368832K893160K131279K710410
4345F9909153K713424L464485L522117L278696L460695L679895M137115M748905
$$ plain form
4409 14262513 14713800 15089753 15446481 15693127 15557391 16375379 17011822 17047953 17218021 17507196
4399 17507196 17971907 18259745 18396073 18393037 19357355 19652972 19731682 20434893 20504950 20362281
4389 20362281 20729352 21132052 21173388 21966523 22835008 23299157 23799885 24079934 24578064 24475407
4379 24475407 25065539 25985324 26882688 27486345 27883301 28451097 29259168 30273899 31489537
4370 31489537 32215599 32345110 32838694 34042060 35363159 36240316 37371111 38173252 39085548
4361 39085548 40639803 41887369 42944027 44588556 46194834 47544249 49532067 51400335
4353 51400335 53361812 54932386 56904818 59805472 62174304 65067464 67198743 69909153
4345 69909153 72622577 76087062 79609179 82887875 86348570 90028465 94165580 98914485
4337I8914485M945910M796559N474620O248089O742513P199659P376212P950926
4329A49648973P980893Q720126R159468Q826695Q608066P879558O915043N911062
4321B13649884M101994J992489L0557k328240m035160o129393p025833q068027
4313A92188271q964360r353256r056345q829696q590455q177370p458395o828584
4305A24929810o695104o385199n311850m861718n248385m182642l972632l704932
4297H4567348l425174l489020k999543k403816k572120k871481j882844j647545
4289F3275805k052022j703660j709846j343040j169837j000797j304929o44454
4281E2347220j271134p52178m86042j219609m44324p37965p27063o66970n107
$$ plain form
4337 98914485 103860395 108656954 114131574 120379663 127122176 134321835 141698047 149648973
4329 149648973 157629866 166349992 175509460 184336155 192944221 200823779 207738822 213649884
4321 213649884 217751878 219744367 219774924 217446684 213411524 207282131 200256298 192188271
4313 192188271 183223911 173870655 164814310 155984614 147394159 139216789 131758394 124929810
4305 124929810 118234706 111849507 106537657 101675939 96427554 92244912 88272280 84567348
4297 84567348 81142174 77653154 74653611 72249795 69677675 66806194 64923350 63275805
4289 63275805 61223783 59520123 57810277 56467237 55297400 54296603 52991674 52347220
4281 52347220 51076086 50323908 49837866 48618257 48173933 47435968 46708905 46041935 46036828
4272D6036828j68533j147997q03931J20159q21917n48987l07040q53333p38635
4263D0766614r24258q45501j231566q86130p92692p68869O8406j88538k14891
4254C4982575m11067n62445m84227l84022J33542q29522n38592n7838o93764k97440
4244C0857200k08537k67406n3380l8479k24855p51032p95468O1927n20895n57069
4234B7502006K1564m53536O8145j04163p53032k52949m3663l52307j98800l92632
4224B5040633k83411k26402q8927k18246k88254J46775k94456n4754k95584l57859
4214B3079515n1560K68185m62877p83959k40188m55221k99963l80395n69681o52463
4204A9451393j47362k5172o41619j20815m61514m41464m71308k73980k30253n00828
$$ plain form
4272 46036828 45868295 44720298 43916367 44036526 43214609 42665622 42358582 41505249 40766614
4263 40766614 39842356 38996855 37765289 36879159 36086467 35317598 35386004 35197466 34982575
4254 34982575 34571508 34009063 33524836 33140814 33274356 32444834 31906242 31848404 31154640 30857200
4244 30857200 30648663 30381257 30327877 30289398 30064543 29313511 28518043 28579970 28059075 27502006
4234 27502006 27523570 27070034 27138179 27034016 26280984 26028035 25984372 25632065 25433265 25040633
4224 25040633 24757222 24530820 24441893 24223647 23935393 24082168 23787712 23732958 23437374 23079515
4214 23079515 23027955 23296140 22833263 22049304 21809116 21353895 21053932 20673537 20103856 19451393
4204 19451393 19304031 19278859 18637240 18516425 18054911 17613447 17142139 16868159 16637906 16137078
4194A6137078k38854K02291l70614m73392j25352k53440L58546m34908k3861K58384
4184A5035878j64869j0121J69398l91807n61573j90965K44143K80864k91659l53854
4174A3765435k7942R203m11975m340k88020M18078l44994j01518j10816l24175
4164A2578936k36208m22815J54395J46398m50129l14363L68776J49774n88541
4155A1386223p4464N8616K6880l5873J52425J66497q57L93213n4215M61759k83166
4144A2197038k79170j74430J67213p841k05643M51978k22943J49624P782m63616
4134A1619992k1515l8442L32871j21574K8706o3900K1294L76733j97134o44116
4124A1292915M62406K47523L42962N3969o00032j96184N88563P63215K17132p3477
$$ plain form
4194 16137078 15898224 16100515 15729901 15256509 15131157 14877717 15236263 14801355 14777494 15035878
4184 15035878 14871009 14860888 15030286 14638479 14076906 13885941 14130084 14410948 14119289 13765435
4174 13765435 13737493 13746696 13334721 13330381 13042361 13460439 13115445 13013927 12903111 12578936
4164 12578936 12342728 11919913 12074308 12220706 11770577 11456214 11824990 11974764 11386223
4155 11386223 11311759 11370375 11397255 11361382 11513807 11680304 11679447 12072660 12018445 12480204 12197038
4144 12197038 11917868 11743438 11910651 11902810 11697167 12149145 11926202 12075826 12083608 11619992
4134 11619992 11598477 11560035 11892906 11771332 11800038 11736138 11757432 12134165 11937031 11292915
4124 11292915 11755321 12002844 12345806 12399775 11799743 11603559 12192122 12955337 13172469 13098992
4114A3098992j76463L09567j03529j44517j82753L46243j42596K24907M86283
4105A3716134K6844K82888k88034n9028N35966M84342m95696k6083O74603M73992
4095A5325928N28248L91071L66495J96738j10256K7992O38976P56853k90561M48160
4085A8279644P94619L74481M57211O14964k4996O16775R00508R12372Q58572O59569
4075B4443719P78682J088739O00521P75362J138189J181293J032589J114099J252241
4066C3405434J275898J365614P09311J364899Q91640J259383J361258J383944
4058D3017381N54440O27278J094973J373731P16449L33727R81774Q27202N44582
4049E0071537R97077O59128K04542R53979M45768O85505O03259N68752J146287
$$ plain form
4114 13098992 12922529 13232096 13128567 12984050 12801297 13147540 13004944 13229851 13716134
4105 13716134 13742978 14025866 13737832 13678804 14214770 14699112 14203416 14177333 14851936 15325928
4095 15325928 15854176 16245247 16611742 16808480 16698224 16726216 17365192 18122045 17831484 18279644
4085 18279644 19074263 19448744 19905955 20520919 20495923 21112698 22013206 22925578 23784150 24443719
4075 24443719 25222401 26311140 26911661 27687023 28825212 30006505 31039094 32153193 33405434
4066 33405434 34681332 36046946 36756257 38121156 39012796 40272179 41633437 43017381
4058 43017381 43571821 44199099 45294072 46667803 47384252 47717979 48699753 49526955 50071537
4049 50071537 51068614 51727742 51932284 52886263 53332031 54017536 54620795 55189547 56335834
4040E6335834Q62638M92770N61882L50139Q19516K4798M82603N60983Q60997J09905
4030F1462065l5965M69080l44250j35252O7807m3320k88402p09443p07483n35202
4020E9199635q85611o58429r91192j100402j433447q03215q86033j085473j005392
4011E0350441n61912j049068j033546r25280o72304j043397n92407n99619n47611
4002D3325297j199138r89457q67325o24234m18885r37103k98548q31749j309799
3993C5849059j262651q33150o59262q72786j370762j053630j082590j051704l58870
3984B7303654j237168j288902q20189r29803n54511p51802q34612q38303p96260
3975A9252104m56871k27686p1206q13757o05324o24464m43684r767J73601m08664
$$ plain form
4040 56335834 57198472 57691242 58253124 58603263 59422779 59447577 59930180 60491163 61352160 61462065
4030 61462065 61426100 61895180 61550930 61415678 61483485 61440165 61151763 60442320 59734837 59199635
4020 59199635 58314024 57655595 56664403 55564001 54130554 53327339 52441306 51355833 50350441
4011 50350441 49788529 48739461 47705915 46780635 46108331 45064934 44472527 43872908 43325297
4002 43325297 42126159 41136702 40269377 39645143 39226258 38289155 37990607 37158858 35849059
3993 35849059 34586408 33753258 33093996 32221210 30850448 29796818 28714228 27662524 27303654
3984 27303654 26066486 24777584 23957395 23027592 22473081 21721279 20886667 20048364 19252104
3975 19252104 18795233 18567547 18496341 17682584 17077260 16452796 16009112 15999345 16172946 15764282
3965A5764282j091615o02024l40637k8371j94453l20053j34395k78622k10263
3956A2563849j34645l60152j60595j06878n51974k77261M34765J86164o61776
3947A0931497r1312r6857P1343n794q28180l94971M5096L3597l32777q2145k90658
3936H958839J78030l4869q0794l16695j97952L45522l59860j01554J91894j78774
3926H403787J89118k76455k12041j65653l13090Q3165N28198m43073j67976k07632
3916G418348L68679K48585l17644l43145J5907n01050K55258N85002l969j67046
3906G558925L53999o8365l63433k34138N60191M22757k78155l414n24955J21936
3896G545348m16514J90961N20062K80486l10989r2203L71356J16263o42448j4689
$$ plain form
3965 15764282 14672667 14070643 13730006 13701635 13507182 13187129 13052734 12774112 12563849
3956 12563849 12429204 12069052 11908457 11801579 11249605 10972344 11407109 11593273 10931497
3947 10931497 10840185 10743328 10814671 10808877 9980697 9585726 9630822 9664419 9331642 9249497 8958839
3936 8958839 9136869 9102000 9021206 8704511 8506559 8852081 8492221 8390667 8582561 8403787
3926 8403787 8592905 8316450 8104409 7938756 7625666 7708831 8237029 7793956 7625980 7418348
3916 7418348 7787027 8035612 7717968 7374823 7390730 6889680 7144938 7729940 7725971 7558925
3906 7558925 7912924 7844559 7481126 7246988 7807179 8229936 7951781 7948367 7423412 7545348
3896 7545348 7128834 7319795 7839857 8120343 7809354 7717151 8088507 8204770 7562322 7547633
3886G547633L10386J74942P3806J52214J38152j70534k37607m92626O82632P45480
3876H924478k72256J45359l5971K92774J63441q8452J37633J0553J34185L05113
3866I716857L82388l96061k99727K2198j33355O16339K20931N2094L35155j75134
3856A0341685j37312L71055L96039K68478L90054M2917j2868M01873K86075N66672
3846A2914668L36023M2228k2463m50624L66547M47735J51227j01605M48661L71356
3836A4503753K08072j31132Q1042J15371O23552L49172K96540M91392k69077P18218
3826A6986903N27531L56393J41831Q03386K93929M57648J050955M46208K90051
3817B1354835L91207N06464M57565N98968R47124R95717R39945M46277N73389
$$ plain form
3886 7547633 7858019 8032961 8106767 8258981 8397133 8226599 7988992 7496366 8178998 8924478
3876 8924478 8652222 8797581 8761610 9054384 9217825 9129373 9267006 9277559 9411744 9716857
3866 9716857 10099245 9703184 9403457 9425655 9292300 9908639 10129570 10181664 10516819 10341685
3856 10341685 10204373 10575428 10971467 11239945 11629999 11672916 11660048 12061921 12347996 12914668
3846 12914668 13250691 13292919 13270456 12819832 13186379 13634114 13785341 13683736 14132397 14503753
3836 14503753 14711825 14580693 14661735 14777106 15400658 15749830 16046370 16537762 16268685 16986903
3826 16986903 17514434 17870827 18012658 18816044 19109973 19567621 20618576 21064784 21354835
3817 21354835 21746042 22252506 22710071 23309039 24256163 25251880 26191825 26638102 27211491
3808B7211491R40877R16304J376374J128325R52698J755534J580767Q11426J102429
3799C7776225J766293J509337J911328J878033K395864J677019K354084L113160
3791E4381343L004176L294300L143307L746254L841196M635426N367518N443452
3783H6856972N963729N718103O130575P038479O435018N764982N419995M954581
3775A34282434L487704K568614N70009r78267k027115k731568l312363l633276
3767A28226172l158973k373798k212757j614298m70856p2060J35203O07870J582667
3758A20649170J296261J228205J382896Q65039N59578k42331j301047k152875
3750A22284896l864149m377656n333654o781495p113515o726076n801409n730449
$$ plain form
3808 27211491 28152368 29068672 30445046 31573371 32526069 34281603 35862370 36673796 37776225
3799 37776225 39542518 41051855 42963183 44841216 47237080 48914099 51268183 54381343
3791 54381343 57385519 60679819 63823126 67569380 71410576 76046002 81413520 86856972
3783 86856972 92820701 98538804 104669379 111707858 118142876 123907858 129327853 134282434
3775 134282434 137770138 140338752 140908761 139930494 137903379 135171811 131859448 128226172
3767 128226172 125067199 122693401 120480644 118866346 118395490 118323430 118458633 119066503 120649170
3758 120649170 121945431 123173636 124556532 125421571 125981149 125738818 124437771 122284896
3750 122284896 118420747 114043091 108709437 101927942 94814427 88088351 82286942 76556493
3742G6556493n089244m820671m382982l561511l312673k772593k856035k129108
3734D7631676k006792j927441j811192j784898j413565k573485k080232j718621
3726C2315450j612168j089174j076439j063208r87442j068773o51795j184927
3718B3581524p33632p27006q87671m43893l86922o43410n27329q60836q45882
3709A7524943l58333k8686k96817m40970o47598l74532m5122n85514J88316j51571
3699A4784116k27704j71132n80258m43126k22574l21965k07484k44151j36026
3690A2229696M8849k39073J02800K66378q9439l12810p50393m78418Q0744n60020
3680A0298314k94134k96585j99283M82302j8458l59178j43905k97017j26993J0052
$$ plain form
3742 76556493 71467249 66646578 62263596 58702085 55389412 52616819 49760784 47631676
3734 47631676 45624884 43697443 41886251 40101353 38687788 36114303 34034071 32315450
3726 32315450 30703282 29614108 28537669 27474461 26487019 25418246 24766451 23581524
3718 23581524 22847892 22120886 21233215 20789322 20402400 19758990 19231661 18370825 17524943
3709 17524943 17166610 17137924 16841107 16400137 15752539 15378007 15332885 14747371 14935687 14784116
3699 14784116 14556412 14385280 13805022 13361896 13139322 12817357 12609873 12365722 12229696
3690 12229696 12278545 12039472 12142272 12408650 12319211 12006401 11256008 10777590 10858334 10298314
3680 10298314 10004180 9707595 9508312 9990614 9972156 9612978 9469073 9172056 9045063 9055115
3670I055115j06291m42620l48817L5881j09489J22634J06671k59686l98509j53415
3660G501474m43699K5839p8186k28031J08089K75080l19067k12953K80645l44413
3650F564778m14305P1485K16437p6542j99156r9540K16328m83966M294M79429
3640F279242k20054P655j06220N5103n25107m93052L27350l9664K96320K8418
3630E609991l76354j83630j0773M03803o6815O403r3309m6956p1825o5403K07266
3619E312398L7156k17381p055j10430K21811p4320j58189K9084n9025K87787n2620
3608E209216n60257K86334K12539M6269j28913L00412k11402l80690M14282L4718
3598E222508K52180L33937l91760l25356J59199P4436M94505l50889j67451L62063
$$ plain form
3670 9055115 8948824 8506204 8157387 8193268 8083779 8206413 8313084 8053398 7654889 7501474
3660 7501474 7057775 7083614 7005428 6777397 6885486 7160566 6841499 6628546 6909191 6564778
3650 6564778 6150473 6221958 6438395 6361853 6162697 6063157 6279485 5795519 5799813 6279242
3640 6279242 6059188 6066843 5960623 6015726 5490619 4997567 5324917 5285253 5581573 5609991
3630 5609991 5233637 5050007 5039234 5443037 5376222 5382625 5289316 5242360 5170535 5105132 5312398
3619 5312398 5349554 5132173 5125118 5014688 5236499 5162179 5003990 5033074 4974049 5261836 5209216
3608 5209216 4648959 4935293 5147832 5194101 5065188 5365600 5154198 4773508 5187790 5222508
3598 5222508 5474688 5808625 5416865 5091509 5250708 5325144 5819649 5468760 5301309 5663372
3588E663372j05212J86561N59372J67784M63581N16492L05823J26353J47493L87098
3578H418717k63376M21232o5802q78297l8517R3217n35940o17385J28807m1736
3568F620920M68527k28643Q8628m99773j72775k16891l26185M69155P8152p8797
3558F202318k34068M19999K4318j87250k05776n5360o7960j91243n5075L50352
3548F000255j86730K20337R445o05639K58432L92843O7336k11305k19670k22571
3538E502733K39700M35471m0428j59499L30228J4534l14629l5305K72419m44470
3528E800754J24372J9764j6811J41170j7636Q1094O8123L1960k47938j99577j661
3517E783614R4221L62519P0042O3679k83366n9580K58949L01968p0021J53750
$$ plain form
3588 5663372 5558160 5744721 6304093 6471877 6935458 7451950 7757773 7884126 8031619 8418717
3578 8418717 8155341 8576573 8510771 7632474 7593957 7687174 7151234 6533849 6662656 6620920
3568 6620920 7089447 6860804 6949432 6449659 6276884 6059993 5733808 6202963 6281115 6202318
3558 6202318 5968250 6388249 6412567 6225317 6019541 5964181 5896221 5704978 5649903 6000255
3548 6000255 5813525 6033862 6043307 5437668 5696100 6088943 6156279 5944974 5725304 5502733
3538 5502733 5742433 6177904 6137476 5977977 6308205 6322739 6008110 5972805 6245224 5800754
3528 5800754 5925126 5944890 5928079 6069249 6051613 6132707 6200830 6232790 5984852 5785275 5783614
3517 5783614 5877835 6240354 6310396 6374075 6090709 6031129 6290078 6592046 6522025 6675775
3507F675775R5984o04172L21790L43080j97143j71316K11248k5557J04101p8382
3497F675408L35506q2489J01885P7879m15633K78576K78122j62562K47926R1386
3487G426004J75833J40963j64611J8061O06626m5337K57162j20711J62182N0360
3477H506532n4322r8999O42749l1972j29194M54009K85003K90285l27443K35898
3467I772546K47144L20472k56371J59893M93513K60677k73829M77968K46843K75664
3457A1724520J2505J87564M7653L3013M32348o9625K9019M70511M29142J41666
3447A3438316L70347N86110J68849Q9466K10063M25872M50801L41269K85344J3223
3437A6379660O95615M27919L01970K28433M13023P20268M02143K18721O60603
$$ plain form
3507 6675775 6771759 6167587 6489377 6832457 6635314 6463998 6675246 6649689 6753790 6675408
3497 6675408 7010914 6928425 7030310 7108189 6692556 6971132 7249254 7086692 7334618 7426004
3487 7426004 7601837 7742800 7578189 7596250 8202876 8157539 8414701 8293990 8456172 8506532
3477 8506532 8452210 8353211 8995960 8963988 8834794 9288803 9573806 9864091 9536648 9772546
3467 9772546 10019690 10340162 10083791 10243684 10737197 10997874 10724045 11202013 11448856 11724520
3457 11724520 11737025 11924589 11972242 12005255 12437603 12367978 12396997 12867508 13296650 13438316
3447 13438316 13808663 14394773 14563622 14653088 14863151 15289023 15739824 16081093 16366437 16379660
3437 16379660 17075275 17503194 17805164 18033597 18446620 19166888 19569031 19787752 20448355
3428B0448355J38894K07602R39025M57550P86765K2460j86547L43814M14454M68076
3418B4040448M12365Q39842J063929M63407L39463L60036P06749R08278R18030
3409C0052547K86057O96170J337544J231909Q41359R36164J623279J086474J055026
3400C9146529J644539J551601J331342J476087J538910J611255K281636J988269
3392E2570168K299886K136013K506157L045573K874812L955224M110592M413470
3384G7911895M903707N880240N869188O131036O997355P351312P590120P856326
3376A30491179P189687O845457O878542O974173P164881Q037137R051006Q497135
3368A91129197Q021448P648280M902061L147812K822103L070251M352216N171749
$$ plain form
3428 20448355 20587249 20794851 21733876 22191426 22978191 23000651 22814104 23157918 23572372 24040448
3418 24040448 24452813 25292655 26356584 26819991 27159454 27519490 28226239 29134517 30052547
3409 30052547 30338604 31034774 32372318 33604227 34445586 35381750 37005029 38091503 39146529
3400 39146529 40791068 42342669 43674011 45150098 46689008 48300263 50581899 52570168
3392 52570168 54870054 57006067 59512224 62557797 65432609 69387833 73498425 77911895
3384 77911895 82815602 88695842 94565030 100696066 107693421 115044733 122634853 130491179
3376 130491179 137680866 144526323 151404865 158379038 165543919 173581056 182632062 191129197
3368 191129197 199150645 206798925 211700986 214848798 217670901 220741152 225093368 230265117
3360B30265117N026620L060621P98902l110351o746665p644419o450382m959287
3352B10240156l960285l485571l304982m994609p448307r301933r750880q392619
3344A59600970p060819n549905n319392m879646n211078o051202p042948o453538
3336A12032442n537106m266134l630690k653689k083586j551361j007241l50087
3328I0952548k10569l45093k62193o09787m53288p57629m24741p56708j176914
3319H5955626j655291q90481o05806r33311j474326n33032j717550j886646k027444
3310G4231739k001910k051351j999054k218710k729197j932615j359116j784467
3302E8155319j027507r60071j561198j002872q17594m71310j117842q41332k31336
$$ plain form
3360 230265117 235291737 238352358 239151260 236040909 229294244 221649825 215199443 210240156
3352 210240156 206279871 202794300 199489318 194494709 187046402 177744469 167993589 159600970
3344 159600970 152540151 146990246 141670854 136791208 131580130 125528928 118485980 112032442
3336 112032442 106495336 102229202 98598512 95944823 93861237 92309876 91302635 90952548
3328 90952548 90741979 90396886 90134693 89524906 89071618 88313989 87889248 87132540 85955626
3319 85955626 84300335 83409854 82804048 81870737 80396411 79863379 78145829 76259183 74231739
3310 74231739 72229829 70178478 68179424 65960714 63231517 61298902 59939786 58155319
3302 58155319 57127812 56167741 54606543 53603671 52786077 52314767 51196925 50355593 50124257
3293E0124257n25875j122780k61409o54740m08646k40546q03845p89194j001663
3284D4315559q43857m70450j362005q45289j094191j259566j391503j297568j356378
3275C4394752j415123j035341j204380j495818j065160r99280r48185p23280r19861
3266B4588324o22008q21807q24592m77161p97305n13879j40954p11006q50638
3257A8828974m02841j52536m27279m19803n48902l14596J15483J28207l62036
3248A6444671o37514q673k74125l40609L8581r0923J96534l57491k64779q243
3238A4697429m85432p22972l79243j39588k43221m61697q3559n05529o9704O0413
3228A1666897r6423j87331l70672K54564K30096l35307L7539j25170l51418N9006
$$ plain form
3293 50124257 49598382 48475602 48214193 47559453 47150807 46910261 46106416 45317222 44315559
3284 44315559 43471702 43001252 41639247 40793958 39699767 38440201 37048698 35751130 34394752
3275 34394752 32979629 31944288 30739908 29244090 28178930 27179650 26231465 25508185 24588324
3266 24588324 23966316 23144509 22319917 21842756 21045451 20531572 20390618 19679612 18828974
3257 18828974 18426133 18273597 17846318 17426515 16877613 16563017 16678500 16806707 16444671
3248 16444671 15807157 15798484 15524359 15183750 15222331 15131408 15327942 14970451 14705672 14697429
3238 14697429 14211997 13489025 13109782 12970194 12726973 12265276 12181717 11676188 11606484 11666897
3228 11666897 11570474 11383143 11012471 11267035 11497131 11161824 11199363 11074193 10722775 10781781
3218A0781781l04202k9996n27818m91421K26732j09808j56741J42371K229n77404
3208H955723n25495J51524J77950L77891J13016k34629l55012m32166k32489n86164
3198G410149O6127K79169n9012m0428J29100l94058J27869o68391n913J79313
3188G023925l74217l4640l9769R0177l2220r4952j00729k772M78738k1080l23571
3177F568890k72912M37908K71266n72617j9694L34515j39502n51070J00296J49908
3167F306988J12721l47505K59004N7566J5782k08353k14946n4948j48769K04253
3157E981793L15259k51264Q9159J73005K38177j58098l71472p6104l90246J75637
3147E725846J82361j75975K08486L6199k83533N8342L09893k33871l06854K30292
$$ plain form
3218 10781781 10477579 10447583 9919765 9428344 9655076 9545268 9388527 9530898 9533127 8955723
3208 8955723 8430228 8581752 8759702 9137593 9250609 9015980 8660968 8228802 7996313 7410149
3198 7410149 7476276 7755445 7696433 7656005 7785105 7391047 7518916 6850525 6844612 7023925
3188 7023925 6649708 6615068 6575299 6665476 6633256 6538304 6437575 6434803 6913541 6892461 6568890
3177 6568890 6295978 6733886 7005152 6432535 6412841 6747356 6607854 6056784 6157080 6306988
3167 6306988 6419709 6072204 6331208 6388774 6404556 6196203 5981257 5926309 5777540 5981793
3157 5981793 6297052 6045788 6134947 6307952 6546129 6388031 6016559 5940455 5550209 5725846
3147 5725846 5908207 5732232 5940718 5976917 5693384 5751726 6061619 5827748 5520894 5751186
3137E751186O85854j59388k02762J99387M9420k43328J68326J84815l51776o4938
3127F016796M15105P22856k30192k52854N668n3561M95480L4572p9401o3303N74636
3116G585802L39636K4533p7643m47347J35021R6446j68024J93253l40303n7284
3106G284090L34445j58594M86518L8709K4868M95125J33931k12304K00141L62569
3096H989498M1078l30682J19889M66638m50241l72600o313j5323r9020m51261
3086G891663k87951k55891j37585K2379k7070O0496k65381J70036J99555K6562
3076G396813j08256Q0215j3924J57152n9638r5806j08257m5067M455k58460K76254
3065G225481K2800K07973K30745l81448p156K03176m21866M29386N70909Q1509
$$ plain form
3137 5751186 6437040 6277652 6074890 6274277 6323697 6080369 6248695 6433510 6081734 6016796
3127 6016796 6431901 7154757 6924565 6671711 6677379 6623818 7119298 7153870 7074469 7011166 7585802
3116 7585802 7925438 7949971 7872328 7424981 7560002 7656448 7488424 7681677 7341374 7284090
3106 7284090 7618535 7459941 7946459 7985168 8010036 8505161 8639092 8426788 8626929 8989498
3096 8989498 9030576 8699894 8819783 9286421 8836180 8463580 8457267 8441944 8342924 7891663
3086 7891663 7603712 7347821 7210236 7232615 7205545 7266041 7000660 7170696 7370251 7396813
3076 7396813 7288557 7368772 7354848 7512000 7452362 7356556 7248299 7203232 7207687 6949227 7225481
3065 7225481 7248281 7456254 7686999 7305551 7298395 7501571 7079705 7509091 8080000 8161509
3055H161509Q633L98190L61523k72390r2643q232L83596l87081j51423N39313
3045H940995O03937M4547m39404N57548N12929J31301m18983K39322J22641N48809
3035A0843642j37801k45705L9844L97014R1441J8456K98565M8947K14401L42467
3025A1911271L57494K07303J17539k4977L89336L93933P8123Q6589R0254r9684
3015A3507181N2291J072324p0778j26681O19733J85338k23362K46580L3124L2773
3005A5328523J56619L771K43715K58859J66368L80704J63373R0332J19534N96082
2995A7507880J78607K17452O36541L16271P00704N52730P43359L36725O79924
2986B1870193M82091P73140P61974P47356N46588P00571Q65787J035282J035128
$$ plain form
3055 8161509 8170142 8568332 8929855 8657465 8564822 8556590 8940186 8553105 8401682 8940995
3045 8940995 9544932 9589479 9150075 9707623 10220552 10351853 9932870 10172192 10294833 10843642
3035 10843642 10705841 10460136 10499980 10896994 10988435 11006891 11305456 11354403 11568804 11911271
3025 11911271 12268765 12476068 12593607 12568630 12957966 13351899 13430022 13516611 13606865 13507181
3015 13507181 13559472 14631796 14561018 14434337 15054070 15239408 15016046 15262626 15295750 15328523
3005 15328523 15485142 15488913 15732628 15991487 16157855 16538559 16701932 16792264 16911798 17507880
2995 17507880 17686487 17903939 18540480 18856751 19557455 20110185 20853544 21190269 21870193
2986 21870193 22352284 23125424 23887398 24634754 25181342 25881913 26747700 27782982 28818110
2977B8818110J200354J095236J321425J494837J901557J894276K157028J692750
2969D1575573K231705L380532L989138M512612O486510Q830741J0611746J2157612
2961I3776169J2690906J1103330J2293043J0877720J0088704N858173l812340
2954A52875705j6282516k7790866k1268006j3839750j0079930p261879n667652
2947E0685106m214213l477112k580698k134046j584736j483102j277077j318004
2939C2616118j421946j244035j229668k24988n93771o50008m10770n76821n31508
2930B5732603K22780o94854m37637K691M2648r9981l89313J59326r0698O9473
2920B4517038r5063K51975k6788J82323k8012j54017r5059J74494Q9886K82522
$$ plain form
2977 28818110 30018464 31113700 32435125 33929962 35831519 37725795 39882823 41575573
2969 41575573 43807278 47187810 51176948 55689560 62176070 71006811 81618557 93776169
2961 93776169 106467075 117570405 129863448 140741168 150829872 156688045 152875705
2954 152875705 136593189 108802323 87534317 73694567 63614637 56352758 50685106
2947 50685106 46470893 42993781 40413083 38279037 36694301 35211199 33934122 32616118
2939 32616118 31194172 29950137 28720469 28495481 27901710 27251702 26840932 26264111 25732603
2930 25732603 25955383 25260529 24822892 24825583 24868231 24768250 24378937 24538263 24447565 24517038
2920 24517038 24421975 24673950 24647162 24829485 24801473 24647456 24552397 24726891 24816777 25099299
2910B5099299M17147J04031k98758J38859N88727M65741P3179K4729M14128O83042
2900B7710124J09165Q63750J032504M81558L8686K96904R79573Q85662N22012
2891C2919938P98104Q04872P69023P22923P29040P29984R91103J049016J245177
2882D0759180J314316J596637P79770R63430K011049Q90450J098060J573278Q54245
2873E1840415K060896J725431J938181J750773K087713K020572J759466K325355
2865F7508802K104382K223009K117220L003301K713590K491526K216633K655852
2857H7034315K422843K767402K571528K800011L095533K731769L055240L237687
2849A09716328K310287K967134K980034K807346K310377K538046K294935K115133
$$ plain form
2910 25099299 25516446 25620477 25321719 25460578 26049305 26515046 26588225 26612954 27027082 27710124
2900 27710124 27819289 28683039 29715543 30197101 30235787 30532691 31512264 32397926 32919938
2891 32919938 33718042 34522914 35291937 36014860 36743900 37473884 38464987 39514003 40759180
2882 40759180 42073496 43670133 44449903 45413333 47424382 48314832 49412892 50986170 51840415
2873 51840415 53901311 55626742 57564923 59315696 61403409 63423981 65183447 67508802
2865 67508802 69613184 71836193 73953413 76956714 79670304 82161830 84378463 87034315
2857 87034315 89457158 92224560 94796088 97596099 100691632 103423401 106478641 109716328
2849 109716328 112026615 114993749 117973783 120781129 123091506 125629552 127924487 130039620
2841A30039620K164985J851105K026097J682947K083736J835571J250222J075528
2833A44009811R56762N88516J13159K20234r26955r96294j049723j043986j071070
2824A40800454j519080j362548j539700j587495j347832k414266k393958k372379
2816A26263196k420680k379459k642218k709789k468503k714152l413815l074936
2808A04439644k009417k302841l005819k798226k295283k167726k164875k131337
2800H5564120k048526j764585j999925j841525k148970k273690j455563j240477
2792G0790859j645254p89057j219446j537498j181071p91753l07701j256213r12928
2783F1149938r06447m74456o39668j98407q2575k83031o76668l16557o20531n81557
$$ plain form
2841 130039620 132204605 134055710 136081807 137764754 139848490 141684061 142934283 144009811
2833 144009811 144966573 145555089 145668248 145888482 144961527 143965233 142915510 141871524 140800454
2824 140800454 139281374 137918826 136379126 134791631 133443799 131029533 128635575 126263196
2816 126263196 123842516 121463057 118820839 116111050 113642547 110928395 107514580 104439644
2808 104439644 102430227 100127386 97121567 94323341 92028058 89860332 87695457 85564120
2800 85564120 83515594 81751009 79751084 77909559 75760589 73486899 72031336 70790859
2792 70790859 69145605 68356548 67137102 65599604 64418533 63626780 63319079 62062866 61149938
2783 61149938 60243491 59769035 59129367 58930960 58848385 58565354 57888686 57572129 56951598 56370041
2773E6370041K17963r2080k56500n03411j33994j40499K36890q21369J05397L40393
2763E5322831k8935m96099K7342l84057L58946l3784O9024N35608K77149P10950
2753E6358975M21926j86632L21158K05261O19031N56327O79978Q98454Q88157
2744F0762635J161317J268344P82835J217649J462188R98867J700074J912361
2736G1266270K372976J518986J673085K819721K765984K471992L153606L049452
2728I1092072K996964L488543L862847M262352M772112M751403N037961N907727
2720A26171981O310414P122752P870947Q465122R003927J0201969J1166984J2724393
2712A99038489J3022062J3640312J4631487J4908606J4544150J4070779J2233613
$$ plain form
2773 56370041 56588004 56495924 56239424 55736013 55602019 55461520 55698410 54877041 54982438 55322831
2763 55322831 55293896 54797797 54825139 54441082 54800028 54766244 54835268 55370876 55648025 56358975
2753 56358975 56780901 56594269 56915427 57120688 57739719 58296046 58976024 59874478 60762635
2744 60762635 61923952 63192296 63975131 65192780 66654968 67653835 69353909 71266270
2736 71266270 73639246 75158232 76831317 79651038 82417022 84889014 88042620 91092072
2728 91092072 94089036 97577579 101440426 105702778 110474890 115226293 120264254 126171981
2720 126171981 132482395 139605147 147476094 155941216 164945143 175147112 186314096 199038489
2712 199038489 212060551 225700863 240332350 255240956 269785106 283855885 296089498
2705B96089498J1226133R182150O361511M950798J778313M62641j785068k954537
2697C25311439l465979l593886l652747m227769m534329m844733n103352o764057
2689B89124587p843639r166506j0334466j2003478j3115919j3006662j3711625
2682B09942292j3604228j3265349j2559367j1992071j0891877r956697q567616
2675A29105087q192740p270989o623764n793986n047157n022493m426185m050669
2667H2677104l955404l171927l061861k889816k548806k696785k341007j948815
2659F0062683j473001j530531j742933j681487j941168j464587j466952j396507
2651D7365517j164711j494292j281644r83731p89796q81687r12999n18954n41082
$$ plain form
2705 296089498 307315631 316497781 322859292 327810090 329588403 330051044 328265976 325311439
2697 325311439 321845460 318251574 314598827 310371058 305836729 300991996 295888644 289124587
2689 289124587 281280948 272114442 261779976 249776498 236660579 223653917 209942292
2682 209942292 196338064 183072715 170513348 158521277 147629400 137672703 129105087
2675 129105087 120912347 113641358 107017594 101223608 96176451 91153958 86727773 82677104
2667 82677104 78721700 75549773 72487912 69598096 67049290 64352505 62011498 60062683
2659 60062683 58589682 57059151 55316218 53634731 51693563 50228976 48762024 47365517
2651 47365517 46200806 44706514 43424870 42441139 41651343 40769656 39856657 39337703 38796621
2642C8796621r65300j051056j021354n76311Q0808o33183m34307j042080j000317
2633C2153521l16505p85336p94110l2229k17097n39957n9219m65660k52193l14591
2623B8376624l75338l46635K10014m00050k64253m32539m64210J27834j92751
2614B6238696m24245j35342j32266j77711j15885k09649J1658l23468q41605m29097
2604B3461086M27421N843m08110m0464j92153K40252K96826j90230k19216l70392
2594B3010863K6945L096l05981J75974j54118P8564l64836j31303M55488j72335
2584B2622357j10266m46624L3819K73428j23259O8555J83999L1993K84777J87382
2574B3006161m67159K10380L81947j37154k07655J92435K04557M7147O7765N17337
$$ plain form
2642 38796621 37831321 36780265 35758911 35182600 35263408 34630225 34195918 33153838 32153521
2633 32153521 31837016 31051680 30257570 30225341 30008244 29468287 29409068 28943408 28691215 28376624
2623 28376624 28001286 27654651 27864665 27464615 27200362 26767823 26303613 26431447 26238696
2614 26238696 25814451 25679109 25546843 25369132 25253247 25043598 25055256 24731788 23890183 23461086
2604 23461086 23888507 23894350 23486240 23445776 23253623 23493875 23790701 23600471 23381255 23010863
2594 23010863 23037808 23040904 22734923 22910897 22756779 22835343 22470507 22339204 22794692 22622357
2584 22622357 22512091 22065467 22099286 22372714 22249455 22318010 22502009 22534002 22818779 23006161
2574 23006161 22539002 22749382 23131329 22994175 22786520 22978955 23183512 23230659 23298424 23815761
2564B3815761M84906p46N49895J47019M49571J54683M45879L39373p186P14402
2554B7093557N18939O7011L07079L82379O07707K82623L94371N07746N92092L76096
2544C1129600L95603J136093J005173J109910L41235L75499O60245N19647R49310
2535C7622315J264480R38152O73580P64329J168386J132402Q50057J254415J476140
2526D7144256O06288J221528J389492J410652J301295R09008Q31301J204671J303411
2517E7321902J436870K022764J440109J462010J344717J037238J734325K104412
2509F9904347J722912J999554K125338J880975J847506J767777K009341K553611
2501H5811361K617168K070606K523399K428710L123751L344898L604423L940790
$$ plain form
2564 23815761 24300667 24299921 24849816 24996835 25446406 25601089 26046968 26386341 26379155 27093557
2554 27093557 27612496 27679507 27986586 28368965 28976672 29259295 29653666 30161412 30753504 31129600
2544 31129600 31525203 32661296 33666469 34776379 35117614 35493113 36153358 36673005 37622315
2535 37622315 38886795 39824947 40498527 41262856 42431242 43563644 44413701 45668116 47144256
2526 47144256 47750544 48972072 50361564 51772216 53073511 53982519 54813820 56018491 57321902
2517 57321902 58758772 60781536 62221645 63683655 65028372 66065610 67799935 69904347
2509 69904347 71627259 73626813 75752151 77633126 79480632 81248409 83257750 85811361
2501 85811361 88428529 90499135 93022534 95451244 98574995 101919893 105524316 109465106
2493A09465106L891140M319248N006843M637052N192755N421697O357043O861671
2485A51152555P261158P864533P969256Q079756Q507149R014761Q582806P993456
2477B16425430P941229P482797P249030O922424N533808N563557N423790N434583
2469B67976648M796051M674295M386091M762394L957714K655957J614019N48806
2461B95371975j153602k315832l470617m688589n717977p040021p669401o866081
2453B56449855p736119p665620p854464p991316p863643p682871p641089p669985
2445A94344748q702366q336623q611018q661975q580654q375837p701759p892714
2437A27481802p517427o898322o275538n913009n622382m745545m196188m254975
$$ plain form
2493 109465106 113356246 117675494 122682337 127319389 132512144 137933841 144290884 151152555
2485 151152555 158413713 166278246 174247502 182327258 190834407 199849168 208431974 216425430
2477 216425430 224366659 231849456 239098486 246020910 251554718 257118275 262542065 267976648
2469 267976648 272772699 277446994 281833085 286595479 290553193 293209150 294823169 295371975
2461 295371975 294218373 291902541 288431924 283743335 278025358 270985337 263315936 256449855
2453 256449855 248713736 241048116 233193652 225202336 217338693 209655822 202014733 194344748
2445 194344748 185642382 177305759 168694741 160032766 151452112 143076275 135374516 127481802
2437 127481802 119964375 113066053 106790515 100877506 95255124 90509579 86313391 82058416
2429H2058416l545612l475311k886869l025610k398451k649543k524742k097161
2421E9455117j430728j718779k157089k392182j536523j194336j437295j680656
2413D5907529j228456j074853j084370o92872j242558j231057q33501o47643r45931
2404C6926288o65059m00134j272005q08189l67430o08072l43693j301166j079494
2395C0081046o13235n15326n48485p06693q10171n15563l76977l59287m63884
2386B5171425o37528j04479m18909n14488n80395n46733l88278j01437o53589
2377B1225589o55812o86529o94847m53585k30923l26949m25671o85097m80290
2368A6585886m31757j64729J05777n67802o78347j4143m61145k07761l80514p65372
$$ plain form
2429 82058416 78512804 75037493 72150624 69125014 66726563 64077020 61552278 59455117
2421 59455117 58024389 56305610 54148521 51756339 50219816 49025480 47588185 45907529
2413 45907529 44679073 43604220 42519850 41826978 40584420 39353363 38519862 37872219 36926288
2404 36926288 36261229 35861095 34589090 33780901 33413471 32805399 32461706 31160540 30081046
2395 30081046 29467811 28952485 28404000 27697307 26887136 26371573 25994596 25635309 25171425
2386 25171425 24533897 24429418 24010509 23496021 22915626 22368893 21980615 21879178 21225589
2377 21225589 20569777 19883248 19188401 18734816 18503893 18176944 17751273 17066176 16585886
2368 16585886 16154129 15989400 16095177 15527375 14849028 14834885 14373740 14165979 13785465 13020093
2358A3020093k47791l6399m4702m88538k62839l78270k08039n43003m1469P9602
2348A0848645j15730k45388l5635J21086q29835j54481l12134m22922L19691l55554
2338H817743k23371K52496J77669n11392k60541m14103j9203K71957l80419O2405
2328G773241O9038r1457M129q8364j0764j450m2601l17001Q6882N3375j09004
2317G326024l85038M1158j30971K5922j73998n72261n10803r6502N02943q0560
2307E945914j50590j69052m44359K43547K35315r9735M13737k25883j26536l64321
2297E258037k45828j54123J31589L19833k95592N0203p5110l44308l42830J29454
2287D431325Q5753k19302O14837k02756P0495n9136l76776L98264n51634J16527
$$ plain form
2358 13020093 12772302 12735903 12691201 12202663 11939824 11561554 11353515 10810512 10769043 10848645
2348 10848645 10732915 10487527 10451892 10572978 9743143 9588662 9276528 8853606 9173297 8817743
2338 8817743 8594372 8846868 9024537 8513145 8252604 7838501 7819298 8091255 7710836 7773241
2328 7773241 7842279 7750822 7754951 7666587 7655823 7654373 7611772 7294771 7381653 7435028 7326024
2317 7326024 6940986 6982144 6851173 6877095 6703097 6130836 5620033 5523531 6026474 5945914
2307 5945914 5795324 5626272 5181913 5425460 5660775 5561040 5974777 5748894 5622358 5258037
2297 5258037 5012209 4858086 4989675 5309508 5013916 5064119 4989009 4644701 4301871 4431325
2287 4431325 4517078 4297776 4912613 4709857 4780352 4721216 4344440 4742704 4191070 4307597
2277D307597J20564l17103l3879J94526K59876O7182n47459j90434R5810m53540
2267C503140K83424L67490k1601m2455K47085K04607O8416l38673m26534k28939
2257C615960k79657J29981j46425k1096K89179J25079J91263P9506k26513j94302
2247C562975N49211N8802k83512J4424j43478N1110L81325J82084l24815n5402
2237C992724q3236N6929L88717j24459l6997J75553m664k19420J81213M79512
2227D805872J42448l6750L4428n41516r3346K47602m1927j67879k67386J48731
2217D230277j0357m66259L02673J1756K88556N8918l57435k05364k83333j20864
2207C448568J49771r4793N42891M13874k36036l54730O0968M16389Q512L44435
$$ plain form
2277 4307597 4428161 4111058 4077179 4271705 4531581 4598763 4051304 3860870 3956680 3503140
2267 3503140 3786564 4154054 4132453 4089998 4337083 4541690 4610106 4271433 3844899 3615960
2257 3615960 3336303 3466284 3319859 3298763 3587942 3713021 3904284 3983790 3757277 3562975
2247 3562975 4112186 4170988 3887476 3901900 3758422 3809532 4190857 4372941 4048126 3992724
2237 3992724 3909488 3966417 4355134 4230675 4193678 4369231 4364567 4145147 4326360 4805872
2227 4805872 4948320 4911570 4945998 4404482 4311136 4558738 4516811 4348932 4081546 4230277
2217 4230277 4219920 3753661 4056334 4068090 4356646 4415564 4058129 3852765 3569432 3448568
2207 3448568 3598339 3503546 4046437 4460311 4224275 3869545 3930513 4346902 4355414 4699849
2197D699849k34917J45036J45261Q7513m5709M50119n63917j82925J58553K5146
2187D684009J71943n17400p4844J64972K19633L95668K11634K42628J55908n7199
2177E596952j49982j35847J73911M88727K48380O2195q8895j14393O9001L88670
2167F538719o0941N06477M46267K01107J01041k57484K05450j22017M45477K68531
2157H272627K4224r3859K88781M6817j29205K39033r46J25185O63507m3777K41677
2146I634064K44654l120J39875O53425M52698q9205R119L00341O82183M33058
2136A2457092M720O757L05250k17160j40098p61386n74765p30020k06520l69114
2126I774756m44103q7454o01700k26297m94177K09764j71300k45661J3981m7025
$$ plain form
2197 4699849 4464932 4609968 4755229 4842742 4797033 5247152 4683235 4500310 4658863 4684009
2187 4684009 4855952 4338552 4263708 4428680 4648313 5043981 5255615 5498243 5654151 5596952
2177 5596952 5446970 5311123 5485034 5973761 6222141 6284336 6195441 6081048 6150049 6538719
2167 6538719 6477778 6984255 7430522 7631629 7732670 7475186 7680636 7558619 8004096 8272627
2157 8272627 8296851 8202992 8491773 8538590 8409385 8648418 8647472 8772657 9436164 9392387 9634064
2146 9634064 9878718 9875598 10015473 10668898 11121596 11032391 11041510 11341851 12024034 12457092
2136 12457092 12461812 12468569 12773819 12556659 12416561 11655175 11080410 10350390 10143870 9774756
2126 9774756 9330653 9243199 8641499 8415202 7921025 8130789 7959489 7713828 7727809 7680784
2116G680784J75484j42101m25159m99501K90905L32579k82631p41391l85873R0738
2106F093834r9762M9063M16647k6923J61686k53216n00625J84909j92397K64730
2096F097946M44980m75396j39076M11781j14037l54755j61728N41043O73084l1438
2086F892404r2165k13291J17772J62280J6393l15161L57610Q1133k57339M4884
2076F794520J55020j84281k72964N0711j729J33852J80783K49812o50982k25493
2066F229249J04333k0904n5360k72654j51760K68071k97094K83447k72434n0574
2056E764320l56887R2480M10477l16189R4244K70487J34627M20418L9960k46587
2046F307350K83784J43972L24629j46177k08719p3456o42224O4149k01380l55957
$$ plain form
2116 7680784 7856268 7714167 7289008 6789507 7080412 7412991 7130360 6388969 6003096 6093834
2106 6093834 5994072 6043135 6459782 6432859 6594545 6341329 5840704 6025613 5833216 6097946
2096 6097946 6542926 6067530 5928454 6340235 6226198 5871443 5709715 6250758 6923842 6892404
2086 6892404 6800239 6586948 6704720 6867000 6883393 6568232 6925842 7006975 6749636 6794520
2076 6794520 6949540 6765259 6492295 6543006 6541277 6675129 6855912 7105724 6454742 6229249
2066 6229249 6333582 6312678 6257318 5984664 5832904 6100975 5803881 6087328 5814894 5764320
2056 5764320 5407433 5499913 5910390 5594201 5688445 5958932 6093559 6513977 6553937 6307350
2046 6307350 6591134 6735106 7059735 6913558 6704839 6631383 5989159 6053308 5851928 5495971
2036E495971l4308k65061P5451j78762l12505j95121K92520k42528L77535n82168
2026D431024K49113P7985p8739K1176j52801L15372K19087n59562n9169k8027
2016D435459j98947n07130n4910j39722k08832L79617L3449k50091n46224L14825
2006C257494K67628R0666m75986P7169J85401R7288m01730m7724K88867P457j68211
1995C178319K27427K5158J08142j37482m17731k72843K60300J44425K41758k9588
1985C327885k61623O7266k03762l05986K84604K7420m50177K30601K63496j65860
1975B813864K93770L60908l22983j34347L25392M6828M4499J56906j11053L56366
1965C830150J38129n686o20089O1792J9891j10927J86246K62041K47905n76470
$$ plain form
2036 5495971 5461663 5196602 5272053 5093291 4780786 4585665 4878185 4635657 5013192 4431024
2026 4431024 4680137 4758122 4679383 4700559 4547758 4863130 5082217 4522655 4463486 4435459
2016 4435459 4236512 3729382 3674472 3534750 3325918 3705535 3738984 3488893 2942669 3257494
2006 3257494 3525122 3615788 3139802 3216971 3402372 3499660 3097930 3050206 3339073 3346530 3178319
1995 3178319 3405746 3430904 3539046 3401564 2983833 2710990 2971290 3115715 3357473 3327885
1985 3327885 3066262 3133528 2929766 2623780 2908384 2935804 2485627 2716228 2979724 2813864
1975 2813864 3107634 3468542 3145559 3011212 3336604 3383432 3427931 3584837 3473784 3830150
1965 3830150 3968279 3962593 3342504 3404296 3424187 3313260 3499506 3761547 4009452 3432982
1955C432982M43574p0367q1367N29357J76649M71839N1959m21750k71271j47680
1945D113925J24814k75743m17475J14935m4171j38321m7214k1474l35042L1374
1935C105608P1263r1414j44324j3444N4382k27037J36811K9101M7973J1658k87472
1924B693105o56684J71137O4640P9945J36480O0798K9409j94063k32655L57031
1914B509143M35870k58919m13514l97591J55466N74272J58747o8801j66820m17823
1904B110030k85136J67417M59007n5986J44860L0773K18786k87828j69449m00391
1894A932083r8059k0453K44609J07220J33799k50645j53766J3040l3503K06451
1884B080776K94967m51684n43782L6332K76950P0795j17318K84650l14555P9530
$$ plain form
1955 3432982 3876556 3806189 3724822 4254179 4430828 4902667 4954626 4532876 4261605 4113925
1945 4113925 4238739 3962996 3545521 3660456 3616285 3477964 3430750 3409276 3074234 3105608
1935 3105608 3176871 3085457 2941133 2927689 2982071 2755034 2891845 2920946 2968919 2980577 2693105
1924 2693105 2036421 2207558 2272198 2352143 2488623 2549421 2578830 2384767 2152112 2509143
1914 2509143 2945013 2686094 2272580 1874989 2030455 2604727 2763474 2694673 2527853 2110030
1904 2110030 1824894 1992311 2451318 2395332 2540192 2570965 2789751 2501923 2332474 1932083
1894 1932083 1834024 1813571 2058180 2165400 2299199 2048554 1894788 1907828 1874325 2080776
1884 2080776 2375743 1924059 1380277 1416609 1693559 1764354 1647036 1931686 1617131 1696661
1874A696661M79133k66241j03577N6426J21297J08924n9159J09501k56694p7559
1864A808712K61422J24476k98969J60245P561M93762k65693k64431k90257J48607
1854A885435K1598K49832m2001k88137l87682l63893P19252L74018j99517j59997
1844A808908j56292J65330j67634K04651J92717j24714L06825K10407j70691l21458
1834A948049p5892k69757P07355r1270k494J58225n0963l94992J41912O9156J42650
1823B281979k25555o2693K52475J95130J18653l81439J21935J68509k09359J36460
1813B396095J03266j88021K95445l0423k38565j12321J28453j00850j75195P41906
1803B819790n5359m06348m35272l5954Q36993m10547O2971M0525j39458L62181
$$ plain form
1874 1696661 2175794 1909553 1805976 1862402 1983699 2092623 2033464 2142965 1886271 1808712
1864 1808712 2070134 2194610 1895641 2055886 2063447 2557209 2291516 2027085 1736828 1885435
1854 1885435 1907033 2156865 2114864 1826727 1439045 1075152 1794404 2168422 1968905 1808908
1844 1808908 1652616 1817946 1650312 1854963 2047680 1922966 2229791 2440198 2269507 1948049
1834 1948049 1872157 1602400 2309755 2218485 2215991 2374216 2323253 1928261 2070173 2139329 2281979
1823 2281979 2056424 1993731 2246206 2441336 2559989 2178550 2300485 2468994 2259635 2396095
1813 2396095 2499361 2311340 2606785 2576362 2337797 2225476 2353929 2253079 2077884 2819790
1803 2819790 2764431 2358083 1922811 1886857 2723850 2313303 2376274 2416799 2277341 2639522
1793B639522k30624j73995j18116j98084P7687N21501L29736M73345K10229n04460
1783C026741j09280J65980O082l07894j93034O45277K80023k18456j37995j22215
1773C035229N8086l52934J65804K79474L65902K88972j89528j31891k8323j63517
1763C327274m49678j28823P93449j75779r68010m05909n433K65667K47009M00969
1753B900736R1216k34373R7620J52447l40090l23449K30458p9978N9119J18185
1743B671891L59117l505k22559l9051k30629k29183N28213k75961J42907q4747
1733B616493m9530o3514j35623J12955j69759M16403R917m3032l1566m86910L2900
1722B208734L04952J35289P0341k26128o8899k28713L41328k05089k51874L63141
$$ plain form
1793 2639522 2408898 2234903 2116787 1918703 1996390 2517891 2847627 3320972 3531201 3026741
1783 3026741 2917461 3083441 3089523 2781629 2588595 3233872 3513895 3295439 3157444 3035229
1773 3035229 3093315 2740381 2906185 3185659 3551561 3840533 3651005 3519114 3490791 3327274
1763 3327274 2877596 2748773 3542222 3366443 2398433 1992524 1987091 2252758 2499767 2900736
1753 2900736 2991952 2757579 2855199 3007646 2667556 2344107 2574565 2494587 2553706 2671891
1743 2671891 3031008 3027503 2804944 2765893 2535264 2306081 2834294 2558333 2701240 2616493
1733 2616493 2566963 2503449 2367826 2480781 2311022 2727425 2737342 2694310 2662744 2175834 2208734
1722 2208734 2513686 2648975 2719316 2493188 2424289 2195576 2536904 2331815 2079941 2443082
1712B443082K04046l66872m02488j33569j05498J95339K89007l49136K00503l03452
1702A670962N791N8035j64795M22677k90786m63928K18138J16251K96909J26778
1692A996032L5644j90241K40214n5130l40642j23298J45124K1480j96366M06327
1682A939144l79476k35488P246o3238j89226M11652r3494j8305L10817q3564K64434
1671A870502p1639m02559l51973L73020K54177m25989J39966K33650n1873l01857
1661A265425k6476L31157j99459m67180p6999j09786J87051j58768l47015M05570
1651H03520J01335M16489j18310Q8570k74921k15635L95900r2282R1693m10856
1641G85503q7706O30178k07195k85710l19312L36514L70421n10955k8621N12127
$$ plain form
1712 2443082 2647128 2280256 1877768 1744199 1638701 1834040 2123047 1773911 1974414 1670962
1702 1670962 1676753 1734788 1569993 1992670 1701884 1237956 1456094 1572345 1869254 1996032
1692 1996032 2031676 1841435 2081649 2026519 1685877 1562579 1707703 1729183 1532817 1939144
1682 1939144 1559668 1324180 1331426 1268188 1078962 1490614 1397120 1378815 1689632 1606068 1870502
1671 1870502 1798863 1396304 1044331 1417351 1671528 1245539 1385505 1619155 1567282 1265425
1661 1265425 1238949 1570106 1370647 903467 826468 716682 903733 744965 397950 803520
1651 803520 904855 1321344 1203034 1291604 1016683 801048 1196948 1104666 1196359 785503
1641 785503 697797 1327975 1120780 835070 515758 852272 1222693 711738 683117 1195244
1631A195244k81238n277J1474l13429L7309r7504K63959J55022L38593r4535n10454
1620F99164l96089M27828q5736J81547J48313J16064l22956j13031M34996k8403
1610A061697L22957j87373l09517j39380j85279m4493j76353m9740M43938J85438
1600I21895j48089J05518k08375k57811R5599j96243J54791R5975K78639q1480
1590G60419r7688o19327j17660J75418j99866p7561N51044M6208K97108l3803
1580F84292l31250J29647k56097J59436j04853l59009q2216M39957o9477k05812
1570D618k88995L60192L8401n24839M01741j99600K5726K66651M63894p8738R212
1559D78263Q291l63457J6676l90907K66316L30010n15542m0247N83191k49506
$$ plain form
1631 1195244 914006 908729 920203 606774 644083 546579 810538 965560 1304153 1209618 699164
1620 699164 303075 730903 645167 826714 975027 1091091 768135 655104 1090100 1061697
1610 1061697 1384654 1197281 887764 748384 563105 518612 342259 292519 736457 921895
1600 921895 773806 879324 670949 413138 508737 312494 467285 563260 841899 760419
1590 760419 662731 43404 -74256 101162 -98704 -176265 374779 420987 718095 684292
1580 684292 353042 482689 226592 386028 281175 -77834 -160050 279907 210430 4618
1570 4618 -284377 75815 114216 -410623 -8882 -208482 -182756 83895 547789 469051 478263
1559 478263 486554 123097 139773 -251134 15182 345192 -170350 -210597 372594 123088
1549A23088L3023N1755J7010k04747K22049q9703j94343K56539j06614L36918
1539D44975r9977l53966N45104k40859j33445l97196K31231J14788K37506j11045
1529B37116j00220M41755o651j85314j8124Q114j7491K04405o5729k35145j37518
1518A25198l2910M11358R9479j68315m009n39784R3896J38111K22365J85060p7737
1507D52712j21305l848k66400k62377O2561m0838K30291k20839J95309l980J09732
1496A31018k13643k28194k9653N28824M5154r9936M52181M32256n94732n28843
1486a05568K09323J48655J25280q6013J04612k08012j70999j00100O07416k22713
1476C01881l09135M157J59964J70722k97620k56457J3516L39510j85492l56863
$$ plain form
1549 123088 156111 207866 224876 20129 242178 152475 -41868 214671 108057 444975
1539 444975 344998 -8968 536136 295277 161832 -235364 -4133 110655 348161 237116
1529 237116 136896 578651 572000 386686 368562 376676 359185 563590 497861 262716 125198
1518 125198 92288 503646 603125 434810 430801 -108983 -15087 123024 345389 530449 452712
1507 452712 331407 327559 61159 -201218 -138657 -179495 50796 -170043 25266 21286 131018
1496 131018 -82625 -310819 -340472 188352 233506 133570 585751 1018007 423275 -105568
1486 -105568 103755 252410 377690 291677 396289 188277 17278 -82822 524594 301881
1476 301881 -7254 -3097 156867 327589 29969 -226488 -212972 126538 -58954 -415817
1466d15817J62544M1638L84249k96021J07239j97971K82345m0623J01519P6763
1456B05865l82706J42048M09542j75975k26083j84513l0937j43834j22193N50263
1446D1477J21926l9028Q0981k17629J57676J78861L7480P4147R4020j08395K47685
1435F69201r8626k67190J37401m1263m07074K49819L509k1337K85330o6456K0562
1424D63876j51323M8806j53259j12704J17821J08996r5213J67350j81288j06593
1414A06469J59570k30044L86442J98598k16896M2526j92843k44676K94876L6325
1404C40347m15436J17435L14993j34138K0413J23969N8810k43526j70726K61524
1394B73665J73144l5104l23362K13662k71867j28382j19131K09684O78255P2141
$$ plain form
1466 -415817 -253273 -211635 172614 -123407 -16168 -214139 68206 27583 129102 205865
1456 205865 -176841 -34793 374749 198774 -27309 -211822 -242759 -386593 -508786 41477
1446 41477 163403 124375 205356 -12273 145403 324264 361744 435891 529911 421516 669201
1435 669201 570575 303385 440786 399523 -7551 242268 245777 224440 509770 443314 463876
1424 463876 312553 361359 208100 95396 213217 322213 227000 394350 213062 106469
1414 106469 266039 35995 422437 621035 404139 446665 253822 9146 304022 340347
1404 340347 -75089 42346 357339 223201 243614 367583 426393 182867 12141 273665
1394 273665 446809 411705 88343 302005 30138 -98244 -217375 -7691 670564 742705
1384G42705m13054j70796K42039Q7060l9510m59526j37725K01083K66660k35329
1374H3607k28626n6317L56798J71980l63207O9744J1665j21144m5030j37635n0049
1363c08214O87422j35186j51735K7487j18991J722J12276o20013M97054j1540
1353a9718L03012k47377m61668O90475J23118k89096L8543j14382m503o6621M6293
1342a924J32522J6485k55186l41382M65372k3557m5059J59614L50771n2927k59894
1331A44835m0406r0309J11762K47678l08084R5172M59682p3344K60926j75761
1321F32151J37819j83833k75054P272l39328K54428K06172m64796N5656J54476
1311A84963j48793r4134N4329k85202q2978L42556p4602p3982L49526M26459k29715
$$ plain form
1384 742705 329651 158855 400894 487954 448444 -11082 -148807 52276 318936 83607
1374 83607 -145019 -201336 155462 327442 -35765 33979 45644 -75500 -120530 -258165 -308214
1363 -308214 379208 244022 92287 119774 783 2505 114781 -505232 -8178 -19718
1353 -19718 283294 35917 -425751 264724 387842 98746 137289 22907 18404 -48217 -1924
1342 -1924 130598 147083 -108103 -449485 15887 -7670 -52729 106885 457656 404729 144835
1331 144835 104429 14120 125882 373560 65476 160648 620330 546986 807912 632151
1321 632151 769970 586137 311083 318355 -20973 233455 439627 -25169 30487 184963
1311 184963 36170 -57964 -3635 -288837 -371815 -29259 -103861 -177843 171683 598142 368427
1300C68427q4301l58230L95989j05753l10083J87503k91918J08285j00077K50683
1290F0525M84712m20462o54781J99077J24235k9532j51248L22518N58245o06094
1280a12805J16034o199J39849m3465l99400l11457M62575l6524q4748J42462Q531
1269a25147m04784k48272K98294Q0401k2180K03617K98349R1488L2033m1272J88487
1258C51014K75359R4467j30458q98742J58828L39337o033K16809l32516J47432
1248B15497J14985n6792j9238k03735Q2540o04242L42271N39765l13770K23348
1238C20629k04741K97607j03861k07427M14625j3927k17145K78862J38232K30989
1228I33843M8501l54620L59862J59582o42807j1503J32486M1066l19055k80261
$$ plain form
1300 368427 284126 -74104 321885 216132 -93951 93552 -198366 -90081 -190158 60525
1290 60525 545237 124775 -530006 -330929 -206694 -236226 -387474 -64956 493289 -112805
1280 -112805 3229 -2970 136879 93414 -305986 -617443 -154868 -191392 -276140 -133678 -125147
1269 -125147 -529931 -778203 -479909 -399508 -421688 -218071 80278 171766 203799 162527 351014
1258 351014 626373 720840 590382 -308360 -149532 189805 183772 400581 68065 215497
1248 215497 330482 273690 254452 50717 133257 -470985 -128714 411051 97281 320629
1238 320629 115888 413495 309634 102207 516832 502905 285760 564622 702854 933843
1228 933843 982344 627724 987586 1147168 504361 492858 625344 666410 347355 67094
1218F7094K61015M44027j38785j01547l23496J15275p1633j43239J39426l1149
1208B16988p5996o3363k12025P0959K32598q2413K82681K46056n3796m96469k60812
1197a95592m13582K76257N01943J23897J33943j23038m17716J36479K29115j28681
1187A23025L75210L1958p59609j5527K03390o8711l00624N56738l05065j02289
1177b61504K53746j22130j82115L40962K61544j68940o15124j30619Q7447N47913
1167A1180m381J55286L69662j65259P5747j84464K21705l68918R825j824P9167
1156A97726L42216K91766q3843l20182j12426L9728q1636J3094k16266K7250r9838
1145b411Q2002N62755k50316k74974O6673j36971m6624M8216K91486J99117j36060
$$ plain form
1218 67094 328109 772136 633351 531804 208308 323583 251950 108711 248137 216988
1208 216988 140992 77629 -134396 -63437 169161 86748 369429 615485 561689 65220 -195592
1197 -195592 -609174 -332917 169026 292923 426866 303828 -113888 22591 251706 123025
1187 123025 498235 530193 -229416 -244943 -41553 -110264 -410888 145850 -159215 -261504
1177 -261504 -7758 -129888 -312003 28959 290503 121563 -493561 -624180 -536733 11180
1167 11180 6799 162085 531747 366488 442235 257771 479476 110558 120383 118559 197726
1156 197726 539942 831708 747865 427683 315257 354985 273349 286443 70177 97427 -2411
1145 -2411 79591 642346 392030 117056 183729 46758 134 48350 339836 538953 402893
1134D02893n40331K48858j57533J252j78020L7245J76226O2530k1816p0426L9679
1123E57N07767j12059L86793L87416m74232n77623J83832R5816K43450l67316
1113B74401j03558N72589K38276k93035l1043N02029l84421J69725j66111Q9362
1103H68214q0249k37298j25551l01054N00730m4613j75694K22485R9748p8630
1093F48088K14565j86703l00291L49455k73692r2251M37356p8291j38211K20075
1083H00100J51688r3356o0050N7539j65019j61829k9663K54925J06139J10653
1073I71127K38552l15665k47034j531M23792p876k8886L90560l18445j22859q1318
1062I00417L21857j7796q5486K06705l03105L15000J21266j23243J08988l81269
$$ plain form
1134 402893 -137438 111420 -46113 -44861 -222881 -185636 -9410 53120 31304 -39122 557
1123 557 508324 396265 783058 1170474 696242 118619 302451 398267 641717 274401
1113 274401 170843 743432 981708 688673 657630 1159659 775238 944963 778852 868214
1103 868214 787965 550667 425116 124062 624792 580179 404485 626970 726718 648088
1093 648088 862653 675950 375659 725114 451422 359171 796527 718236 580025 800100
1083 800100 951788 858432 798382 855921 690902 529073 499410 754335 860474 971127
1073 971127 1209679 894014 646980 645449 1069241 1061365 1032479 1423039 1104594 981735 900417
1062 900417 1222274 1204478 1118992 1325697 1022592 1337592 1458858 1335615 1444603 1063334
1052A063334L93287k53282l6693M73174M94691m63100N2600k58866o2143R6970
1042A499972K76070K8370N6475Q3640k12095J02020N0754j64200J00474Q9715
1032A911195K1692J64333K85893J80255K68696n30219J86133o5943m51344J65502
1022B136193J12038M41608p3147k3151j38920L46341M399M31654K51705M69152
1012C957872k47920j35676M36075j65815j37497m42000J7565J87661M30736J02737
1002D003738j87545R7373p6037L86025O69817j67230q6195O32796K18488o917
992E484313k33789N46657J65684L19585K18587P3710q8916M06378M27999J13451
982G433659L52999Q01504q5508J55000Q32648M07240K76250Q01767N99868L90832
$$ plain form
1052 1063334 1456621 1203339 1166646 1639820 2134511 1671411 1724011 1465145 1403002 1499972
1042 1499972 1776042 1804412 1860887 1944527 1732432 1834452 1885206 1721006 1821480 1911195
1032 1911195 1932887 2097220 2383113 2563368 2832064 2301845 2487978 2422035 1970691 2136193
1022 2136193 2248231 2689839 2616692 2593541 2454621 2800962 2805361 3237015 3488720 3957872
1012 3957872 3709952 3574276 4010351 3844536 3707039 3265039 3282604 3470265 3901001 4003738
1002 4003738 3816193 3913566 3837529 4223554 4893371 4726141 4639946 5272742 5491230 5484313
992 5484313 5250524 5797181 5962865 6282450 6501037 6574747 6485831 6892209 7320208 7433659
982 7433659 7786658 8588162 8502654 8657654 9490302 9897542 10173792 10975559 11575427 11966259
972A1966259M82677N14314P67440R72249J50755N60687J331354Q74600J319705
963A8940040J141919J138954J385255J561357J417553J448546J763805J983356
955C0780785J643649J821731L097599M128242N011544O690448Q680453J0883869
947G2738320J1498412J1193580J0359739J0070117R252634Q321010J261069q819470
939A25875411k1223752k2906340j5477067j0825797p985053o220979m222920l916255
931C3097248k962571k127010j868568j888208j366977q00487j010063r50226j797931
922A8325207j839614o10153n19363j354970j168886m09168j025966p24119O1830
913A0734798m47919q34265m08106j08467j66067K4717j53368p59397m03127j027256
$$ plain form
972 11966259 12448936 12963250 13730690 14702939 14853694 15414381 16745735 17620335 18940040
963 18940040 20081959 21220913 22606168 24167525 25585078 27033624 28797429 30780785
955 30780785 32424434 34246165 37343764 41472006 46483550 53173998 61854451 72738320
947 72738320 84236732 95430312 105790051 115860168 125112802 133433812 134694881 125875411
939 125875411 104651659 81745319 66268252 55442455 47457402 41236423 37013503 33097248
931 33097248 30134677 28007667 26139099 24250891 22883914 22083427 21073364 20123138 18325207
922 18325207 16485593 15875440 15356077 14001107 12832221 12423053 11397087 10672968 10734798
913 10734798 10286879 9452614 9044508 8936041 8769974 8794691 8641323 7881926 7478799 6451543
903F451543m33899K22475j11418n65230J5116l21169j00407j45233l04553k9057
893D678168M4259r997k88778l12282q4099m16174K24641K94540k70591o62777
883C196910k40714K83505j33835l18539J3231M02751L26997k61092p41062k42938
873B285214P1233J3145J68501n27820o575L33960J5473K00197n50072m2866J98763
862B159153k31188m06908j48572O78172L09051K3816o35928L1176K9272o2792
852A745252J9025k01417j21155l01730J99861L71225q8441l59301K844L57817
842A623980K22793m35873k58214j41266N795J90309k47522K95229j80276l54956
832G19999L32595L84372N95l38086l1983Q8846J2586o62627m85148R8096M82944
$$ plain form
903 6451543 6017644 6240119 6128701 5563471 5578587 5257418 5157011 5011778 4707225 4678168
893 4678168 4722427 4712430 4423652 4111370 4027271 3611097 3835738 4130278 3859687 3196910
883 3196910 2956196 3239701 3105866 2787327 2800558 3203309 3530306 3269214 2528152 2285214
873 2285214 2356447 2369592 2538093 2010273 2003698 2337658 2353131 2553328 2003256 1960390 2159153
862 2159153 1927965 1521057 1372485 2050657 2359708 2383524 1747596 1778772 1808044 1745252
852 1745252 1764277 1562860 1441705 1139975 1339836 1711061 1622620 1263319 1266163 1623980
842 1623980 1846773 1410900 1152686 1011420 1017215 1207524 960002 1255231 1074955 719999
832 719999 1052594 1436966 1437561 1099475 1067492 1156338 1168924 506297 21149 119245 602189
821F02189N415P4326p8233K74513P2054K41393J75798o29061l15862K55562o9765
810F08329M52776j2308m43728k13528M835N88323l5117K3909q0397o70710J28128
799C50512J56459L3755o1884J64651k8186l16042k47320M7670K48085p354J21096
788D61442N8274N1237K19245r803m14576r0693J52668o17464l9448K45533J27205
777A43620m52167n22936P84983K29779l45435K8989k92563M64777N08678l24631
767B23094N3718J26240n2147j39523k12811M2584P845r8789m01355L40794j47972
756b58322q8499K3066m6541O6889j41294J18792J86709K5046m33331j3381L28067
745b32799O54441j73242k2531m75016o4537M14935l91088j98347L80603J36421
$$ plain form
821 602189 607604 681930 603697 878210 950264 1191657 1367455 738394 422532 678094 608329
810 608329 1061105 1048797 605069 391541 396376 984699 949582 973491 893094 222384 350512
799 350512 506971 540726 478842 643493 615307 299265 51945 99615 347700 340346 461442
788 461442 519716 570953 790198 780395 365819 275126 427794 -189670 -229118 16415 143620
777 143620 -308547 -831483 -46500 183279 -162156 -133167 -425730 39047 547725 223094
767 223094 276812 403052 350905 211382 -1429 41155 49000 -49789 -451144 -110350 -258322
756 -258322 -346821 -323755 -370296 -303407 -444701 -325909 -139200 -114154 -547485 -560866 -232799
745 -232799 421642 248400 225869 -249147 -313684 101251 -289837 -488184 -107581 28840
735B8840N11942p651n52813M5569L29083J08291j94994k9762k04826j7743l0193
724a4257L09344o5255K82187k94978n94393J56146K53751J32742m66527J9706
714b81534J86564k46501l7816L87148k18132J40372k0466n1939m5887l32156L27352
703a92995K09865L91953p6829l93716J03002J20842J08371q868k09346n3475K69145
692B67949k93878k79905P0799N15133j80837K9634n5974j71849J20954L36988
682C59014l47520k78562p0714J14442j55279Q6866N48409J49708n86671r2181
672b72488J50271K70470J53615Q485k44378j61463K35498J97208j55222r9897
662H2099J84084n3534J10601k5657l89342J25220K43474j16283O5268L70108l2924
$$ plain form
735 28840 540782 533131 -19682 25887 354970 463261 268267 238505 33679 15936 -14257
724 -14257 295087 229832 512019 217041 -377352 -221206 32545 165287 -301240 -281534
714 -281534 -94970 -341471 -379287 7861 -210271 -69899 -90365 -142304 -188191 -520347 -192995
703 -192995 16870 408823 331994 -61722 41280 162122 270493 261625 52279 -1196 267949
692 267949 -25929 -305834 -235035 280098 99261 128895 72921 -98928 22026 359014
682 359014 11494 -267068 -337782 -223340 -378619 -291753 256656 406364 -180307 -272488
672 -272488 -122217 148253 301868 310353 65975 -95488 140010 337218 181996 82099
662 82099 266183 212649 323250 297593 -91749 33471 276945 160662 225930 596038 563114
651E63114n0151J08646O4834k92281j55792L52545l82212J04433j76324O1712
641A98524l55101j01451l07430K3587O6170k04226L18911K02037j56588o8142
631c83709k77790J58382K88780J10524J89479J12511m1451n34291K19525L27991
621A69951k32807n4086l13489K62496m37878L26432L34290K37069k08500o32110
611e48632l89847M69425M559p3708N50405q2726J60282k1814J98265q0706k88246
600a02743o26261Q1232N58989J02056j501k43780r2302L82621n02651L53630j74571
589b65281M5019J71727o4452J23039m06351L54402j22331j39180J74116l38202
579d67494J4335K73909J93456l5502j50848M49890J36511l05989o7657J33027
$$ plain form
651 563114 512963 621609 686443 394162 238370 590915 208703 313136 136812 198524
641 198524 -156577 -258028 -565458 -541871 -475701 -679927 -361016 -158979 -315567 -383709
631 -383709 -661499 -503117 -214337 -103813 85666 198177 156726 -377565 -158040 169951
621 169951 -62856 -116942 -430431 -167935 -605813 -279381 54909 291978 83478 -548632
611 -548632 -938479 -469054 -464495 -538203 12202 -70524 89758 67944 266209 185503 -102743
600 -102743 -729004 -647772 -88783 13273 11772 -232008 -324310 58311 -444340 -90710 -265281
589 -265281 -220262 -48535 -112987 10052 -396299 -41897 -164228 -303408 -129292 -467494
579 -467494 -453159 -179250 14206 -21296 -172144 277746 414257 108268 40611 173638
569A73638J64458o5582o65018K69345K82678n32824k59116P2806K06431k56364
559f09548J59472M86178k71661j85097l91635K18702J6088J30972K61524m69366
549f54371k9077l0127J17306L5560n6322J68977M13996l56059l21609K25677J36616
538c49433q5728P82356k35732n93787k51631K02037J18640p9709L75872L53549
528B36434l73256k51096J84604l28910L43321M00981l44490m06161L08306k61302
518d91569J6988j26710J69138k04297k90959Q4709O02071j39745j45077k85699
508h11150L05972O39726l34536o7974R9604O1601k14184L22571l8112L83842k26669
497A20691l81762L48602o9366n0906j84377o2041K63770J16079M3058k21513l04200
$$ plain form
569 173638 338096 272514 -392504 -123159 159519 -373305 -632421 -559615 -353184 -609548
559 -609548 -450076 36102 -235559 -420656 -812291 -593589 -577501 -446529 -185005 -654371
549 -654371 -683448 -713575 -596269 -560709 -617031 -448054 -34058 -390117 -711726 -486049 -349433
538 -349433 -435161 347195 111463 -482324 -733955 -531918 -413278 -492987 -117115 236434
528 236434 -136822 -387918 -203314 -532224 -188903 212078 -132412 -538573 -230267 -491569
518 -491569 -474581 -601291 -432153 -636450 -927409 -842700 -240629 -380374 -525451 -811150
508 -811150 -505178 134548 -199988 -267962 -168358 -106757 -320941 1630 -36482 347360 120691
497 120691 -261071 87531 18165 -32741 -217118 -279159 -15389 100690 143748 -77765 -381965
486c81965J50500k05845k07243K27082K36250K26863n42669p8197N47927p0515
476i7812k9448l11274k47033L08120N24431L41639l38444L1004j51552Q5515m32190
465c17044Q3907J11060J07786J20877l0205k92675k91426K51323K77193n5976
455c5180k68760K25200N65974o12733m36911J99883j38077k22788K70001K32549
445b20842N0060l042m08988J79204L84957P9081l97538N36123j36689K5997p5347
434A2976r9801j25946N9260K8117l0522J48214K63437k88300l10099N5024r2266
423c79906K09206j47032j36197m1204p3825K63742Q7621J54553L06932l14849
413g0959n19157r0804N06634L65789K70494j25067l52286m46491r3921j40710
$$ plain form
486 -381965 -231465 -437310 -644553 -417471 -181221 45642 -497027 -575224 -27297 -97812
476 -97812 -127260 -438534 -685567 -377447 146984 488623 150179 181183 29631 115146 -317044
465 -317044 -233137 -122077 -14291 106586 76381 -216294 -507720 -256397 20796 -35180
455 -35180 -303940 -78740 487234 -125499 -562410 -362527 -500604 -723392 -453391 -220842
445 -220842 -170782 -173824 -582812 -403608 -18651 60430 -337108 199015 62326 88323 12976
434 12976 -86825 -212771 -153511 -125394 -155916 -7702 255735 -32565 -342664 -287640 -379906
423 -379906 -170700 -317732 -453929 -495133 -568958 -305216 -217595 -63042 243890 -70959
413 -70959 -590116 -680920 -174286 191503 461997 336930 -15356 -461847 -555768 -696478
403f96478J63367K1465L53479k20559K14563N0265N3586k5489J39036k0848k96552
392b64165j19522J725P25312j75868k63332J09542j74528l0625j5775J70788O9676
381C3228n26651j07119K27565J976J75772K87238l0172k521l36178l72642l06081
370i55585M06737j73173N20660p9872j5972K61345o9630j97208j86074R1814M9048
359c47910P8324k3039r967k1664n3329l4773n74937K10729j30348K59738M58759
348a88417j01848Q1932l31395K56753j44380K48223L06218k36826k99574l23846
338g33160L23210J52457M83706l78861j23554K05669m48823J17140P0762M08522
328G7068K1628r9968J0679j30282k67895P29756L1881l76708k75611N86581l98702
$$ plain form
403 -696478 -533111 -511646 -158167 -378726 -164163 -113898 -60312 -85801 53235 32387 -264165
392 -264165 -383687 -381962 343350 167482 -95850 13692 -160836 -191461 -207236 -36448 33228
381 33228 -493423 -600542 -372977 -371001 -195229 92009 61837 59316 -276862 -649504 -955585
370 -955585 -548848 -722021 -201361 -281233 -297205 -35860 -105490 -302698 -488772 -396958 -347910
359 -347910 -269586 -292625 -302592 -324256 -377585 -412358 -987295 -776566 -906914 -647176 -188417
348 -188417 -290265 -208333 -539728 -282975 -427355 -179132 127086 -109740 -409314 -733160
338 -733160 -409950 -257493 226213 -152648 -276202 -70533 -519356 -402216 -331454 77068
328 77068 98696 -1272 9407 -120875 -388770 340986 372867 -3841 -279452 307129 -91573
317i1573j13203Q6869j54803m81426q3357O40105l73656k54883j82543L68477
307f39993M50256R4850m4579O8481k31290R1386J96761L23021j77082k4417J35801
296B43195r1769j17273n69009p8425K69867K36952k70260j83036K60914l51314
286f50158K63042J02871N2178O45427j46711n08721j05274m72283K20869M76476
276a22284Q5092q9795j57748N20661l86128r1505L22513k2849q06859j39048L54301
265e33649K739j13134N7603O20855k68287m93059j9400M60551l0442J24696k23517
254d15044p106k85213p9636K05379k55989J49858J92728K1111J22385J76780l12735
243d87482o5186O232j60127r8245J67592J64756K90751O1314r5550m54300O1828
$$ plain form
317 -91573 -204776 -117907 -272710 -754136 -837493 -197388 -571044 -825927 -1008470 -639993
307 -639993 -189737 -94887 -139466 -70985 -302275 -210889 -14128 308893 131811 107394 243195
296 243195 151426 34153 -534856 -613281 -343414 -106462 -376722 -559758 -298844 -650158
286 -650158 -387116 -284245 -232067 413360 266649 -242072 -347346 -819629 -598760 -122284
276 -122284 -37192 -126987 -284735 235926 -150202 -241707 80806 57957 -748902 -887950 -533649
265 -533649 -530910 -644044 -586441 34414 -233873 -726932 -746332 -285781 -316223 -191527 -415044
254 -415044 -422150 -707363 -786999 -581620 -837609 -687751 -495023 -473912 -351527 -174747 -487482
243 -487482 -552668 -546436 -706563 -804808 -637216 -472460 -181709 -120395 -215945 -670245 -608417
232f08417R9852k01001L84220O9276l31590j42591L70857N818l14012j74622M60508
221c81702J52516k87003K76240L71218j39647J15707m5350k71975k56012l72748
211h38756N674K67356R8347J27441N1386j00820m9050J65235K37822n5348J7483
200g3230J13957L40644k17486n0542n0415n53414O8943K42942r0712j85192j78101
189f32606J38723k3213n6138J94640j39678k38162K52199K55708k30196l11546
179g90269L92617J71058l22250J26170j54073K21013R5880r1469l4932k08042
169e94297P5987J24978L29885l25888R592J0253K04052l12799j71032k83499N3797
158h78971M3607p0550J39910J32433j55740L46073j17198k08965L85644k24657
$$ plain form
232 -608417 -508565 -709566 -325346 -256070 -587660 -730251 -359394 -353576 -667588 -842210 -381702
221 -381702 -229186 -516189 -239949 131269 -8378 107329 61979 -209996 -466008 -838756
211 -838756 -833082 -565726 -467379 -339938 -288552 -389372 -438422 -273187 -35365 -90713 -73230
200 -73230 40727 381371 163885 113343 62928 -490486 -421543 -178601 -269313 -454505 -632606
189 -632606 -493883 -517096 -573234 -378594 -518272 -756434 -504235 -248527 -478723 -790269
179 -790269 -397652 -226594 -548844 -422674 -576747 -355734 -259854 -351323 -386255 -594297
169 -594297 -518310 -393332 -63447 -389335 -379743 -369490 -165438 -478237 -649269 -932768 -878971
158 -878971 -835364 -905914 -766004 -633571 -789311 -443238 -560436 -769401 -383757 -608414
148f08414P0868J86520K34111J1738j87679K35717o1277o05775J09923L04385
138c09883q9178K86691J81429n03609j98702L85040k39826k70950R9290J98431
128d61267K3815K03984J61753k50798J80266k45171k35629J48034L27808N8148
118h9057N3233j30718l98755l2810K39825j33573l13739j61262J30778l26320
108a162398J44517J77982J24659Q5776l7563j43847J78118K66979N2130l59641
98f73288l54901K74056L33082k419r7283j32214L51460j44530p9951K34812k038
87b93214n7577Q7054k16541j57974L8925J15887J0765J44167K7276k61269j64429
76g26930K48752J78882J01858r257k71217j10715l7236q7268J61571J21357l19379
$$ plain form
148 -608414 -537546 -351026 -116915 -105177 -292856 -57139 -118416 -724191 -614268 -309883
138 -309883 -399061 -112370 69059 -434550 -633252 -248212 -488038 -758988 -659698 -461267
128 -461267 -437452 -233468 -71715 -322513 -142247 -387418 -623047 -475013 -147205 -89057
118 -89057 -35824 -166542 -565297 -598107 -358282 -491855 -805594 -966856 -836078 -1162398
108 -1162398 -1017881 -839899 -715240 -629464 -667027 -810874 -632756 -365777 -313647 -673288
98 -673288 -1028189 -754133 -421051 -423470 -520753 -652967 -301507 -446037 -525988 -291176 -293214
87 -293214 -350791 -263737 -480278 -638252 -599327 -483440 -472675 -328508 -301232 -562501 -726930
76 -726930 -478178 -299296 -197438 -206695 -477912 -588627 -625863 -713131 -551560 -430203 -749582
65g49582k08076K94050L98554q4201K11256k22351k12524K99279p1633k26749
55e71977j94043L58594k25610K3136J83040J8271k06184j94775K1017K98142k3384
44e13773k693J34592k28101j6899j03164N7022O4146K50163j94575R3845K78644
33a80793K0156k38194J94520R9036l50309l87404O282L80653m9566j84193R4887
22e94925k50092j47432J85533j44890P5738l1684j43213M56040J55444q1346j71803
11f92630k85770J20708K20029K99445L27982l58161j41677M8848J04094k63869
1f21001J51520
0d69481
$$ plain form
65 -749582 -957658 -663608 -265054 -349255 -137999 -360350 -572874 -273595 -345228 -571977
55 -571977 -766020 -407426 -633036 -609900 -426860 -408589 -614773 -809548 -788531 -490389 -513773
44 -513773 -516466 -381874 -609975 -626874 -730038 -673016 -608870 -358707 -553282 -459437 -180793
33 -180793 -160637 -398831 -204311 -105275 -455584 -842988 -836706 -456053 -505619 -689812 -594925
22 -594925 -845017 -992449 -806916 -951806 -876068 -907752 -1050965 -594925 -439481 -520827 -692630
11 -692630 -978400 -857692 -637663 -338218 -10236 -368397 -510074 -461226 -357132 -621001
1 -621001 -469481
0 -469481
$$ Imaginary data points
##PAGE= N=2
##DATA TABLE= (X++(I..I)), XYDATA
16383d801444o692Q942Q6123o4396K57324J86354K4079J4539J75549J41121j13379
16372d091880K64397l6298k8169M41088j90059p5478J10225R0637k17932j03735
16362c837204Q8531L13622J74617m6131K88746R7094k46811k6579K05294K6383
16352b962438J4206J92338j7696J10908j539p7901K0083R0973J73480J14895J13879
16341b228812K36889r740j34699J91757j31674K38291J05388j22095K13576l10352
16331a951471L47784j22375r0342J2172K02799k3537l3200P9070K9985r219N7033
16320a501301J3015j5454L23942J49860K58958r4008k42266K60488q0370q1154
16310a008290J90724L31469M0874j82044k87967N3647P3096L70891j15137q6981
$$ plain form
16383 -4801444 -4808136 -4799194 -4713071 -4777467 -4520143 -4333789 -4309710 -4295171 -4119622 -3978501 -4091880
16372 -4091880 -3827483 -3863781 -3891950 -3450862 -3640921 -3716399 -3606174 -3515537 -3733469 -3837204
16362 -3837204 -3748673 -3435051 -3260434 -3306565 -3017819 -2920725 -3167536 -3194115 -2988821 -2962438
16352 -2962438 -2948232 -2755894 -2773590 -2662682 -2664221 -2742122 -2722039 -2631066 -2457586 -2342691 -2228812
16341 -2228812 -1991923 -2001663 -2136362 -1944605 -2076279 -1837988 -1732600 -1854695 -1641119 -1951471
16331 -1951471 -1603687 -1726062 -1816404 -1804232 -1601433 -1624970 -1658170 -1579100 -1549115 -1558334 -1501301
16320 -1501301 -1488286 -1503740 -1179798 -1029938 -770980 -864988 -1107254 -846766 -927136 -1008290
16310 -1008290 -817566 -486097 -445223 -627267 -915234 -861587 -788491 -417600 -532737 -619718
16300f19718J56793J01841K2729j0317L2453K23337J44632J95760k79844J02267
16290F9933J53183J85678p322n90882Q6920L26810L83776k9528j17287j05666
16280C55615J47273J1006p4478K56902K55452P2889k15066k36378j5457K09967
16270G67725J43109k2335j41663L6688J14575J25609J02336o1183K40918k8366
16260A277413p0642L3590l96065Q4519J11739M33433M05918k35278j30054K29323
16250A743896k99323k09296M13839M9212n6876j34412r0988K03279K20131p2131
16240A767331J52937l1095J9155o7259J80455O752j07232j25715K42099J3493
16230B050921O6150J11631j7730K28196l61592k05995K17977k74916K48904M92866
$$ plain form
16300 -619718 -462925 -361084 -338355 -348672 -316219 -92882 51750 247510 -32334 69933
16290 69933 223116 408794 401472 -189410 -102490 224320 608096 578568 461281 355615
16280 355615 502888 513894 439416 696318 951770 1024659 809593 573215 557758 767725
16270 767725 910834 888499 746836 783524 898099 1023708 1126044 1064861 1305779 1277413
16260 1277413 1206771 1240361 844296 928815 1040554 1473987 1879905 1644627 1514573 1743896
16250 1743896 1444573 1235277 1649116 1698328 1641452 1507040 1416052 1619331 1839462 1767331
16240 1767331 1920268 1889173 1908328 1841069 2021524 2028276 1921044 1795329 2037428 2050921
16230 2050921 2117071 2228702 2210972 2439168 2077576 1871581 2089558 1814642 2063546 2556412
16220B556412J05419l20836Q9578Q9807J88228J25079o5791J49953J62935k60260
$$ plain form
16220 2556412 2661831 2340995 2430573 2520380 2708608 2833687 2767896 2917849 3080784 2820524
$$ [...]
##END NTUPLES=NMR SPECTRUM
##END=
