##TITLE=1H_EC-3245(1)x
 CDCl3,8 sc, 
 1.03.2021
##JCAMPDX= 6.0         $$ Bruker NMR JCAMP-DX V2.0
##DATA TYPE= NMR SPECTRUM
##DATA CLASS= NTUPLES
##ORIGIN= UXNMR, Bruker Analytische Messtechnik GmbH
##OWNER= root
$$ XWIN-NMR		Version 3.5
$$ Mon Mar  1 11:09:17 2021 Russian Standard Time (UT+4h)  she@DPX200
##.OBSERVE FREQUENCY= 200.1315066352
##.OBSERVE NUCLEUS= ^1H
##.ACQUISITION MODE= SIMULTANEOUS
##.ACQUISITION SCHEME= undefined
##.AVERAGES= 8
##.DIGITISER RES= 18
##SPECTROMETER/DATA SYSTEM= spect
##.PULSE SEQUENCE= zg30
##.SOLVENT NAME= CDCl3
##.SHIFT REFERENCE= (INTERNAL, CDCl3, 0, 16.1791)
##AUDIT TRAIL= $$ (NUMBER, WHEN, WHO, WHERE, WHAT)
$$ ##TITLE= Audit trail, XWIN-NMR		Version 3.5
$$ ##JCAMPDX= 5.01
$$ ##ORIGIN= Bruker BioSpin GmbH
$$ ##OWNER= she
$$ F:/spectra/data/she/nmr/H-F/1/pdata/1/auditp.txt
$$ ##AUDIT TRAIL=  $$ (NUMBER, WHEN, WHO, WHERE, WHAT)
(   1,<2021-03-01 11:08:02.92 +0400>,<she>,<DPX200>,
      <created by zg, POWCHK disabled, PULCHK disabled
       configuration hash MD5:
       00 E9 B6 7A A2 85 ED C7 34 08 36 98 17 FE 4E 26
       data hash MD5: 16K
       9C 67 9F 31 10 DE C6 D7 A5 05 ED C5 C7 EF F4 87>)
(   2,<2021-03-01 11:08:05.35 +0400>,<she>,<DPX200>,
      <Start of raw data processing
       efp BC_mod = 2 LB = 0.24 FT_mod = 6 PKNL = 1 PHC0 = -10758.01 PHC1 = 9.800941 SI = 16K 
       data hash MD5: 16K
       94 AF 83 65 83 C7 88 27 FB D1 B1 DD 0B 88 5D BF>)
(   3,<2021-03-01 11:08:26.26 +0400>,<she>,<DPX200>,
      <pk PHC0 = -1.018896 PHC1 = -2 
       data hash MD5: 16K
       47 B6 C4 E2 BC 2A E6 34 20 32 6B FB 5D 76 49 D4>)
(   4,<2021-03-01 11:08:29.28 +0400>,<she>,<DPX200>,
      <abs ABSG = 5 
       data hash MD5: 16K
       D1 71 1C 56 FE 5B DB DB A7 75 A1 AC F6 37 79 6F>)
$$ ##END=
$$ 
$$ hash MD5
$$ 70 F9 A6 DC 79 70 FB 9F 71 F3 DC 65 D2 64 9F F6
##$RELAX= 
##$RELAX= 
##$RELAX= 
##$RELAX= 
##$RELAX= 
##$RELAX= 
$$ Bruker specific parameters
$$ --------------------------
##$DU= <F:/spectra>
##$EXPNO= 1
##$NAME= <H-F>
##$PROCNO= 1
##$TYPE= <nmr>
##$USER= <she>
##$AMP= (0..31)
100 100 100 100 100 100 100 100 100 100 100 100 100 100 100 100 100 100 
100 100 100 100 100 100 100 100 100 100 100 100 100 100 
##$AQSEQ= 0
##$AQ_mod= 1
##$AUNM= <au_zg>
##$AUTOPOS= <>
##$BF1= 200.13
##$BF2= 200.13
##$BF3= 200.13
##$BF4= 200.13
##$BF5= 200.13
##$BF6= 200.13
##$BF7= 200.13
##$BF8= 200.13
##$BYTORDA= 1
##$CFDGTYP= 0
##$CFRGTYP= 5
##$CHEMSTR= <none>
##$CNST= (0..31)
1 1 145 1 1 1 1 1 1 1 1 1 1 1 1 1 1 1 1 1 1 1 1 1 1 1 1 1 1 1 1 1 
##$CPDPRG= <>
##$CPDPRG1= <>
##$CPDPRG2= <>
##$CPDPRG3= <>
##$CPDPRG4= <mlev>
##$CPDPRG5= <mlev>
##$CPDPRG6= <mlev>
##$CPDPRG7= <mlev>
##$CPDPRG8= <mlev>
##$CPDPRGB= <>
##$CPDPRGT= <>
##$D= (0..31)
0 1.2 0 0 0 0 0 0 0 0.06 0 0.03 0 0 0 0 0.0002 0 0 0 0 0 0 0 0 0 0 0 0 
0 0 0 
##$DATE= 1614582482
##$DBL= (0..7)
120 120 120 120 120 120 120 120 
##$DBP= (0..7)
150 150 150 150 150 150 150 150 
##$DBP07= 0
##$DBPNAM0= <>
##$DBPNAM1= <>
##$DBPNAM2= <>
##$DBPNAM3= <>
##$DBPNAM4= <>
$$ [...]
##$SUBNAM3= <"">
##$SUBNAM4= <"">
##$SUBNAM5= <"">
##$SUBNAM6= <"">
##$SUBNAM7= <"">
##$SUBNAM8= <"">
##$SUBNAM9= <"">
##$SW= 16.9725356469052
##$SWIBOX= (0..15)
0 0 2 0 0 0 0 0 0 0 0 0 0 0 0 0 
##$SW_h= 3396.73913043478
##$TD= 16384
##$TD0= 1
##$TE= 0
##$TE2= 300
##$TE3= 300
##$TEG= 300
##$TL= (0..7)
0 120 120 120 120 120 120 120 
##$TP= (0..7)
150 150 150 150 150 150 150 150 
##$TP07= 0
##$TPNAME0= <>
##$TPNAME1= <>
##$TPNAME2= <>
##$TPNAME3= <>
##$TPNAME4= <>
##$TPNAME5= <>
##$TPNAME6= <>
##$TPNAME7= <>
##$TPOAL= (0..7)
0.5 0.5 0.5 0.5 0.5 0.5 0.5 0.5 
##$TPOFFS= (0..7)
0 0 0 0 0 0 0 0 
##$TUNHIN= 0
##$TUNHOUT= 0
##$TUNXOUT= 0
##$USERA1= <user>
##$USERA2= <user>
##$USERA3= <user>
##$USERA4= <user>
##$USERA5= <user>
##$V9= 5
##$VALIST= <valist>
##$VCLIST= <CCCCCCCCCCCCCCC>
##$VD= 0
##$VDLIST= <DDDDDDDDDDDDDDD>
##$VPLIST= <PPPPPPPPPPPPPPP>
##$VTLIST= <TTTTTTTTTTTTTTT>
##$WBST= 1024
##$WBSW= 4
##$XGAIN= (0..3)
0 0 0 0 
##$XL= 0
##$YL= 0
##$YMAX_a= 157689
##$YMIN_a= -97757
##$ZGOPTNS= <>
##$ZL1= 120
##$ZL2= 120
##$ZL3= 120
##$ZL4= 120
##$ABSF1= 16.002
##$ABSF2= -0.9706631
##$ABSG= 5
##$ABSL= 3
##$ALPHA= 0
##$AQORDER= 0
##$ASSFAC= 0
##$ASSFACI= 0
##$ASSFACX= 0
##$ASSWID= 0
##$AUNMP= <proc_1d>
##$AZFE= 0.1
##$AZFW= 0.1
##$BCFW= 0
##$BC_mod= 2
##$BYTORDP= 0
##$COROFFS= 0
##$CY= -3
##$DATMOD= 1
##$DC= 0
##$DFILT= <>
##$DTYPP= 0
##$F1P= 0
##$F2P= 0
##$FCOR= 1
##$FTSIZE= 16384
##$FT_mod= 6
##$GAMMA= 0
##$GB= 0
##$INTBC= 1
##$INTSCL= 2.992141e-10
##$ISEN= 128
##$LB= 0.24
##$LEV0= 0
##$LPBIN= 0
##$MAXI= 10000
##$MC2= 0
##$MEAN= 0
##$ME_mod= 0
##$MI= 1.114404
##$NCOEF= 0
##$NC_proc= -8
##$NLEV= 6
##$NOISF1= 3.799351
##$NOISF2= 2.8
##$NSP= 0
##$NTH_PI= 0
##$NZP= 0
##$OFFSET= 16.17914
##$PC= 1
##$PHC0= -10759.03
##$PHC1= 7.800941
##$PH_mod= 1
##$PKNL= yes
##$PPARMOD= 0
##$PSCAL= 0
##$PSIGN= 0
##$REVERSE= no
##$SF= 200.129967074117
##$SI= 16384
##$SIGF1= 3
##$SIGF2= 2
##$SINO= 5.538805
##$SIOLD= 16384
##$SREGLST= <1H.CDCl3>
##$SSB= 0
##$STSI= 16384
##$STSR= 0
##$SW_p= 3396.73913043478
##$SYMM= 0
##$S_DEV= 0
##$TDeff= 16384
##$TDoff= 0
##$TI= <>
##$TILT= no
##$TM1= 0
##$TM2= 0
##$TOPLEV= 0
##$USERP1= <user>
##$USERP2= <user>
##$USERP3= <user>
##$USERP4= <user>
##$USERP5= <user>
##$WDW= 1
##$XDIM= 16384
##$YMAX_p= 404819841
##$YMIN_p= -1616052
$$ End of Bruker specific parameters
$$ ---------------------------------
##NTUPLES= NMR SPECTRUM
##VAR_NAME=  FREQUENCY,     SPECTRUM/REAL,   SPECTRUM/IMAG
##SYMBOL=    X,             R,               I
##VAR_TYPE=  INDEPENDENT,   DEPENDENT,       DEPENDENT
##VAR_FORM=  AFFN,          ASDF,            ASDF
##VAR_DIM=   16384,         16384,           16384
##UNITS=     HZ,            ARBITRARY UNITS, ARBITRARY UNITS
##FACTOR=    0.207333158178281, 1,           1
##FIRST=     3237.93077368783, 0,            0
##LAST=      -158.808356746954, 0,           0
##MIN=       -158.808356746954, -1616052,    0
##MAX=       3237.93077368783, 404819841,    0
$$ Real data points
##PAGE= N=1
##DATA TABLE= (X++(R..R)), XYDATA
$$ [...]
9381f54754J1436J75622N83206m07740l37245N44448q9171n28877N39952O4781
$$ -654754 -643318 -467696 115510 -292230 -629475 -85027 -174198 -703075 -163123 -98342
9371i8342j43681m08092P31241j5653k68579l08857M84637j9323n8582j76378
$$ -98342 -242023 -650115 81126 65473 -203106 -511963 -27326 -46649 -105231 -281609
9361b81609R43869k85213n74766l92231J29611Q61302o78992n29898J144159j9848
$$ -281609 662260 377047 -197719 -589950 -460339 400963 -278029 -807927 336232 316384
9351C16384m40051l05868J73448O6425m81730j83269M81378M6393n87394K09065
$$ 316384 -123667 -429535 -256087 -189662 -671392 -854661 -373283 -326890 -914284 -705219
9341g05219N68524j15774K05863k60764O93277L02977j242164k34234M80107K54052
$$ -705219 -136695 -252469 -46606 -307370 385907 688884 -553280 -787514 -307407 -53355
9331e3355m94498j03446r0310L07590M56452L17234k47664n5377q63006j28785
$$ -53355 -547853 -651299 -741609 -434019 22433 339667 92003 36626 -826380 -955165
9321i55165M73707L7538l45825M22655K32493K67673n53867J44169Q08062k47873
$$ -955165 -481458 -443920 -789745 -367090 -134597 133076 -420791 -276622 531440 283567
9311B83567j39668K04058p20884j18696N565l0114Q7369N42043K75083j75065
$$ 283567 143899 347957 -372927 -491623 -486058 -516172 -428803 113240 388323 213258
9301B13258n22049j97838m34294P82370m89488J59241L31841k40900k67373r3289
$$ 213258 -308791 -506629 -940923 -158553 -648041 -488800 -156959 -397859 -665232 -758521
9291g58521N30604L0856R9770j23849m08354p19198N03327K24824K97589M62288
$$ -758521 -227917 -197061 -97291 -221140 -629494 -1348692 -845365 -620541 -322952 139336
9281A39336j37770o72901K26473K78792J75283n1234K2632Q2199r09009j50974
$$ 139336 1566 -671335 -444862 -166070 9213 -42021 -19389 62810 -846199 -997173
9271i97173N78688m103m02027L14474k10481j89584K26705j28133K33067j19857
$$ -997173 -418485 -422588 -824615 -510141 -720622 -910206 -683501 -811634 -578567 -698424
9261f98424O19989J72726j91956r0916j77233q5861K99130k3974k73822j23834
$$ -698424 -78435 94291 -97665 -188581 -365814 -451675 -152545 -176519 -450341 -574175
9251e74175J49416k04232M09389m6334J09637M75621K62274j001323J58389K54970
$$ -574175 -424759 -628991 -219602 -265936 -156299 319322 581596 -419727 -261338 -6368
9241f368K5293J26567o52338j82067K78533m74992K2464Q30615j0276L34371l80304
$$ -6368 18925 145492 -506846 -688913 -410380 -885372 -862908 -32293 -42569 291802 -88502
9230h8502j19298k21081l85036N19434O11935l71929k43861l5980o8138L96892
$$ -88502 -207800 -428881 -813917 -294483 317452 -54477 -298338 -334318 -402456 -5564
9220e564j93778R4352j05200J95984J25921o72787k8626k3473L28936n0548J94836
$$ -5564 -199342 -104990 -210190 -14206 111715 -561072 -589698 -613171 -284235 -334783 -139947
9209a39947j13413l87444k85358Q78993l26164j88768j73255K33998O57834n85701
$$ -139947 -253360 -640804 -926162 -47169 -373333 -562101 -735356 -501358 156476 -429225
9199d29225j82518R41399k69033n55167M7821K41848M01880n0653o41277k28670
$$ -429225 -611743 329656 60623 -494544 -446723 -204875 197005 146352 -494925 -723595
9189g23595M05329P1076r5949k12109O6556N29492k45496j50367L0983n14090
$$ -723595 -318266 -247190 -343139 -555248 -488692 40800 -204696 -355063 -324080 -838170
9179h38170j05189M20666Q91936j54351K00978l85094J26708k48748L79603j66860
$$ -838170 -943359 -522693 369243 214892 415870 30776 157484 -91264 288339 121479
9169A21479m55765k25907k94463J30775L65824j21872M80956K01804k58849k65143
$$ 121479 -334286 -560193 -854656 -723881 -358057 -479929 1027 202831 -56018 -321161
9159c21161O8611M12957j63435k66034k45627j70273K65615P3911r4793l5838
$$ -321161 -252550 160407 -3028 -269062 -514689 -684962 -419347 -345436 -440229 -476067
9149d76067j12979J35454l02537j92459r0083M63091P15485o73371l01936M39346
$$ -476067 -589046 -453592 -756129 -948588 -1038671 -575580 139905 -533466 -835402 -396056
9139c96056M98600j26122j51262M9178m8720m85908l38274P84464q2768j56122
$$ -396056 102544 -23578 -174840 -125662 -174382 -660290 -998564 -214100 -296868 -452990
9129d52990n36178O54037K43593m77888j51146K70922K11397N1890R1679L43360
$$ -452990 -989168 -335131 -91538 -569426 -720572 -449650 -238253 -186363 -94684 248676
9119B48676L29198j058302k14937O74531L19574J2786l82526Q502n0600j32562
$$ 248676 577874 -480428 -695365 -20834 298740 311526 -71000 -62498 -113098 -245660
9109b45660l57513P7013L60256L8869j41272J64628n00431L50034m60822J06204
$$ -245660 -603173 -526160 -165904 -127035 -268307 -103679 -604110 -254076 -714898 -608694
9099f08694q30k75036R43936J9106m47180j18839L82321l08673J6905k23023J48253
$$ -608694 -609524 -884560 59376 78482 -368698 -487537 -105216 -413889 -396984 -620007 -471754
9088d71754L3120L85663J69022j4532j20252l20829K01400k38884r2486K11592
$$ -471754 -438634 -52971 116051 101519 -18733 -339562 -138162 -377046 -469532 -257940
9078b57940k28860J23707n09452j74015J92853J79247N3020N85252k23959m82048
$$ -257940 -486800 -363093 -872545 -1046560 -853707 -674460 -621440 -36188 -260147 -742195
9068g42195K42410P8841R1826j65358J25161j73654O92134l89348Q5122J87043
$$ -742195 -499785 -420944 -329118 -494476 -369315 -542969 149165 -240183 -155061 31982
9058C1982O12168j72806n71603j3818R6212l77590N199P0458l61627L43784Q365
$$ 31982 644150 471344 -100259 -114077 -17865 -395455 -390256 -319798 -681425 -337641 -329276
9047c29276M32354m60660j4618J68559J14307K95482l78664j62924k7449M13326
$$ -329276 103078 -357582 -372200 -203641 -89334 206148 -172516 -335440 -362889 50437
9037E0437k80619P7995K41744m4058j93326M12488n92907m39625O54248l527j90966
$$ 50437 -230182 -152187 89557 45499 -147827 264661 -328246 -767871 -113623 -117150 -308116
9026c08116n16660O21468K83811k93900p39410M98640K39693k62298j61464k99551
$$ -308116 -824776 -203308 80503 -213397 -952807 -454167 -214474 -476772 -638236 -937787
9016i37787M35298N20240j50597K85361P054n74561J11627N06903j68890l77496
$$ -937787 -502489 17751 -132846 152515 159569 -414992 -303365 203538 34648 -342848
9006c42848M86845o6129k72562J39659j91408r928L3342j05065p38228K81276
$$ -342848 143997 77868 -194694 -55035 -246443 -256371 -223029 -328094 -1066322 -785046
8996g85046Q12817q15706j18903P31164J74825P0276K753K1338n82618J25368
$$ -785046 27771 -787935 -906838 -175674 -849 69427 72180 93518 -489100 -363732
8986c63732K42497k9001Q4697n52603M08408N86691k06963J66334J17666L43044
$$ -363732 -121235 -150236 -65539 -618142 -209734 376957 169994 336328 453994 797038
8976G97038j92110m91981l14967k60318l9852j31853M3701l75091M6558M39535
$$ 797038 604928 112947 -202020 -462338 -502190 -634043 -590342 -965433 -918875 -479340
8966d79340M2756K94406m65729j29403j39977k41297k6469J80412J93988O49065
$$ -479340 -436584 -142178 -607907 -737310 -877287 -1118584 -1145053 -964641 -770653 -121588
8956a21588M82873n81257M4695N3812J18522J19105m87116j52837K64423K2073
$$ -121588 361285 -219972 -175277 -121465 -2943 116162 -370954 -523791 -259368 -237295
8946b37295L02851n72529J72605M45339M4123n00986l97808K21525M71599o742
$$ -237295 65556 -506973 -334368 110971 155094 -345892 -743700 -522175 -50576 -57318
8936e7318M59137Q9767j13613k70919j40165M81258J25511m83545j85505m57714
$$ -57318 401819 491586 377973 107054 -33111 448147 573658 90113 -95392 -553106
8926e53106Q4402n087J6332P92776J50612q05580K67357O7492m47970l98845m29146
$$ -553106 -468704 -473791 -457459 335317 485929 -319651 -52294 15198 -432772 -831617 -1260763
8915a260763l55289M3409P34755K81719N7776p79842P1214N01126M60492k81474
$$ -1260763 -1616052 -1572643 -837888 -556169 -498393 -1278235 -1207021 -705895 -245403 -526877
8905e26877m13320j55809O89605o66859j3082O13000P1443j36336Q2371J3600
$$ -526877 -940197 -1096006 -406401 -1073260 -1086342 -473342 -401899 -538235 -455864 -442264
8895d42264L77338k13836J52340K9117r0332O8844n433K85690J65519k64357k07406
$$ -442264 -64926 -278762 -126422 -97305 -187637 -118793 -124226 161464 326983 62626 -144780
8884a44780k43768K93788m05239m6695P46373L87845J12826q59163p18309J19773
$$ -144780 -388548 -94760 -499999 -546694 199679 587524 700350 -158813 -877122 -757349
8874g57349M16725L64237k37320l39945Q66067n71125l14023m2651O29718l86523
$$ -757349 -340624 23613 -213707 -553652 312415 -258710 -572733 -615384 14334 -372189
8864c72189P7991J71015j08431m39821K7669L7538J95297j27485k47523l4641
$$ -372189 -294198 -123183 -231614 -671435 -643766 -606228 -410931 -538416 -785939 -820580
8854h20580M47491k02670l86808Q74848M60642q01157l61008K25539L53019M1780
$$ -820580 -373089 -575759 -962567 -87719 372923 -428234 -789242 -563703 -210684 -168904
8844a68904j29608l37077q7813p0360J08809N6432o9459k8372k77365Q85166k0014
$$ -168904 -298512 -635589 -723402 -793762 -684953 -628521 -697980 -726352 -1003717 -118551 -138565
8833a38565r18796j6191Q29640j2377n17923j84798P38404J82613J60157o29065
$$ -138565 -1057361 -1073552 -243912 -256289 -774212 -959010 -220606 -37993 122164 -506901
8823e06901K67516M39224l07541j08528N7677K17998K49644K13544J69171M3071
$$ -506901 -239385 199839 -107702 -216230 -158553 59445 309089 522633 691804 734875
8813G34875p66563l85133R64406j75761q41506j19540K78683o2404k68953m12614
$$ 734875 -31688 -416821 547585 371824 -469682 -589222 -310539 -372943 -641896 -1054510
8803a054510N26144M98241J15228l46397r01131K85126K48347J73651R2474o5608
$$ -1054510 -528366 -30125 85103 -261294 -1162425 -877299 -628952 -455301 -362827 -428435
8793d28435k63738P8014M82091j36923l69805J98692O65542k02289n47036k37072
$$ -428435 -692173 -614159 -132068 -268991 -638796 -440104 225438 23149 -523887 -760959
8783g60959J93353M43740L73964j08512p9322L8989p0493l5366n41909k85255
$$ -760959 -567606 -123866 250098 141586 62264 101253 30760 -4606 -546515 -831770
8773h31770L73618L56763l4179j04665k89717N36672K1325K30611j54001l06558
$$ -831770 -458152 -101389 -135568 -240233 -529950 6722 28047 258658 104657 -201901
8763b01901K93129o9907N8927l52901j502N15695K61821j95280q71437M75165
$$ -201901 91228 21321 80248 -272653 -274155 241540 503361 308081 -563356 -88191
8753h8191n3694n04479P18227K47365m22030K0455R5843k19451m54368L99182
$$ -88191 -141885 -646364 71863 319228 -102802 -82347 13496 -205955 -660323 -261141
8743b61141L1479n6614M2295n16031M02555N76066l02261m98602P07334L64009
$$ -261141 -229662 -286276 -243981 -760012 -357457 218609 -83652 -582254 125080 489089
8733D89089q21066k67340L02303j85164j07940M34886p4216m36382L54117n8960
$$ 489089 -331977 -599317 -297014 -482178 -590118 -155232 -229448 -665830 -311713 -370673
8723c70673M71640j8494o08539m02423L75009M32715o21941K93373M42506j86465
$$ -370673 100967 82473 -526066 -928489 -553480 -120765 -742706 -449333 -6827 -193292
8713a93292M93619p97334j2633K48376K45377k12577M04468J36594j52516j27381
$$ -193292 300327 -497007 -509640 -261264 -15887 -228464 176004 312598 160082 32701
8703C2701k87296O2359K33968M3983L11573m81214m77584j23274J77100N95288
$$ 32701 -254595 -192236 41732 85715 397288 -83926 -561510 -684784 -507684 87604
8693H7604j87906l59708Q6469O07778r5452m41777n37734R6922Q10288n0137l36880
$$ 87604 -100302 -460010 -373541 234237 138785 -302992 -840726 -743804 66484 16347 -320533
8682c20533K14455m09876K92263Q9905L77152o00729L21490O1095k87372l02161
$$ -320533 -106078 -515954 -223691 -133786 243366 -357363 -35873 25222 -262150 -564311
8672e64311J8346P3166M80689j90926l43520J08140J44863k97115L16730J69043
$$ -564311 -545965 -472799 7890 -183036 -526556 -418416 -273553 -570668 -253938 -84895
8662h4895j17896J21100J6412J00151m5752K43334K5440K367O54831q51235k5953
$$ -84895 -202791 -81691 -65279 34872 -10880 232454 257894 260261 915092 63857 37904
8651C7904L80359K23795J04306l81446k9572l03410j8937o6208r9107P165M22167
$$ 37904 418263 642058 746364 364918 335346 31936 12999 -53209 -152316 -145151 277016
8640B77016m56898M46639j41649k65305o3212K75611M11241j19363k71557n26782
$$ 277016 -179882 266757 125108 -140197 -203409 72202 483443 364080 92523 -434259
8630d34259k22113O00021P43963o89118o89985K04149N9149K55295K28161M84654
$$ -434259 -656372 -56351 687612 -1506 -691491 -487342 -428193 -172898 55263 539917
8620E39917q0853Q8356o17346K82916K76667k14002m48333L95641N81887k59074
$$ 539917 459064 547420 -69926 212990 489657 275655 -172678 222963 804850 545776
8610E45776n5217o54092j89629L65414L85845Q2476L40005J13702q38800L12991
$$ 545776 490559 -163533 -353162 12252 398097 480573 820578 934280 95480 408471
8600D08471Q05975n86645J55990j70596k66469o8409L15225J71692m6513L19049
$$ 408471 1214446 627801 783791 613195 346726 278317 593542 765234 718721 1037770
8590A037770j87647M15359L55859p19238J42216j5510n09674J05805P6044L51630
$$ 1037770 850123 1265482 1621341 902103 1044319 1028809 519135 624940 700984 1052614
8580A052614m29330R95818P00554q6393k98974J35365l70452n00428K31818k12958
$$ 1052614 623284 1619102 2319656 2233263 1934289 2069654 1699202 1198774 1430592 1217634
8570A217634j60196m5306k29526J74961K97876p11239p7533Q9414n8757j74496
$$ 1217634 1057438 1012132 782606 957567 1255443 544204 466671 556085 497328 322832
8560C22832N23462l51765K52399K55820m01234R91648K34818n68630m09063N7164
$$ 322832 846294 494529 746928 1002748 601514 1593162 1827980 1259350 850287 907451
8550I07451K0539k89966J54273J51139k36379k41411J248829P9114J20736m25133
$$ 907451 927990 638024 792297 943436 707057 465646 1714475 1793589 1914325 1489192
8540A489192p35915N66050M62833l62116l70038J16100m81513N39423P21974j21088
$$ 1489192 753277 1319327 1782160 1420044 1050006 1166106 684593 1224016 1945990 1824902
8530A824902k78040L00424K56276N19063P3829p7647k20242K10633P47335P7865
$$ 1824902 1546862 1847286 2103562 2622625 2696454 2618807 2398565 2609198 3356533 3434398
8520C434398K26125J5192q7040N9232J143936N74324l00949O26794M13020L21477
$$ 3434398 3660523 3675715 3588675 3647907 4791843 5366167 5065218 5692012 6105032 6426509
8510F426509P67174R84709p6486P96274P17145M92473L20936K03803k1567n91210
$$ 6426509 7193683 8178392 8101906 8898180 9615325 10107798 10428734 10632537 10610970 10019760
8500A0019760L06909L3448p02055l70400j499488j290022P59691o08014n98870
$$ 10019760 10326669 10360117 9658062 9287662 7788174 6498152 7257843 6649829 6050959
8491F050959m96569j363203n3305k11239K2098m27769l162l78828o82202M34583
$$ 6050959 5554390 4191187 4137882 3926643 3948741 3520972 3517810 3138982 2456780 2891363
8481B891363K3873k82891o02174J54665O36079k46490n21767M06416m71354l91426
$$ 2891363 2915236 2632345 2030171 2184836 2820915 2574425 2052658 2459074 1987720 1596294
8471A596294j79497P98367k28107n36171o01163M26300P40756q49460N03109o97245
$$ 1596294 1416797 2215164 1987057 1450886 849723 1276023 2016779 1167319 1670428 973183
8461I73183j64103N47722m56042m09528J54859K51679k24783O41926k70186j24814
$$ 973183 809080 1356802 900760 491232 646091 897770 672987 1314913 1044727 919913
8451I19913m51582J48792L88147n3907l41501K96778k7223n2413P22541m39734
$$ 919913 468331 617123 1005270 951363 609862 906640 879417 827004 1549545 1109811
8441A109811m4615j55362m11942k27121L05871J51786K73648j93027m43404K01956
$$ 1109811 1065196 909834 497892 270771 576642 728428 1002076 809049 365645 567601
8431E67601p4920j9958J72330m40104L9597L15495J12979k42779m60453l05978
$$ 567601 492681 472723 645053 204949 244546 560041 673020 430241 -30212 -336190
8421c36190M40459M4610o0371J38165l28928L9666O64450O2211l80116O77983
$$ -336190 104269 148879 88508 226673 -102255 -62589 601861 664072 283956 961939
8411I61939l12919L50660N9471m82279N86801j94716m03017K30475j87237k12337
$$ 961939 649020 999680 1059151 576872 1163673 968957 565940 796415 609178 396841
8401C96841P678n07255R11706k1978L55088o94292l90974m4906M39532K28857
$$ 396841 404519 -102736 808970 786992 1142080 447788 56814 11908 451440 680297
8391F80297l30686N39232k98193k61215N72027K5296m37018L46087j130135P09392
$$ 680297 349611 888843 590650 329435 901462 926758 489740 835827 -294308 415084
8381D15084N0673Q2237R017m44921K3601N84380M7239j32677K70071l31007L58617
$$ 415084 465757 547994 557011 112090 135691 720071 767310 634633 904704 573697 932314
8370I32314m3385m6211O6077o28384j21890O91163K80380m03187j2619j04111
$$ 932314 888929 842718 908795 280411 158521 849684 1130064 726877 714258 610147
8360F10147L3824K41747n44717k57680P43993q4279l49795P96915m1760k56821
$$ 610147 643971 885718 341001 83321 827314 743035 393240 1190155 1148395 891574
8350H91574j75440M54776l11058o07103K01636L50841K6936J02534m04523J93930
$$ 891574 716134 1170910 859852 252749 454385 805226 832162 934696 530173 724103
8340G24103L95023L8394n19443j00270L59980K25381l4430R1985l85888L28530
$$ 724103 1119126 1157520 638077 537807 897787 1123168 1088738 1180723 794835 1123365
8330A123365L3369J09880J36736n25862K36522K43405n7198n53432m29133K70562
$$ 1123365 1156734 1266614 1403350 877488 1114010 1357415 1300217 746785 317652 588214
8320E88214L48855k91462K59547j9898J94789l29980l17085k43656k7503P453
$$ 588214 937069 645607 905154 885256 1080045 750065 432980 189324 161821 169274
8310A69274Q8239O01485P6021j96239K67967J24634o2593K10615Q2590m84233
$$ 169274 257513 858998 935019 738780 1006747 1131381 1068788 1279403 1361993 877760
8300H77760j363K5451N27852k22363J46243q6882j78214K5028l13165k32624N72800
$$ 877760 876397 901848 1429700 1207337 1353580 1266698 1088484 1113512 800347 567723 1140523
8289A140523n68431R868R53856k408j75307N4233L3992j30487L00497M2587K05819
$$ 1140523 572092 581960 1535816 1533408 1358101 1412334 1446326 1315839 1616336 1658923 1864742
8278A864742k00582m07784J31129N06906l02842n23602j74601N43843j04822l50849
$$ 1864742 1664160 1256376 1387505 1894411 1591569 1067967 893366 1437209 1332387 981538
8268I81538M60293K38442j097122K78140J94774L9707K01971k82897K28772N52345
$$ 981538 1441831 1680273 583151 861291 1056065 1095772 1297743 1014846 1243618 1795963
8258A795963m25397n25037M96247q4480j48064J207013j83651k32352J38235o4597
$$ 1795963 1370566 845529 1341776 1257296 1109232 2316245 2132594 1900242 2038477 1973880
8248A973880L34056q5554m2130N04761p72114p47006L03794M86004L20937l41824
$$ 1973880 2307936 2222382 2180252 2685013 1912899 1165893 1469687 1955691 2276628 1934804
8238A934804K7912Q39255m74993j196664M33452L97126o58207m29387J230244
$$ 1934804 1962716 2801971 2326978 1130314 1563766 1960892 1302685 873298 2103542
8229B103542L98531k58971l1148q4164L83814J39864j35095N62264K55851l15967
$$ 2103542 2502073 2243102 2211954 2127790 2511604 2651468 2516373 3078637 3334488 3018521
8219C018521m73417M94752O22033l12670L55109O66666j01655m23678n48133L09565
$$ 3018521 2545104 3039856 3661889 3349219 3704328 4370994 4269339 3845661 3297528 3607093
8209C607093j11368M4253P4436J62069m25282j61100K28006L68659o32279L49219
$$ 3607093 3495725 3539978 3614414 3776483 3351201 3190101 3418107 3786766 3154487 3503706
8199C503706l75430m58650J77096J04833j86350J25889q71933K655287K369457
$$ 3503706 3128276 2669626 2846722 2951555 2765205 2891094 2019161 4674448 7043905
8190G043905j394922j73957j45537L56835n55559J71424l16298J175J51185M47472
$$ 7043905 5648983 5475026 5329489 5686324 5130765 5302189 4985891 4987066 5138251 5585723
8180E585723O0357p1353J01198M64282n03513K56585O13594J50987N3735K11763
$$ 5585723 5646080 5574727 5675925 6140207 5636694 5893279 6506873 6657860 6711595 6923358
8170F923358J3178P21730K31518j080801j6499O34226m358K43539J3400K49574
$$ 6923358 6936536 7658266 7889784 6808983 6792484 7426710 7422352 7665891 7679291 7928865
8160G928865l09151m2765O07546O69067l83671j73662j98885N20615j08999M07924
$$ 7928865 7619714 7576949 8184495 8853562 8469891 8296229 8097344 8617959 8508960 8916884
8150H916884M18617N24233K44101q05203J023237k12162l12275M44726N89172
$$ 8916884 9335501 9859734 10103835 9298632 10321869 10109707 9797432 10242158 10831330
8141A0831330n1478P86097j74572K38969M62119j4178J06507O35793K84621J34120
$$ 10831330 10779852 11565949 11391377 11630346 12092465 12078287 12184794 12820587 13105208 13239328
8131A3239328k95564j74678M42674p7658M66655M30388j72518K63231K33372k70256
$$ 13239328 12943764 12769086 13211760 13134102 13600757 14031145 13858627 14121858 14355230 14084974
8121A4084974J90367L77364J60938K07890p6317K40079p5416N06606J13000L13405
$$ 14084974 14275341 14652705 14813643 15021533 14945216 15185295 15109879 15616485 15729485 16042890
8111A6042890j23428j84354K88439M43185J12714l54923k38374L67760O33020
$$ 16042890 15919462 15735108 16023547 16466732 16579446 16224523 15986149 16353909 16986929
8102A6986929k15949J34290o49317o7329k59994K58952k49625j12038j41276N0846
$$ 16986929 16770980 16905270 16255953 16188624 15928630 16187582 15937957 15825919 15684643 15735489
8092A5735489N48277r36072K43440j80040p01781L26445P783l40994L10441k54992
$$ 15735489 16283766 15347694 15591134 15411094 14709313 15035758 15043541 14702547 15012988 14757996
8082A4757996o44542q61584q4310O23614L07020o12383q54648M4671k00994Q6065
$$ 14757996 14113454 13251870 13167560 13791174 14098194 13485811 12631163 12675834 12474840 12560905
8072A2560905l54766N1782j05442o04500J4758O368r4146n12199n0144m6287n36335
$$ 12560905 12206139 12257921 12152479 11547979 11562737 11569105 11474959 10962760 10912616 10866329 10329994
8061A0329994M17816k45228R2149K12629o09560Q0222k63816m97676Q11872j06014
$$ 10329994 10747810 10502582 10594731 10807360 10197800 10278022 10014206 9516530 10328402 10222388
8051A0222388k88740J28972l00893J51770j3047n70562k17875L85883J2645j43828
$$ 10222388 9933648 10062620 9761727 9913497 9900450 9329888 9112013 9497896 9510541 9366713
8041I366713q00162K1318O52821m59753k37970J94297O57437o21432j49599p39599
$$ 9366713 8566551 8587869 9240690 8780937 8542967 8737264 9394701 8773269 8623670 7884071
8031G884071L93118J29573K42482K41853n22748O50014M8432j61085n47854O75625
$$ 7884071 8277189 8406762 8649244 8891097 8368349 9018363 9066795 8905710 8357856 9033481
8021I033481k68717M81609O8252L37662l14823J55879J36886L23120j97443n52561
$$ 9033481 8764764 9246373 9314625 9652287 9337464 9493343 9630229 9953349 9755906 9203345
8011I203345R79127m08394j73603L81109R10665j08099o52098K61232R29531l63168
$$ 9203345 10182472 9774078 9600475 9981584 10892249 10784150 10132052 10393284 11322815 10959647
8001A0959647K70618P90752O99051L56038M7014N90773N94813O53802M50415Q05638
$$ 10959647 11230265 12021017 12720068 13076106 13123120 13713893 14308706 14962508 15412923 16218561
7991A6218561N14102Q14193R23768J694625J218240J542917J872476K153466K566810
$$ 16218561 16732663 17546856 18470624 20165249 21383489 22926406 24798882 26952348 29519158
7982B9519158K157933L626282M291971M043865M862722N063270L690028L644934
$$ 29519158 31677091 35303373 39595344 43639209 48501931 53565201 57255229 60900163
7974F0900163J895059r82541m954154q612292p994264m573636k905856k076788
$$ 60900163 62795222 61812681 56858527 48246235 40251971 35678335 32772479 30695691
7966C0695691j134200n46476q39658R1755J108396Q24874J197275L7170J553147
$$ 30695691 29561491 29015015 28175357 28267112 29375508 30200382 31397657 31434827 32987974
7957C2987974Q02318J50807n34183j151554j689336j482358k136670j688054l87003
$$ 32987974 33790292 33941099 33406916 32255362 30566026 29083668 26946998 25258944 24871941
7948B4871941p64936n08604q14357M91465r4243M18196Q31962Q96338Q93803J178444
$$ 24871941 24107005 23598401 22784044 23275509 23181266 23599462 24431424 25327762 26221565 27400009
7938B7400009J377865J331681J243469J700191R67769J7121p73416j957806j553166
$$ 27400009 28777874 30109555 31353024 33053215 34020984 34038105 33264689 31306883 29753717
7929B9753717k195819j871607j623610m18774m49749o54007k22631J55446M66329
$$ 29753717 27557898 25686291 24062681 23643907 23194158 22540151 22317520 22472966 22939295
7920B2939295J08306J086262J406282J229603Q94565P72854N54898P66654p2018
$$ 22939295 23047601 24133863 25540145 26769748 27664313 28437167 28992065 29758719 29686701
7911B9686701j555234j519153j888354l107803k181869j898805j495185r53793
$$ 29686701 28131467 26612314 24723960 21616157 19434288 17535483 16040298 15086505
7903A5086505j405106p19365p03929j165292q30088o53597m08013J96775r24668
$$ 15086505 13681399 12962034 12258105 11092813 10262725 9609128 9201115 9397890 8473222
7894H473222q7405o19370l97513n2443M4646k41615p76555l82621n65046N80926
$$ 8473222 8385817 7766447 7368934 7316491 7361137 7119522 6342967 5960346 5395300 5976226
7884E976226k11371N5965k69160l04742l74874P0545o59692L10165J93954l11298
$$ 5976226 5764855 5820820 5551660 5246918 4872044 4942589 4282897 4593062 4787016 4475718
7874D475718k90968k36605M9103O5706L9661n03719L12439k34118R2759p27661
$$ 4475718 4184750 3948145 3997248 4062954 4102615 3598896 3911335 3677217 3769976 3042315
7864C042315l37301J69403J094720K55830m97307J08472p67483J64058n17723
$$ 3042315 2705014 2874417 3969137 4224967 3727660 3836132 3068649 3232707 2714984
7855B714984N75941J13043m00021l38410N67013l08213o2216L7601R360N93660
$$ 2714984 3290925 3403968 3003947 2665537 3232550 2924337 2862121 2899722 2909082 3502742
7845C502742o22274J84039k70446N22510p53072J59890j17393L86090J30184l14305
$$ 3502742 2880468 3064507 2794061 3316571 2563499 2723389 2605996 2992086 3122270 2807965
7835B807965J04914n75738Q8866M74062j60942p61523l30652L85506k08417l39540
$$ 2807965 2912879 2337141 2426007 2900069 2739127 1977604 1646952 2032458 1824041 1484501
7825A484501L90283J82388k74400M41442L17534n09642m35747K85872M66624m01527
$$ 1484501 1874784 2057172 1782772 2224214 2541748 2032106 1596359 1882231 2348855 1947328
7815A947328L2172K4207M64384j6237o94447k52276R41823o61711j72997L73188
$$ 1947328 1979500 2003707 2468091 2451854 1757407 1505131 2446954 1785243 1612246 1985434
7805A985434k79440M8001l914P05102o29568p65180K57662J12706J64864k30454
$$ 1985434 1705994 1753995 1750081 2455183 1825615 1060435 1318097 1430803 1595667 1365213
7795A365213P7066K26852O29938p44321j22134o1871N90697r1811L04434M07086
$$ 1365213 1442279 1669131 2299069 1554748 1432614 1370743 1961440 1869629 2174063 2581149
7785B581149j177350n71975K91035K85747P2008K59479L6575N94216p82089k21166
$$ 2581149 1403799 831824 1122859 1408606 1480614 1740093 1776668 2370884 1588795 1367629
7775A367629j70597Q67966J79997O2208p65849n57291j12423m74345R43360K62504
$$ 1367629 1197032 2064998 2244995 2307203 1541354 984063 871640 397295 1340655 1603159
7765A603159k82691J30348Q5495J05133m52551J48381K35048j79537K67275j29235
$$ 1603159 1320468 1450816 1536311 1641444 1188893 1337274 1572322 1392785 1660060 1530825
7755A530825l5521O39523q1776L42287k29773K7577n73124J15877P7860k18902
$$ 1530825 1495304 2134827 2053051 2395338 2165565 2193142 1620018 1735895 1813755 1594853
7745A594853R9646R8911j11378L29828N6153l78904m68426j27755N33654J13211
$$ 1594853 1694499 1793410 1682032 2011860 2068013 1689109 1220683 1092928 1626582 1739793
7735A739793m85644k41388N9683K32156M43091k87765p2703K87064P6961k00085
$$ 1739793 1254149 1012761 1072444 1304600 1747691 1459926 1387223 1674287 1751248 1551163
7725A551163q4461k56890J59217L18855L61568l10206L96106k22497j80345r5674
$$ 1551163 1466702 1209812 1369029 1687884 2049452 1739246 2135352 1912855 1732510 1636836
7715A636836K41311p7314k16897K4641j51969j10944R2858L13714N31585j57027
$$ 1636836 1878147 1800833 1583936 1608577 1456608 1345664 1438522 1752236 2283821 2126794
7705B126794l47296n49753K8858M24674j44761n19061K83645l02434O8725P16674
$$ 2126794 1779498 1229745 1258603 1683277 1538516 1019455 1303100 1000666 1069391 1786065
7695A786065o949m98180K17427l34859M58741m91937p8474J5933K12701K07228
$$ 1786065 1779116 1280936 1498363 1163504 1622245 1130308 1051834 1067767 1280468 1487696
7685A487696l24995M71995L559K16680l55353k6196k40969K86648P75611m2571
$$ 1487696 1162701 1634696 1638255 1854935 1499582 1473386 1232417 1519065 2294676 2252105
7675B252105m44457j99395O28940J33520o21858L41483O9179l31812K06185k7486
$$ 2252105 1807648 1608253 2237193 2370713 1748855 2090338 2159517 1827705 2033890 2006404
7665B006404j1775L34493Q2997N4017l74559J34028n44452N58925K43707j08463
$$ 2006404 1994629 2329122 2412119 2466136 2091577 2225605 1681153 2240078 2483785 2375322
7655B375322l51823L18653K51859K40261O045j09174K28658n5030K66544J3414
$$ 2375322 2023499 2342152 2594011 2834272 2840317 2731143 2959801 2904771 3171315 3184729
7645C184729l65198K19691j58006J25872l9361j32924P17264J46728p58988j68662
$$ 3184729 2819531 3039222 2881216 3007088 2967727 2834803 3552067 3698795 2939807 2771145
7635B771145k16095M54650N1893l2534M8811K4770N21408J2788Q7109p66174M00415
$$ 2771145 2555050 3009700 3061593 3029059 3077870 3102640 3624048 3636836 3723945 2957771 3358186
7624C358186k5638N08109k02549k91427K34957O00984N16944p23736L42791N90684
$$ 3358186 3332548 3840657 3638108 3346681 3581638 4182622 4699566 3975830 4318621 4909305
7614D909305j79006M96042n32875n07723L61564O35421O92349r7812k47736K67372
$$ 4909305 4730299 5226341 4693466 4185743 4547307 5182728 5875077 5777265 5529529 5796901
7604E796901M74735J17323n51446L02595L28470M45734K73085R08112K38035R2341
$$ 5796901 6271636 6388959 5837513 6140108 6468578 6914312 7187397 8095509 8333544 8425885
7594H425885K04401L11207q6747K03475N07147M30190P15268k71152Q20688J482775
$$ 8425885 8630286 8941493 8854746 9058221 9565368 9995558 10710826 10439674 11260362 12743137
7584A2743137M74827N33569P89096K90437J615715J181331J119794J108510J842914
$$ 12743137 13217964 13751533 14540629 14831066 16446781 17628112 18747906 19856416 21699330
7575B1699330K079779J967907K287672J701223J498004Q76670r3587j42607q27135
$$ 21699330 23779109 25747016 28034688 29735911 31233915 32110585 32016998 31874391 31047256
7566C1047256m51853P32829K87884Q72802J424225R13054J695715m83672r94826
$$ 31047256 30595403 31328232 31616116 32488918 33913143 34826197 36521912 36038240 35043414
7557C5043414j175394j740069k582787k309746k554170j340908j456932j288440
$$ 35043414 33868020 32127951 29545164 27235418 24681248 23340340 21883408 20594968
7549B0594968k53376J6967k57038n85536j18800k00339p01952J3552O17415O99991
$$ 20594968 20341592 20358559 20101521 19515985 19397185 19196846 18494894 18508446 19125861 19825852
7539A9825852Q9485K16099Q34282Q19549P66673O02705J594944K016464K117594
$$ 19825852 19915337 20131436 20965718 21785267 22551940 23154645 24749589 26766053 28883647
7530B8883647J942242K508185J864683J184051J271620Q56194n67562j057076
$$ 28883647 30825889 33334074 35198757 36382808 37654428 38510622 37943060 36885984
7522C6885984l58119P72339J94875Q29896J728482K422578J105377J029509O32937
$$ 36885984 36527865 37300204 37495079 38324975 40053457 42476035 43581412 44610921 45243858
7513D5243858L48969o10566k210034j922231j346099k248530j200861k244919
$$ 45243858 45592827 44982261 42772227 40849996 39503897 37255367 36054506 33809587
7505C3809587j735733k325660j645057m55580j62863n17925p74371O02380p1115
$$ 33809587 32073854 29748194 28103137 27647557 27484694 26966769 26192398 26794778 26723663
7496B6723663j046552j599035j057156q74749o93898j642678r89899q22178m10190
$$ 26723663 25677111 24078076 23020920 22146171 21452273 19809595 18819696 17997518 17587328
7487A7587328q08572k45809p6899M5468N81439m15683o4884J84409Q33215P45274
$$ 17587328 16778756 16532947 16456048 16501516 17082955 16667272 16602388 16786797 17620012 18365286
7477A8365286P25988N07637M97373K51827P35873K022098J200077J797630K028225
$$ 18365286 19091274 19598911 20096284 20348111 21083984 23106082 24306159 26103789 28132014
7468B8132014K780791J544389J574823J498078J335571k60434j113170j276683
$$ 28132014 30912805 32457194 34032017 35530095 36865666 36605232 35492062 34215379
7460C4215379j490955j400589q63406J63684M70715o00784p97964K27621j034623
$$ 34215379 32724424 31323835 30460429 30624113 31094828 30494044 29696080 29923701 28889078
7451B8889078j966801j478695j288430k145156k240759j952316r85895q02818
$$ 28889078 26922277 25443582 24155152 22009996 19769237 17816921 16831026 16028208
7443A6028208j004179k61563q6869j042170j361829q1716N84891k03577o82952
$$ 16028208 15024029 14762466 14675597 13633427 12271598 12189882 12774773 12571196 11888244
7434A1888244L08363J99212L0566o92255J86266J298397P80223N68693k1555J199098
$$ 11888244 12196607 12395819 12426385 11734130 11920396 13218793 13999016 14567709 14546154 15745252
7424A5745252Q35992J016151O98875Q50283L21247k3736j034716q56024j184726
$$ 15745252 16581244 17597395 18296270 19146553 19467800 19444064 18409348 17553324 16368598
7415A6368598n78965m37737M16333O8101l28135l3062m60922k01243r60399r07543
$$ 16368598 15789633 15351896 15768229 15836330 15508195 15475133 15014211 14812968 13852569 12945026
7405A2945026j389398j008799j130840j419213k56177n42176o76074j98214l61274
$$ 12945026 11555628 10546829 9415989 7996776 7740599 7198423 6522349 6324135 5962861
7396E962861p71251k95100n5328j84348J5668j37639J68371Q3034J07262l74091
$$ 5962861 5191610 4896510 4841182 4656834 4672502 4534863 4703234 4786268 4893530 4519439
7386D519439m33106J32340J84684o31215l15191K3373L25252J87228k84054m06932
$$ 4519439 4086333 4218673 4403357 3772142 3456951 3480324 3805576 3992804 3708750 3301818
7376C301818O6413j10537J10430J98158j34992k95239p3143l31412L29785n65746
$$ 3301818 3368231 3257694 3368124 3566282 3431290 3136051 3062908 2731496 3061281 2495535
7366B495535O2227N08363J51397p19801l25923L83438N0046j29455l62577l01882
$$ 2495535 2557762 3066125 3217522 2497721 2171798 2555236 2605282 2475827 2113250 1811368
7356A811368K20945j64440l26878M81318l5381j25940Q3495Q895L62321j01344
$$ 1811368 2032313 1867873 1540995 2022313 1986932 1860992 1944487 1953382 2315703 2214359
7346B214359j65007k27524k01863m24071o9036K06760N45959n34907q32016M24300
$$ 2214359 2049352 1821828 1619965 1195894 1126858 1333618 1879577 1344670 512654 936954
7336I36954L21186K44285j92251O1336o47744J26805L33042M96629m85159l36434
$$ 936954 1258140 1502425 1310174 1371510 723766 850571 1183613 1680242 1195083 858649
7326H58649l76012q5804N17942K81717k36136k24301n9057N85990L38330l3687
$$ 858649 482637 396833 914775 1196492 960356 736055 676998 1262988 1601318 1567631
7316A567631K2125n2929k89703J92577O84068l6527k88217l34881m43616J52531
$$ 1567631 1589756 1536827 1247124 1439701 2123769 2087242 1799025 1464144 1020528 1173059
7306A173059k34862p4666J04749o049M9543l5304L02080o90758k27985j10056
$$ 1173059 938197 863531 968280 962231 1011774 976470 1278550 587792 359807 249751
7296B49751L94265L26880p8726o3607p1037k68986k26068K59494l07201K83081
$$ 249751 644016 970896 892170 828563 757526 488540 262472 521966 214765 497846
7286D97846m0115J49543N77305j180656k28179L61860M84029m30992J79481m1658
$$ 497846 457731 607274 1184579 3923 -224256 137604 621633 190641 370122 328464
7276C28464k5815N2878j5685k43698K0279J94994j43957L61420j88596o91609
$$ 328464 302649 355527 339842 96144 116423 311417 167460 528880 340284 -351325
7266c51325k02653L98402j42885q7206M4248Q96879L54189N3619m32315l85908
$$ -351325 -553978 -155576 -298461 -385667 -341419 555460 909649 963268 530953 145045
7256A45045M68856K40284J39391j68940L53640k68459n12528O85930q70489q8337
$$ 145045 613901 854185 993576 824636 1178276 909817 397289 1083219 212730 124393
7246A24393M91000M53852n90056l58119q040j74711K89644P33219l14407p8636
$$ 124393 615393 1069245 479189 121070 113030 -61681 227963 961182 646775 568139
7236E68139J34449k00241j95598q6121k69819o7770J51461K74933K46569l14183
$$ 568139 702588 502347 306749 220628 -49191 -116961 34500 309433 556002 241819
7226B41819K9908J7280l38982K0122L59951P23569n67686k5959j21034j31220
$$ 241819 271727 289007 -49975 -29853 330098 1053667 485981 460022 338988 207768
7216B07768N30022m37573k0805k00607J51586j24950J33522k16924l58117l16300
$$ 207768 737790 300217 279412 78805 230391 105441 238963 22039 -336078 -652378
7206f52378J23371O69103N00086k501L59638m61450L2277m7101m22654j70546
$$ -652378 -529007 140096 640182 637681 997319 535869 568146 521045 98391 -72155
7196g2155K58028p2508J16856L84130j71640m87750Q17502j57650N5782K34320
$$ -72155 185873 113365 230221 614351 442711 -45039 772463 614813 670595 904915
7186I04915L9k62907k73863O13008l81268j74081L44085J27840j47037q15893
$$ 904915 904954 642047 368184 981192 599924 425843 769928 897768 750731 -65162
7176f5162Q5929M09624k73378l69467K69040L59742j01454k09866M31131r8388
$$ -65162 20767 430391 157013 -212454 56586 416328 314874 105008 536139 437751
7166D37751m65466J26890K46244l69778j72646k78240N8664N10493j8922m64114
$$ 437751 -27715 99175 345419 -24359 -197005 -475245 -416581 93912 74990 -389124
7156c89124k27242R58900k81698l22882P5471K01331J1733j93345J93568J17590
$$ -389124 -616366 342534 60836 -262046 -186575 14756 26489 -166856 26712 144302
7146A44302j49089N94451k47526R5138m25549k6637O71123O21003o15856O6353
$$ 144302 -4787 589664 342138 437276 11727 -14910 656213 1277216 661360 727713
7136G27713M39316l30181n91431Q4594K00124k15990J29943L19931j22032j32160
$$ 727713 1167029 836848 245417 330011 530135 314145 444088 764019 641987 509827
7126E09827O1747k08764K88958M63654q88838m3086N31344j31287p58898J37471
$$ 509827 571574 362810 651768 1115422 226584 183498 714842 583555 -175343 -37872
7116c7872K37338j29749j9538P7925O32516n67819m99823N05434q8260n38152
$$ -37872 199466 69717 50179 128104 760620 192801 -307022 198412 110152 -428000
7106d28000L29307J91961L44572n90188q0150K27871L55698j90066j91244O67293
$$ -428000 -98693 93268 437840 -152348 -232498 -4627 351071 161005 -30239 637054
7096F37054l87103P6545k01877n20101M77988j81071P9421O88396M13998n98782
$$ 637054 249951 326496 124619 -395482 82506 -98565 -19144 669252 1083250 484468
7086D84468o4645Q2311R19421o40673j29318M41034j79091j004027j21062J001913
$$ 484468 419823 502134 1421555 780882 651564 1092598 913507 -90520 -211582 790331
7076G90331q57092m30445P16993L35283o20651O21107K26769k53256J16286M036
$$ 790331 -66761 -497206 219787 555070 -65581 555526 782295 529039 645325 649361
7066F49361K99318j60862k64469Q2996M3456J0055P13705q16094k32290k48105
$$ 649361 948679 787817 523348 606344 649800 659855 1373560 557466 325176 77071
7056G7071k10745K40841K10346K56051n42707N94162R7253k80779n40660k13142
$$ 77071 -133674 107167 317513 573564 30857 625019 722272 441493 -99167 -312309
7046c12309K48322M10846j27911n71255k1181j57497M12911O50814J17632m33325
$$ -312309 -63987 346859 218948 -352307 -373488 -530985 -118074 532740 650372 217047
7036B17047K83296O2013n29001J28914O87294M48021p84493L57902L23280J20197
$$ 217047 500343 562356 33355 162269 849563 1297584 513091 870993 1194273 1314470
7026A314470n88328k18335m37552q2888M36590L20535j02504k06134k16440M03342
$$ 1314470 726142 507807 70255 -12633 423957 744492 641988 435854 219414 622756
7016F22756R75252j14350p45235m0890k08109l11251O05031k60788k51839p07723
$$ 622756 1598008 1483658 738423 697533 489424 178173 783204 522416 270577 -437146
7006d37146R0702J057418j55651j52000O9594j9746K94861k48518n118M39181
$$ -437146 -346444 710974 555323 403323 472917 453171 748032 499514 494396 933577
6996I33577J42947j51668n6773j1267l46123n82154M6405M80377k80748k07092
$$ 933577 1076524 924856 868083 856816 510693 -71461 -25056 455321 174573 -32519
6986c2519P9045N63012l53723l5531L43013L4176m79531L65124K2187J92580K19188
$$ -32519 46526 609538 255815 220284 563297 597473 117942 483066 505253 697833 917021
6975I17021o71763J56844K23453l03226m31228N55200J29950l55975J94005Q74320
$$ 917021 245258 402102 625555 322329 -108899 446301 576251 220276 414281 1288601
6965A288601l9035j158189k3937P19320M86485K93158m73926k3182j47402m35927
$$ 1288601 1249566 91377 67440 786760 1273245 1566403 1092477 1069295 921893 485966
6955D85966M47617J81701m9235o31201r479N24612n43578J94472K04809Q7848
$$ 485966 933583 1115284 1066049 434848 425369 949981 406403 600875 805684 893532
6945H93532k68914m72214P2693N89589k73190o9500k44764K62071K01506k15213
$$ 893532 624618 152404 225097 814686 541496 471996 227232 489303 690809 475596
6935D75596l83753r5382j35507K48231M74311m3520j27973m5605l2537J20279
$$ 475596 91843 -3539 -139046 109185 583496 539976 412003 366398 333861 454140
6925D54140j44447K09409L81650q2009o4012L24977k73926O7272J73861k17363
$$ 454140 309693 519102 900752 818743 754731 1079708 805782 873054 1046915 829552
6915H29552l26953m14527J116305J1516l32498N84322l36096K53246k41557j48728
$$ 829552 502599 88072 1204377 1215893 883395 1467717 1131621 1384867 1143310 994582
6905I94582J24762k12080M73263j14466l09812L93747k7542l98859M24892n25519
$$ 994582 1119344 907264 1380527 1266061 956249 1349996 1322454 923595 1348487 822968
6895H22968Q6455J53314l6P4912l51960m38197O41161K78802k2656m36705l96657
$$ 822968 909423 1062737 1062701 1137613 785653 347456 988617 1267419 1244763 808058 411401
6884D11401M40237j81294M63736p22181o53569J098615J01743K03058m9475j16790
$$ 411401 851638 670344 1134080 411899 -241670 856945 958688 1161746 1112271 995481
6874I95481J08607k73699N2520L6294q0767P29746j28584j3462n87294J41975
$$ 995481 1104088 830389 882909 919203 838436 1568182 1439598 1426136 838842 980817
6864I80817R35843j19858n09481l93040k6806l75322M78004R7809k6002j14984
$$ 980817 1916660 1796802 1287321 894281 867475 492153 970157 1067966 1041964 926980
6854I26980M56072L55474o39245j59472R5643o6741k49941J078320m19624q0072
$$ 926980 1383052 1738526 1099281 939809 1035452 968711 718770 1797090 1377466 1297394
6844A297394M92043n3907m5891K41055M2612O1277O5451l55381N3476k41778Q56767
$$ 1297394 1789437 1735530 1689639 1930694 1973306 2034583 2100034 1744653 1798129 1556351 2413118
6833B413118K23074K44289j87596k06021J05454J19463J80463o70231m18964j87772
$$ 2413118 2636192 2880481 2692885 2486864 2592318 2711781 2892244 2222013 1803049 1615277
6823A615277n02926O31955J0063m49756O42357J12401r52275K42365L07393k61987
$$ 1615277 1112351 1744306 1754369 1304613 1946970 2059371 1107096 1349461 1656854 1394867
6813A394867l7009K53289q6324M3954K54263M44413r0298p5885J96098J32187
$$ 1394867 1357858 1611147 1524823 1568777 1823040 2267453 2177155 2101270 2297368 2429555
6803B429555p3605k95806K79749k26269R28228O49766l35847k48305R7846J93599
$$ 2429555 2355950 2060144 2339893 2113624 3041852 3691618 3355771 3107466 3205312 3398911
6793C398911j3745L7593o58954k18986j28496K35382M94435k56082L36720L4787
$$ 3398911 3385166 3422759 2763805 2544819 2416323 2651705 3146140 2890058 3226778 3261565
6783C261565j45195j30909L80460k00547M26668Q45669k57485J39790J11551j85590
$$ 3261565 3116370 2985461 3365921 3165374 3592042 4437711 4180226 4320016 4431567 4245977
6773D245977K29666M64946N72457m31709q37072m2562j55424M23749l22544N6539
$$ 4245977 4475643 4940589 5513046 5081337 4244265 4201703 4046279 4470028 4147484 4204023
6763D204023N07409k50131l4469k94196k07511K5452j00504L30934k01852K4844
$$ 4204023 4711432 4461301 4426832 4132636 3925125 3950577 3850073 4181007 3979155 4003999
6753D003999N10737J14828j43712N41444j41915J98812o03933M42669R27888k12401
$$ 4003999 4514736 4629564 4485852 5027296 4885381 5084193 4480260 4922929 5850817 5638416
6743E638416L8810J89439J57597o31120l7937K00103L47981m00159l05881k43889
$$ 5638416 5677226 5866665 6024262 5393142 5355205 5555308 5903289 5503130 5197249 4953360
6733D953360j09621J33630N63949L24812l19913J13204M38567K99637l29389o52905
$$ 4953360 4843739 4977369 5541318 5866130 5546217 5659421 6097988 6397625 6068236 5415331
6723E415331K93145R94488o11744m52890L23211l11050M90579m6867O62786k36171
$$ 5415331 5708476 6702964 6091220 5638330 5961541 5650491 6141070 6094203 6756989 6520818
6713F520818j85016J01404k36349K81764M63221o4642K4557N9274m04902j29139
$$ 6520818 6335802 6437206 6200857 6482621 6945842 6881200 6905757 6965031 6560129 6430990
6703F430990P72601N05573q28152J18963K90309m19815L50558K05385J43969Q2773
$$ 6430990 7203591 7709164 6881012 6999975 7290284 6870469 7221027 7426412 7570381 7653154
6693G653154K06502K76022n80253L9917M00067Q6567P53735L50802n39272O61319
$$ 7653154 7859656 8135678 7555425 7595342 7995409 8081976 8835711 9186513 8647241 9308560
6683I308560k96001M03695N3244K65828N08026l48899J67622M25723N80234L80171
$$ 9308560 9012559 9416254 9469498 9735326 10243352 9894453 10062075 10487798 11068032 11448203
6673A1448203o9769K76042K12145O6795Q13255j34694K64481L24771L49235O34719
$$ 11448203 11378434 11654476 11866621 11933416 12746671 12611977 12876458 13201229 13550464 14185183
6663A4185183M10187o6318J4259N39253O50592L42311j20388L22402P01047k47013
$$ 14185183 14595370 14529052 14543311 15082564 15733156 16075467 15955079 16277481 16978528 16731515
6653A6731515O19551N7128j53443k38256n1524N84858J71444k6242J72210Q03560
$$ 16731515 17351066 17408194 17254751 17016495 16964971 17549829 17721273 17695031 17867241 18670801
6643A8670801k1052o15117p2821J017898K7213j85881K99067n1396K81771K69843
$$ 18670801 18649749 18034632 17961811 18979709 19006922 18821041 19120108 19068712 19350483 19620326
6633A9620326K13003R68870J51069N55739N33546k26053J03388N22756R46655
$$ 19620326 19833329 20802199 20953268 21509007 22042553 21816500 21919888 22442644 23389299
6624B3389299Q38414j74803L23178P42198O11760K98086O47523J4288P00620J027901
$$ 23389299 24227713 24052910 24376088 25118286 25730046 26028132 26675655 26689943 27390563 28418464
6614B8418464M75064K77627l0598P56790J231535J120247l8662M14504P29816
$$ 28418464 28893528 29171155 29140557 29897347 31128882 32249129 32210467 32624971 33354787
6605C3354787K91454N20960Q51192L42119N86064K59354Q42838O45670J09723
$$ 33354787 33646241 34167201 35018393 35360512 35946576 36205930 37048768 37694438 37804161
6596C7804161Q40869Q96159O01757n79329O03797J287439P67846M82628P04973
$$ 37804161 38645030 39541189 40142946 39563617 40167414 41454853 42222699 42705327 43410300
6587D3410300J848740Q54570L86017Q73044R87906Q29302Q79681J345003J516970
$$ 43410300 45259040 46113610 46499627 47372671 48360577 49189879 50069560 51414563 52931533
6578E2931533Q28856J166867J450145K257008J593422Q18987K327834K319033
$$ 52931533 53760389 54927256 56377401 58634409 60227831 61046818 63374652 65693685
6570F5693685J135712J528937K611560J849472K719708K151567K234051K946537
$$ 65693685 66829397 68358334 70969894 72819366 75539074 77690641 79924692 82871229
6562H2871229K610676L097248L250371L073120L162006L404247L888936L863626
$$ 82871229 85481905 88579153 91829524 94902644 98064650 101468897 105357833 109221459
6554A09221459M296429M970267M840355N099042N226284O256764O330220O371144
$$ 109221459 113517888 118488155 123328510 128427552 133653836 139910600 146240820 152611964
6546A52611964O863491P265544P725420R130610R715188R147855J0558814J0455057
$$ 152611964 159475455 166740999 174466419 183597029 193312217 202460072 213018886 223473943
6538B23473943J1526160J2353918J1973216J2772690J3169520J3571448J3570788
$$ 223473943 235000103 247354021 259327237 272099927 285269447 298840895 312411683
6531C12411683J3837414J3751937J3323567J2628815J1223715R817342Q152066
$$ 312411683 326249097 340001034 353324601 365953416 377177131 386994473 395146539
6524C95146539M810389L352927J509986j807460m849454p833434j0001931j1755190
$$ 395146539 399956928 403309855 404819841 403012381 398162927 390329493 380327562 368572372
6516C68572372j3278597j5222437j5538337j6203996j5691808j6009848j6049806
$$ 368572372 355293775 340071338 324533001 308329005 292637197 276627349 260577543
6509B60577543j4956162j4537199j2722627j2098470j1408226j1368996r669028
$$ 260577543 245621381 231084182 218361555 206263085 194854859 183485863 173816835
6502A73816835q829502q947522p733229p642357p182289o201323n877512o315962
$$ 173816835 164987333 156039811 148306582 140664225 133481936 127280613 121403101 115087139
6494A15087139m837172m496928m402409m327575m003148l816394m200609k764471
$$ 115087139 110249967 105753039 101350630 97023055 93019907 89203513 85002904 82238433
6486H2238433l093224k972728l065059k664063l221683j532857k250178k824272
$$ 82238433 79145209 76172481 73107422 70443359 67221676 65688819 63438641 60614369
6478F0614369k368812j927625j819546k064929j635109j817782q60392j543065
$$ 60614369 58245557 56317932 54498386 52433457 50798348 48980566 48120174 46577109
6470D6577109j812905j661301j935053r27772j418836j355014r52587j327708
$$ 46577109 44764204 43102903 41167850 40240078 38821242 37466228 36513641 35185933
6462C5185933k14384q41286j489355j142372q96629k76502q04965j465325o09301
$$ 35185933 34971549 34130263 32640908 31498536 30601907 30325405 29520440 28055115 27445814
6453B7445814o40898l68243q95149n18032o87841p06213l55029p07773p09887
$$ 27445814 26804916 26436673 25541524 25023492 24335651 23629438 23274409 22566636 21856749
6444B1856749m50975l15476l65207k88318p52760m47552L45223m99702k23722
$$ 21856749 21405774 21090298 20725091 20436773 19684013 19236461 19581684 19081982 18858260
6435A8858260n7246j167855r79838K31886o2790r3156j298685q3380L66382n09515
$$ 18858260 18801014 17633159 16653321 16885207 16822417 16729261 15430576 15347196 15713578 15204063
6425A5204063k01683N87356m32856p94858L60p33889m12163o76524m61575O36344
$$ 15204063 15002380 15589736 15156880 14362022 14362382 13628493 13216330 12539806 12078231 12714575
6415A2714575p8433r49022m1093o93756J9138k90953j90745k42023n51956O3526
$$ 12714575 12636142 11687120 11646027 10952271 10971409 10680456 10489711 10247688 9695732 9759258
6405I759258l36833p9787o1494m02572L19734o5301k24512j153779l32538N86172
$$ 9759258 9422425 9342638 9281144 8878572 9198306 9133005 8908493 7754714 7422176 8008348
6395H008348k08353K68739o6640n66230L84658j92081o45698O9617q4742J08156
$$ 8008348 7799995 8068734 8002094 7435864 7820522 7628441 6982743 7052360 6967618 7075774
6385G075774k11445m18824R3672L46047k14432j99543j90167k84348k36757J50106
$$ 7075774 6864329 6445505 6539177 6885224 6670792 6471249 6281082 5996734 5759977 5910083
6375E910083L32353k66213n98924j20313P32207p0960j089434k4368K969L88567
$$ 5910083 6242436 5976223 5377299 5256986 5989193 5918233 4828799 4804431 4807400 5195967
6365E195967o96852k27800p7113m12735J27289j9035r8018j13884m63429j41646
$$ 5195967 4499115 4271315 4194202 3781467 3908756 3889721 3791703 3677819 3214390 3072744
6355C072744M75679J33653m42225K47836M25827p26651k73007K83318j15985K7916
$$ 3072744 3548423 3682076 3239851 3487687 3913514 3186863 2913856 3197174 3081189 3109105
6345C109105J93491k42415j68078K32001k98979K57883l5297j8455j29675n4226
$$ 3109105 3302596 3060181 2892103 3124104 2825125 3083008 3047711 3029256 2899581 2845355
6335B845355K16974O9084l7124n1845l57932k52550j50533R8021K4394l32437
$$ 2845355 3062329 3131413 3094289 3042444 2684512 2431962 2281429 2379450 2403844 2071407
6325B071407L41894m18373K94009j29474K0348J50165K59055L8257k91336L0864
$$ 2071407 2413301 1994928 2288937 2159463 2179811 2329976 2589031 2627288 2335952 2366816
6315B366816J83975J76371k57551q2756k06973k3627O07715k00451j46733k75180
$$ 2366816 2550791 2727162 2469611 2386855 2179882 2156255 2763970 2563519 2416786 2141606
6305B141606K13112K26361J12976n69393l36151k45474M42334L11105K38371r73924
$$ 2141606 2354718 2581079 2694055 2124662 1788511 1543037 1985371 2296476 2534847 1560923
6295A560923r9882j2593j81749j48956K9946Q3762J49813j02994k61069N31k57741
$$ 1560923 1461041 1448448 1266699 1117743 1147689 1231451 1381264 1278270 1017201 1017732 759991
6284G59991O23651n5525o44339K32724n39066l35110O06310k67300Q18352k9559
$$ 759991 1383642 1328117 683778 916502 377436 42326 648636 381336 1199688 1170129
6274A170129N6618K30222l74044j0137l97910M56138K95465l49397o9230J15938
$$ 1170129 1226747 1456969 1082925 1072788 674878 1131016 1426481 1077084 1007854 1123792
6264A123792M71106o55451k16814J47537j1753j6438L65089j05669M06688m75939
$$ 1123792 1594898 939447 722633 870170 858417 841979 1207068 1101399 1508087 1032148
6254A032148p19605L87179O88765l92823n1158j69729L14586n7972n97708K46073
$$ 1032148 312543 699722 1388487 995664 944506 774777 1089363 1031391 433683 679756
6244F79756j81108j71566j1021M03415k12761n95418K50710j50710L29607N8529
$$ 679756 498648 327082 316061 719476 506715 -88703 162007 11297 340904 399433
6234C99433K05678J71648q8850j11287L38826j1115k53609l82848L12850L71267
$$ 399433 605111 776759 687909 576622 915448 904333 650724 267876 580726 951993
6224I51993n09583k58254j64799L17879m268j35042P2758M44751j97285m68908
$$ 951993 442410 184156 19357 337236 332968 197926 270684 715435 518150 49242
6214D9242n3991N46249j67670J50978J5210j11002k7892J95466k66327L77870
$$ 49242 -4749 541500 373830 524808 540018 429016 401124 596590 330263 708133
6204G08133l93429O58070L07827P0540l7978m99339M91833K46295q39661n24637
$$ 708133 314704 972774 1280601 1351141 1313163 813824 1305657 1551952 712291 187654
6194A87654L00960K64268j45054k01508O2601k416K32476l41189J34462N3355
$$ 187654 488614 752882 607828 406320 468921 466505 698981 357792 492254 545609
6184E45609k34589R4629k01751P7753m2046l7866K04302k39291R7731r8265K0230
$$ 545609 311020 405649 203898 281651 239605 201739 406041 166750 264481 166216 186446
6173A86446m0774M2902m80166M42602O0370k20178k30404L13087L9969j41388
$$ 186446 145672 188574 -291592 151010 211380 -8798 -239202 73885 113854 -27534
6163b7534J5385M68032j99524p9209J96015M13894m03993m96677K50437L87759
$$ -27534 -12149 455883 256359 177150 373165 787059 383066 -113611 136826 524585
6153E24585N52535j05589l31004j4080N3454K86940k25345k47233J98236K76750
$$ 524585 1077120 971531 640527 626447 679901 966841 741496 494263 692499 969249
6143I69249Q9727j7926p19917N0836K69461n05905m5834j15304N97157K48810
$$ 969249 1058976 1041050 321133 371969 641430 135525 89691 -25613 571544 820354
6133H20354N8534j38703m88504N11138K73253k32424j55482n6602K11595m53699
$$ 820354 878888 740185 251681 762819 1036072 803648 648166 591564 803159 349460
6123C49460M04174J17796p96139K79523R5438m18322L0548n89144K12874o7709
$$ 349460 753634 871430 75291 354814 450252 31930 62478 -526666 -313792 -381501
6113c81501L65730L21398k26570J3067K51744n43581q9841k83165N34756Q1022
$$ -381501 -15771 305627 79057 92124 343868 -199713 -289554 -572719 -37963 43059
6103D3059j8949R9033o46630N0109J65399J32961M61564k75731J80660N87628
$$ 43059 24110 123143 -523487 -473378 -307979 -175018 286546 10815 191475 779103
6093G79103o47810o40120Q06986L24067j11735l12539L84375m4128q1005k54732
$$ 779103 131293 -508827 298159 622226 510491 197952 582327 538199 457194 202462
6083B02462o16701J66640l612M70700Q6896m60425j71128j01294P73540L00000
$$ 202462 -414239 -247599 -251211 219489 306385 -154040 -325168 -426462 347078 647078
6073F47078p916j86542K31281N7772q55929j03349o9823L41157N6166J99734k14400
$$ 647078 639162 452620 683901 741673 -114256 -217605 -287428 53729 109895 309629 95229
6062I5229j57848m83128J0309M49154m71326o12335Q36924J98839o0913n24042
$$ 95229 -62619 -545747 -535438 -86284 -557610 -1169945 -333021 -134182 -195095 -719137
6052g19137k97130K02026O88409J34819k03293K23796r4727K15227J4535n97318
$$ -719137 -1016267 -814241 -125832 8987 -194306 29490 -65237 149990 164525 -432793
6042d32793l66119L10881K82555M1429n90660k02588J037059j26093m30430k4041
$$ -432793 -798912 -488031 -205476 -164047 -754707 -957295 79764 -46329 -476759 -500800
6032e00800N18521M33635l65976J86038n05801k63632k6773M82390J91043o24512
$$ -500800 17721 451356 85380 271418 -234383 -498015 -524788 -42398 148645 -475867
6022d75867J27963O1198l2683l8700N1419K76405L63912l69519q4974J49045k3190
$$ -475867 -347904 -286706 -319389 -358089 -306670 -30265 333647 -35872 -120846 28199 5009
6011E009o9717p0957K38784K76942k47019j71326M02645N1747p84294l91603N66498
$$ 5009 -64708 -135665 103119 380061 133042 -38284 364361 416108 -368186 -759789 -193291
6000a93291L63549m60415m32329P62844R1714K74528k52065o24195N47127m79587
$$ -193291 170258 -290157 -722486 40358 132072 406600 154535 -469660 77467 -402120
5990d02120L39248J48221l05832J1522R9396o0797L4254l73363K05329J91551
$$ -402120 -62872 85349 -220483 -208961 -109565 -170362 -136108 -509471 -304142 -112591
5980a12591k52512J7558O80715L12403r91135j24658J33475K65942J8084j35043
$$ -112591 -365103 -347545 333170 645573 -345562 -470220 -336745 -70803 -52719 -187762
5970a87762o04447K14922O37556k65616n02266R7128K33232j65005O4075N86529
$$ -187762 -792209 -577287 60269 -205347 -707613 -610485 -377253 -542258 -478183 108346
5960A08346J77482j00146K72226l32900p4577N9765o7177r0348L65218l72568
$$ 108346 285828 185682 457908 125008 50431 110196 43019 -47329 317889 -54679
5950e4679m07620L86652n39492P86586Q4895k13075k86161l61723L88838r0822
$$ -54679 -462299 -75647 -615139 171447 256342 43267 -242894 -604617 -215779 -306601
5940c06601j36528N93355o30078L62907M37126q90533l27473Q6839L30408J0242
$$ -306601 -443129 150226 -479852 -116945 320181 -570352 -897825 -810986 -480578 -470336
5930d70336R4462L05242J29146k57577J51251n32787M77146P10611j41906p83693
$$ -470336 -375874 -70632 58514 -199063 -47812 -580599 -103453 607158 465252 -318441
5920c18441l33023J005356o10185p8286O82312p03758k28659M67966P4654K95156
$$ -318441 -651464 353892 -256293 -334579 347733 -356025 -584684 -116718 -42064 253092
5910B53092k44021l84664j03133P93871J6187l00129k22533o12283L33845O0284
$$ 253092 9071 -375593 -478726 315145 331332 31203 -191330 -803613 -469768 -409484
5900d09484N79921p519n46490k79794K26080l78398L16465K01346r6392L76877
$$ -409484 170437 162918 -383572 -663366 -437286 -815684 -499219 -297873 -394265 -17388
5890a7388o25536k43164K12655l03083j73806J76045L88590N88777m33382M9232
$$ -17388 -642924 -886088 -673433 -976516 -1150322 -974277 -585687 3090 -430292 -381060
5880c81060J71369Q6606m25823l75412Q01554j23872m9671j92907R3713J20194
$$ -381060 -209691 -123085 -548908 -924320 -122766 -246638 -296309 -489216 -395503 -275309
5870b75309O6278j02520j7165r8795k10435q902J41081k01478l87607N13796O85926
$$ -275309 -209031 -311551 -328716 -427511 -637946 -646848 -505767 -707245 -1094852 -581056 104870
5859A04870l83795m47154R1099J57894l9634k14301m25638K77450N16947r5793
$$ 104870 -278925 -726079 -634980 -477086 -516720 -731021 -1156659 -879209 -362262 -458055
5849d58055l15732q714K60692K34629J82075J75036L90609q21675L0614m68935
$$ -458055 -773787 -782501 -521809 -287180 -105105 69931 460540 -361135 -330521 -799456
5839g99456N7143O12606L30067J02077j17552l37788J75775J35599j36780m49112
$$ -799456 -742313 -129707 200360 302437 184885 -152903 22872 158471 21691 -427421
5829d27421O4217n8848J5014N02378j59779l77459j25816k9896J58018K94093
$$ -427421 -363204 -422052 -407038 95340 -64439 -441898 -567714 -597610 -439592 -145499
5819a45499o50432l18590N11743L48441n63620k23536P50595r8740L04551J81310
$$ -145499 -795931 -1114521 -602778 -254337 -817957 -1041493 -290898 -389638 -85087 96223
5809I6223m25948j45977q6130K61146k65344M3885L47902J27176J43024p5262
$$ 96223 -329725 -475702 -561832 -300686 -566030 -522145 -174243 -47067 95957 20695
5799B0695n50573L7456P21196k61531m87214J49852P73672j46035n29561K67053
$$ 20695 -529878 -492422 228774 -32757 -519971 -370119 403553 257518 -272043 -4990
5789d990R5048L55920l58360l78222j24950j89632j04845O98153l05619L3606
$$ -4990 90058 445978 87618 -290604 -415554 -605186 -710031 -11878 -317497 -283891
5779b83891q51155J60796P48492p3235n64303J28674M83635K98385J25664j6656
$$ -283891 -1135046 -974250 -225758 -298993 -863296 -734622 -250987 47398 173062 156406
5769A56406l55744K7516J98848k67171r1712m19496L04342K39742J24344m23110
$$ 156406 -199338 -171822 27026 -240145 -331857 -751353 -447011 -207269 -82925 -506035
5759e06035l05508Q26297L43238n28061m58433M05192L21129m05840m70364n3940
$$ -506035 -811543 14754 357992 -170069 -628502 -223310 97819 -308021 -778385 -832325
5749h32325L77935J83386J55648m54705p175n725L90209N68280j96049l45009
$$ -832325 -454390 -271004 -115356 -570061 -577236 -582961 -192752 375528 179479 -165530
5739a65530q8459j59188J39978k27977P19577l6504p17929N57913j55989j55768
$$ -165530 -253989 -413177 -273199 -501176 218401 181897 -536032 21881 -134108 -289876
5729b89876m32813J13914O21038m242J3786n26588j78403M6004j63274M44512
$$ -289876 -722689 -608775 12263 8021 21807 -504781 -683184 -637180 -800454 -355942
5719c55942L87248J20088o3084p48352j40533J53794L65262J19006P3992k47715
$$ -355942 31306 151394 88310 -660042 -800575 -646781 -281519 -162513 -88521 -336236
5709c36236K06826l09116L11518j4748j39462K31575j50342l69160j95113m65056
$$ -336236 -129410 -438526 -127008 -141756 -281218 -49643 -199985 -569145 -764258 -1229314
5699a229314n055Q90225q6121j09798k0691J9077j90545L08545n5196J63126J4417
$$ -1229314 -1234369 -344144 -430265 -540063 -560754 -541677 -732222 -423677 -478873 -315747 -301330
5688c01330K32010J16912q5314r5829K7912k37116m0436N03080K97988j34209
$$ -301330 -69320 47592 -37722 -133551 -105639 -342755 -383191 119889 417877 283668
5678B83668j96472l16979K47241K21686j45279k51822l87404O55914j04934o5306
$$ 283668 87196 -229783 17458 239144 93865 -157957 -545361 110553 5619 -59687
5668e9687N79884p76851j28300J09224K14317K64920k96196l83297j12696j40588
$$ -59687 520197 -256654 -384954 -275730 -61413 203507 -92689 -475986 -588682 -729270
5658g29270N68433j00190n35287j04124K77620R8281j51647R1151l1398K33401
$$ -729270 -160837 -261027 -796314 -900438 -622818 -524537 -676184 -585033 -616431 -383030
5648c83030L13558J98270p18427K37623n43785K66909M63325L00917L76569k07613
$$ -383030 -69472 128798 -589629 -352006 -895791 -628882 -165557 135360 511929 304316
5638C04316r8425l74039k46871N20429l51707j40952N11391o71155o8953M59850
$$ 304316 205891 -168148 -415019 105410 -246297 -387249 124142 -547013 -615966 -156116
5628a56116k1622n414o22621M35465L75656K73639l16867j69887m39192N52181
$$ -156116 -177738 -183152 -805773 -370308 5348 278987 -37880 -207767 -646959 -94778
5618i4778K34994m73212O03710n43756K41860k29923r6187o5495L67484J88655
$$ -94778 140216 -332996 270714 -273042 -31182 -261105 -357292 -422787 -55303 133352
5608A33352M27100o29538l72173K44815J78722n8603j276m62784P0742M94643
$$ 133352 560452 -69086 -441259 -196444 -17722 -76325 -77601 -540385 -469643 25000
5598B5000n25004n61734N50940J56050n18100L02313l0304m6012M28338M4923
$$ 25000 -500004 -1061738 -510798 -354748 -872848 -570535 -600839 -646851 -218513 -173590
5588a73590L81817l48266k33038O51121M0367o81691k35002K25007P18419O5630
$$ -173590 208227 -140039 -373077 278044 318411 -363280 -598282 -373275 345144 410774
5578D10774m31799O4874o8095j4994J40336L89981l28777j66778m73897N09041
$$ 410774 -21025 43849 -24246 -39240 101096 491077 162300 -4478 -478375 30666
5568C0666N14503j25758M764K8898n70723k7894j96083K83354K84852p54984K46304
$$ 30666 545169 419411 424175 453073 -117650 -145544 -341627 -58273 226579 -528405 -282101
5557b82101L53096J54654q6757L9998r9405m46715J5581O98817N3186o45796l36447
$$ -282101 70995 225649 138892 178890 79485 -367230 -351649 347168 400354 -245442 -581889
5546e81889O50938K02365n52959O17675l97412P6686j93392j84872M22613K32099
$$ -581889 69049 271414 -281545 336130 -61282 15404 -177988 -362860 59753 291852
5536B91852o145J47271j085041l20902M22894O09464L22479p68715n70689O04170
$$ 291852 285707 432978 -652063 -972965 -550071 59393 381872 -386843 -957532 -353362
5526c53362O13265o75025J0019L48291N27039q9069m14151L31234J05923j75962
$$ -353362 259903 -415122 -405103 -56812 470227 381158 -32993 298241 404164 228202
5516B28202N6398m3160j18400k37519N92965L06163k23890p071l64106r380K93693
$$ 228202 284600 241440 123040 -114479 478486 784649 560759 553688 189582 180202 473895
5505D73895n32206M1281j29548K25025j15460L56548j12831j17278k30567K31357
$$ 473895 -58311 -17030 -146578 78447 -37013 319535 206704 89426 -141141 90216
5495I0216j54559m1346K74590J48211j17949J12711N3973j27123J58674Q3947
$$ 90216 -64343 -105689 168901 317112 199163 311874 365847 238724 397398 481345
5485D81345l48105m41130N53401k61442J29645O7031o04430K20187P29688L11326
$$ 481345 133240 -307890 245511 -15931 113714 180745 -423685 -203498 526190 837516
5475H37516m19635n61387n879Q19665J34035n06720k46424l406K93613l1356j73337
$$ 837516 417881 -143506 -149385 670280 804315 297595 51171 47765 341378 310022 136685
5464A36685L22999r7385q28525M04120K88558l76635l84427Q65314J24251l2757
$$ 136685 459684 362299 -466226 -62106 226452 -150183 -534610 330704 454955 422198
5454D22198j84463O98998N619p99321J8549P06514M79659J56602r33514k71456
$$ 422198 237735 936733 942352 143031 161580 868094 1347753 1504355 570841 299385
5444B99385m6484J76635K88930K36185J3778q42634k83008M89216K86817r56609
$$ 299385 252901 429536 718466 954651 968429 125795 -157213 332003 618820 -337789
5434c37789R480O07180K72766j5708K05848p35682j01322k7678J18487k34475
$$ -337789 -328309 278871 551637 535929 741777 6095 -95227 -122905 -4418 -238893
5424b38893N78099J61707k19692K5457L57484j19165J76167L34254o08173j84205
$$ -238893 339206 500913 281221 306678 664162 544997 721164 1055418 447245 263040
5414B63040L23662L8160n821O8210j22246n0836j23065K26676K28699j13033j95906
$$ 263040 586702 624862 619041 687251 565005 514169 391104 617780 846479 733446 537540
5403E37540j4879m4006l92354L28151L56446q1074n4158J07969j03094j95654
$$ 537540 522661 478655 86301 414452 770898 689824 635666 743635 640541 444887
5393D44887k73220k52435N50853k83989K47972k69546M07202J07230r6906O34893
$$ 444887 171667 -80768 470085 186096 434068 164522 571724 678954 582048 1216941
5383A216941K88034n62198J10327M5584k16925l65763J77821J27747j69142O90196
$$ 1216941 1504975 942777 1053104 1098688 881763 516000 693821 821568 652426 1342622
5373A342622o10897k9901J83051k53444M39490j42803O6630j84048j02239O63730
$$ 1342622 731725 701824 884875 631431 1070921 928118 994748 810700 708461 1372191
5363A372191K30304l05849k41779L48325J44331j99759j81195o3927J05678j31714
$$ 1372191 1602495 1296646 1054867 1403192 1547523 1347764 1166569 1102642 1208320 1076606
5353A076606Q1725Q64104j71686r17502m4332N11629M38231J00499p05130R6247
$$ 1076606 1158331 2022435 1850749 933247 888915 1400544 1838775 1939274 1234144 1330391
5343A330391K79571j43868J01866M7011m71019j46617K00698L44342O30130m59845
$$ 1330391 1609962 1466094 1567960 1614971 1143952 997335 1198033 1542375 2172505 1712660
5333A712660k78842K68239M29944O7305j49126M39035L25682n25096l80702N03787
$$ 1712660 1433818 1702057 2132001 2199306 2050180 2489215 2814897 2289801 1909099 2412886
5323B412886O291k64585j13090J5304L54645O66332l38147K81791N2735o30250
$$ 2412886 2419177 2154592 2041502 2056806 2411451 3077783 2739636 3021427 3074162 2443912
5313B443912j52878L72961m27269j69649P38100O3385M80156l70348J3210N77801
$$ 2443912 2291034 2663995 2236726 2067077 2805177 2868562 3348718 2978370 2991580 3569381
5303C569381J59811p57335j16003J23871N87826M07293j181588P51845O59226
$$ 3569381 3729192 2971857 2855854 2979725 3567551 3974844 2793256 3545101 4204327
5294D204327n1441j3250j37105M9134N10403p82313K67843O68512k43160P8660
$$ 4204327 4152886 4139636 4002531 4051665 4562068 3779755 4047598 4716110 4472950 4551610
5284D551610P08506L50336m60462K82604l40821R79188J97013o46116L81977P84814
$$ 4551610 5260116 5610452 5149990 5432594 5091773 6070961 6267974 5621858 6003835 6788649
5274F788649R5892N03519l70111J84885L84798k8843J359284M71216k18372O15440
$$ 6788649 6884541 7388060 7017949 7202834 7587632 7558789 8918073 9389289 9170917 9786357
5264I786357R42257K72843M67158J50653J231651J247776J98934L76008P10315
$$ 9786357 10728614 11001457 11468615 11619268 12850919 14098695 14297629 14673637 15383952
5255A5383952J010119P71346Q62302O72402O07289N40784O18117P91181J11355
$$ 15383952 16394071 17165417 18027719 18700121 19307410 19848194 20466311 21257492 21368847
5246B1368847M53335O86471M5220P6934K12342o4834M88010L40073j20032k35524
$$ 21368847 21822182 22508653 22553873 22630807 22843149 22778315 23266325 23606398 23486366 23250842
5236B3250842K08637O12277P9015l67897l1298K67227n2494j80392r6117o86750
$$ 23250842 23459479 24071756 24150771 23782874 23751576 24018803 23966309 23785917 23689800 23003050
5226B3003050j03031Q4691j192966J87945m23295j098625K25560l28426n67260
$$ 23003050 22900019 22984710 21791744 21979689 21556394 20457769 20683329 20354903 19787643
5217A9787643m01511q94025L89383n55976l63187L99897m04912N50736m2073M9968
$$ 19787643 19386132 18492107 18881490 18325514 17962327 18362224 17957312 18508048 18465975 18515943
5207A8515943j88851R0056L68981M61247M72816L37058M94722J631181K99928
$$ 18515943 18327092 18417148 18786129 19247376 19720192 20057250 20551972 22183153 22483081
5198B2483081K82245J279333P30454J495590R19721J102927O91298R05592J257636
$$ 22483081 22765326 24044659 24775113 26270703 27190424 28293351 28984649 29890241 31147877
5189C1147877J127636Q93512J090816P79894M35801O5777N94642N89904J05357
$$ 31147877 32275513 33169025 34259841 35039735 35475536 35541313 36135955 36725859 36831216
5180C6831216Q39003J50763Q3135r10911j07026K13411M5249n52224k80128r155
$$ 36831216 37670219 37820982 37904117 36993206 36886180 37099591 37144840 36592616 36312488 36303333
5170C6303333L09462L29089q25865l20302R7461N29776j95098K1068k18430l75920
$$ 36303333 36612795 36941884 36116019 35795717 35893178 36422954 36227856 36248924 36030494 35654574
5160C5654574m04741j67878m33681m83078l38216l54154o68903j148113o40903
$$ 35654574 35249833 35081955 34648274 34165196 33826980 33472826 32803923 31655810 31014907
5151C1014907q08968p26332p33831j251293r12924r46225j138516p24920k91678
$$ 31014907 30205939 29479607 28745776 27494483 26581559 25635334 24496818 23771898 23480220
5142B3480220o62620m12873m80895p48292r60494m48078J65704l51618p2479J65809
$$ 23480220 22817600 22404727 21923832 21175540 20215046 19766968 19932672 19581054 19508575 19674384
5132A9674384j04454K71741K17258O90615K23398L10737M70736L67300O42610
$$ 19674384 19569930 19841671 20058929 20749544 20972942 21283679 21754415 22121715 22764325
5123B2764325K31020L72201J152324j56588K78165j41713j9710L85525o79702
$$ 22764325 22995345 23367546 24519870 24363282 24641447 24499734 24480024 24865549 24185847
5114B4185847m20145o85279j000652p18167n46610j162956j023365l69906J10035
$$ 24185847 23765702 23080423 22079771 21361604 20814994 19652038 18628673 18258767 18368802
5105A8368802p79871j270098q75288l15617l48133l51870j55726k04917l04851
$$ 18368802 17588931 16318833 15443545 15127928 14779795 14427925 14272199 14067282 13762431
5096A3762431K12829j15718P2890M45293k00845N75321J07361q69167J68219J74794
$$ 13762431 13975260 13859542 13932432 14377725 14176880 14752201 14859562 13990395 14158614 14333408
5086A4333408L25355j84140n9328j85624o7498r89927q57099m62386l85338R7920
$$ 14333408 14658763 14474623 14415295 14229671 14162173 13172246 12315147 11852761 11467423 11565343
5076A1565343l52967q71407J72269o98159q78767r6310m77995m19748K43524J34641
$$ 11565343 11212376 10340969 10513238 9815079 8936312 8840002 8362007 7942259 8185783 8320424
5066H320424m53856m48966j27574l55590l33882j79708j07517j40330o42753Q5785
$$ 8320424 7866568 7417602 7290028 6934438 6600556 6420848 6313331 6173001 5530248 5616033
5056E616033N03190o45172m36682k10798N16253L11190k38393l0055m74556k4120
$$ 5616033 6119223 5474051 5037369 4826571 5342824 5654014 5415621 5385566 4911010 4886890
5046D886890K599M07571K27724m13444m28487n2080J50868L13268Q5859m86120
$$ 4886890 4889489 5297060 5524784 5111340 4682853 4630773 4781641 5094909 5180768 4694648
5036D694648k82037R4175M23237K71422J46652K2608n93189K27172M22902P2316
$$ 4694648 4412611 4506786 4930023 5201445 5348097 5370705 4777516 5004688 5427590 5499906
5026E499906m32585j29566K6410j61174j3351L03072J78367O70510l90816l00039
$$ 5499906 5067321 4937755 4964165 4802991 4789640 5092712 5271079 5941589 5550773 5250734
5016E250734M46565K68766k7778m47478m5042Q80252L7828Q9584k19547o02647
$$ 5250734 5697299 5966065 5938287 5490809 5445767 6326019 6363847 6453431 6233884 5631237
5006E631237Q02283N01174m35111o8794O81139P72180m8923L99047m90807m3746
$$ 5631237 6433520 6934694 6499583 6430789 7111928 7884108 7835185 8234232 7743425 7699679
4996G699679R16106J201708N33998k61433J37719N62532Q93147N22858M33450
$$ 7699679 8615785 9817493 10351491 10090058 10227777 10790309 11683456 12206314 12639764
4987A2639764L28769Q55376M84756K80411O57557L61699j0139M1450L77862K02689
$$ 12639764 12968533 13823909 14308665 14589076 15246633 15608332 15598193 15639643 16017505 16220194
4977A6220194m94251M89886o5329j44430K28231J76964N45803P3649o03607L20675
$$ 16220194 15725943 16215829 16150500 16006070 16234301 16411265 16957068 17030717 16427110 16747785
4967A6747785J036146P52429j18026O40369J169923O65477O99063J459478R43345
$$ 16747785 17783931 18536360 18418334 19058703 20228626 20894103 21593166 23052644 23995989
4958B3995989M50338L42649J248172P93341L36035L22107k21445l85673r15591
$$ 23995989 24446327 24788976 26037148 26830489 27166524 27488631 27267186 26881513 25965922
4949B5965922j464487n54661j29384j207075j034309k78225k86880r04441l26873
$$ 25965922 24501435 23946774 23817390 22610315 21576006 21297781 21010901 20106460 19779587
4940A9779587k86549K76716K1641K49661j21994m9159j58656M11524L13441R39488
$$ 19779587 19493038 19769754 19791395 20041056 19919062 19869903 19711247 20122771 20436212 21375700
4930B1375700J99389N07784N80791M02612k7133k62371L97589K51967l92202n77165
$$ 21375700 21575089 22082873 22663664 23066276 23039143 22776772 23174361 23426328 23034126 22456961
4920B2456961J69518p7136J54035n18845O23220M02611N87850O11551l1509P14861
$$ 22456961 22626479 22549343 22703378 22184533 22807753 23210364 23798214 24409765 24378256 25093117
4910B5093117K38862L37417J268038P81002L09774P38595L81815J90447n27177
$$ 25093117 25331979 25669396 26937434 27718436 28028210 28766805 29148620 29339067 28811890
4901B8811890J79041R36863K25694J73028l65886J86031j61826j17607m47366
$$ 28811890 28990931 29927794 30153488 30326516 29960630 30146661 29984835 29867228 29419862
4892B9419862k54480m50246J43761K60923L25655J7417m14013L26963K08658Q52245
$$ 29419862 29165382 28715136 28858897 29119820 29445475 29462892 29048879 29375842 29584500 30436745
4882C0436745K1870m00009m99357j77412m61736J70077l84906q848j47433l99496
$$ 30436745 30458615 30058606 29559249 29381837 28920101 29090178 28705272 28696424 28548991 28149495
4872B8149495k12035n52576R03856J91983j29662n57354N53932J47200k34248
$$ 28149495 27937460 27384884 28288740 28480723 28351061 27793707 28347639 28494839 28260591
4863B8260591l45960K1212o86414O3459o14036n45601K07118j276005k72116l94201
$$ 28260591 27914631 27935843 27249429 27312888 26698852 26153251 26360369 25084364 24812248 24418047
4853B4418047q53035k41340j84259p02358n05316r08045L0988m90421j093454
$$ 24418047 23565012 23323672 23139413 22437055 21931739 21023694 21054682 20564261 19470807
4844A9470807n56513l90284K08301J66547J18280l90291N55758K87517m46840
$$ 19470807 18914294 18524010 18732311 18898858 19017138 18626847 19182605 19470122 19023282
4835A9023282l96454L67755q2809J52358K52891k56861m31742k83618Q5606l50141
$$ 19023282 18626828 18994583 18911774 19064132 19317023 19060162 18628420 18344802 18430408 18080267
4825A8080267n13350n91156l56199p78930L65566o30391j202943K38102K73366
$$ 18080267 17566917 16975761 16619562 15840632 16206198 15575807 14372864 14610966 14884332
4816A4884332q00909n10556k43815j27180K17201J05799N0065n04918k18959M25155
$$ 14884332 14083423 13572867 13329052 13201872 13419073 13524872 13574937 13070019 12851060 13276215
4806A3276215L51409L05513K03333Q313L89784M76818k83869j62355R7109N65878
$$ 13276215 13627624 13933137 14136470 14144783 14534567 15011385 14727516 14565161 14662270 15228148
4796A5228148m46081k9737o00990J77387k43432q09336p13905l41642o74418q84697
$$ 15228148 14782067 14752330 14151340 14328727 14085295 13275959 12562054 12220412 11545994 10661297
4786A0661297q93200n7803o599q56844j45100j48908j182015o04729M42009o82519
$$ 10661297 9768097 9710294 9703695 8846851 8701751 8552843 7370828 6766099 7208108 6525589
4776F525589l64317l72885J5720k869j16886m20692j5419N5859m30349o15094
$$ 6525589 6161272 5788387 5804107 5801238 5684352 5263660 5248241 5304100 4873751 4258657
4766D258657o13567K72940J18831p2851M75797K20103q95901Q1944l5382l93167
$$ 4258657 3645090 3918030 4036861 3964010 4439807 4659910 3764009 3845953 3810571 3417404
4756C417404l33944j32451J31426k69911r5598l36822Q24933j00315o43385j01318
$$ 3417404 3083460 2951009 3082435 2812524 2716926 2380104 3205037 3104722 2461337 2360019
4746B360019L27487l38632m4496P1186J5755l37353K94804R52384k34735o66130
$$ 2360019 2687506 2348874 2304378 2375564 2391319 2053966 2348770 3301154 3066419 2400289
4736B400289k29538j54985j1516m16602K57811K48409Q6821J06050l83694j43437
$$ 2400289 2170751 2015766 2004250 1587648 1845459 2093868 2180689 2286739 1903045 1759608
4726A759608k07036j0996L07103J78859k43278m97731K55970j01690K3022k41830
$$ 1759608 1552572 1541576 1848679 2027538 1784260 1286529 1542499 1440809 1463831 1222001
4716A222001K28895J55603K08551k71095L53838m65821o93652P25553n3487J19851
$$ 1222001 1450896 1606499 1815050 1543955 1897793 1431972 738320 1463873 1410386 1530237
4706A530237j2108M51366j49679l67640m91958L49470O8052l28643M9084j48750
$$ 1530237 1518129 1969495 1819816 1452176 960218 1309688 1377740 1049097 1098181 949431
4696I49431k84825L58928K22939L00769n00831k11203P85406N33779o02134p37353
$$ 949431 664606 1023534 1246473 1547242 1046411 835208 1620614 2154393 1552259 814906
4686H14906O14859L20932m01429J91812K17713J77193m92977K53528r4458l65786
$$ 814906 1429765 1750697 1349268 1541080 1758793 1935986 1443009 1696537 1602079 1236293
4676A236293n52198L3166Q37213j24893p07111M44468M35628Q2452p30313K8216
$$ 1236293 684095 717261 1554474 1429581 722470 1166938 1602566 1685018 954705 982921
4666I82921R92109n70091m86653k45953N11968J90861r3919K06194J94792m17198
$$ 982921 1975030 1404939 918286 672333 1184301 1375162 1281243 1487437 1682229 1265031
4656A265031M18269j8056J20133o63866n73128K43153M15104j65704l04571n36413
$$ 1265031 1683300 1665244 1785377 1121511 548383 791536 1206640 1040936 736365 199952
4646A99952M75216R4163o24496O60344N0084j99902j20664K7160M93014q0080
$$ 199952 675168 769331 144835 805179 855263 655361 534697 561857 1054871 974791
4636I74791K23116J05863R6875N59999p18601Q95L39805k71729k71573K34329
$$ 974791 1197907 1303770 1400645 1960644 1242043 1242938 1582743 1311014 1039441 1273770
4626A273770P24075k45971K50178k0167j13798m63054m54259R3111M5877J54784
$$ 1273770 1997845 1751874 2002052 1981885 1868087 1405033 950774 1043885 1089762 1244546
4616A244546l01875O50340l91016q8969l80582l26473N48577r1445j33773L47807
$$ 1244546 942671 1593011 1201995 1113026 732444 405971 954548 863103 729330 1077137
4606A077137j87147L33633J40985k0125O52225l78174n30372J60885M34409p0583
$$ 1077137 889990 1223623 1364608 1344483 1996708 1618534 1088162 1249047 1683456 1612873
4596A612873p1058k61945k4947N85260p59265Q930n0330J93073P5788l01482l28066
$$ 1612873 1541815 1279870 1254923 1840183 1080918 1089848 1039518 1232591 1308379 1006897 678831
4585F78831P09855l87496m67273J6478J62863O04979P5918L50785J71000o61895
$$ 678831 1388686 1001190 533917 550395 713258 1318237 1394155 1744940 1915940 1254045
4575A254045n52777Q42118K09058m37205J73687L93577k5276k61321k67649L10101
$$ 1254045 701268 1543386 1752444 1315239 1488926 1882503 1857227 1595906 1328257 1638358
4565A638358K55992l80710n24422N01615J82969l41790m99945R07053J90525q2809
$$ 1638358 1894350 1513640 989218 1490833 1673802 1332012 832067 1739120 1929645 1846836
4555A846836k77493L33759J66219m97789J30777o8570R8391O27554k12548L27899
$$ 1846836 1569343 1903102 2069321 1571532 1702309 1633739 1732130 2359684 2147136 2475035
4545B475035k17050o11313M35365K82882l75728r54563L49894P9319L61573j86017
$$ 2475035 2257985 1646672 2082037 2364919 1989191 1034628 1384522 1463841 1825414 1639397
4535A639397M7305M43456m77288N9342k38161J37054J64536L95370r7588J14924
$$ 1639397 1686702 2130158 1652870 1712212 1474051 1611105 1775641 2171011 2073423 2188347
4525B188347M40056m52710j13203K11206l55352M39267L88764k43907M9877j40516
$$ 2188347 2628403 2175693 2062490 2273696 1918344 2357611 2746375 2502468 2552345 2411829
4515B411829M78010K41294J22297j86792l74205j13824K43811O2467q9252l93779
$$ 2411829 2889839 3131133 3253430 3066638 2692433 2578609 2822420 2884887 2795635 2401856
4505B401856N21943O55181O08760o49285l02090M36093n00068K89118N57516k119
$$ 2401856 2923799 3578980 4187740 3538455 3236365 3672458 3172390 3461508 4019024 4016905
4495D016905j98141M137j05999M16116m14089K79971N70793l10029N67M51200
$$ 4016905 3818764 3822901 3716902 4133018 3718929 3998900 4569693 4259664 4260231 4711431
4485D711431K57757k93303L8417l63994K01719M91063k13634n24262J03204J94086
$$ 4711431 4969188 4675885 4714302 4350308 4552027 5043090 4829456 4305194 4408398 4602484
4475D602484l3312J91849O6043M96528m73889L73898M37422j92017O2238J39748
$$ 4602484 4569172 4761021 4827064 5323592 4849703 5223601 5661023 5469006 5531244 5670992
4465E670992o1614K85421J13476K43661K60501L524M79507K12513n42102N1846
$$ 5670992 5609378 5894799 6008275 6251936 6512437 6515961 6995468 7207981 6665879 6717725
4455F717725K28019M081N05614j24113P39042R57268J1275l90235Q06138K61459
$$ 6717725 6945744 6949825 7455439 7331326 8070368 9027636 9038911 8648676 9454814 9716273
4445I716273N77224j98236l3322O39748N35652O82469M65060Q92558P18010R96709
$$ 9716273 10293497 10095261 10061939 10701687 11237339 11919808 12384868 13277426 13995436 14992145
4435A4992145K98370P49842K88964Q05236N93570Q21651K54372O1649O4457M49276
$$ 14992145 15290515 16040357 16329321 17134557 17728127 18549778 18804150 18865799 18930256 19379532
4425A9379532K38898R7516j54681L22626N52023m60338O80801k19818R29291j37096
$$ 19379532 19618430 19715946 19561265 19883891 20435914 19975576 20656377 20436559 21365850 21228754
4415B1228754o22417K32328M30755J72964l76175k37329j37770L47811K52928
$$ 21228754 20606337 20838665 21269420 21442384 21066209 20828880 20691110 21038921 21291849
4406B1291849M14212j69471K9228K83614L92269L36432q56763o33608k25378P43411
$$ 21291849 21706061 21536590 21565818 21849432 22241701 22578133 21721370 21087762 20862384 21605795
4396B1605795o1748K54525q55621l59826m28273N3179L56020O46269n59070o70118
$$ 21605795 21544047 21798572 20942951 20583125 20154852 20208031 20564051 21210320 20651250 19981132
4386A9981132J87182l10305J54346k14906O14517M41623r38791K94716J21765
$$ 19981132 20168314 19858009 20012355 19797449 20411966 20853589 19914798 20209514 20331279
4377B0331279m39276k58019o31873N3925K6289J97582l09031k95069P2905N68897
$$ 20331279 19892003 19633984 19002111 19056036 19082325 19279907 18970876 18675807 18748712 19317609
4367A9317609N83721P78181m46323M30639k45887j65443N71962N12391K34177
$$ 19317609 19901330 20679511 20233188 20663827 20417940 20252497 20824459 21336850 21571027
4358B1571027O22961K98671o68768l14438K62469J055273k78667j01933K05820
$$ 21571027 22193988 22492659 21823891 21509453 21771922 22827195 22548528 22446595 22652415
4349B2652415l55004N30416K52613N21851m66709J9945q98696r8205K39152l86104
$$ 22652415 22297411 22827827 23080440 23602291 23135582 23155527 22256831 22158626 22397778 22011674
4339B2011674n82425K85753o8382r07737m95183P8630J45324j026469K97892l36287
$$ 22011674 21429249 21715002 21646620 20738883 20243700 20322330 20467654 19441185 19739077 19402790
4329A9402790k86635r51100O0663j47348o06184k80888k14853M60523r23725o04642
$$ 19402790 19116155 18165055 18225718 18078370 17472186 17191298 16976445 17436968 16513243 15908601
4319A5908601n46192M48147M06222l4383p24870o43797m6961O40810Q10200o117
$$ 15908601 15362409 15810556 16216778 16182395 15457525 14813728 14766767 15407577 16217777 16211660
4309A6211660J16163j62144O17507R7350j08158M6944M61588L15529J92602P6664
$$ 16211660 16327823 16165679 16783186 16880536 16772378 16819322 17280910 17596439 17789041 17865705
4299A7865705L60209P9146j95338l44505Q4306O32824j89950K13418k64435q08620
$$ 17865705 18225914 18305060 18109722 17765217 17849523 18482347 18292397 18505815 18241380 17432760
4289A7432760k24667R94658N79670m89885m9349J00191k46169J76606N17847L98340
$$ 17432760 17208093 18202751 18782421 18292536 18243187 18343378 18097209 18273815 18791662 19190002
4279A9190002o2867L61885Q45480P2598K16749R6005K68592O26233L4771P4035
$$ 19190002 19127135 19489020 20334500 20407098 20623847 20719852 20988444 21614677 21649448 21723483
4269B1723483L17377J99426P1543l17367r8165m60272L70332J14603m23729l07915
$$ 21723483 22040860 22240286 22311829 21994462 21896297 21436025 21806357 21920960 21497231 21189316
4259B1189316q47274k16311N5652J55428n71368j8010K9704p6594J91721J79801
$$ 21189316 20342042 20125731 20181383 20336811 19765443 19747433 19777137 19700543 19892264 20072065
4249B0072065O95305M6600j09341o9800K87024M27383n768r342P07508R72354
$$ 20072065 20767370 20813970 20704629 20634829 20921853 21349236 21343468 21334126 22041634 23013988
4239B3013988Q03422P13280L98046N41724J076973Q57145Q44956J373739K06711
$$ 23013988 23817410 24530690 24928736 25470460 26547433 27404578 28249534 29623273 29829984
4230B9829984Q84578J701244Q90680O83237Q90133R78877O70522L0107L25176
$$ 29829984 30714562 32415806 33306486 33989723 34879856 35858733 36529255 36559362 36884538
4221C6884538Q18143L35026O34587m9130j06291L83476M48745l44857m85975m00199
$$ 36884538 37702681 38037707 38672294 38623164 38516873 38900349 39349094 39004237 38518262 38118063
4211C8118063l41455k47996o21718q83391k91188n16794o20196l71197o05362
$$ 38118063 37776608 37528612 36906894 36023503 35732315 35215521 34595325 34224128 33618766
4202C3618766n26005j30247o15431l74479r2393m94709m23581p99q4514p03228
$$ 33618766 33092761 32962514 32347083 31972604 31880211 31385502 30961921 30961122 30876608 30173380
4192C0173380r57472k44973j501k09921j016834m99338n20205o20902l96619j37301
$$ 30173380 29215908 28970935 28969434 28759513 27742679 27243341 26723136 26102234 25705615 25568314
4182B5568314j53810p33566J16285n58949r23653o02816l10339l36942q10411
$$ 25568314 25414504 24680938 24797223 24238274 23314621 22711805 22401466 22064524 21254113
4173B1254113n77864O26380o36577p01870m49626j75629k64443n28898r1082l7929
$$ 21254113 20676249 21302629 20666052 19964182 19514556 19338927 19074484 18545586 18454504 18416575
4163A8416575J32769m77901q47367N67168L81565q30993l03611Q003k53826k56864
$$ 18416575 18549344 18071443 17224076 17791244 18172809 17341816 17038205 17046208 16792382 16535518
4153A6535518L23788L4466k40771m95714n00822M67518p23570j35648M23600J67085
$$ 16535518 16859306 16893772 16653001 16157287 15656465 16123983 15400413 15264765 15688365 15855450
4143A5855450k91167p69619l0122P19031M87021n24013K3336o46777o33334r31268
$$ 15855450 15564283 14794664 14764542 15483573 15970594 15446581 15469917 14823140 14189806 13258538
4133A3258538K91909O17499k83992j249486o19456K12343q99395l33164J81758
$$ 13258538 13550447 14167946 13883954 12634468 12015012 12227355 11327960 10994796 11176554
4124A1176554k55244l49916o31749q3725K82086o48619j48202j3631M3256N4761
$$ 11176554 10921310 10571394 9939645 9855920 10138006 9489387 9341185 9327554 9370810 9425571
4114I425571n88088j53959K61738k02934j19559J25272J33979n20989K31090l01283
$$ 9425571 8837483 8683524 8945262 8742328 8622769 8748041 8882020 8361031 8592121 8290838
4104H290838O1443M3471m3620r331k16758k81011m94363L82621k58101q19115
$$ 8290838 8352281 8395752 8352132 8342801 8126043 7845032 7350669 7733290 7475189 6656074
4094F656074m86026O6035M74465k61186J43589J04810m89256j82786Q6468o72185
$$ 6656074 6170048 6236083 6710548 6449362 6592951 6697761 6208505 6025719 6112187 5440002
4084E440002J6121j96080J91690J19996q4209l09041k36722M05725N21499j59404
$$ 5440002 5456123 5260043 5451733 5571729 5487520 5178479 4941757 5347482 5868981 5709577
4074E709577m81395M25215J46184m94755j49467K32589L87021L88995n61233k64491
$$ 5709577 5228182 5653397 5799581 5304826 5155359 5387948 5774969 6163964 5602731 5338240
4064E338240q5035m55188K00009Q10886j22823n65350n60730O42238L1439o39076
$$ 5338240 5253205 4798017 4998026 5808912 5686089 5120739 4560009 5202247 5233686 4594610
4054D594610K41137O73995R051k25731k46738R0877L70840k60050n94686L60905
$$ 4594610 4835747 5509742 5518793 5293062 5046324 5137201 5508041 5247991 4653305 5014210
4044E014210K58117J97657j65852J39071J20865n04995k17262J310968j63031
$$ 5014210 5272327 5469984 5304132 5443203 5564068 5059073 4841811 6152779 5989748
4035E989748m04183J38522P701k00407k30687l01963k01922M10930J53491J80547
$$ 5989748 5585565 5724087 5731788 5531381 5300694 4998731 4796809 5207739 5361230 5541777
4025E541777P4579l59903j06358J55998l35698o1899J52727J22629J83430o89164
$$ 5541777 5616356 5256453 5150095 5306093 4970395 4908496 5061223 5183852 5367282 4678118
4015D678118M5762L85403K54257J74442K82132k50501k247K06579L5296L68962
$$ 4678118 4723880 5109283 5363540 5537982 5820114 5569613 5567366 5773945 5809241 6178203
4005F178203l39863K22754k42938M73242j15011l74090N2702K73042j80968L14860
$$ 6178203 5838340 6061094 5818156 6291398 6176387 5802297 5854999 6128041 5947073 6261933
3995F261933K34768J33798o2155l75764q1015j23433N99750j19841j28494N70214
$$ 6261933 6496701 6630499 6568344 6192580 6111565 5988132 6587882 6468041 6339547 6909761
3985F909761O4459J53220J50566J03790j61555r5443p0714N10455K4664K96454
$$ 6909761 6974220 7127440 7278006 7381796 7220241 7124798 7054084 7564539 7589203 7885657
3975G885657n4862j2136l07969J73113R04088J76013m23815J25241k21175L49697
$$ 7885657 7830795 7818659 7510690 7683803 8587891 8763904 8340089 8465330 8244155 8593852
3965H593852q5538O209R9835L035J029369J10587J97610l70611K50490Q77114
$$ 8593852 8508314 8514523 8614358 8617393 9646762 9757349 9954959 9584348 9834838 10711952
3955A0711952R56302n203j48102k2673M99928M86864J92301R57730R58633J67966
$$ 10711952 11668254 11663051 11514949 11492276 11992204 12479068 12671369 13629099 14587732 14755698
3945A4755698m24345j34957R64670K30208L30591Q51277N95267j39047L2841L94100
$$ 14755698 14331353 14196396 15161066 15391274 15721865 16573142 17168409 17029362 17062203 17456303
3935A7456303L64003k30431P21632J23010O87142J8436k61810J66540O59635l59012
$$ 17456303 17820306 17589875 18311507 18434517 19121659 19140095 18878285 19044825 19704460 19345448
3925A9345448M29625K71470K77512J71195l37886O58798l69085m3399L17244M7454
$$ 19345448 19775073 20046543 20324055 20495250 20157364 20816162 20447077 20403678 20720922 20768376
3915B0768376o294l12754n57018L18532l28618o38818k46117K40868j83796j06048
$$ 20768376 20762082 20449328 19892310 20210842 19882224 19243406 18997289 19238157 19054361 18948313
3905A8948313m7035m42992m21954m15165k56633K83872l57234K18825q30087o69092
$$ 18948313 18901278 18458286 18036332 17621167 17364534 17648406 17291172 17509997 16679910 16010818
3895A6010818l66886M65789o92529J10144k48942l40554m99368J91752k12497
$$ 16010818 15643932 16109721 15417192 15527336 15278394 14937840 14438472 14630224 14417727
3886A4417727R1418l63935J92012K21651J08459m80859l43478L78108m8717L17002
$$ 14417727 14509145 14145210 14337222 14558873 14667332 14186473 13842995 14221103 14172386 14489388
3876A4489388L2960M76967l3093M3496K08816J98149O16080L27756j27534O66712
$$ 14489388 14522348 14999315 14966222 15009718 15218534 15416683 16032763 16360519 16232985 16899697
3866A6899697N04802L68240K46847L34571J54245J84927M35205P23964p5690J75606
$$ 16899697 17404499 17772739 18019586 18354157 18508402 18693329 19128534 19852498 19776808 19952414
3856A9952414M44560M1734M73171k32585n72679M71477k28097Q76126p41039j86334
$$ 19952414 20396974 20438708 20911879 20679294 20106615 20578092 20349995 21226121 20485082 20298748
3846B0298748k57005K7094j30448l14112L1213r637q40824n91812m91449l73626
$$ 20298748 20041743 20068837 19938389 19624277 19655490 19645853 18805029 18213217 17721768 17348142
3836A7348142L3541m36723p47449q54377k83774k01528j01382o09140k66360l77263
$$ 17348142 17381683 16944960 16197511 15343134 15059360 14857832 14756450 14147310 13880950 13503687
3826A3503687j30737m58908m85712K51156N0592j44458N455M15610K3356k89966
$$ 13503687 13372950 12914042 12428330 12679486 12730078 12585620 12591075 13006685 13030041 12740075
3816A2740075J04249k03792k38501p860J46374N60453R5208p20507k65456K26298
$$ 12740075 12844324 12640532 12402031 12394171 12540545 13100998 13196206 12475699 12210243 12436541
3806A2436541L17008K79841P50408m14058k19457L65928M904M26772M30526n28276
$$ 12436541 12753549 13033390 13783798 13369740 13150283 13516211 13521115 13947887 14378413 13850137
3796A3850137K7850O73556N4145j50045n89358Q91680K39809l19610j2416K78803
$$ 13850137 13877987 14551543 14605688 14455643 13866285 14757965 14997774 14678164 14665748 14944551
3786A4944551N56933K24937j10846K20642O31632j48119j01020L28818M2602j00031
$$ 14944551 15501484 15726421 15615575 15836217 16467849 16319730 16218710 16547528 16590130 16490099
3776A6490099P63945L06823J06703j45718L77159R31685M48552K0335L20995O94189
$$ 16490099 17254044 17560867 17667570 17521852 17899011 18830696 19279248 19299583 19620578 20314767
3766B0314767O51553l1991Q34776J066311K14891Q38758J053452O08270M01034
$$ 20314767 20966320 20934329 21769105 22835416 23050307 23889065 24942517 25550787 25951821
3757B5951821J023449J321445J276661Q94495J013785J708861J379426J010208
$$ 25951821 26975270 28296715 29573376 30467871 31481656 33190517 34569943 35580151
3749C5580151J151275K020224J988716J525833K529021K546427K544619K567008
$$ 35580151 36731426 38751650 40740366 42266199 44795220 47341647 49886266 52453274
3741E2453274L312671L918288L853794M495566M612841M768603N843584N693437
$$ 52453274 55765945 59684233 63538027 68033593 72646434 77415037 83258621 88952058
3733H8952058O354902O392189O163475N531915N144384L732193K274772J22314
$$ 88952058 95306960 101699149 107862624 113394539 118538923 122271116 124545888 124668202
3725A24668202j613193k996178l395883l297156l513195l330642k467803j754687
$$ 124668202 123055009 120058831 116662948 113365792 109852597 106521955 104054152 102299465
3717A02299465j227753n09884O5468Q57416J160178J366108J984188K588228K264202
$$ 102299465 101071712 100561828 100627296 101484712 102644890 104010998 105995186 108583414 110847616
3708A10847616L025893K096056J627825M49131o20429k503446m197378n980319
$$ 110847616 113873509 115969565 117597390 118046521 117426092 114922646 110725268 104744949
3700A04744949n889768o477775o453989o653952o149104m970764m282268m236509
$$ 104744949 98855181 92377406 85923417 79269465 73120361 68149597 63867329 59630820
3692E9630820l489885l457195k929686k978638k532803k135392k192445j498661
$$ 59630820 56140935 52683740 49754054 46775416 44242613 42107221 39914776 38416115
3684C8416115j507270j871522p52295j569776r98272m35332j695816p52147J27326
$$ 38416115 36908845 35037323 34285028 32715252 31716980 31281648 29585832 28833685 28961011
3675B8961011r28850j130723m96755n83674k7047p75586k51763r97112l85162
$$ 28961011 28032161 26901438 26404683 25821009 25793962 25018376 24766613 23769501 23384339
$$ [...]
##END NTUPLES=NMR SPECTRUM
##END=
