##TITLE=1H_EC-3244(5-2)
 CDCl3,8 sc, 
 1.04.2021
##JCAMPDX= 6.0         $$ Bruker NMR JCAMP-DX V2.0
##DATA TYPE= NMR SPECTRUM
##DATA CLASS= NTUPLES
##ORIGIN= UXNMR, Bruker Analytische Messtechnik GmbH
##OWNER= root
$$ XWIN-NMR		Version 3.5
$$ Thu Apr  1 13:03:07 2021 Russian Standard Time (UT+4h)  she@DPX200
##.OBSERVE FREQUENCY= 200.131506
##.OBSERVE NUCLEUS= ^1H
##.ACQUISITION MODE= SIMULTANEOUS
##.ACQUISITION SCHEME= undefined
##.AVERAGES= 8
##.DIGITISER RES= 18
##SPECTROMETER/DATA SYSTEM= spect
##.PULSE SEQUENCE= zg30
##.SOLVENT NAME= CDCl3
##.SHIFT REFERENCE= (INTERNAL, CDCl3, 0, 15.9916)
##AUDIT TRAIL= $$ (NUMBER, WHEN, WHO, WHERE, WHAT)
$$ ##TITLE= Audit trail, XWIN-NMR		Version 3.5
$$ ##JCAMPDX= 5.01
$$ ##ORIGIN= Bruker BioSpin GmbH
$$ ##OWNER= she
$$ F:/spectra/data/she/nmr/H-F/1/pdata/1/auditp.txt
$$ ##AUDIT TRAIL=  $$ (NUMBER, WHEN, WHO, WHERE, WHAT)
(   1,<2021-04-01 13:01:59.96 +0400>,<she>,<DPX200>,
      <created by zg, POWCHK disabled, PULCHK disabled
       configuration hash MD5:
       00 E9 B6 7A A2 85 ED C7 34 08 36 98 17 FE 4E 26
       data hash MD5: 16K
       83 62 9A 41 13 15 AB 22 DC 96 46 BA 56 C5 73 75>)
(   2,<2021-04-01 13:02:02.53 +0400>,<she>,<DPX200>,
      <Start of raw data processing
       efp BC_mod = 2 LB = 0.24 FT_mod = 6 PKNL = 1 PHC0 = -11122.9 PHC1 = 13.00093 SI = 16K 
       data hash MD5: 16K
       1E A2 B9 2A FF 74 9C CA C6 FD FD 50 5B 4A 65 37>)
(   3,<2021-04-01 13:02:18.92 +0400>,<she>,<DPX200>,
      <pk PHC0 = 2.038599 PHC1 = -1.8 
       data hash MD5: 16K
       BA A4 70 20 DD 22 F0 E3 16 74 D2 6A 97 95 DC BF>)
(   4,<2021-04-01 13:02:22.20 +0400>,<she>,<DPX200>,
      <abs ABSG = 5 
       data hash MD5: 16K
       20 7A B6 5B 19 87 8E FE 2B A2 6B 88 3A C1 36 DF>)
$$ ##END=
$$ 
$$ hash MD5
$$ 71 CD 35 CC 8C 5B 20 C2 5D 8E 82 6A 48 50 1A 8F
##$RELAX= 
##$RELAX= 
##$RELAX= 
##$RELAX= 
##$RELAX= 
##$RELAX= 
$$ Bruker specific parameters
$$ --------------------------
##$DU= <F:/spectra>
##$EXPNO= 1
##$NAME= <H-F>
##$PROCNO= 1
##$TYPE= <nmr>
##$USER= <she>
##$AMP= (0..31)
100 100 100 100 100 100 100 100 100 100 100 100 100 100 100 100 100 100 
100 100 100 100 100 100 100 100 100 100 100 100 100 100 
##$AQSEQ= 0
##$AQ_mod= 1
##$AUNM= <au_zg>
##$AUTOPOS= <>
##$BF1= 200.13
##$BF2= 200.13
##$BF3= 200.13
##$BF4= 200.13
##$BF5= 200.13
##$BF6= 200.13
##$BF7= 200.13
##$BF8= 200.13
##$BYTORDA= 1
##$CFDGTYP= 0
##$CFRGTYP= 5
##$CHEMSTR= <none>
##$CNST= (0..31)
1 1 145 1 1 1 1 1 1 1 1 1 1 1 1 1 1 1 1 1 1 1 1 1 1 1 1 1 1 1 1 1 
##$CPDPRG= <>
##$CPDPRG1= <>
##$CPDPRG2= <>
##$CPDPRG3= <>
##$CPDPRG4= <mlev>
##$CPDPRG5= <mlev>
##$CPDPRG6= <mlev>
##$CPDPRG7= <mlev>
##$CPDPRG8= <mlev>
##$CPDPRGB= <>
##$CPDPRGT= <>
##$D= (0..31)
0 1.2 0 0 0 0 0 0 0 0.06 0 0.03 0 0 0 0 0.0002 0 0 0 0 0 0 0 0 0 0 0 0 
0 0 0 
##$DATE= 1617267719
##$DBL= (0..7)
120 120 120 120 120 120 120 120 
##$DBP= (0..7)
150 150 150 150 150 150 150 150 
##$DBP07= 0
##$DBPNAM0= <>
##$DBPNAM1= <>
##$DBPNAM2= <>
##$DBPNAM3= <>
##$DBPNAM4= <>
$$ [...]
##$SUBNAM3= <"">
##$SUBNAM4= <"">
##$SUBNAM5= <"">
##$SUBNAM6= <"">
##$SUBNAM7= <"">
##$SUBNAM8= <"">
##$SUBNAM9= <"">
##$SW= 16.9725357007746
##$SWIBOX= (0..15)
0 0 2 0 0 0 0 0 0 0 0 0 0 0 0 0 
##$SW_h= 3396.73913043478
##$TD= 16384
##$TD0= 1
##$TE= 0
##$TE2= 300
##$TE3= 300
##$TEG= 300
##$TL= (0..7)
0 120 120 120 120 120 120 120 
##$TP= (0..7)
150 150 150 150 150 150 150 150 
##$TP07= 0
##$TPNAME0= <>
##$TPNAME1= <>
##$TPNAME2= <>
##$TPNAME3= <>
##$TPNAME4= <>
##$TPNAME5= <>
##$TPNAME6= <>
##$TPNAME7= <>
##$TPOAL= (0..7)
0.5 0.5 0.5 0.5 0.5 0.5 0.5 0.5 
##$TPOFFS= (0..7)
0 0 0 0 0 0 0 0 
##$TUNHIN= 0
##$TUNHOUT= 0
##$TUNXOUT= 0
##$USERA1= <user>
##$USERA2= <user>
##$USERA3= <user>
##$USERA4= <user>
##$USERA5= <user>
##$V9= 5
##$VALIST= <valist>
##$VCLIST= <CCCCCCCCCCCCCCC>
##$VD= 0
##$VDLIST= <DDDDDDDDDDDDDDD>
##$VPLIST= <PPPPPPPPPPPPPPP>
##$VTLIST= <TTTTTTTTTTTTTTT>
##$WBST= 1024
##$WBSW= 4
##$XGAIN= (0..3)
0 0 0 0 
##$XL= 0
##$YL= 0
##$YMAX_a= 748439
##$YMIN_a= -746555
##$ZGOPTNS= <>
##$ZL1= 120
##$ZL2= 120
##$ZL3= 120
##$ZL4= 120
##$ABSF1= 15.9616
##$ABSF2= -1.011062
##$ABSG= 5
##$ABSL= 3
##$ALPHA= 0
##$AQORDER= 0
##$ASSFAC= 0
##$ASSFACI= 0
##$ASSFACX= 0
##$ASSWID= 0
##$AUNMP= <proc_1d>
##$AZFE= 0.1
##$AZFW= 0.1
##$BCFW= 0
##$BC_mod= 2
##$BYTORDP= 0
##$COROFFS= 0
##$CY= -3
##$DATMOD= 1
##$DC= 0
##$DFILT= <>
##$DTYPP= 0
##$F1P= 0
##$F2P= 0
##$FCOR= 1
##$FTSIZE= 16384
##$FT_mod= 6
##$GAMMA= 0
##$GB= 0
##$INTBC= 1
##$INTSCL= 2.992141e-10
##$ISEN= 128
##$LB= 0.24
##$LEV0= 0
##$LPBIN= 0
##$MAXI= 10000
##$MC2= 0
##$MEAN= 0
##$ME_mod= 0
##$MI= 1.114404
##$NCOEF= 0
##$NC_proc= -5
##$NLEV= 6
##$NOISF1= 3.799351
##$NOISF2= 2.8
##$NSP= 0
##$NTH_PI= 0
##$NZP= 0
##$OFFSET= 15.99164
##$PC= 1
##$PHC0= -11120.86
##$PHC1= 11.20093
##$PH_mod= 1
##$PKNL= yes
##$PPARMOD= 0
##$PSCAL= 0
##$PSIGN= 0
##$REVERSE= no
##$SF= 200.130003963243
##$SI= 16384
##$SIGF1= 3
##$SIGF2= 2
##$SINO= 5.538805
##$SIOLD= 16384
##$SREGLST= <1H.CDCl3>
##$SSB= 0
##$STSI= 16384
##$STSR= 0
##$SW_p= 3396.73913043479
##$SYMM= 0
##$S_DEV= 0
##$TDeff= 16384
##$TDoff= 0
##$TI= <>
##$TILT= no
##$TM1= 0
##$TM2= 0
##$TOPLEV= 0
##$USERP1= <user>
##$USERP2= <user>
##$USERP3= <user>
##$USERP4= <user>
##$USERP5= <user>
##$WDW= 1
##$XDIM= 16384
##$YMAX_p= 386587727
##$YMIN_p= -248273
$$ End of Bruker specific parameters
$$ ---------------------------------
##NTUPLES= NMR SPECTRUM
##VAR_NAME=  FREQUENCY,     SPECTRUM/REAL,   SPECTRUM/IMAG
##SYMBOL=    X,             R,               I
##VAR_TYPE=  INDEPENDENT,   DEPENDENT,       DEPENDENT
##VAR_FORM=  AFFN,          ASDF,            ASDF
##VAR_DIM=   16384,         16384,           16384
##UNITS=     HZ,            ARBITRARY UNITS, ARBITRARY UNITS
##FACTOR=    0.207333158178282, 1,           1
##FIRST=     3200.40699477905, 0,            0
##LAST=      -196.332135655735, 0,           0
##MIN=       -196.332135655735, -248273,     0
##MAX=       3200.40699477905, 386587727,    0
$$ Real data points
##PAGE= N=1
##DATA TABLE= (X++(R..R)), XYDATA
$$ [...]
6111F5895j7115L8702J4340l1810l2330J3268j0404K4255J5235M6165k0169P631
6099A13663M7650P669K4998j9572m0796j2794K033m7968O346k4339M1763K3128
6087A21781J3518K4392K5287j2090Q165N2538k6967j2244J5902J4358l4080j5678
6075A74882J3860k8428K9219n0333K8718K3407m1615M1251P6010l9002k277J4094
6063B39786K7584J1190k930k1537J9710k7763m2825Q98K7993m126l4677K964J4683
6050B10950O7053o0839q515R505K3400l314N1811K0202L6255n3840k463R493L8312
6037C38010j8225k1018j5282q325N8213o401j1516N0535l6203K9080K9378r993
6025C78253k0897l1475l9194K3523m780K008M1965K7355j2806p4462J5875O0504
$$ y = [65895, 48780, 87482, 101822, 70012, 37682, 50950, 40546, 64801, 80036, 126201, 106032, 113663, 161313, 168982, 193980, 174408, 133612, 120818, 122851, 74883, 81229, 56890, 98653, 121781, 135299, 159691, 184978, 172888, 181053, 233591, 206624, 194380, 210282, 224640, 190560, 174882, 188742, 160314, 189533, 139200, 167918, 191325, 149710, 190961, 266971, 227969, 225692, 239786, 267370, 278560, 275630, 254093, 273803, 246040, 203215, 204113, 232106, 227980, 193303, 196267, 210950, 278003, 217164, 208649, 218154, 241554, 238240, 290051, 310253, 346508, 292668, 290205, 299698, 338010, 319785, 298767, 283485, 275160, 333373, 326972, 315456, 365991, 329788, 358868, 388246, 378253, 357356, 325881, 286687, 310210, 305430, 307438, 349403, 376758, 363952, 289490, 305365, 365869]
6013C65869Q021m1326K6384L6349n4078k8854k0434K6835k3793k8470m799n0528
6001B11176N0673K298l592L7382K485J1739n345J4191M9850O015J1789K6886R38
5988D16485l297O994k9080j2654m5214j5094K6169L7775L5388M1279q546j7671
5976D32534j1353J3502J3262J5181K3041L182q294j5270j8481N4658j9072j8268
5964D64622Q511j4888J7507L5837L0889l8652J5589N2580m3867L9447L6576K356
5952F06507K3760k4854Q025N0978l3149j9752P3373p786k608L4723j6831O6361
5940G58747M885j1026J4378L9053K5969n4058N3922j0485k2654K3205m299L1600
5928H49237M7647K777K053N3597M7058N2707N7304K1150j0140N6120L1819N088
$$ y = [365869, 373890, 332564, 358948, 395297, 341219, 312365, 291931, 318766, 294973, 266503, 261704, 211176, 261849, 264147, 260555, 297937, 300422, 312161, 306816, 321007, 370857, 376872, 388661, 415547, 416485, 413188, 420182, 391102, 378448, 333234, 318140, 344309, 382084, 417472, 458751, 450205, 432534, 421181, 434683, 447945, 463126, 486167, 489349, 481055, 465785, 447304, 501962, 482890, 464622, 473133, 458245, 475752, 511589, 542478, 503826, 519415, 571995, 528128, 567575, 604151, 606507, 630267, 605413, 613438, 664416, 631267, 611515, 684888, 677102, 674494, 709217, 692386, 758747, 763632, 752606, 766984, 806037, 832006, 777948, 831870, 821385, 798731, 821936, 817637, 849237, 896884, 899661, 901714, 955311, 1002369, 1055076, 1112380, 1133530, 1123390, 1179510, 1211329, 1216417]
5916A216417L5280K2670J9273M409Q2575L8279K8218N6772N6385M822M0600M5770
5904A651470Q294M5600N2619O4386K6138N1492R9844N8112M5186N3042j3667J5337
5892B157853N2961L7704K4104J01827J5389N8672N1775M5809O4282R2642L5247
5881B738265K7818Q7305O6036O1465J15221J04975N9924R6504J29948J05443L4119
5870C627023J30386Q9383J36915J61473J25222J27559J61826J83047J59953K28616
5860E131403J98747J61070J49884K23399K17872K74705K93260K74366L45406L29730
5850G599842L20476K73820L83162M17910M07679M26795N04097N43683N28780N50376
5840A1956620N88329P01448O49491O79644P26910P70851P54905P51930P60296
$$ y = [1216417, 1251697, 1274367, 1293640, 1298049, 1380624, 1418903, 1447121, 1503893, 1560278, 1565100, 1605700, 1651470, 1659764, 1705364, 1757983, 1822369, 1848507, 1899999, 1999843, 2057955, 2103141, 2156183, 2142516, 2157853, 2210814, 2248518, 2272622, 2374449, 2389838, 2448510, 2500285, 2546094, 2610376, 2703018, 2738265, 2766083, 2853388, 2919424, 2980889, 3096110, 3201085, 3261009, 3357513, 3487461, 3592904, 3627023, 3757409, 3846792, 3983707, 4145180, 4270402, 4397961, 4559787, 4742834, 4902787, 5131403, 5330150, 5491220, 5641104, 5864503, 6082375, 6357080, 6650340, 6924706, 7270112, 7599842, 7920318, 8194138, 8577300, 8995210, 9402889, 9829684, 10333781, 10877464, 11406244, 11956620, 12544949, 13246397, 13895888, 14575532, 15302442, 16073293, 16828198, 17580128, 18340424]
5831A8340424O99750O65171N87013N33388M00526K32825J08825j177j62881k97851
5821B1106013m38755m97209o09235o92200p04888q07933q48569p58060p47620
5812A5001544p07833p46958p44186o80698o19517n71886m99814n77104n29442
5803I324106m89697m07005m37885l81553l05818k96414l12526l02643k48623k19493
5793E922449k92353k72753k11645j90429j62655j38211k05267j30015r0712j24433
5783D103976j47607j98189j38370j01540r7522j16557l6852j02328q2792j23701
5773B958518j41867o4664l1558j05826p1923r1272p2719q1386o1621n5514l0837
5762B149331k1204p1111r1895n3191j8087o1947n5543o5303j0896o7783q2991
$$ y = [18340424, 19040174, 19705345, 20292358, 20825746, 21226272, 21459097, 21567922, 21566745, 21403864, 21106013, 20667258, 20170049, 19560814, 18868614, 18163726, 17355793, 16507224, 15749164, 15001544, 14293711, 13546753, 12802567, 12121869, 11502352, 10930466, 10430652, 9853548, 9324106, 8834409, 8427404, 7989519, 7607966, 7302148, 7005734, 6693208, 6390565, 6141942, 5922449, 5630096, 5357343, 5145698, 4955269, 4792614, 4654403, 4449136, 4319121, 4228409, 4103976, 3956369, 3758180, 3619810, 3518270, 3420748, 3304191, 3267339, 3165011, 3082219, 2958518, 2816651, 2751987, 2720429, 2614603, 2542680, 2451408, 2378689, 2297303, 2235682, 2180168, 2149331, 2128127, 2057016, 1965121, 1911930, 1893843, 1831896, 1776353, 1711050, 1700154, 1632371, 1549380]
5751A549380m209j1718l1090j8313l5341l9179n0460j9840j593q962j2253k0653
5739A295769p2908j8106j1332P507n7383k8301j7568k9029l3227M471j3847o0397
5727I65649K7773M3948m2037q3931K2568k0259m6540l5806j5548k8642J488l6915
5715G51748j1894n2845j9808n0681K2809j2567j4013K7968k016n033K3689n5979
5703F01378L4140j0174q9619l3067j039l2864j264j458L9842j8553k5443j7094
5691D44785L988k1779K5353J1274L7022L9029m3061l8783k2897p0795n811j7843
5679C40482r645L294m5904j9667P5946N9387l4586m6632j1289K8204r004j5779
5667C14807K4699L1594n8132k5245K5612Q746k9625k7026n665K6819n1569m3767
$$ y = [1549380, 1545171, 1533453, 1502363, 1484050, 1448709, 1409530, 1359070, 1339230, 1337637, 1328675, 1316422, 1295769, 1222861, 1204755, 1193423, 1200930, 1143547, 1115246, 1097678, 1068649, 1035422, 1039893, 1026046, 965649, 993422, 1037370, 995333, 911402, 933970, 913711, 867171, 831365, 815817, 787175, 788663, 751748, 739854, 687009, 667201, 616520, 639329, 626762, 612749, 640717, 638701, 633668, 657357, 601378, 635518, 625344, 535725, 502658, 501619, 468755, 467491, 466033, 505875, 487322, 461879, 444785, 448773, 426994, 452347, 463621, 500643, 539672, 496611, 457828, 434931, 364136, 358325, 340482, 330837, 334131, 288227, 268560, 344506, 403893, 369307, 322675, 311386, 339590, 330586, 314807, 339506, 371100, 312968, 287723, 313335, 322081, 292456, 265430, 259765, 286584, 235015, 191248]
5655A91248L986N8327m0429J9113K1776j7370l3286K7542J0787k787J0657P361
5643B56925J620j6521n8103K9091l6557J3799M176K557o882j9610o861K7827J6155
5630B07616j5841K980l9162M1795K3620n8228K7587J5161j6962k6927M2467m281
5618A99825L5448k6243k6997L5343J4284o350j3608L6448J8475k9208l9940M2614
5606B40091p215q2120QJ9817n0028p208J6253N565K3435l6788k1411k033j5508
5593H2858J599N7458r757k3261J6600K5761J7212K0844m8227n9587N576k2249
5581F4827j6553K0946K9642r563j7375J651O0074K7688m3643o4080J0494N6506
5569A20614j2066l1143M275j1469L9994j5253L4696J4997n7981l368K5746J4681
$$ y = [191248, 195234, 253561, 213132, 232245, 254021, 236651, 203365, 230907, 241694, 238907, 249564, 256925, 258545, 242024, 183921, 213012, 176455, 190254, 194430, 196987, 190105, 170495, 163634, 191461, 207616, 191775, 194755, 155593, 197388, 221008, 162780, 190367, 205528, 188566, 161639, 204106, 199825, 235273, 209030, 182033, 217376, 231660, 225310, 211702, 248150, 266625, 237417, 197477, 240091, 232876, 150756, 150764, 170581, 120553, 113345, 129598, 135163, 158598, 121810, 100399, 98366, 82858, 84457, 141915, 132158, 108897, 125497, 151258, 168470, 189314, 141087, 81500, 87076, 64827, 48274, 69220, 98862, 89299, 71924, 73575, 133649, 161337, 117694, 53614, 64108, 120614, 108548, 77405, 81680, 70211, 110205, 94952, 129648, 144645, 86664, 83296, 109042, 123723]
5557A23723l8597j5384N991M1738L6558J723j5787k0568p386k9908J9917l1774
5545G0246j9475J6782L5306n4325j4613J5756j809M5178K2951J206k302k8611
5533H6290n327k6567K4755j0859M830J4735k5624l0467K0552o28M241R588J3964
5520G9483M3385R405K2877j8341o6535p492R117L5716l8274l1707L8817M953J0279
5507I1683K6705L3227p0086j567j2662N8171J7856m3904k7452o285M6973l4906
5495G7753L7826L4651k7891o2732L4027L7666j2019j9855l8097K9922M372m2706
5483E2917k218M5503L6644j1976K8132m550O3088l4801l9313L948M2249J8474
5471A98097m1152j2609K1846J7474n6174k3684N0462N3562l7035j2282M9670J2425
$$ y = [123723, 85126, 69742, 75733, 117471, 154029, 155752, 139965, 119397, 112011, 82103, 102020, 70246, 50771, 67553, 102859, 48534, 33921, 49677, 47868, 93046, 115997, 117203, 114901, 86290, 80963, 54396, 79151, 68292, 73122, 87857, 62233, 31766, 52318, 51690, 55931, 65519, 79483, 122868, 132273, 155150, 136809, 70274, 62782, 71899, 107615, 69341, 37634, 76451, 81404, 91683, 118388, 151615, 81529, 79962, 67300, 125471, 143327, 99423, 71971, 65686, 112659, 77753, 115579, 150230, 122339, 59607, 93634, 131300, 119281, 99426, 61329, 91251, 95623, 52917, 50699, 96202, 132846, 120870, 149002, 144452, 207540, 172739, 133426, 137374, 179623, 198097, 156945, 144336, 166182, 183656, 127482, 103798, 154260, 207822, 170787, 158505, 208175, 220600]
5459B20600K940O158M4550j1607J0107o899k835J9249n9300k5656J066K2375J8578
5446B39326R406j8489N0943j1633K9333l6896k0644J4338q773k1848l5288j5162
5434A74613P3114p662j5358l3066L9279K0939J4925K0991j3845J034J07068M9207
5422D31239l7628K1643L5042M546J196j1610P617k4159p8943k5603R403j6722
5410C16021m9167J7348N8191j16n0270k5717L457L3610q2868k1214K9688O7362
5398B96325J6664m1856Q07J006J1583M322j7530J9332K678p429M7484m7981n6193
5385B29212j2181L6623L5096l3544l5889P71p783J4479j2288R206N988m5100j5600
5372A68990q677L2174o3798p0014P4643L5399o848l7521N3655J791r474J0481
$$ y = [220600, 223540, 229698, 274248, 262641, 272748, 265849, 263014, 282263, 222963, 197307, 198373, 220748, 239326, 248732, 230243, 281186, 269553, 298886, 261990, 241346, 255684, 246911, 225063, 189775, 174613, 247727, 240065, 224707, 191641, 230920, 251859, 266784, 287775, 273930, 274964, 382032, 431239, 393611, 415254, 450296, 454842, 456038, 444428, 452045, 427886, 348943, 323340, 332743, 316021, 266854, 284202, 342393, 342277, 292007, 266290, 269747, 303357, 220489, 199275, 228963, 296325, 312989, 271133, 271940, 272946, 284529, 288851, 271321, 290653, 293331, 285902, 333386, 285405, 229212, 217031, 253654, 288750, 255206, 219317, 220088, 212305, 226784, 214496, 223702, 229690, 184590, 168990, 160313, 192487, 128689, 58675, 133318, 168717, 161869, 124348, 178003, 179794, 170320, 180801]
5360A80801j6611J0571m0996J0799J5680K4081p091j931K2638k7789K8971k4763
5348A74360k3068N8597M7849k088n9301L8915m668m4462n240J0040l4397o402
5336A50135K7740J1205j8125M8203m500j6056J1450O2564K8216l2624j9783k8784
5324B19641K14j9182J407P607n675K0130L7758p936m7207N1129K4692k3976K440
5311B61042P597J5952k5535k1640Q944J7736K8195j4192M602k5586l680N0146
5299C03581J8415o8660L4558L7871l5279M111q02R197N891P698K135O0106P974
5286C86796K8128J729L6779j7515J2430J747k7138K5869L174k6200q2715p328
5274C35756L4612K1306k0357J0791L8536M0819j894k4619p915k0044p608K7627
$$ y = [180801, 164190, 174761, 133765, 144564, 160244, 184325, 177234, 175303, 197941, 170152, 199123, 174360, 151292, 209889, 257738, 255650, 196349, 235264, 230596, 186134, 180894, 190934, 156537, 150135, 177875, 189080, 170955, 219158, 214658, 198602, 210052, 272616, 300832, 268208, 248425, 219641, 219855, 200673, 202080, 209687, 204012, 224142, 261900, 253964, 206757, 257886, 282578, 258602, 261042, 268639, 284591, 259056, 237416, 246360, 264096, 292291, 278099, 282701, 257115, 253435, 303581, 321996, 253336, 287894, 325765, 290486, 294597, 293795, 302992, 308883, 316581, 318716, 378822, 386796, 414924, 416653, 453432, 435917, 448347, 450094, 422956, 448825, 451999, 425799, 343084, 335756, 370368, 391674, 371317, 382108, 420644, 461463, 459569, 434950, 427035, 406991, 399383, 427010]
5262D27010m201L3119O5328L0020r482R703j3249j3201k764j2998K6057p540M865
5249E32667J8303O734k240p294j4425M0608L0981o606k3520L4649L6107p186K5851
5236F64629O141m528K32M8968R702k3070M657J6457J2530M1724J2860K1644K7312
5223H39258k7630M552r680j8073J4857L6950N3019M7725J4936K593K6965N9956
5211A045428K8680j3493J7108N7958M004K5101p432L2575k2772k6525P1718K5060
5199A237410L7940O2256k033K1670O3554O0303N126K771M9342Q3490R362L3145
5187A664336L6635o3853Q6197O4326K7915K7414O6526K8626L2092J05366O8525
5176B144105L7233Q4017O3222Q5195P0072L7344K7003M0270P8665N4588M4624
$$ y = [427010, 422809, 455928, 521256, 551276, 541794, 551497, 538248, 525047, 522283, 509285, 535342, 527802, 532667, 550970, 557704, 555464, 548170, 533745, 574353, 605334, 598728, 575208, 609857, 645964, 638778, 664629, 670770, 666242, 666474, 715442, 725144, 702074, 706731, 723188, 735718, 777442, 790302, 811946, 839258, 811628, 816180, 806500, 788427, 803284, 840234, 893253, 940978, 955914, 958507, 985472, 1045428, 1074108, 1060615, 1077723, 1135681, 1139685, 1164786, 1157354, 1189929, 1167157, 1140632, 1212350, 1237410, 1275350, 1337606, 1335573, 1357243, 1420797, 1481100, 1486226, 1488997, 1538339, 1621829, 1631191, 1664336, 1700971, 1637118, 1723315, 1787641, 1815556, 1842970, 1909496, 1938122, 1970214, 2075580, 2144105, 2181338, 2265355, 2328577, 2413772, 2483844, 2521188, 2548191, 2588461, 2667126, 2721714, 2766338]
5165B766338O7595Q1591J21482Q9340P5655J46976J32795J11318Q8975J81299
5155C863364K01129Q7233O1179J23649J10412J70726J72939J65590J80398J54079
5145E290698K11198K36819K27244K50417K76946K40275K77381K97808L61700L92760
5135H063246M11459M16938M48889N39925O17831P17246Q01223Q63756J014545
5126A3895058J102440J183922J274329J332670J388389J320761J339044J090606
5118B3927219P87497L25303j86958o40889r49092j164510j183812j011792q28301
5109A9074665o89724m99508l24666j90094o4323K9463J42197L59049N32422N46186
5099A8915667P22674R17224J080813J291605J473727J699244J979081K169481
$$ y = [2766338, 2833933, 2915524, 3037006, 3126346, 3202001, 3348977, 3481772, 3593090, 3682065, 3863364, 4064493, 4151726, 4212905, 4336554, 4446966, 4617692, 4790631, 4956221, 5136619, 5290698, 5501896, 5738715, 5965959, 6216376, 6493322, 6733597, 7010978, 7308786, 7670486, 8063246, 8474705, 8891643, 9340532, 9880457, 10498288, 11215534, 12016757, 12880513, 13895058, 14997498, 16181420, 17455749, 18788419, 20176808, 21497569, 22836613, 23927219, 24714716, 25040019, 24853061, 24212172, 23263080, 22098570, 20914758, 19902966, 19074665, 18384941, 17885433, 17560767, 17370673, 17306350, 17335813, 17478010, 17837059, 18369481, 18915667, 19638341, 20555565, 21636378, 22927983, 24401710, 26100954, 28080035, 30249516]
5091C0249516K393727K524153K639719K587760K352499K011615J155482J9196
5083D5933667j239485k408348l292717l644085l454256l005065k584690k130736
5075B4174285j663948j406978j169786r23120p60422n85811m89992l63491j93912
5066A6616825o6051O2548J90268K75093M84316N49965O73981Q04266Q93809R44867
5056B1429887R31835R04866P21745N18850M6000m52087r71689j376926j690268
5047B0062213j876290j724972j541346j405225j176087r86108q71877p92400o70771
5038I017137o55223n37355m90442m09489m11630l14200l37384l23952k57461j92519
5028E087482j99841j74190k02592k47657j51766j16102j28658n0370j10251k02799
$$ y = [30249516, 32643243, 35167396, 37807115, 40394875, 42747374, 44758989, 45914471, 45933667, 44694182, 42285834, 38993117, 35349032, 31894776, 28889711, 26305021, 24174285, 22510337, 21103359, 19933573, 19010453, 18250031, 17664220, 17174228, 16810737, 16616825, 16550774, 16613322, 16803590, 17078683, 17562999, 18112964, 18786945, 19591211, 20485020, 21429887, 22361722, 23266588, 23988333, 24507183, 24553183, 24101096, 23129407, 21752481, 20062213, 18185923, 16460951, 14919605, 13514380, 12338293, 11352185, 10480308, 9687908, 9017137, 8361914, 7824559, 7334117, 6924628, 6512998, 6198798, 5861414, 5537462, 5280001, 5087482, 4887641, 4713451, 4510859, 4263202, 4111436, 3995334, 3866676, 3816306, 3706055, 3503256]
5018C503256j08996p8803j00786p1665o9699j03599r8509j25168j27043p954p8817
5007B532217j24929j12697l5484o7069o9203l0112o7750p7300n4779q1249k3984
4996A787661r204n9580q0138n4213J2039m8696j6538J3136N2164l1124l2248m2558
4984A490701j9355k363l5854K3006K8859o8907o2153l006k9845p1700m0700l8328
4972A170355J416m4343o6217l3127l1361O544m7872l3563J0404k204m389k4336
4960I01307j3191o6162Q750L0564k6947o4128k7867n81J0846j8041p3141k8784
4948F32625L2158L7318j7249k7460J9544j4434m8653Q911J9324k183j79n2033
4936E87689m711k7089O059n0827r965J3322J026l3379N051M2140K6756p2354j3249
$$ y = [3503256, 3394260, 3315457, 3214671, 3143006, 3073307, 2969708, 2871199, 2746031, 2618988, 2611034, 2532217, 2407288, 2294591, 2259107, 2192038, 2122835, 2092723, 2024973, 1947673, 1892894, 1811645, 1787661, 1778457, 1718877, 1638739, 1584526, 1596565, 1547869, 1531331, 1544467, 1596631, 1565507, 1533259, 1490701, 1471346, 1468983, 1433129, 1456135, 1484994, 1416087, 1353934, 1350928, 1321083, 1249383, 1208683, 1170355, 1171771, 1127428, 1061211, 1028084, 996723, 1003267, 955395, 921832, 932236, 930032, 925643, 901307, 888116, 821954, 830704, 861268, 834321, 770193, 742326, 741745, 752591, 734550, 661409, 632625, 664783, 702101, 684852, 657392, 676936, 662502, 613849, 622760, 642084, 639901, 639722, 587689, 582978, 555889, 561948, 511121, 501156, 514478, 515504, 482125, 487176, 529316, 556072, 483718, 470469]
4923D70469l1533j3886J8655k6613n3710k0460K4651K8703o862J2557N157L0295
4911D37423k6309M905k7584l1933l394M0706N4081j2281N205k4904K9257m0780
4899D04392k031l3142j5292J0368L4442K0053K6276l3299J2572J0670k6764L9893
4887D48138k7768k9964j1500m4702N5821L6790k7351n7633K6216J0416k7870J6348
4875C66941J9609j9982k2921N6814j8513k3449k7462k8980M896o230N3121J9169
4863C73013j486m3377k2311o8027m086M371O1512l5121Q6275O992l2250m4934
4851B80571K6034M4211j9541j0499J9330J5782n4075J2629m68k2876p965M6144
4839C29277K1646Q439m0629j8209l2859M0840n797O644l0977k9873k1551K1995
$$ y = [470469, 438936, 425050, 443705, 417092, 363382, 342922, 367573, 396276, 389414, 401971, 407128, 437423, 411114, 416019, 388435, 356502, 353108, 393814, 447895, 435614, 440819, 415915, 445172, 404392, 402361, 369219, 353927, 364295, 398737, 418790, 445066, 411767, 424339, 435009, 408245, 448138, 420370, 390406, 378906, 334204, 390025, 426815, 399464, 341831, 368047, 378463, 350593, 366941, 386550, 366568, 343647, 400461, 381948, 358499, 331037, 302057, 306953, 300723, 353844, 373013, 371527, 328150, 305839, 237812, 233726, 238097, 299609, 264488, 350763, 357755, 325505, 280571, 306605, 350816, 331275, 320776, 340106, 355888, 301813, 314442, 313974, 291098, 283133, 329277, 350923, 359362, 318733, 300524, 267665, 308505, 302708, 309352, 278375, 248502, 226951, 248946]
4827B48946j8528m187Q140O043J0150O9K665J6860J9422P560j1005J182P052L8976
4813C33345p116n0375M2521R054N103p162M3304p1450j2422N803J2110j0852n9269
4800B32594L7592J1947o10q500J7055K8103M2385k0941n9211K7255K4217J3942
4788C45828j1188L6960J0013l174j9064m102N7145J7347Q83m218N9332L5457J9132
4775E40351K8678k2599l0110L8345J6817O1028k1689l5478K0676N1526J6308K4097
4763F87950j9014k350k6085l7048M278K0314j2426n503j8708j5542J8058k19m373
4750E89332n311M2599J277M3106k2133j7486o3179o05Q854j1521p866n246j4880
4737E36941l013k428n2986k7258N6050r621n7521j6921n132K3570k9079N969n2738
$$ y = [248946, 230418, 226231, 234371, 240414, 250564, 250633, 253298, 270158, 289580, 297140, 286135, 287317, 294369, 333345, 326229, 275854, 318375, 327429, 332532, 325370, 368674, 297224, 284802, 290605, 302715, 291863, 232594, 270186, 282133, 281523, 273023, 290078, 318181, 360566, 339625, 280414, 307669, 331886, 345828, 334640, 371600, 381613, 378439, 359375, 355273, 412418, 429765, 430648, 426430, 485762, 521219, 540351, 569029, 546430, 516320, 554665, 571482, 632510, 610821, 575343, 596019, 647545, 663853, 687950, 668936, 666586, 640501, 603453, 607731, 628045, 615619, 610116, 591408, 575866, 593924, 593705, 589332, 584021, 626620, 627897, 671003, 648870, 631384, 568205, 567600, 576454, 564933, 557067, 551821, 536941, 533928, 531500, 478514, 451256, 507306, 497685, 440164, 423243, 418111, 441681, 412602, 418571, 365833]
4724C65833j8224J7281J8547K4817m3213K531K0932K9111N945o383L5802l2766
4712D20213r159P534l4093Q3160m3365p1853L367L373j4690k1929M659K298K1287
4699C50802L3707J5480j3580J8139j5300K8406J2080m5347m2485J5143J4159l5144
4687C36060k7593o954L4114P16j9313O123K447K3928n510j1032K193J3366j1328
4674C37217j4977J021k4016k3674K1240l7835k4425M4355O6394l8530q014K8160
4662C26916J8741o366O0109Q724R256K3874l4809K4077k5905J348k9569k7174
4650C49222J8134J6054j1764K3189j6405o281M6359M219j267j1058J1998m4493
4638C77907N9940L8343j8528k001J10424o4425m2495J7435k6217j595m7823P1791
$$ y = [365833, 347609, 364890, 383437, 408254, 365041, 367572, 388504, 417615, 423560, 417177, 452979, 420213, 411054, 418588, 384495, 467655, 424290, 352437, 355804, 359177, 344487, 322558, 327217, 329515, 350802, 384509, 399989, 386409, 404548, 389248, 417654, 429734, 384387, 341902, 357045, 371204, 336060, 308467, 301513, 335627, 336343, 317030, 323153, 325600, 349528, 344018, 332986, 335179, 348545, 337217, 322240, 323261, 299245, 275571, 296811, 258976, 234551, 278906, 345300, 306770, 298756, 326916, 345657, 339291, 399400, 408124, 417380, 441254, 406445, 430522, 404617, 405965, 376396, 349222, 367356, 383410, 371646, 394835, 378430, 372149, 418508, 422727, 421460, 410402, 422400, 377907, 437847, 476190, 457662, 455661, 566085, 501660, 459165, 476600, 450383, 448788, 400965, 472756]
4626D72756J1416K0708L1447K2971l5811n8650M3785L1888r664L025m6504l3067
4614D54300M4412J9714l2158K7709j3566L8194M5563o969j9293L1326k687K0831
4602F07376K0534m9220l1219j4369L2375P921m1604L0017N3395K2679o8J1200
4590F49017K6778K0479J1353N5476N1189j4025J8319M5374l772l0493m8034M0542
4578H22203l243K551N5070K5382J0226J6352L1159P3569O9665l275J8899K356
4566A120914N0516P0427p646J1084n4312J8790k3537R472K9292j7937M2542L1624
4554A281229k6110N8097O717K8447P682m8501M7139K7566M6745O8356M1833J4948
4542A554148j5502N0152L4835M4967O7435M9596M3541O9252r935j5483M8936M8490
$$ y = [472756, 484172, 504880, 536327, 559298, 523487, 464837, 508622, 540510, 530846, 533871, 487367, 454300, 498712, 518426, 486268, 513977, 500411, 538605, 584168, 577199, 557906, 589232, 586545, 607376, 627910, 578690, 547471, 533102, 565477, 573398, 531794, 561811, 615206, 637885, 637817, 649017, 675795, 696274, 707627, 763103, 814292, 800267, 818586, 863960, 860188, 829695, 781661, 822203, 818960, 821511, 876581, 901963, 912189, 928541, 959700, 1033269, 1102934, 1099659, 1118558, 1120914, 1171430, 1241857, 1234211, 1245295, 1190983, 1209773, 1186236, 1195708, 1225000, 1207063, 1249605, 1281229, 1255119, 1313216, 1319933, 1348380, 1356062, 1307561, 1354700, 1382266, 1429011, 1497367, 1539200, 1554148, 1538646, 1588798, 1623633, 1668600, 1736035, 1785631, 1829172, 1898424, 1888489, 1873006, 1921942, 1970432]
4530A970432O7661R8200R3250P2042M598k7820P9028Q8467J17991R0797J01695
4519B756341N5156J06477Q2615K8180M0417P4629J35097P7140P1133J51638M8893
4508C627716Q3137J08744K7893M1719J36900J04333O1268J35886J69355Q0649
4498D577600J15000Q8005J36606J45481J09696J23780J58931J70920J20075J56158
4488E902252K06600J86135K08750K44994J57514K29465L03097K82644L19418L55688
4478H396557L02471L49072M11151M21386M46475M60859N48555N13501N37616O03983
4468A2991626O78679P31974P35807Q05147Q84610R31188J046763J136316J238235
4459B1180345J419727J579914J772414K037645K304727K523711K698086K975379
$$ y = [1970432, 2038093, 2136293, 2229543, 2301585, 2306183, 2278363, 2357391, 2445858, 2563849, 2654646, 2756341, 2811497, 2917974, 3000589, 3028769, 3069186, 3143815, 3278912, 3356052, 3427185, 3578823, 3627716, 3710853, 3819597, 3847490, 3889209, 4026109, 4130442, 4191710, 4327596, 4496951, 4577600, 4692600, 4780605, 4917211, 5062692, 5172388, 5296168, 5455099, 5626019, 5746094, 5902252, 6108852, 6294987, 6503737, 6748731, 6906245, 7135710, 7438807, 7721451, 8040869, 8396557, 8699028, 9048100, 9459251, 9880637, 10327112, 10787971, 11336526, 11850027, 12387643, 12991626, 13670305, 14402279, 15138086, 15943233, 16827843, 17759031, 18805794, 19942110, 21180345, 22600072, 24179986, 25952400, 27990045, 30294772, 32818483, 35516569, 38491948]
4451C8491948L273372L446833L501853L505246L404930L210777K919078K597695
4443F4351732K064121J483111P31104l27803j333257k269758l133980l441768
4435E8123502l556092l487452l506338l500053l452211l337689l202671l041590
4427C1039406k773787k494155k235731k010009j729676j493139j349252j208946
4419A5744711j019470r63238q49185p28984o03256o14701n32053m44795m97317
4410I491712m28876m09367l73886k87870l29979l00192k87651l33685k50956j60913
4400F328337j82197j93121k18706k20562k11366j56527j50577j67759j67506j28539
4390D531477j50056j34743j41412j19573j22004j30595j24226n9076r9927j18679
$$ y = [38491948, 41765320, 45212153, 48714006, 52219252, 55624182, 58834959, 61754037, 64351732, 66415853, 67898964, 68630068, 68302265, 66969008, 64699250, 61565270, 58123502, 54567410, 51079958, 47573620, 44073567, 40621356, 37283667, 34080996, 31039406, 28265619, 25771464, 23535733, 21525724, 19796048, 18302909, 16953657, 15744711, 14725241, 13762003, 12912818, 12183834, 11580578, 10965877, 10433824, 9989029, 9491712, 9062836, 8653469, 8279583, 7991713, 7661734, 7361542, 7073891, 6740206, 6489250, 6328337, 6146140, 5953019, 5734313, 5513751, 5302385, 5145858, 4995281, 4827522, 4660016, 4531477, 4381421, 4246678, 4105266, 3985693, 3863689, 3733094, 3608868, 3549792, 3449865, 3331186]
4380C331186q0694o2975r1378p6293m9063p9966m0061l2880q1850l7068q043o134
4368B684781r4159q3062n4273m7353j17023l3746r0586p8535o0417m2058r8003
4357A885566o252m1707l9579p268o4607o275L6245j8072l8276m1159m6457k6319
4345A585840J4039o2396m9484R909l7643r3569m6403k7318k572Q286o2889j7004
4333A218796L8713M7182n8918j0088j3109J048j3394j6073k0866r262k5734k7223
4321A111072l7884J6046K0736l8225m006J2866m7694r291l9186l66k0320o4289
4309H99459k0848J4719k5275m520o92k1193m860j5595k5445Q076L7408q454k3272
4296H09508j1875k2996J384p6552J7532L3609K2061o1126l8576Q0158K5266p8458
$$ y = [3331186, 3250492, 3187517, 3096139, 3019846, 2970783, 2890817, 2850756, 2817876, 2736026, 2698958, 2690915, 2684781, 2590622, 2507560, 2453287, 2405934, 2288911, 2255165, 2164579, 2086044, 2025627, 1983569, 1885566, 1879314, 1837607, 1798028, 1790760, 1726153, 1719878, 1756123, 1738051, 1699775, 1658616, 1612159, 1585840, 1599879, 1537483, 1487999, 1497908, 1460265, 1366696, 1320293, 1292975, 1290403, 1298689, 1235800, 1218796, 1257509, 1304691, 1245773, 1235685, 1222576, 1223624, 1210230, 1194157, 1173291, 1164029, 1138295, 1111072, 1073188, 1089234, 1109970, 1071745, 1067739, 1080605, 1032911, 1023620, 984434, 984068, 963748, 899459, 878611, 893330, 868055, 863535, 862843, 841650, 836790, 821195, 795750, 803826, 841234, 832780, 809508, 797633, 774637, 776021, 699469, 717001, 750610, 772671, 711545, 672969, 753127, 778393, 699935]
4284F99935k1572K7827n885J1453l3278k6465J1828k3001P909L41j7019J898K1003
4271F54974L5476j6531o7815N9106k2189j0634q766j4280K8910j7894l7701J3685
4259E96341P5781K909l3225J532k716J5154L6900p9431k1662K2561K1171n8329
4247E76986j7684N5876k5883o8116N4421K9901p0605m8823p74M0919j2642j5268
4235D98308m111q703l0916r353L8458K9297m3702p159N5163P486j7319k562m156
4222E00731j570k963j6121O248M1453J6804n3675l860J6258k9570k6788k8119
4210D18828L3264J0318o4355l171O6435O3571j0432k1500p886M0139o914K1058
4198E39355L8747m3436j4633P2602O0891p811J215p715O7726L5432q848O70L9754
$$ y = [699935, 678363, 706190, 700305, 711758, 678480, 652015, 663843, 640842, 648751, 649092, 632073, 633971, 654974, 690450, 673919, 606104, 665210, 643021, 632387, 623621, 609341, 638251, 620357, 582656, 596341, 672122, 675031, 641806, 643338, 640622, 655776, 692676, 613245, 591583, 614144, 635315, 576986, 559302, 615178, 589295, 521179, 575600, 605501, 534896, 486073, 485299, 526218, 513576, 498308, 494197, 485494, 454578, 445225, 483683, 512980, 469278, 462119, 517282, 524768, 507449, 504887, 500731, 499161, 496198, 480077, 486325, 527778, 544582, 490907, 487047, 503305, 473735, 446947, 418828, 452092, 462410, 398055, 394884, 461319, 524890, 514458, 492958, 485072, 525211, 518297, 539355, 578102, 534666, 520033, 592635, 653526, 645715, 646930, 639215, 706941, 742373, 733525, 734195, 773949]
4185G73949j3227n2429p1731n833q11o0931m7623J6995K9746j7337m5609l1316
4173D73843J305l7160M779p133K6616l9568k8285M2261M0217J3623j637q34M3201
4160E31228n8382k5854L3685J3250q390o3732j0898N2016o518q378k2582L2210
4148D57655L0310J8473L1933l1430J5190M9726l7970J2622N6638P4l6413N3092
4136F19900k1061j4321K993m0907j1046J7146Q1819L3780R328K0240K0677O2917
4124G81465K6718k6698J1040j1241l396L9827k1443j8149n851J1482L5618l2566
4112G86806K2697l9818j9802J8038j9673k8928r462K0067j4768n5349k4510J7247
4100F52545K7342j6552k9118L0516j3382l0297n1562J1989N8857J3495m5127p656
$$ y = [773949, 760722, 708293, 636562, 630729, 629918, 568987, 521364, 538359, 568105, 550768, 505159, 473843, 475148, 437988, 442767, 435634, 462250, 422682, 394397, 436658, 476875, 490498, 488861, 488027, 531228, 472846, 446992, 480677, 493927, 485537, 421805, 410907, 462923, 456405, 448027, 425445, 457655, 487965, 506438, 538371, 506941, 522131, 571857, 533887, 546509, 603147, 603221, 566808, 619900, 598839, 584518, 587511, 546604, 535558, 552704, 634523, 668303, 677631, 697871, 718548, 781465, 808183, 781485, 792525, 781284, 777888, 817715, 796272, 778123, 772272, 783754, 819372, 786806, 809503, 769685, 749883, 767921, 748248, 719320, 709858, 729925, 715157, 659808, 635298, 652545, 679887, 663335, 634217, 664733, 651351, 621054, 569492, 581481, 640338, 653833, 608706, 601050]
4088F01050J5843J6129j4074J1918J1482n4034J6538L9991L0106j0749m9399k7921
4076E86880N4603L5102j7524j12034m434O0784M7207L473J1478K4073r501n659
4064F74448K7173P037k0126l4682l2168O411J4192K2030L9742K3643k414l0724
4052F94562j0280O8888k7624n1154P7357Q5296j7403J810m4523q57K2138K1650
4040H19860L8734O140M1512l6655k8194N3282N581j337n323j7108M022K7085K9912
4027I37511L4357L675m0750L691M2455K7000l5473k740N4463O1792K5811m582
4015A107210J8138K6999k2941J761R976P120k8776P354j9541N533K5473L93J0804
4002A149503O3602k963J6056L484K6792l360N678m2156J8305M1767m0279r890
$$ y = [601050, 616893, 633022, 618948, 630866, 642348, 588314, 604852, 644843, 674949, 664200, 614801, 586880, 641483, 676585, 659061, 547027, 542593, 603377, 650584, 654057, 665535, 689608, 680107, 674448, 701621, 708658, 688532, 653850, 621682, 628093, 642285, 664315, 704057, 727700, 725286, 694562, 684282, 753170, 725546, 674392, 751749, 837045, 819642, 821452, 776929, 776072, 798210, 819860, 858594, 864734, 906246, 869591, 841397, 894679, 900260, 898923, 893600, 876492, 880514, 907599, 937511, 971868, 975543, 934793, 938484, 980939, 1007939, 972466, 969726, 1024189, 1085981, 1111792, 1107210, 1125348, 1152347, 1129406, 1131167, 1141143, 1148263, 1119487, 1126841, 1107300, 1112833, 1138306, 1138699, 1149503, 1213105, 1210142, 1226198, 1229682, 1256474, 1253114, 1258792, 1216636, 1234941, 1276708, 1236429, 1226539]
3990A226539K8388L1269J4458L7017J5900K1191j9407Q068M7841o390L5492Q5817
3978A526183j8562l905J1555J3370J1832l6988k5267r305k6092J1621K2492j918
3966A475016o0883L535j3185J5184N8756q744Q769L0799K9377J1475m0198N6879
3954A566780O94p7529O916N8536l0364k6648n559L1527j987J8744m893k451P3854
3941A607620k589K915p7937j9836M5550L8538J7061J8745n0499j1247K2381L215
3929A593917J3256M4751L3439l3546J4338O075n782k4465P4398n852j1593O635
3917A705571l6967M9730L7468k5409K3195N068J150K373l9083K4747K9909o946
3905A770806M4418J4053M238K0954j5207J5351L563j1902L0186K20j949j5469
$$ y = [1226539, 1254927, 1286196, 1300654, 1337671, 1353571, 1374762, 1355355, 1363423, 1411264, 1404874, 1440366, 1526183, 1507621, 1503716, 1515271, 1528641, 1540473, 1503485, 1478218, 1468913, 1442821, 1454442, 1476934, 1475016, 1414133, 1417668, 1404483, 1419667, 1478423, 1469679, 1478448, 1509247, 1538624, 1550099, 1509901, 1566780, 1567474, 1489945, 1496861, 1555397, 1525033, 1498385, 1492826, 1524353, 1522366, 1541110, 1536217, 1533766, 1607620, 1605031, 1607946, 1530009, 1510173, 1555723, 1594261, 1611322, 1630067, 1579568, 1568321, 1590702, 1593917, 1607173, 1651924, 1685363, 1651817, 1666155, 1672230, 1666448, 1641983, 1716381, 1710529, 1698936, 1705571, 1668604, 1718334, 1755802, 1730393, 1753588, 1758656, 1759806, 1762179, 1723096, 1747843, 1777752, 1770806, 1815224, 1829277, 1833515, 1854469, 1839262, 1854613, 1858176, 1846274, 1876460, 1876680, 1874731, 1859262]
3893A859262L4415J5206M6072J2270m0333p9144M8888L6855l6608P890M9832m8604
3881A906001l0837K9134k5323K372Q8884P5670k3753k3985j4271K2621L2885M3158
3869B082556n3782N791p947k2413j6166O920Q919m0241L561O9174N0585K4679
3857B111636k0898N6792K6374J1492M7603K943n886n888K1272M7091J855k4142
3845B270244M01j6275K0551M4701K4399J5831M3205M2505k1088L849N1864L9467
3833B519654J8044K6310l141N3540J770J6344K4382J4911M7703L6454N0551K7675
3821B834197K8721O1419K8803Q404O081M5120N1423M6577J0290j0804R1383O0714
3809C262328K1031M0040O4433J7806P1411P2639P4712N4929M8839O4219J12887
$$ y = [1859262, 1893677, 1908883, 1954955, 1967225, 1926892, 1847748, 1896636, 1933491, 1896883, 1904773, 1954605, 1906001, 1875164, 1904298, 1878975, 1881347, 1970231, 2045901, 2022148, 1998163, 1983892, 2006513, 2039398, 2082556, 2028774, 2034565, 2026618, 2004205, 1988039, 1994959, 2003878, 1963637, 1967198, 2036372, 2086957, 2111636, 2090738, 2147530, 2173904, 2185396, 2232999, 2235942, 2230056, 2224168, 2245440, 2292531, 2294386, 2270244, 2270645, 2254370, 2274921, 2319622, 2344021, 2359852, 2403057, 2445562, 2424474, 2428323, 2480187, 2519654, 2537698, 2564008, 2560867, 2614407, 2616177, 2632521, 2656903, 2671814, 2719517, 2755971, 2806522, 2834197, 2862918, 2924337, 2953140, 2961544, 2967625, 3012745, 3064168, 3110745, 3121035, 3110231, 3201614, 3262328, 3283359, 3323399, 3387832, 3405638, 3477049, 3549688, 3624400, 3679329, 3728168, 3792387, 3905274]
3798C905274O5044J06360O1537Q5759O7897P4518R6803P9185O2957R4815J40643
3787D840792J32077J50212R4223J61340J13413J47285K08213J99439K41530K53369
3777F541893K53849L08327L27493M20875M57382N34326N43555O92572P79365Q35088
3767A1694725R14286R87460R78368P71084M37877Q3448m44881q43300j029551
3758A3549516j006567p87788n03300k51102j42355j9536O4288J82056J78612J80585
3748A1444409K58451K46748K83414K75072L36940L46004K69049L44715M00621
3739A4205423L51664L62557L72520M44758M34190M23369M33564N38022N72679
3730A8138746N17836N06297N42562M92074M56949M89443M73605M48964M74943
$$ y = [3905274, 3970318, 4076678, 4138215, 4223974, 4291871, 4366389, 4463192, 4542377, 4605334, 4700149, 4840792, 4972869, 5123081, 5217304, 5378644, 5492057, 5639342, 5847555, 6046994, 6288524, 6541893, 6795742, 7104069, 7431562, 7852437, 8309819, 8844145, 9387700, 10080272, 10859637, 11694725, 12609011, 13596471, 14574839, 15345923, 15783800, 15867248, 15422367, 14579067, 13549516, 12542949, 11755161, 11251861, 11000759, 10858404, 10838868, 10903156, 11085212, 11263824, 11444409, 11702860, 11949608, 12233022, 12508094, 12845034, 13191038, 13460087, 13804802, 14205423, 14557087, 14919644, 15292164, 15736922, 16171112, 16594481, 17028045, 17566067, 18138746, 18656582, 19162879, 19705441, 20197515, 20654464, 21143907, 21617512, 22066476, 22541419]
3721B2541419N03323N71437O79929P34390P50106R56869J037232J124738J196477
3712C0095920J288163J418854J465137J528378J501576J595883J565246J557706
3704D2016863J644331J771601J711792J800576J797577J745560J702630J670584
3696E5861514J594566J376039J220124J034104N82082M00894M31526L55482M46027
3687F3302358P15145R15304R85207R82047R48644Q08951O89917O44210N26916
3678G0518699M34551N20843M04429L42306K60828k9355l30818p17383j225882
3669G0178218j739861k222983k644268k850629k916801k804744k413489j949376
3661E0636067j511034r71302n15650j59060J02567K03949K66671K7350l81296
$$ y = [22541419, 23044742, 23616179, 24296108, 25030498, 25780604, 26737473, 27774705, 28899443, 30095920, 31384083, 32802937, 34268074, 35796452, 37298028, 38893911, 40459157, 42016863, 43661194, 45432795, 47144587, 48945163, 50742740, 52488300, 54190930, 55861514, 57456080, 58832119, 60052243, 61086347, 61668429, 62069323, 62500849, 62856331, 63302358, 64017503, 64932807, 65918014, 66900061, 67848705, 68657656, 69347573, 69991783, 70518699, 70953250, 71474093, 71878522, 72220828, 72481656, 72452301, 72121483, 71404100, 70178218, 68438357, 66215374, 63571106, 60720477, 57803676, 54998932, 52585443, 50636067, 49125033, 48153731, 47638081, 47479021, 47581588, 47785537, 48052208, 48079558, 47698262]
3652D7698262j092430j860598k539937k923983k930597k730683k440774k041738
3644B9137522j744857j475632j178341j046227r08862p31686o34773n76813m34110
3635B0406221l52655k63567k56844k55392k15295k54886k51797l36157m13923
3626A7805705m48094n27009o03938n42687n14946n24716m48702m29139l70307
3617A3396167k42674k67773k52253k28777k93656l18460l15044k73407l03459
3608A0900664l67742l88014l33818l41087l83565l01469k19693k45467k97860
3599H021949j96908j60085j73568k28270j69327p8478q4517j26394j06703j19652
3589F578047j08181j02566j41507j04881j76459j47277j80260j20238p7559j59186
$$ y = [47698262, 46605832, 44745234, 42205297, 39281314, 36350717, 33620034, 31179260, 29137522, 27392665, 25917033, 24738692, 23692465, 22783603, 22051917, 21417144, 20840331, 20406221, 20053566, 19789999, 19533155, 19277763, 19062468, 18807582, 18555785, 18219628, 17805705, 17357611, 16830602, 16226664, 15683977, 15169031, 14644315, 14195613, 13766474, 13396167, 13153493, 12885720, 12633467, 12404690, 12111034, 11792574, 11477530, 11204123, 10900664, 10532922, 10144908, 9811090, 9470003, 9086438, 8784969, 8565276, 8319809, 8021949, 7825041, 7664956, 7491388, 7263118, 7093791, 7015313, 6930796, 6804402, 6697699, 6578047, 6469866, 6367300, 6225793, 6120912, 5944453, 5797176, 5616916, 5496678, 5419119, 5259933]
3579E259933j24191j02406j39296r5815r0280o2214q7602n6775n8272o7508p3743
3568D301831o6127p026J400o1996o3177q2843o6254m8241l5873o4483O371j6192
3556C797390m4270p6258m8677o5346R551j27k8945K4440L4257o0895k2835k6880
3544C491405k1917k4408l91L2760k1755q4526l7450O0044Q3110n1395k3628r14
3532C400935M1106K6067m3701l3620K2306L0760L1552k2396J918R996k5825L5116
3520C474214r163N629K9360O8130J0582l6826M1693K1154O2541L741n215k1174
3508C644666N1321L0189p0691j3495r168M9381j8133K3982Q9820O3396k2512j5233
3496C803523N9501J11956O027M0942P2918N9980M733O9008J17000R5490K3102
$$ y = [5259933, 5135742, 5033336, 4894040, 4798225, 4707945, 4645731, 4558129, 4501354, 4443082, 4375574, 4301831, 4235704, 4228678, 4230078, 4168082, 4104905, 4022062, 3955808, 3907567, 3871694, 3807211, 3813582, 3797390, 3753120, 3676862, 3628185, 3562839, 3572390, 3572263, 3543318, 3567758, 3602015, 3541120, 3518285, 3491405, 3469488, 3445080, 3444689, 3477449, 3455694, 3371168, 3333718, 3393762, 3476872, 3425477, 3401849, 3400935, 3442041, 3468108, 3424407, 3390787, 3413093, 3443853, 3475405, 3453009, 3454927, 3464923, 3439098, 3474214, 3465051, 3470680, 3500040, 3568170, 3578752, 3541926, 3583619, 3604773, 3667314, 3671055, 3665840, 3644666, 3695987, 3726176, 3655485, 3641990, 3632822, 3682203, 3664070, 3688052, 3777872, 3841268, 3818756, 3803523, 3863024, 3974980, 3981007, 4021949, 4094867, 4154847, 4159580, 4228588, 4345588, 4441078, 4464180]
3485D464180K4633P0866J39766R1439L1459Q8832J36414Q4342L8636J01033J83358
3474E454958J06917Q0249Q6302O9651Q4809J03929J73661Q0869J32161J22131
3464F495637R7780J87015J56835J36387J29116J14107J29881J33983J70438K36564
3454G987743J25377J60468J69390K33735J40206P9430J89918K15743J59932J82690
3444I644632K38154K33043J99119K16459K60154K75281L21991L62053L69473M15661
3434A2536020L91589M62656M93562N60357N04731O20209O51151O70231O93750
3425A7584256P07505P38311Q03329P95118P86867Q59370R05280R81109J040696
3416B5201841J103858J246789J359388J402195J482077J661436J857332K089706
$$ y = [4464180, 4488813, 4559679, 4699445, 4790884, 4822343, 4911175, 5047589, 5131931, 5170567, 5271600, 5454958, 5561875, 5642124, 5728426, 5798077, 5882886, 5986815, 6160476, 6241345, 6373506, 6495637, 6593417, 6780432, 6937267, 7073654, 7202770, 7316877, 7446758, 7580741, 7751179, 7987743, 8113120, 8273588, 8442978, 8676713, 8816919, 8896349, 9086267, 9302010, 9461942, 9644632, 9882786, 10115829, 10314948, 10531407, 10791561, 11066842, 11388833, 11750886, 12120359, 12536020, 12927609, 13390265, 13883827, 14444184, 14948915, 15569124, 16220275, 16890506, 17584256, 18291761, 19030072, 19833401, 20628519, 21415386, 22274756, 23180036, 24161145, 25201841, 26305699, 27552488, 28911876, 30314071, 31796148, 33457584, 35314916, 37404622]
3408C7404622K313573K566213L035224L337290L777812M364120N027756N779879
3400F7606489O637562P577121Q429905R176381R639353R723563R390759Q162530
3392A36343663N237448L74003n503233j0692221j3637964j3817056j2312300j0170500
3384G5821840q245747o709747n431069m468678l712953l090615k587603k294689
3376C9280739j993844j785373j607258j392953j272626j085034q67191p67140
3368B8509320p06283n51075m18970l26505k57352j65684j18595j6297O5283J35268
3358B6149110K38568K65103K83747K93489L31997L57104K91886K46049K75918
3349B8732971L45210L55326L97380O40005P81144Q92800J036185J332439J432991
$$ y = [37404622, 39718195, 42284408, 45319632, 48656922, 52434734, 56798854, 61826610, 67606489, 74244051, 81821172, 90251077, 99427458, 109066811, 118790374, 128181133, 136343663, 141581111, 141955114, 136451881, 125759660, 112121696, 98304640, 85992340, 75821840, 67576093, 60866346, 55435277, 50966599, 47253646, 44163031, 41575428, 39280739, 37286895, 35501522, 33894264, 32501311, 31228685, 30143651, 29276460, 28509320, 27803037, 27251962, 26832992, 26506487, 26249135, 26083451, 25964856, 25948559, 26013842, 26149110, 26387678, 26652781, 26936528, 27230017, 27562014, 27919118, 28211004, 28457053, 28732971, 29078181, 29433507, 29830887, 30470892, 31252036, 32144836, 33181021, 34513460, 35946451]
3340C5946451J541050J653281J682262J663431J503063J136561O86327J83807
3332D5996233k45671n44211n51251m31643j88683m7367J14200K67065K53414J43312
3322D4765398J83412J27553K10798M12756O14271P86540J088222J248465J466661
3313E0904076J829825K250578K632668L177600L520427L993507M433359M738948
3305G7480988M924191N017343M801712M128395L093865K204559J649546J817843
3297A05118442K770722M199294N665758O980841Q179070Q958249Q736183P278272
3289A57886831M811967J314724k635846o585790j0079449j2386878j3457453j3278511
3281A05589595j1857628r756420p601872n784327m347387l320375k598864k065755
$$ y = [35946451, 37487501, 39140782, 40823044, 42486475, 43989538, 45126099, 45812426, 45996233, 45750562, 45206351, 44655100, 44223457, 44034774, 43987407, 44101607, 44368672, 44622086, 44765398, 44948810, 45076363, 45287161, 45699917, 46314188, 47100728, 48188950, 49437415, 50904076, 52733901, 54984479, 57617147, 60794747, 64315174, 68308681, 72742040, 77480988, 82405179, 87422522, 92224234, 96352629, 99446494, 101651053, 103300599, 105118442, 107889164, 112088458, 117754216, 124735057, 132914127, 141872376, 150608559, 157886831, 162698798, 164013522, 161377676, 154791886, 144712437, 132325559, 118868106, 105589595, 93731967, 83975547, 76373675, 70589348, 66241961, 62921586, 60322722, 58256967]
3273E8256967j721302j487477j443227j516536j755443k123071k504360k831577
3265D2873974k870397k730811k561279k271462j998956j762855j567051j428329
3257B5682834j246246j125081j012328r57539q63439p08065p18902p00045n74464
3248A7776725n33675m40908m66147m20212l46994l27366m11252l72527m27756
3239A4029888l67203m42428l77465l57910l19919l11023k53462k05992j86206
3230A1208280k37398k30194k07125j29813j50074j82731j68761j11444j89674
3221I601066j37817j22708j28435j20226r0383j48375j25183j19924q7374j07887
3211H412754j23290j13643j30728j46123j04553j03677j17572j18999n5274j19430
$$ y = [58256967, 56535665, 55048188, 53604961, 52088425, 50332982, 48209911, 45705551, 42873974, 40003577, 37272766, 34711487, 32440025, 30441069, 28678214, 27111163, 25682834, 24436588, 23311507, 22299179, 21341640, 20478201, 19770136, 19051234, 18351189, 17776725, 17243050, 16802142, 16335995, 15915783, 15568789, 15241423, 14830171, 14457644, 14029888, 13662685, 13220257, 12842792, 12484882, 12164963, 11853940, 11600478, 11394486, 11208280, 10970882, 10740688, 10533563, 10403750, 10253676, 10070945, 9902184, 9790740, 9601066, 9463249, 9340541, 9212106, 9091880, 9001497, 8853122, 8727939, 8608015, 8520641, 8412754, 8289464, 8175821, 8045093, 7898970, 7794417, 7690740, 7573168, 7454169, 7398895, 7279465]
3201G279465o8031o8956q148m350k2420p6946j02316j7555j4645k5172j1947m9047
3189F809932N5741l5977n8390q5142k9805n9687n8525M347L6695N7011N7520k1072
3177F672648K0649o2625O5501K5310j2980n5006m3875R754J1348M2822P5166O6818
3165F815530O0609R1172J28603J01208J47735J04666K9819N3780Q3093J06560
3155G722775J07830P3759L7256P0887N3130J12098J64062Q7471N3555K12493J70974
3144H866290J16794R4608J92937J50891J74891J81610J88040K01278J73333J36670
3134A0477342J93106J59842J76306J93818K58641K21590L33145K76784K77429
3125A2568003K65309L05239K65577L67197L96656M22337N01033M92713N00267
$$ y = [7279465, 7211434, 7142478, 7134330, 7129980, 7107560, 7030614, 6928298, 6910743, 6896098, 6870926, 6858979, 6809932, 6865673, 6829696, 6771306, 6686164, 6656359, 6596672, 6538147, 6542494, 6579189, 6636200, 6693720, 6672648, 6693297, 6630672, 6696173, 6721483, 6708503, 6653497, 6609622, 6619376, 6630724, 6673546, 6748712, 6815530, 6876139, 6967311, 7095914, 7197122, 7344857, 7449523, 7479342, 7533122, 7616215, 7722775, 7830605, 7904364, 7941620, 8012507, 8065637, 8177735, 8341797, 8429268, 8482823, 8695316, 8866290, 8983084, 9077692, 9270629, 9421520, 9596411, 9778021, 9966061, 10167339, 10340672, 10477342, 10670448, 10830290, 11006596, 11200414, 11459055, 11680645, 12013790, 12290574, 12568003, 12833312, 13138551, 13404128, 13771325, 14167981, 14590318, 15091351, 15584064, 16084331]
3116A6084331O37769O04040O95228P45636Q97075R84091J234792J363500J592462
3107B4838924J664808J938883K165190K500014K833435L292238L561725L906196
3099D6701413M060057M335902M155558M220737L809269K150889r30434m193773
3091F4309618o738169p178244o104152m565039l294290k346259j772042j250732
3083C1060691r23909m95448l15705j43250j30959L1932M2506J83033J85333K75486
3073B9769710J79628J49570J67458K91416J40568J55649j26727k56999k57470
3064C0212803j85294m3039J63987K91871M48451N77394P53818Q84937J103364
3055C4208292J110538J256389J339500J316774J280620J358258J413252J628385
$$ y = [16084331, 16722100, 17326140, 18021368, 18767004, 19664079, 20648170, 21882962, 23246462, 24838924, 26503732, 28442615, 30607805, 33107819, 35941254, 39233492, 42795217, 46701413, 50761470, 55097372, 59252930, 63473667, 67282936, 69433825, 68503391, 64309618, 57571449, 50393205, 44289053, 39724014, 36429724, 34083465, 32311423, 31060691, 30136782, 29641334, 29325629, 29182379, 29051420, 29083352, 29125858, 29308891, 29494224, 29769710, 29949338, 30098908, 30266366, 30557782, 30698350, 30853999, 30727272, 30470273, 30212803, 30027509, 29984470, 30148457, 30440328, 30888779, 31466173, 32219991, 33104928, 34208292, 35318830, 36575219, 37914719, 39231493, 40512113, 41870371, 43283623, 44912008]
3047D4912008J812172J966505K275758K337360K345747K481587K519343K915754
3039F3566234L212795L675929M293458N116559O120738O956769P840129R402462
3031A10185073J1693418J4911258J8981135K1404299K4141429K9276954L0113112
3024B60706678K8042899L4864053L8161374K4812723r623907k9403553n8243079
3017B89317188o5631162m6052226l1940865k1165415j6413203j1769831r655479
3010H6689007p645813o778919m984804m445933l703031l835850l518696l607249
3002D8168712k831303k611670k064411j963383j515746j498823j080723j168153
2994C3434500r32376j149177r23745j044458q98559r96480q02888q75116n19959
$$ y = [44912008, 46724180, 48690685, 50966443, 53303803, 55649550, 58131137, 60650480, 63566234, 66779029, 70454958, 74748416, 79864975, 85985713, 92942482, 100782611, 110185073, 121878491, 136789749, 155770884, 177175183, 201316612, 230593566, 260706678, 288749577, 323613630, 361775004, 386587727, 376963820, 347560267, 289317188, 223686026, 177633800, 145692935, 124527520, 108114317, 96344486, 86689007, 79043194, 72264275, 67279471, 62833538, 59130507, 55294657, 51775961, 48168712, 45337409, 42725739, 40661328, 38697945, 37182199, 35683376, 34602653, 33434500, 32502124, 31352947, 30429202, 29384744, 28486185, 27489705, 26686817, 25811701, 25291742]
2985B5291742n89300m48359o52025m59072n70669l99034m92436k92174l63597
2976B1025076k62154l34403k27981l05912j89103k72579k00904k74185j84638
2967A8773217j91548j31115j27115J28927N0530J15302P8628K53089J28820J75671
2957A9254406J76002J61098J45200J30969J46882J91489J71879K29959K90712
2948B0898596L37718L03816L59532K78599L18847L13109L46914L59221M28492
2939B3944844M20834M51516N23503N16466M87379N51635N74362N77134N57226
2930B8604899O60183P40039P26969Q09410Q08985Q56588Q51714Q41264R16523
2921C5816574R15081R17841R42129R56471R69532R74964R81613J045736J049207
$$ y = [25291742, 24702442, 24254083, 23602058, 23142986, 22572317, 22173283, 21680847, 21388673, 21025076, 20762922, 20428519, 20200538, 19894626, 19705523, 19432944, 19232040, 18957855, 18773217, 18581669, 18450554, 18323439, 18452366, 18502896, 18618198, 18696826, 18949915, 19078735, 19254406, 19430408, 19591506, 19736706, 19867675, 20014557, 20206046, 20377925, 20607884, 20898596, 21236314, 21540130, 21899662, 22178261, 22497108, 22810217, 23157131, 23516352, 23944844, 24365678, 24817194, 25340697, 25857163, 26344542, 26896177, 27470539, 28047673, 28604899, 29265082, 30005121, 30732090, 31541500, 32350485, 33207073, 34058787, 34900051, 35816574, 36731655, 37649496, 38591625, 39548096, 40517628, 41492592, 42474205, 43519941, 44569148]
2912D4569148J034351J084516J047305J119733J088141J108924J128023J188568
2904E3368709J123032J147084J105383J150360J055450J032256R79497Q99902
2896F1861673Q25733Q56066P44220P55243O80457O89874O51721O29806N35930
2887F8230723N57524M07365K96512J24127J04610r5528j59734l06791l01263l79630
2877F8477915m18317m12586l68688l43118l39286l98280m28608m35751l66135
2868F4967146m23861l43054l11213k39852p0519N7226J24142L56304M21882N15535
2858F5053736L99031L17550M4130l19320p98035j102851j530052j715761j868272
2849E8480156j838054j822552j694404j518967j447903j373880j312000j311134
$$ y = [44569148, 45603499, 46688015, 47735320, 48855053, 49943194, 51052118, 52180141, 53368709, 54491741, 55638825, 56744208, 57894568, 58950018, 59982274, 60961771, 61861673, 62687406, 63543472, 64287692, 65042935, 65723392, 66413266, 67064987, 67694793, 68230723, 68788247, 69195612, 69492124, 69616251, 69720861, 69625333, 69465599, 69158808, 68857545, 68477915, 68059598, 67647012, 67278324, 66935206, 66595920, 66197640, 65769032, 65333281, 64967146, 64543285, 64200231, 63889018, 63649166, 63578647, 63635873, 63760015, 64116319, 64538201, 65053736, 65452767, 65770317, 65814447, 65495127, 64697092, 63594241, 62064189, 60348428, 58480156, 56642102, 54819550, 53125146, 51606179, 50158276, 48784396, 47472396, 46161262]
2841D6161262j326342j500436j658664j801219j962665k091330k081420k011817
2833C1727369j860300j700254j563726j444729j326254j165831j004881q43430
2825B0817964p76809p25940o65698o09558m84430m74005m61913l63001l33719
2816A5922891l12701l41157k73967k73864j49843j68400j95434j42759j02770
2807A3961996j33351j36132r0063r1720o3864n8127j30047l1673j2755k8982k4030
2796A3161252P6559l5645m6683j9275L216O4547N8788N7515Q5693J15360J59850
2785A3681177J46760J06689J56068J27659N2276J26845J37762J39819K06852J90969
2775A5072876K14520K17351J80237J90107J79170J74094K42636K43288K20784
$$ y = [46161262, 44834920, 43334484, 41675820, 39874601, 37911936, 35820606, 33739186, 31727369, 29867069, 28166815, 26603089, 25158360, 23832106, 22666275, 21661394, 20817964, 20041155, 19315215, 18649517, 18039959, 17555529, 17081524, 16619611, 16256610, 15922891, 15610190, 15269033, 14995066, 14721202, 14571359, 14402959, 14207525, 14064766, 13961996, 13828645, 13692513, 13602450, 13510730, 13446866, 13388739, 13258692, 13227019, 13214264, 13185282, 13161252, 13237811, 13202166, 13155483, 13136208, 13139424, 13203971, 13262759, 13320274, 13405967, 13521327, 13681177, 13827937, 13934626, 14090694, 14218353, 14270629, 14397474, 14535236, 14675055, 14881907, 15072876, 15287396, 15504747, 15684984, 15875091, 16054261, 16228355, 16470991, 16714279, 16935063]
2766A6935063K47607J95227L00086K77202L21353L03453M34779M28233M32808
2757A9875811M43524M87214N48708O24128N80995P35700P40990P09859P55501
2748B5502430R04460R12162R86817J035660J122758J201917J210330J310820J450055
2739C5637409J542534J705666J909331K076774K278387K492274K790931L110498
2731E3543804L467643L874215M317049M803298N372601N996533O603148P398004
2723I5376295Q058137Q615485R224435R543424R527474R081501Q050205O571579
2715A64048535M620402K497858N82298q70113j951578k325713k293939k185460
2707A62122290j871863j443442j219467j152033j379553j935036k737601l873454
$$ y = [16935063, 17182670, 17377897, 17677983, 17955185, 18276538, 18579991, 19014770, 19443003, 19875811, 20319335, 20806549, 21355257, 21979385, 22560380, 23296080, 24037070, 24746929, 25502430, 26406890, 27319052, 28305869, 29341529, 30464287, 31666204, 32876534, 34187354, 35637409, 37179943, 38885609, 40794940, 42871714, 45150101, 47642375, 50433306, 53543804, 57011447, 60885662, 65202711, 70006009, 75378610, 81375143, 87978291, 95376295, 103434432, 112049917, 121274352, 130817776, 140345250, 149426751, 157476956, 164048535, 168668937, 171166795, 171749093, 170878980, 168927402, 166601689, 164307750, 162122290, 160250427, 158806985, 157587518, 156435485, 155055932, 153120896, 150383295, 146509841]
2699A46509841n198523o574865p871853q839313r368408r311733q846054q074218
2691H2424874p190306o376029n534716m825618m265896l810771l335433k922303
2683D4163802k657364k398743k127183j906749j699565j601691j491871j339407
2675B8941229j165820j072128r20706r58598q41571p83061p61958o60995o29609
2666B1146783n53313n65472n71304n18489m63046m52966m28261l38036l21985
2657A6933911l31750k92185k49555l18428k40788k27282k22215l08205j99826
2648A4543677k21157j95694j66543j76165k01227j65129q6182j01473j52765j05231
2638A2972111o9484j09813j06892j19291p4172m3090j62030n1558m0013p3805
$$ y = [146509841, 141311318, 134736453, 126864600, 118025287, 108656879, 99345146, 90499092, 82424874, 75234568, 68858539, 63323823, 58498205, 54232309, 50421538, 47086105, 44163802, 41506438, 39107695, 36980512, 35073763, 33374198, 31772507, 30280636, 28941229, 27775409, 26703281, 25782575, 24823977, 23982406, 23199345, 22437387, 21776392, 21146783, 20593470, 20027998, 19456694, 18938205, 18475159, 18022193, 17593932, 17255896, 16933911, 16602161, 16309976, 16060421, 15741993, 15501205, 15273923, 15051708, 14743503, 14543677, 14322520, 14126826, 13960283, 13784118, 13582891, 13417762, 13331580, 13230107, 13077342, 12972111, 12902627, 12792814, 12685922, 12566631, 12492459, 12449369, 12287339, 12235781, 12195768, 12121963]
2628A2121963j09868k6730j7803m8879m4193o6713k1421M903O245J7018L8904
2617A1853426J4896K2241M4961N7518J27455P2614O3314R7390R1392P9314J04504
2606A2629025K19766J50446Q2362J69783K00055K08680K27893K14305K93829L26418
2596A4722562K42708L05435L52753M53762M20667N07977N22743N07750O17217
2587A8653574O22308O22243P27795Q14218Q83634R66143J048923J086654J186619
2578B6612111J271822J349756J387023J375830J454993J292771J176956J088232
2570C7009494R23311Q28509Q59834Q98889Q99755R60434J017340J085524J184090
2561D5667180J107469J035796R51531P78888O49150M17740J68317j8436j73044
$$ y = [12121963, 12012095, 11985365, 11967562, 11918683, 11874490, 11807777, 11786356, 11791259, 11797504, 11814522, 11853426, 11868322, 11890563, 11935524, 11993042, 12120497, 12193111, 12256425, 12353815, 12445207, 12524521, 12629025, 12848791, 12999237, 13081599, 13251382, 13451437, 13660117, 13888010, 14102315, 14396144, 14722562, 14965270, 15270705, 15623458, 16077220, 16497887, 17005864, 17528607, 18036357, 18653574, 19275882, 19898125, 20625920, 21440138, 22323772, 23289915, 24338838, 25425492, 26612111, 27883933, 29233689, 30620712, 31996542, 33451535, 34744306, 35921262, 37009494, 37932805, 38761314, 39621148, 40520037, 41419792, 42380226, 43397566, 44483090, 45667180, 46774649, 47810445, 48761976, 49540864, 50190014, 50607754, 50776071, 50757635, 50584591]
2552E0584591k05432k08163j37319m5525J08364K27642L34227N07065O27914P08516
2542E2501880P63481P72803Q30598Q97169J006533J219163J566755J864527K221278
2533F3644187K649053L064440L527413M006950M423681M914119N214464N435253
2525I6879560N562703N455055N064138M456134L676885K909125K242780J979574
2517A28225954K031977K306744K795338L252197L517896L819884L737185L406758
2509A53093933K602722J517478J71896j241791k674433l906177m827586n352638
2501A39383404n512767n333539m973353m557233m056900l710216l461570l384845
2493A04392981l485311l760637m163455m644257n098327n474270n639437n512998
$$ y = [50584591, 50379159, 50170996, 50033677, 49988152, 50096516, 50324158, 50658385, 51165450, 51793364, 52501880, 53265361, 54038164, 54868762, 55765931, 56772464, 57991627, 59558382, 61422909, 63644187, 66293240, 69357680, 72885093, 76892043, 81315724, 86229843, 91444307, 96879560, 102442263, 107897318, 112961456, 117417590, 121094475, 124003600, 126246380, 128225954, 130257931, 132564675, 135360013, 138612210, 142130106, 145949990, 149687175, 153093933, 155696655, 157214133, 157386029, 156144238, 153469805, 149563628, 144736042, 139383404, 133870637, 128537098, 123563745, 119006512, 114949612, 111239396, 107777826, 104392981, 100907670, 97147033, 92983578, 88339321, 83240994, 77766724, 72127287, 66614289]
2485F6614289n256882m832695m325931l819483l340216k971720k671917k368621
2477C7026824k119159j867574j748310j584855j438366j327298j211877j113450
2469B4615935r71468r20263q17945q12612p40381o25788o48028o09548n45030
2460A7924872n79735n18545m90903m78754m10413m56720m42803l51484l51171
2451A3844344l69739k90879k98740k97047k50850l08265k60862k25864k57212
2442A1284886k77971k55228k72900k84835k53519k39299k36217j90504j92287
2433I082126j83454j97407k27454j78991j91105j76322j46754j85233j39127j80587
2423G275692j33643j21839j39532j41708j07119j57296o8802j44619j08442j02829
$$ y = [66614289, 61357407, 56524712, 52198781, 48379298, 45039082, 42067362, 39395445, 37026824, 34907665, 33040091, 31291781, 29706926, 28268560, 26941262, 25729385, 24615935, 23644467, 22724204, 21906259, 21093647, 20353266, 19727478, 19079450, 18469902, 17924872, 17345137, 16826592, 16335689, 15856935, 15446522, 14989802, 14546999, 14195515, 13844344, 13474605, 13183726, 12884986, 12587939, 12337089, 12028824, 11767962, 11542098, 11284886, 11006915, 10751687, 10478787, 10193952, 9940433, 9701134, 9464917, 9274413, 9082126, 8898672, 8701265, 8473811, 8294820, 8103715, 7927393, 7780639, 7595406, 7456279, 7275692, 7142049, 7020210, 6880678, 6738970, 6631851, 6474555, 6405753, 6261134, 6152692, 6049863]
2413F049863j01885r174o2924q1495m9874m7065m5228m9371m7947j01746k3338
2402E429816p5850r1650q2246p8380r3699m5567q6743m0917o0336o4418o9368
2391D640642j06701o2470n7792j18253j14471n9838q5524q3734j20530r5482l6385
2380C699462j50161j52380o6847k6573p5235n1311k7320m0892o9865j1311l1294
2369B996273r6694m9223n6116l3870k2023k5206k9192N065m2651p4362o4364j9398
2357B488239J3764l3061l6387l0623j02430n7752J1952J6881l0476R297K050k5362
2345B226092o8773l6075j3078o0073m6203K036m2990o079p931l6656l7646o019
2333A866605n997R560j5508p9998j9619K266l9615n823m4471L38l3336j0530k997
$$ y = [6049863, 5947978, 5938804, 5875880, 5794385, 5744511, 5697446, 5652218, 5602847, 5554900, 5453154, 5429816, 5353966, 5262316, 5180070, 5101690, 5007991, 4962424, 4875681, 4834764, 4774428, 4710010, 4640642, 4533941, 4471471, 4413679, 4295426, 4180955, 4121117, 4035593, 3951859, 3831329, 3735847, 3699462, 3549301, 3396921, 3330074, 3303501, 3228266, 3176955, 3149635, 3108743, 3038878, 3027567, 2996273, 2899579, 2850356, 2794240, 2760370, 2738347, 2713141, 2683949, 2689014, 2646363, 2572001, 2507637, 2488239, 2502003, 2468942, 2432555, 2401932, 2299502, 2241750, 2253702, 2270583, 2240107, 2249404, 2251454, 2226092, 2157319, 2121244, 2108166, 2048093, 2001890, 2003926, 1960936, 1954857, 1946926, 1910270, 1872624, 1866605, 1860608, 1870168, 1854660, 1774662, 1755043, 1757309, 1717694, 1711871, 1667400, 1667738, 1634402, 1623872, 1620875]
2320A620875L431m2444k1917L3611J4062n6454m9070K375K1423p837q7659o8730
2308A361666K7496n8221k7429O6922r362M884l0141r883N3712j9802l9179m895
2296A315768k498m2283K6951Q748m2594l0178P993j619j5083m4577j6375K5757
2284A190010q642J3255l9796J3336L5767q0924k8331J5104M2603j7681N521M8860
2272A189082q783n9246j1378J7214n467j7880K3137K3809L9090l5236q2108R003
2260A081237K6327M5193M140Q422R004J8264o583J3980N8724K4950r0920m5254
2248A147484K4414l5386k249p048n275J3565R383l7679J5578M6023k5794l4842
2236A108174n767L4379N983q112k363L1991J6379o4912j632J2939J857M8992k139
$$ y = [1620875, 1624306, 1581862, 1559945, 1593556, 1607618, 1551164, 1502094, 1504469, 1525892, 1518055, 1430396, 1361666, 1389162, 1330941, 1303512, 1370434, 1361072, 1365956, 1335815, 1325932, 1379644, 1359842, 1320663, 1315768, 1313270, 1270987, 1297938, 1306686, 1264092, 1233914, 1241907, 1240288, 1225205, 1180628, 1164253, 1190010, 1181368, 1194623, 1154827, 1168163, 1203930, 1123006, 1094675, 1109779, 1152382, 1134701, 1140222, 1189082, 1180299, 1121053, 1109675, 1126889, 1121422, 1103542, 1126679, 1150488, 1189578, 1154342, 1072234, 1081237, 1107564, 1152757, 1156897, 1165319, 1174323, 1192587, 1186004, 1199984, 1258708, 1283658, 1192738, 1147484, 1171898, 1136512, 1134263, 1127215, 1121940, 1135505, 1144888, 1107209, 1122787, 1168810, 1143016, 1108174, 1102407, 1136786, 1142769, 1134657, 1132294, 1164285, 1180664, 1115752, 1114120, 1127059, 1128916, 1177908, 1175769]
2223A175769M460l549K9178J2220J5044M0727R280O5345O1626M633k5790n3266
2211A335677L7175K3295j322K5331J7622K3108j764l2448L3886K0206K3031K480
2199A506277K4773j5098j3068j1896k1898l3522q004k2269l871j4771k4934n9544
2187A302175j2965j410l3504j4757k3546k6945k6046o1601j7554L1987L932o4670
2175A055096o09J7297j8080m6454L923k7426m6943J214R387K8977k6428K950J6300
2162I69204N0392J5448n9178J1167P4849L140o2347r383k6339n7364o326n5090
2150H48173K3123K4046o3279J9373L1358k6560N473l90k7646o6234k5805M4260
2138G85892K5662K2331l7646j4634m0323J8855L6692n0317n1J1983J3166J8764
$$ y = [1175769, 1180229, 1176680, 1205858, 1218078, 1233122, 1273849, 1283129, 1348474, 1410100, 1414733, 1388943, 1335677, 1372852, 1396147, 1394825, 1420156, 1437778, 1460886, 1459122, 1426674, 1460560, 1480766, 1503797, 1506277, 1531050, 1515952, 1502884, 1490988, 1469090, 1435568, 1427564, 1405295, 1401424, 1386653, 1361719, 1302175, 1289210, 1287800, 1254296, 1239539, 1215993, 1189048, 1163002, 1101401, 1083847, 1115834, 1119766, 1055096, 1054487, 1071784, 1053704, 1007250, 1011173, 983747, 936804, 938018, 947405, 976382, 949954, 952904, 969204, 1019596, 1035044, 975866, 987033, 1061882, 1065022, 1002675, 993292, 966953, 909589, 903263, 848173, 871296, 895342, 832063, 851436, 882794, 856234, 861707, 861317, 833671, 767437, 741632, 785892, 811554, 833885, 796239, 781605, 741282, 760137, 796829, 746512, 746461, 758444, 771610, 790374]
2126G90374K5637j6977n646R8627q153l5200O8029J911L3385N46j0541j01596
2114H40396n7592k6495q454j9037l3141j7698j463k4491j0911N510k8569j8755
2102E99300J8757K7700L7355k5276k566N0251M8127K9762K5813K8247J5646L4071
2090H87187M8403Q0096R9183J4756M5955L2621J0700j03492j02353k9786r9535
2079H83735n6901o7562o0478l4833n8818m821L0098K9533n2189p0221N4484l9096
2067E52931k7355M0752N320K2431k0431p3251K5122O2936l430J2756j3558M7445
2055F31668L1396J6887N0559P8485j2236q5917m796k8682r2131p4416J3171K8311
2043E52299q538m2689L4209m2424l4238L726j2014q817k6511m0078L977L1535
$$ y = [790374, 816011, 799034, 793388, 892015, 883862, 848662, 916691, 918602, 951987, 952533, 941992, 840396, 782804, 756309, 747855, 728818, 695677, 677979, 676516, 652025, 641114, 646624, 618055, 599300, 618057, 645757, 683112, 657836, 655270, 705521, 753648, 783410, 809223, 837470, 853116, 887187, 935590, 1015686, 1114869, 1129625, 1175580, 1208201, 1218901, 1115409, 1013056, 983270, 883735, 826834, 759272, 698794, 663961, 605143, 600322, 630420, 659953, 607764, 537543, 592027, 552931, 525576, 566328, 571648, 594079, 573648, 500397, 525519, 588455, 585025, 597781, 584223, 631668, 663064, 679951, 730510, 808995, 796759, 710842, 706046, 677364, 585233, 510817, 523988, 552299, 543761, 501072, 535281, 492857, 458619, 462345, 450331, 441514, 415003, 374925, 378902, 410437]
2031D10437n716n0998m0849N2533M8897j1834K5171k4223j9152K5968K3436m1517
2019C92153j6047m8183j3414L9526l2182j0701k1032J0769K7013P987j114l9066
2007B95709J6282M1932p362k060M825r981N630k6534l0921j2164k5281J7826L7090
1994C04991R703j9478P017M5399k308r923K2413j4106P25m4496p517N4516n1641
1981B95295k3415j8298j5626o7415L9093n037J0895L2287l2079k805K2915N5848
1969B91658J6410L250l4465L8936j7429J6647m146n4668j1402J3167j444k3828
1957B32686m6170L9108J6637K1081l8976P6803M7773o0813K9948N7550n4584J8460
1945C39503k601n2084k3385k0490m276j0677j9126l0369n871J8079N7839K143
$$ y = [410437, 404721, 353723, 312874, 365407, 414304, 402470, 427641, 403418, 384266, 410234, 433670, 392153, 376106, 327923, 314509, 354035, 321853, 311152, 290120, 300889, 327902, 335889, 334775, 295709, 311991, 353923, 346561, 344501, 349326, 339345, 344975, 318441, 287520, 275356, 250075, 267901, 304991, 314694, 295216, 302233, 347632, 345324, 335401, 357814, 343708, 344433, 299937, 292420, 346936, 295295, 271880, 253582, 237956, 170541, 209634, 204597, 215492, 247779, 215700, 212895, 235810, 291658, 308068, 311318, 276853, 315789, 298360, 315007, 310861, 256193, 244791, 257958, 256514, 232686, 186516, 225624, 242261, 263342, 224366, 301169, 348942, 288129, 318077, 375627, 321043, 339503, 336902, 284818, 261433, 240943, 236667, 225990, 206864, 176495, 170624, 188703, 246542, 248685]
1933B48685K2682N992j8213j022K7178l193P392n649l781m7944k7332J077J8024
1920B23896j8957R109L8235R830l0356N744O7624J4343k3077j8404r255K4529
1908B93261J4834K70p953j542p4395J2989j6016r415K8526k2821m787K9880k8459
1895B14372o6371M5605L9433p514q155l0069m365K720M52k5042j9609K3111J061
1882A65629r265M2013P902m2057j5914K2719Q9442k6279m4225K7928L4034k7497
1870B24430n739K087J2674J2491k7051o446M8224k7036j2061l707j6902r251k2898
1857A68815J3932j6674l7368K4283k0616J7784k211j4547J2356J5120k5427m251
1845A31196O5211k0028L511l764L3699q3600K2975o423L5724M5100k4369l610
$$ y = [248685, 271367, 277359, 259146, 258124, 285302, 282109, 289501, 283852, 280071, 232127, 204795, 205872, 223896, 204939, 214048, 252283, 262113, 231757, 237501, 305125, 319468, 296391, 277987, 268732, 293261, 308095, 308365, 300412, 298870, 224475, 237464, 221448, 212033, 240559, 217738, 212951, 242831, 214372, 148001, 193606, 233039, 225525, 217370, 187301, 182936, 185656, 186108, 161066, 141457, 164568, 165629, 156364, 198377, 206279, 164222, 148308, 171027, 260469, 234190, 189965, 217893, 251927, 224430, 218691, 220778, 233452, 245943, 218892, 212446, 260670, 233634, 221573, 217866, 200964, 191713, 168815, 182747, 166073, 128705, 152988, 132372, 150156, 147945, 133398, 145754, 160874, 135447, 131196, 196407, 176379, 179890, 176126, 209825, 126225, 149200, 142777, 178501, 223601, 199232, 195622]
1833A95622l4495k1722L4464M1907J9322J196k0480j38K1586K7053j8208N581
1821B51688k7935O111n768j9286k2747P705j9725l9013J1138k0437m8820L3127
1809A06038J7098K574J0060J6025N918L6129K8694L6938k5031q688R829k6575
1797B09009l7190m760m5705L0776R55m0925L1761J3062Q416n4289R021L8918K7491
1784A86540M0205j5896k4262K8641j5972N055k2096j5188J9294J1861p1199K9456
1772A56439K1552Q391M7238k5515o6318l888N0722l5714k6048J4759K9852n0579
1760A20891o430n0230K1659Q9710J3789o4145K1788O710k1743L1863K4566m5268
1748A43160j5435j1763J4175L7592J0369o58l1620K5343r02n022m827m673K2349
$$ y = [195622, 161127, 139405, 173869, 215776, 235098, 236294, 215814, 215676, 237262, 264315, 246107, 251688, 223753, 229864, 224096, 204810, 182063, 189768, 170043, 131030, 142168, 121731, 72911, 106038, 123136, 125710, 135770, 151795, 157713, 193842, 222536, 259474, 234443, 225755, 235584, 209009, 171819, 167059, 121354, 152130, 153085, 112160, 143921, 156983, 165399, 111110, 120131, 159049, 186540, 226745, 210849, 186587, 215228, 199256, 204311, 182215, 167027, 186321, 198182, 126983, 156439, 177991, 186382, 233620, 208105, 141787, 137899, 188621, 152907, 126859, 141618, 171470, 120891, 114461, 64231, 85890, 175600, 189389, 125244, 147032, 153742, 131999, 163862, 188428, 143160, 127725, 115962, 130137, 167729, 178098, 177440, 145820, 171163, 170261, 165239, 160412, 155739, 178088]
1735A78088P74j9568j1122m196o504K2279J732P738l0177n3295M761J2091K2439
1722A25040j8505L97K7937L821l0432M019j2420j0843M083k0132l6735L5626J6680
1709H8536J8014K0185p805m2148J4712J2318j2521n2218j2053m8M2027k4599P905
1696E2305K0092P361n3106j5840k8254M1274M9380J2589L62n5291l2901O0127
1684E8098P1280k6032k302j7266M092N377n9861m7120K1013R038J7087K047K1368
1671E6819k6605J231j500L2017J0712k5664l1951K9244K604o253l574N9534l1099
1658F5515k6555m3605J257O5865m1510m512p218M0879j9942k8958L503L9183n1524
1645g622l1092P3482K6330M352l6937j5844N309L1372k6187k5754P1495K5830
$$ y = [178088, 178862, 159294, 148172, 143976, 137472, 159751, 161483, 169221, 139044, 85749, 90510, 102601, 125040, 106535, 106932, 134869, 138690, 108258, 112277, 99857, 89014, 93097, 72965, 36230, 71856, 88536, 106550, 126735, 118930, 76782, 91494, 103812, 91291, 39073, 27020, 26972, 68999, 44400, 52305, 72397, 79758, 26652, 10812, -17442, 23832, 73212, 85801, 86163, 30872, -2029, 58098, 129378, 103346, 101044, 83778, 87870, 93247, 33386, -13734, 7279, 16317, 33404, 35451, 56819, 30214, 31445, 29945, 61962, 72674, 47010, 15059, 44303, 46907, 40654, 37080, 96614, 65515, 38960, -4645, -3388, 62477, 20967, 16455, 9237, 50116, 30174, 1216, 4719, 43902, -7622, -38714, 34768, 61098, 65450, 28513, 12669, 17978, 49350, 23163, -2591, 68904, 94734]
1633I4734m2261k7287j0751j189K5977O652K3330J0536l8920j8488Q479q464j5902
1620F446p58J1999J7313k0433n634N812m4814m550M1909N1331J5200r60p593P004
1606G2272k4962n1778l6745n648O6246L6257O884m3976K7621R100k4080l2971
1594a780J8852j4000J2207K9767r124k0112m8652J2564L7751K8479J676n4508
1582f880m2647K8025K6670L1268K718l0375j5055K7037Q8045M795j02372j0895
1570C34L8427K619K4538m5379N806k1729j9730j943J3804J9824L75J7359K9581
1557F3886j11L0999P770k8380J7345k8578L702K166m9012m0194J4637L3382M0265
1544F7877k7105k7952k2175K4728k8965P457N0991K1065o1491r520K6006K5869
$$ y = [94734, 52473, 25186, 14435, 13246, 39223, 45875, 69205, 79741, 40821, 22333, 30812, 22348, 6446, 5688, 17687, 35000, 14567, 8933, 14745, -30069, -34619, 7290, 58621, 73821, 72861, 65268, 72272, 47310, -4468, -41213, -46861, 19385, 55642, 62526, 18550, 46171, 55271, 31191, -1780, 17072, 3072, 15279, 45046, 35922, 15810, -32842, -20278, 17473, 45952, 47628, -6880, -49527, -21502, 5168, 36436, 39154, 8779, -6276, 20761, 108806, 113601, 11229, 334, 38761, 41380, 65918, 20539, 26345, 4616, -15114, -17057, -3253, 16571, 16946, 34305, 63886, 63775, 94774, 102544, 74164, 91509, 62931, 66633, 68799, 19787, -20407, -5770, 27612, 67877, 40772, 12820, -9355, 15373, -13592, -6135, 44856, 65921, 4430, -5090, 20916, 46785]
1532D6785J2800J6194m9490K6746k4310p4063M4723K4287p826K691j1945J7946
1520B4538K3682o3291P74P6971M917m0878J1048j6668r410j2836L5857l6853q939
1507a1088J0304O653L0533N712l0077L139O009k6888L5152L5823l7941n4383L0281
1494C229M0933k1712o9001K7942O0657n5338K922M4181m884j0727Q589P720j8442
1481A6069M5731k0572j1023K4830l07l2453j3969L0898j6799j8079l6781K8033
1469d422N4425r088J0061L8512k0272l9392k3816M674M3267N28l2662j8081L8528
1456D2262l629j7927L042L3061K1540k6891k4475M864L2099m5265K9177p132q899
1443C1827p158J3831Q190l4152J9173J331k5395M0849L7881o1464j2110L6505
$$ y = [46785, 59585, 75779, 26289, 53035, 28725, -45338, -615, 23672, 15846, 18537, 6592, 24538, 48220, -15071, -14297, 62674, 67591, 26713, 37761, 21093, 11683, -1153, 34704, -2149, -11088, -784, 5869, 36402, 42114, 12037, 15176, 21185, -5703, 29449, 65272, 27331, -27052, 3229, 44162, 22450, -46551, -18609, 42048, -13290, -10368, 33813, 28929, 18202, 26791, 34511, 16069, 61800, 41228, 30205, 55035, 54728, 22275, 8306, 39204, 22405, 4326, -32455, -4422, 50003, 40915, 50976, 89488, 69216, 29824, 6008, 10682, 53949, 54477, 21815, 3734, 42262, 38633, 20706, 23748, 56809, 78349, 51458, 26983, 31847, 63946, 18681, 47858, 40726, 31827, 24669, 38500, 46690, 12538, 31711, 33042, 7647, 48496, 86377, 24913, 12803, 49308]
1431D9308j0163P829k6968k3744J7645m6545J7704J0434J9927J4903K784l75K5953
1418E8692m4718k7452k7185l407J3872J515j5017n5238L6519L5371M209K8996
1406F157j7442l405L0360l888n62j4983j5745K4696J9722j0036Q630L6150K402
1393F2056l1396m5808L3479J6777o0852L8100o587P338J419O285j2769k6311K3451
1380E182J1405l3220l1060p59J7332K580k756k2903J7158L3083k9509q45J9769
1367a4543q3999K5195O4937M150p912q08k399j8448L11k0904L6263M2402j1756
1354A2489k8597l9102K6632L5952j011o730M031L3446O018l9890K764j1353n0762
1341e6113K4836k5568Q264k113k3521r774M1564j5928j707K1470L0239M0811L292
$$ y = [49308, 39145, 46974, 20006, -3738, 13907, -32638, -14934, -4500, 15427, 30330, 33114, 32739, 58692, 13974, -13478, -40663, -44070, -30198, -28683, -43700, -98938, -62419, -27048, -22839, 6157, -11285, -14690, 15670, 11782, 11220, -3763, -19508, 5188, 24910, 14874, 23504, 59654, 62056, 30660, -15148, 18331, 35108, -25744, 12356, 5769, 13107, 14526, 20811, 8042, -18269, 5182, 16587, -16633, -47693, -48452, -31120, -28540, -31296, -54199, -37041, -3958, -33467, -34312, -14543, -98542, -73347, -8410, -4260, -12172, -12980, -15379, -33827, -33516, -54420, -18157, 24245, 12489, -16108, -55210, -28578, 7374, 6363, -367, 3664, 37110, 43128, 3238, 6002, -5351, -56113, -31277, -56845, -48581, -50694, -74215, -83989, -42425, -58353, -60060, -38590, -8351, 32460, 35752]
1328C5752l0438n016O693L696m095J873M3405k274r114l823m2276n3664k4071
1315h3352k887K3516M2114K4088J083n3436R943L2814K0602M954l9887r458J7356
1302a2550R495k314K5256j8458k9079L633k1533L6177N9743n2258j3095J0554
1290d429L012J4251K751l780m2475k1016L3835j226K4011l1849j6458K4204O082
1277a3087l8121M5504p432k9967M3718L7063j0570j8468j9426j1778k5968L2024
1265a6508J3458O344J4549j5713l0124k295R274J0528M7053M3822J4218m0010
1253E4596j7930l1206L1291J1728J5237N52k7716j7849l215N538R373L29l7282
1240f554j1339J303L8083L9672K1568L6797J0579k4410n131K2573j2418j8200
$$ y = [35752, 5314, 298, 6991, 10687, 6592, 8465, 51870, 49596, 40482, 36659, -5617, -59281, -83352, -86239, -62723, -20609, 3479, 4562, -48874, -38931, -6117, 14485, 19439, -20448, -29906, -12550, -3055, -5369, 19887, 1429, -27650, -24017, -45550, -9373, 50370, -1888, -14983, -4429, -1417, 12834, 15585, 11805, -30670, -51686, -17851, -19077, 4934, -26915, -43373, -19169, -13087, -51208, -5704, -13136, -43103, 615, 37678, 27108, 8640, -10786, -22564, -48532, -16508, -3050, 3294, 17843, 2130, -27994, -30289, -21015, -10487, 36566, 80388, 94606, 54596, 36666, 5460, 36751, 48479, 63716, 64268, 36552, 18703, 15488, 21026, 30399, 30728, -6554, -17893, -16590, 21493, 61165, 82733, 119530, 130109, 105699, 100568, 123141, 110723, 92523]
1228I2523j6250K847k6135m2832n4894K7955L4770J3910K8710j1444j2273K4736
1216F1623m379N944j8036j3440L93q260M5345R176m0198p638j2022Q279j7901
1203H886Q623J0341K227l678j067l1536J8998m576l7075O108Q688l9322L404O1512
1189A1533P822q362o364l7724J7455n345q116O8233K1978P771m0448L155J9961
1176E1549J3155J6399l9690m9849J5125K2212p426j4436k1504K0332P813J5130
1164B8810o058j0070q66m9156P702M3672M2744n625o2807k3188K1382J766J7333
1151E639M3054K1212l3684l594o799N775K59l2097j2178L2923L2320j2822j2666
1138B7342J3358J5901k3174J8344l1516n108J5233n689M6821o3987J4756j2939
$$ y = [92523, 76273, 79120, 52985, 10153, -44741, -16786, 17984, 31894, 60604, 49160, 36887, 61623, 57244, 63188, 45152, 31712, 32105, 23845, 69190, 78366, 38168, 30530, 18508, 26787, 8886, 17509, 27850, 30077, 26399, 25332, -6204, 12794, 8218, -28857, -22749, -14061, -53383, -49979, 11533, 19355, 10993, 4629, -33095, -15640, -20985, -29101, 39132, 61110, 68881, 28433, 31588, 51549, 64704, 81103, 41413, -8436, 6689, 28901, 21475, 7039, -14465, 5867, 13680, 28810, 22752, 12682, 11816, -37340, -29638, 14034, 56778, 51153, -11654, -34842, -13460, -11694, 5639, 48693, 69905, 36221, 32627, 25828, 31603, 31862, -235, -12413, 20510, 52830, 40008, 27342, 40700, 56601, 33427, 51771, 20255, 15147, 30380, 24691, 71512, 7525, 22281, 9342]
1126I342O828L9502J96k010J2784J5147K4806p4010k1040J4687K086k7561p456
1113f699O4003k8054m3231K018J1444K6310N4554q7j2376J0528l1106n836K9886
1100G1354j5227K1312K7035l7045k4181K3613j0276J6163m0677n2476O1331L8873
1088G9799J44J6734K420M3958k3784k5546K1460J9839L637k9346M5814L188l0089
1075A28228l4856J3717k0115m4025L2918L2353M8266N939m6760L2144M9920l520
1063A94209O407l8361L805j0839J485k1097p6687M1922K836q152K6716k0007l9702
1050F2535K1541O8039j2499j8340M557K063L6959N9910k8542J2431J5971l902
1038B20723K4897Q294p674k6720k5094O5072K9791l7265q377L3599N8628j2272
$$ y = [9342, 16170, 55672, 55868, 53858, 66642, 81789, 106595, 32585, 11545, 26232, 28318, 757, -6699, 57304, 29250, -13981, -11963, -519, 25791, 80345, 80258, 67882, 78410, 47304, 41468, 71354, 56127, 77439, 104474, 67429, 43248, 66861, 56585, 72748, 32071, -20405, 40926, 79799, 79943, 96677, 99097, 143055, 119271, 93725, 115185, 135024, 138661, 109315, 155129, 158317, 128228, 93372, 107089, 86974, 42949, 75867, 108220, 156486, 162425, 115665, 147809, 197729, 194209, 200616, 162255, 166060, 155221, 156706, 135609, 58922, 100844, 103680, 95528, 122244, 102237, 62535, 84076, 152115, 139616, 121276, 125833, 127896, 164855, 224765, 196223, 208654, 224625, 220723, 245620, 253914, 246240, 219520, 194426, 259498, 289289, 252024, 243647, 277246, 335874, 323602]
1026C23602J8373L2426j083k5857j8664M5367Q049J2327L3530j9430L283M5013
1014D56936K5139K7665k2726n3077K0838O3911Q0481N3806j8652L5988M2885k8729
1002F84465k293p011k2899k8582J6360L5321q304J3318J3393Q7153L2257M1438
990H54616J0947K4067K9770K8893J6305k4888J00890O5606O8617M4019P9248N7266
978A355356O9265Q0308N1107Q0211J46898R0520J13295J47858R8627J07856J43302
967B484603J21989J42385K12253K52456K34079K55683K49447K31428M14903M87387
957E086613N98956Q10540R16127R75241J216849J416370J434705J541335J778437
948A5775173J744270M05330j733516l158054k940440j990725j418628r83297p29394
$$ y = [323602, 341975, 374401, 373318, 347461, 328797, 374164, 382213, 394540, 428070, 408640, 411923, 456936, 482075, 509740, 487014, 433937, 454775, 518686, 599167, 652973, 634321, 670309, 713194, 684465, 682172, 675161, 652262, 623680, 640040, 675361, 667057, 680375, 693768, 780921, 813178, 854616, 865563, 889630, 919400, 948293, 964598, 939710, 1040600, 1106206, 1174823, 1218842, 1298090, 1355356, 1424621, 1504929, 1556036, 1636247, 1783145, 1873665, 1986960, 2134818, 2233445, 2341301, 2484603, 2606592, 2748977, 2961230, 3213686, 3447765, 3703448, 3952895, 4184323, 4599226, 5086613, 5685569, 6496109, 7412236, 8387477, 9604326, 11020696, 12455401, 13996736, 15775173, 17519443, 17924773, 16191257, 13033203, 10092763, 8102038, 6683410, 5700113, 4970719]
939D970719n37464m96616l25012l06020k57089j45465j43728j19639j45817j65021
929B328848k30801j87869j51458j52305j07446k2946r6769p3579j6278p8198j38260
918A072939j7788m7081k3547r329q0331j2140p118J30n7076m0239l9531o439p5581
905F56869j2248m4522l5676K8816j3326j9622K1860k8044l8482l6651K2185j3040
893D88119n6724j5191r748m8629J2831K8689J5180J5847j4403p221n1889l4893
881C21968n6599L210M9928P444q2196N9606N0687n2799n2179O362J3990J167m578
868B66011l472J9455k8660k6907M5600j4423q1633m2230J0800k0472j1831k6764
856H5474K1060N4773J4498k0017k9665N690M4616N412p139p684l661j6000R361
$$ y = [4970719, 4433255, 3936639, 3611627, 3305607, 3048518, 2903053, 2759325, 2639686, 2493869, 2328848, 2098047, 1910178, 1758720, 1606415, 1498969, 1476023, 1379254, 1305675, 1289397, 1211199, 1072939, 1055151, 1008070, 984523, 975194, 894863, 882723, 875605, 875735, 818659, 778420, 738889, 732450, 656869, 644621, 600099, 564423, 593239, 579913, 560291, 582151, 554107, 515625, 478974, 501159, 488119, 431395, 416204, 406456, 357827, 370658, 399347, 414527, 430374, 415971, 408750, 356861, 321968, 265369, 268579, 318507, 325951, 243755, 303361, 354048, 301249, 249070, 255432, 269422, 270589, 266011, 262539, 281994, 253334, 226427, 272027, 257604, 175971, 133741, 144541, 124069, 112238, 85474, 106534, 161307, 175805, 155788, 126123, 131813, 176429, 181841, 174702, 167018, 163357, 147357, 156718]
843A56718J5754m1065j4335k3196k1912N0367k6318j9217m731L2148j5175n1516
831C7522J5503R5724o448m6996k2919N918r213p9346o877J9984K5199J0940O1024
818A00015L325k8354j0518L2261L7679j7983p7799m4344Q3414r251m5244M0192
806F3393P003m9439q952Q887l775K8578L757K3491k4562J9290L863O684k3739
793E4479M0445l6003k811N4812j6155m8492m0851L8756l4113j2620r204J0211
781a546M9140k6950k2586M0710J0441m7684L8545J5151m5063j0119Q80J950j4595
768a1726j5442k9679O0867L0475j4442k9308J634J9095j8351R728M156N1109k3631
755C4485O765M063n367j9171r244r997l8874k1063L0462P2120J5877j5500k2047
$$ y = [156718, 172472, 131407, 117072, 93876, 71964, 122331, 96013, 76796, 72065, 104213, 89038, 37522, 53025, 148749, 142301, 95305, 72386, 78304, 69091, -10255, -17132, 2852, 28051, 38991, 100015, 103340, 74986, 64468, 96729, 134408, 116425, 38626, -5718, 77696, 68445, 23201, 63393, 70396, 20957, 12005, 20892, 17117, 45695, 49452, 72943, 48381, 67671, 71534, 78218, 54479, 94924, 58921, 56110, 110922, 94767, 46275, 5424, 44180, 10067, -2553, -11757, -1546, 47594, 20644, -1942, 38768, 49209, 1525, 40070, 55221, 10158, 39, 919, 2869, -11726, -27168, -56847, 4020, 34495, 20053, -9255, -7621, 11474, -6877, 2851, 7007, 58116, 34485, 41250, 45313, 39946, 20775, 11531, 1534, -37340, -58403, -27941, 44179, 60056, 44556, 22509]
742B2509j3888K6034k1230j1070K3837P4880P589m5794n3840L2470K021l4547
730H971j1861N5905M1349q6962o431L3574R867l0642L7872Q104l4633l7096p126
717a9109M0093o649n3709L673J7525J6782K3119q828j6990N213r417L3196M3047
704F7946R859n2082p679K3568j148m7291m6032M8807j3142j7868m3650J9901P7348
691A8537q5002N302M7887J2029K0200j238n2682j9472O9886P67L2248L6104j9343
678F5223m5338k9095J2127k3287P247k1481p633J5321M1676L3911L3260K360K2485
665A06776j8457J5520Q581k4814k8328L3837J2259m1408r136l506k79n2065k5813
652b6833M0223K3144M476k1760k0727o506l395l7360j8732L7147J1064R808j4684
$$ y = [22509, 8621, 34655, 13425, 2355, 26192, 101072, 108661, 62867, 9027, 41497, 43518, 8971, -2890, 53015, 94364, 7402, 971, 34545, 44412, 13770, 51642, 59746, 25113, -11983, -19109, 20984, 14335, -39374, -35701, -18176, -1394, 21725, 12897, -4093, 1120, -8297, 24899, 67946, 77805, 25723, 18044, 41612, 40464, -6827, -52859, -4052, -17194, -35062, -78712, -58811, 18537, -66465, -61163, -13276, -1247, 18953, 17715, -34967, -54439, 15447, 16214, 48462, 84566, 65223, 19885, -9210, 2917, -20370, -13123, -34604, -42237, -26916, 14760, 48671, 81931, 84291, 106776, 88319, 103839, 112420, 87606, 59278, 93115, 105374, 63966, 54830, 51324, 51045, -1020, -26833, 13390, 36534, 41010, 19250, -1477, -7983, -11378, -48738, -67470, -30323, -19259, -9451, -24135]
639b4135l7235K4863j9361n271L8252K4199J5674k817k3912j6684k1577L8671
627i333K2163o4096K738K3263N2494m2601l9183l658L5022l8999l897K9105K0400
614a6582j8894r387o165K9818K5559j050k9277K0540k588j5729K6308J2966l8508
601b2989j762o838J7037l1305n3567P2954L4723p0824K2988M8934l4259K0704
589d204p658o694k4132j6304l0711J2528R609L1293M6019K7369k8516m5222N062
576c1561m7102k5559J6636l9850M6043Q798k0056J7162L0747j6191j746Q846L5753
563a8080J7939N337o034Q290m1607m0885k4662P187M4501J6093q245K399J8220
550a9547k8186j9546L3789J7358n9576K7357L7268O8069L3371l2440k6512o9128
$$ y = [-24135, -61370, -36507, -55868, -61139, -22887, 1312, 16986, 14169, -9743, -26427, -48004, -9333, 12830, -51266, -48528, -25265, 27229, -15372, -54555, -58213, -23191, -62190, -66087, -36982, -16582, -35476, -44863, -51028, -21210, 4349, 3299, -25978, -5438, -8026, -23755, 2553, 15519, -22989, -24751, -31589, -14552, -45857, -99424, -26470, 8253, -62571, -39583, 9351, -24908, -4204, -11862, -18556, -42688, -58992, -89703, -77175, -67566, -36273, 9746, 37115, 8599, -36623, -31561, -78663, -104222, -87586, -127436, -81393, -72595, -92651, -75489, -44742, -60933, -62679, -53833, -18080, -141, 5196, -838, 7452, -34155, -75040, -99702, -92515, -48014, -31921, -40166, -37767, -19547, -47733, -67279, -33490, -16132, -75708, -48351, -11083, 56986, 90357, 57917, 31405, -37723]
538c7723j0712m850k702K2330k4608K4236j7143M5020j5509j8349j3530M5034
526h506K3157n8478l6306J9960M1738m9960l7689J0005K2612O4044o118m377K8701
513H783k046L2401m6444k8335j576p017J9149k0159K6736n5404l9276O7105k6364
500g2447L0969k206j4422L5238m3407K3089j5564k1400j0321J5812N7721l1311
488d8249o114K2751K3772N2361l6995m1715J8163l7618l0567M3734n638m702n47
475e1364J2871K8141k1434l007j1554J4052j3067p624n354R665k7575N7099K270
462a6881m2324K4931k1836K5680O448l1723J0506N8167q333r9630J3640m617K9952
449e6020l628l3138M4205J6964m2721m13n355M3515J7917n1630N914M5848J0476
$$ y = [-37723, -48435, -53285, -55987, -33657, -58265, -34029, -51172, -6152, -21661, -40010, -53540, -8506, 14651, -43827, -80133, -60173, -18435, -68395, -106084, -96079, -73467, -9423, -15541, -19918, 8783, 6737, 39138, -7306, -35641, -37217, -44234, -25085, -45244, -18508, -73912, -113188, -46083, -72447, -41478, -43684, -58106, -22868, -66275, -43186, -58750, -80150, -90471, -74659, -16938, -48249, -54363, -31612, -7840, 44521, 7526, -34189, -16026, -53644, -84211, -40477, -46115, -50817, -51364, -38493, -10352, -31786, -34793, -46347, -32295, -45362, -52986, -58340, -48675, -76250, -19151, -16881, -59205, -34274, -56110, -30430, -23982, -55705, -45199, 12968, 4635, -94995, -81355, -85972, -56020, -59648, -92786, -48581, -31617, -74338, -74751, -80106, -36591, -18674, -70304, -64390, -18542, -8066]
436h066k3773J7001J2152q384n9182O0003l114n5339q70K969o025O8507R209n097
422iL7976p0049L4466L99j8334j5589k0254K3687R099r882m7818L254L8699k4011
408e8366K776j943k8865J611M506l312K0728J164j1413p342r199K4964K6317j3427
394e1801k413n484l148L2406o789K064n455m8556N9959m5145J0644O8096m5418
381d1040K7540J0350j6178j9769l232k4359l3364M5734j1347L1130N3388r6147
369g7294J4957r790k0709N7279j4275r664r00m3766M0895J9321o01J258Q936K2171
355a2182k6711l4346J2816m1979k3207K9673K662m397P944N0401J8527L9398k3899
342e300j00537K1274K4059J4342l0964k1391j7049L6769l6436M4710M2799n5637
$$ y = [-8066, -31839, -14838, -2686, -11070, -70252, -10249, -13363, -68702, -69572, -66603, -72628, -4121, 5088, -9, 37967, -32082, 2384, 2783, -15551, -31140, -51394, -27707, -18608, -28490, -76308, -73054, -34355, -58366, -55590, -57533, -86398, -84787, -80281, -83593, -62865, -61701, -73114, -80456, -89655, -64691, -38374, -51801, -54214, -59698, -62846, -30440, -37229, -35165, -40620, -89176, -29217, -74362, -63718, 4378, -41040, -13500, -3150, -19328, -39097, -42329, -66688, -100052, -54318, -65665, -34535, 18853, -77294, -62337, -72127, -92836, -35557, -49832, -59496, -60396, -104162, -63267, -43946, -44547, -43289, -34353, -12182, -38893, -73239, -60423, -102402, -125609, -95936, -93274, -97671, -89727, -39326, -20799, 18599, -5300, -105837, -84563, -60504, -46162, -77126, -98517, -115566, -78797, -115233, -70523, -27724, -83361]
330h3361K3466P221m9819l088N3389j6555k4645p29J6505O356K895j0726L5409
317d3682m806l4788q844J1555L1118J7007q950l5090J1906K1075l4242l3046k5497
304a36284L8064L9966j6549l444M3468k2789n0829M1809j3019J3827K4954L228
292c7598m7819J005J8375j0502J2928j7203M2665m904J101k4228l5857K1537j4614
279i5114R170M209l5464L1979K6649R670r129O36p3181O93M2928j5986m3840l1873
265a78653K6836M3401K4044l3176R007N2116m2131K3341j1090R917m484k6304
253a07176l365J9538K7530p955m3370L378l700p79K6287l9141M4764J2910N648
240f5431l1061o442J1694N0372N045m7897J9710j7835j752l1775J6985k1526P215
$$ y = [-83361, -59895, -52674, -102493, -105581, -52192, -68747, -93392, -94121, -77616, -71260, -68365, -79091, -43682, -48488, -83276, -92120, -80565, -49447, -32440, -41390, -76480, -64574, -43499, -77741, -110787, -136284, -98220, -58254, -74803, -78247, -34779, -57568, -108397, -66588, -79607, -65780, -40826, -37598, -85417, -84412, -66037, -76539, -63611, -80814, -38149, -43053, -41952, -66180, -102037, -80500, -95114, -85944, -81735, -117199, -85220, -58571, -48901, -58030, -57394, -130575, -129882, -86954, -102940, -146780, -178653, -151817, -108416, -84372, -117548, -108541, -56425, -98556, -75215, -86305, -76388, -80872, -107176, -110541, -91003, -63473, -71428, -114798, -111420, -115120, -115899, -89612, -128753, -83989, -71079, -65431, -96492, -102934, -91240, -40868, -35823, -83720, -64010, -81845, -83597, -115372, -98387, -119913, -112698]
227a12698O4207o81L1666R724j7117Q630K3031n2788l7615K2596K0j2240m4462
214a17727k8009L5027r505L3691K970J0240N229k1403j6910O703M3616j1719q654
201g6451K645o09j9318j3784j7119o37J6017k5816L7467K6252M023k6883k8957
188a23170L0055M0588l3734k4372L3984o739J2392j599l2693P030k5911l88K2996
175a01561r842n895K6268q91J88j8455j4077K4231J2102m329k6642k8415L5004
162a12314J2412k7431l594J5936j3080J835M3541M0688l221k6637k0588l45j9314
149a12112k0736O4315J9913j4583K407j0168Q978r893n0989k1809J6569O021O459
136a15628L6019Q683k0516k8787K6516l2972K3352o243L817J402J4021k2753K310
$$ y = [-112698, -48491, -49172, -17506, -7782, -24899, -16269, 6762, -46026, -83641, -61045, -61025, -73265, -117727, -145736, -110709, -120214, -86523, -83553, -73313, -68084, -89487, -106397, -99694, -56078, -67797, -76451, -73806, -74415, -93733, -107517, -124636, -125273, -109256, -135072, -97605, -71353, -67330, -94213, -123170, -93115, -52527, -86261, -110633, -76649, -83388, -70996, -72595, -105288, -98258, -124169, -124557, -101561, -111403, -117298, -91030, -91921, -91733, -110188, -124265, -100034, -87932, -92261, -118903, -147318, -112314, -99902, -127333, -130927, -114991, -128071, -126236, -82695, -42007, -45228, -71865, -92453, -92798, -112112, -132848, -68533, -48620, -63203, -60796, -70964, -61986, -71879, -122868, -144677, -128108, -122087, -115628, -79609, -70926, -91442, -120229, -93713, -126685, -103333, -109576, -105759, -104357, -90336, -113089, -110779]
123a10779j1228m3811k993k1162J2237n818P3894K0617l0734K1554J000p989L2236
110g2976O128n1559J0861L7069m441j7851j9719k0110j0983O738J633J4689M409
97a16112k1000J7117K3557j0135o86R365M784J5446m7860j442M5526p507p381
84i6328N641J8122l978j7717k2178J6182j4347k9378L4148j2492J3016l362m0118
71a52789k0231P232J6923r816M0456j5727n340J8007J5356J9724o627j2263O449
58i8646k3814J5444J937L04k4458k145k659j189j4338k932M260J933K4843k3482
44a44942j1932L2642N1603j3445k9391K195K3680P681L990j8628J412R302j9703
31a05536k3294j1715j9580j7568R692O2395k1615k500r605J677L2568m3599j2893
$$ y = [-110779, -122007, -165818, -168811, -189973, -177736, -183554, -109660, -89043, -119777, -98223, -97223, -105212, -72976, -66848, -118407, -107546, -70477, -74918, -92769, -112488, -132598, -143581, -136843, -135210, -120521, -116112, -137112, -119995, -96438, -106573, -107259, -97894, -93110, -77664, -125524, -126966, -81440, -88947, -96328, -90687, -72565, -76543, -94260, -116438, -100256, -114603, -143981, -109833, -122325, -109309, -112671, -152789, -173020, -165788, -148865, -158681, -118225, -133952, -139292, -121285, -105929, -86205, -92832, -105095, -98646, -122460, -107016, -105079, -104775, -129233, -131378, -134037, -135226, -149564, -152496, -148236, -146303, -121460, -144942, -156874, -124232, -72629, -86074, -115465, -113270, -89590, -81909, -77919, -96547, -95135, -85833, -105536, -128830, -140545, -160125, -177693, -168001, -105606, -127221, -129721, -139326, -137649, -105081, -148680, -161573]
18a61573J2845J7773o776K3213J4371k934k6852r926K260K2679M256j2014L703
5a18975J4728k1524j4408J4261r694
0a35612
$$ y = [-161573, -148728, -130955, -137731, -114518, -100147, -103081, -129933, -139859, -137599, -114920, -110664, -122678, -118975, -104247, -125771, -140179, -125918, -135612]
$$ Imaginary data points
##PAGE= N=2
##DATA TABLE= (X++(I..I)), XYDATA
16383b311119M6098M6878j3728K6148N5175M849K7100M9804M1304l886J3367J8315
16371a999695J9935J6784M5790L5292L8687K1756K03J1199N4228o553J0438L3659
16359a718277K8439K9775M7467O9097L6761J0744L0582K0638K0059M206M321J4381
16347a401807N4266L1106J3218J5302L7392L0025J0084Q5798L9346Q898L639k4955
16335a097688M3904L7075J8952M0326L1050L6745j6102L3505M6374M6046m6316
16324h26129N529N1036q815O372L2757K0473j137M0583N1541O0926k1517J0020
16312e78361M1601L2510M6528K653Q597N430L7458J8971Q878Q662Q5645j7332
16300b98760J4813M0873k0333L4770P75O5914L6002L0535n401L9200j399m9551
$$ y = [-2311119, -2265021, -2218143, -2231871, -2205723, -2150548, -2145699, -2118599, -2068795, -2027491, -2031377, -2018010, -1999695, -1979760, -1962976, -1917186, -1881894, -1843207, -1821451, -1821248, -1810049, -1755821, -1762374, -1751936, -1718277, -1689838, -1660063, -1612596, -1543499, -1506738, -1495994, -1465412, -1444774, -1424715, -1420509, -1416188, -1401807, -1347541, -1316435, -1303217, -1287915, -1250523, -1220498, -1210414, -1124616, -1085270, -1076372, -1072733, -1097688, -1053784, -1016709, -997757, -957431, -926381, -889636, -905738, -872233, -825859, -779813, -826129, -820600, -769564, -778379, -772007, -739250, -718777, -719914, -679331, -627790, -566864, -588381, -578361, -536760, -504250, -457722, -455069, -446472, -441042, -403584, -384613, -375735, -367073, -281428, -298760, -283947, -243074, -263407, -228637, -227862, -161948, -125946, -95411, -100812, -61612, -63011, -112562]
16288a12562M0494L7348J7488L089L3975kP9893M691l820L962K2715M7532K1306
16275A96109L1458J3870J5761J3416L9969k2545l1615J2504M1251M8579J6205
16264C74962K9851N8166n638K1438J8468M0089o274n122J5628j5636l8375K3055
16252E10612N2568l91O086j9802N6772J8813J6836K4738N0071M1287K4322J3229
16240G95141L5708l7826k033J1704J671J4131k770K4456j9403q242M0845J8789
16228H72171J0220J2172N1941O5088j5899j6173K2767K6395j3600J0993J2465
16217A038540j9236N975K8546L04L6036k8759l4418J7715M5734Q033K3700Q2810
16205A204980M8347m5857k5838L3516K1565k6484M1392K7590k0574l3715j2600
$$ y = [-112562, -72068, -34720, -17232, -14143, 19832, 19830, 99723, 104414, 100594, 104556, 127271, 174803, 196109, 227567, 241437, 257198, 270614, 310583, 288038, 256423, 268927, 310178, 358757, 374962, 404813, 462979, 457341, 478779, 497247, 537336, 531062, 525940, 541568, 525932, 487557, 510612, 563180, 562789, 568875, 549073, 605845, 624658, 641494, 666232, 716303, 757590, 781912, 795141, 830849, 793023, 790990, 802694, 804365, 818496, 815726, 840182, 820779, 812537, 853382, 872171, 882391, 894563, 946504, 1011592, 995693, 979520, 1002287, 1028682, 1015082, 1026075, 1038540, 1019304, 1025279, 1053825, 1054129, 1090165, 1061406, 1026988, 1044703, 1090437, 1098470, 1122170, 1204980, 1253327, 1207470, 1181632, 1215148, 1236713, 1210229, 1251621, 1279211, 1258637, 1224922, 1212322]
16194A212322J2753J6207k0962p297O7128O3759K0506m5250J1036J4849J5574
16183A360625K5535j3975j3396K6107j5467j6218M4592j9625N638L927K2335J2498
16171A422576m139k57R647L2790M3234q966J35K3293l4777M092l283N647m844
$$ y = [1212322, 1225075, 1241282, 1220320, 1213023, 1280151, 1343910, 1364416, 1319166, 1330202, 1345051, 1360625, 1386160, 1372185, 1358789, 1384896, 1369429, 1353211, 1397803, 1378178, 1383816, 1387743, 1410078, 1422576, 1418437, 1418180, 1427827, 1460617, 1503851, 1494885, 1495020, 1518313, 1483536, 1487628, 1484345, 1489992, 1485148]
$$ [...]
##END NTUPLES=NMR SPECTRUM
##END=
