##TITLE=1H_EC-3244(5-1)
 CDCl3,8 sc, 
 1.04.2021
##JCAMPDX= 6.0         $$ Bruker NMR JCAMP-DX V2.0
##DATA TYPE= NMR SPECTRUM
##DATA CLASS= NTUPLES
##ORIGIN= UXNMR, Bruker Analytische Messtechnik GmbH
##OWNER= root
$$ XWIN-NMR		Version 3.5
$$ Thu Apr  1 12:49:20 2021 Russian Standard Time (UT+4h)  she@DPX200
##.OBSERVE FREQUENCY= 200.131506
##.OBSERVE NUCLEUS= ^1H
##.ACQUISITION MODE= SIMULTANEOUS
##.ACQUISITION SCHEME= undefined
##.AVERAGES= 8
##.DIGITISER RES= 18
##SPECTROMETER/DATA SYSTEM= spect
##.PULSE SEQUENCE= zg30
##.SOLVENT NAME= CDCl3
##.SHIFT REFERENCE= (INTERNAL, CDCl3, 0, 15.9761)
##AUDIT TRAIL= $$ (NUMBER, WHEN, WHO, WHERE, WHAT)
$$ ##TITLE= Audit trail, XWIN-NMR		Version 3.5
$$ ##JCAMPDX= 5.01
$$ ##ORIGIN= Bruker BioSpin GmbH
$$ ##OWNER= she
$$ F:/spectra/data/she/nmr/H-F/1/pdata/1/auditp.txt
$$ ##AUDIT TRAIL=  $$ (NUMBER, WHEN, WHO, WHERE, WHAT)
(   1,<2021-04-01 12:48:08.93 +0400>,<she>,<DPX200>,
      <created by zg, POWCHK disabled, PULCHK disabled
       configuration hash MD5:
       00 E9 B6 7A A2 85 ED C7 34 08 36 98 17 FE 4E 26
       data hash MD5: 16K
       ED 59 36 3F 08 75 EE BD 2A 2F EE 64 CF B5 F1 0E>)
(   2,<2021-04-01 12:48:11.40 +0400>,<she>,<DPX200>,
      <Start of raw data processing
       efp BC_mod = 2 LB = 0.24 FT_mod = 6 PKNL = 1 PHC0 = -11121.17 PHC1 = 11.60093 SI = 16K 
       data hash MD5: 16K
       5D CB 37 33 67 C1 FC 7B C6 4D A2 5A F3 EE 19 EB>)
(   3,<2021-04-01 12:48:32.20 +0400>,<she>,<DPX200>,
      <pk PHC0 = -0.8952803 PHC1 = 3 
       data hash MD5: 16K
       4F 6D CF A2 CA 10 63 FB 4C B1 58 2C 3F 82 6C C5>)
(   4,<2021-04-01 12:48:35.68 +0400>,<she>,<DPX200>,
      <abs ABSG = 5 
       data hash MD5: 16K
       E6 87 B0 5E 92 DD 91 F0 A6 9C 54 5D 91 06 AB 2D>)
$$ ##END=
$$ 
$$ hash MD5
$$ FE 94 11 9B 9B D0 DD 3B BC 12 9C 5D 49 71 AE EA
##$RELAX= 
##$RELAX= 
##$RELAX= 
##$RELAX= 
##$RELAX= 
##$RELAX= 
$$ Bruker specific parameters
$$ --------------------------
##$DU= <F:/spectra>
##$EXPNO= 1
##$NAME= <H-F>
##$PROCNO= 1
##$TYPE= <nmr>
##$USER= <she>
##$AMP= (0..31)
100 100 100 100 100 100 100 100 100 100 100 100 100 100 100 100 100 100 
100 100 100 100 100 100 100 100 100 100 100 100 100 100 
##$AQSEQ= 0
##$AQ_mod= 1
##$AUNM= <au_zg>
##$AUTOPOS= <>
##$BF1= 200.13
##$BF2= 200.13
##$BF3= 200.13
##$BF4= 200.13
##$BF5= 200.13
##$BF6= 200.13
##$BF7= 200.13
##$BF8= 200.13
##$BYTORDA= 1
##$CFDGTYP= 0
##$CFRGTYP= 5
##$CHEMSTR= <none>
##$CNST= (0..31)
1 1 145 1 1 1 1 1 1 1 1 1 1 1 1 1 1 1 1 1 1 1 1 1 1 1 1 1 1 1 1 1 
##$CPDPRG= <>
##$CPDPRG1= <>
##$CPDPRG2= <>
##$CPDPRG3= <>
##$CPDPRG4= <mlev>
##$CPDPRG5= <mlev>
##$CPDPRG6= <mlev>
##$CPDPRG7= <mlev>
##$CPDPRG8= <mlev>
##$CPDPRGB= <>
##$CPDPRGT= <>
##$D= (0..31)
0 1.2 0 0 0 0 0 0 0 0.06 0 0.03 0 0 0 0 0.0002 0 0 0 0 0 0 0 0 0 0 0 0 
0 0 0 
##$DATE= 1617266888
##$DBL= (0..7)
120 120 120 120 120 120 120 120 
##$DBP= (0..7)
150 150 150 150 150 150 150 150 
##$DBP07= 0
##$DBPNAM0= <>
##$DBPNAM1= <>
##$DBPNAM2= <>
##$DBPNAM3= <>
##$DBPNAM4= <>
$$ [...]
##$SUBNAM3= <"">
##$SUBNAM4= <"">
##$SUBNAM5= <"">
##$SUBNAM6= <"">
##$SUBNAM7= <"">
##$SUBNAM8= <"">
##$SUBNAM9= <"">
##$SW= 16.9725357007746
##$SWIBOX= (0..15)
0 0 2 0 0 0 0 0 0 0 0 0 0 0 0 0 
##$SW_h= 3396.73913043478
##$TD= 16384
##$TD0= 1
##$TE= 0
##$TE2= 300
##$TE3= 300
##$TEG= 300
##$TL= (0..7)
0 120 120 120 120 120 120 120 
##$TP= (0..7)
150 150 150 150 150 150 150 150 
##$TP07= 0
##$TPNAME0= <>
##$TPNAME1= <>
##$TPNAME2= <>
##$TPNAME3= <>
##$TPNAME4= <>
##$TPNAME5= <>
##$TPNAME6= <>
##$TPNAME7= <>
##$TPOAL= (0..7)
0.5 0.5 0.5 0.5 0.5 0.5 0.5 0.5 
##$TPOFFS= (0..7)
0 0 0 0 0 0 0 0 
##$TUNHIN= 0
##$TUNHOUT= 0
##$TUNXOUT= 0
##$USERA1= <user>
##$USERA2= <user>
##$USERA3= <user>
##$USERA4= <user>
##$USERA5= <user>
##$V9= 5
##$VALIST= <valist>
##$VCLIST= <CCCCCCCCCCCCCCC>
##$VD= 0
##$VDLIST= <DDDDDDDDDDDDDDD>
##$VPLIST= <PPPPPPPPPPPPPPP>
##$VTLIST= <TTTTTTTTTTTTTTT>
##$WBST= 1024
##$WBSW= 4
##$XGAIN= (0..3)
0 0 0 0 
##$XL= 0
##$YL= 0
##$YMAX_a= 514879
##$YMIN_a= -487398
##$ZGOPTNS= <>
##$ZL1= 120
##$ZL2= 120
##$ZL3= 120
##$ZL4= 120
##$ABSF1= 15.96781
##$ABSF2= -1.004852
##$ABSG= 5
##$ABSL= 3
##$ALPHA= 0
##$AQORDER= 0
##$ASSFAC= 0
##$ASSFACI= 0
##$ASSFACX= 0
##$ASSWID= 0
##$AUNMP= <proc_1d>
##$AZFE= 0.1
##$AZFW= 0.1
##$BCFW= 0
##$BC_mod= 2
##$BYTORDP= 0
##$COROFFS= 0
##$CY= -3
##$DATMOD= 1
##$DC= 0
##$DFILT= <>
##$DTYPP= 0
##$F1P= 0
##$F2P= 0
##$FCOR= 1
##$FTSIZE= 16384
##$FT_mod= 6
##$GAMMA= 0
##$GB= 0
##$INTBC= 1
##$INTSCL= 2.992141e-10
##$ISEN= 128
##$LB= 0.24
##$LEV0= 0
##$LPBIN= 0
##$MAXI= 10000
##$MC2= 0
##$MEAN= 0
##$ME_mod= 0
##$MI= 1.114404
##$NCOEF= 0
##$NC_proc= -6
##$NLEV= 6
##$NOISF1= 3.799351
##$NOISF2= 2.8
##$NSP= 0
##$NTH_PI= 0
##$NZP= 0
##$OFFSET= 15.9761
##$PC= 1
##$PHC0= -11122.07
##$PHC1= 14.60093
##$PH_mod= 1
##$PKNL= yes
##$PPARMOD= 0
##$PSCAL= 0
##$PSIGN= 0
##$REVERSE= no
##$SF= 200.130007071948
##$SI= 16384
##$SIGF1= 3
##$SIGF2= 2
##$SINO= 5.538805
##$SIOLD= 16384
##$SREGLST= <1H.CDCl3>
##$SSB= 0
##$STSI= 16384
##$STSR= 0
##$SW_p= 3396.73913043479
##$SYMM= 0
##$S_DEV= 0
##$TDeff= 16384
##$TDoff= 0
##$TI= <>
##$TILT= no
##$TM1= 0
##$TM2= 0
##$TOPLEV= 0
##$USERP1= <user>
##$USERP2= <user>
##$USERP3= <user>
##$USERP4= <user>
##$USERP5= <user>
##$WDW= 1
##$XDIM= 16384
##$YMAX_p= 284584671
##$YMIN_p= -253596
$$ End of Bruker specific parameters
$$ ---------------------------------
##NTUPLES= NMR SPECTRUM
##VAR_NAME=  FREQUENCY,     SPECTRUM/REAL,   SPECTRUM/IMAG
##SYMBOL=    X,             R,               I
##VAR_TYPE=  INDEPENDENT,   DEPENDENT,       DEPENDENT
##VAR_FORM=  AFFN,          ASDF,            ASDF
##VAR_DIM=   16384,         16384,           16384
##UNITS=     HZ,            ARBITRARY UNITS, ARBITRARY UNITS
##FACTOR=    0.207333158178282, 1,           1
##FIRST=     3197.29699956929, 0,            0
##LAST=      -199.442130865499, 0,           0
##MIN=       -199.442130865499, -253596,     0
##MAX=       3197.29699956929, 284584671,    0
$$ Real data points
##PAGE= N=1
##DATA TABLE= (X++(R..R)), XYDATA
$$ [...]
5611G68623j08279Q2409j1138l6803o0451q502k3014K2624n6112n950J17422l3041
5599F47788n3223p9976M777J60395L0778j7734j4652m2314r9065j10978K5246
5588D51042J9462k7172O9236l5728r851J08776l7434k0800L8780o2378p1112k2596
5576D00225J25036j2728n0985N5122R0l0051n3719m2635P129L7969R527j2767
5564D32213n8467l3206o994l960k3064L1719O0852K4830L6674j11244L4422J5310
5552C99085M4001O5070K6846o6303n6489j11397O6118N0167K3442J5527j11423
5541C44644R9185M4776q62N1590l1351L852j7355j9701m1292r9280N3021J8609
5529D05836J4706o4184r1872k3644P9657N6913n586L8299k1473q4596L5298m3057
$$ plain form
5611 768623 660344 742753 731615 694812 634361 625859 602845 625469 569357 563407 680829 647788
5599 647788 594565 514589 519366 679761 710539 692805 678153 635839 536774 425796 451042
5588 451042 470504 443332 512568 476840 466989 575765 538331 517531 556311 493933 422821 400225
5576 400225 525261 512533 461548 516670 516760 486709 432990 390355 397484 435453 444980 432213
5564 432213 373746 340540 333546 329586 306522 338241 399093 423923 460597 349353 383775 399085
5552 399085 443086 508156 535002 468699 412210 300813 366931 417098 440540 456067 344644
5541 344644 443829 488605 487743 539333 507982 511834 494479 474778 433486 334206 387227 405836
5529 405836 420542 356358 264486 240842 320499 377412 371826 410125 388652 304056 339354 296297
5517B96297N1400Q2891J789j3518K2618N087q3169o684J4979L1935m0046m2033
5505C21546q2468m2239P4831N6572O0704M5846p3656Q2848p4290K8869J40242
5494E38805j55423k2171J7630J22021O8723q8611q8267l51K8436k3746K94J6984
5482D14324L2222L8252o9044J3822k70L6962R9410J0531N5221o759m4857L0490
5470F10304M7027L3935j08359l555L8774K5000m8549k5745M9762j430M5305Q2884
5458G45353K5474j06963o1387O0571Q9011J6526j3715Q6401j0421N7178J5915
5447I03943K5557O1414N2053J12160P6258P2230O7132R8301J44331J60731O9110
5436A843220K2674j00801p68j35021j78134q6770j22712j14754j52533r3704J8370
$$ plain form
5517 296297 347697 430588 432377 418859 441477 446564 363395 356711 371690 403625 363579 321546
5505 321546 239078 196839 271670 328242 388946 434792 361136 443984 369694 398563 538805
5494 538805 383382 361211 378841 500862 569585 480974 392707 392356 420792 397046 397340 414324
5482 414324 446546 484798 415754 429576 429306 466268 565678 576209 631430 624671 579814 610304
5470 610304 657331 691266 582907 579352 618126 643126 594577 568832 618594 617164 662469 745353
5458 745353 770827 663864 602477 663048 752059 768585 754870 841271 830850 888028 903943
5447 903943 929500 990914 1042967 1155127 1231385 1303615 1370747 1469048 1613379 1774110 1843220
5436 1843220 1865894 1765093 1764325 1629304 1451170 1364400 1241688 1126934 974401 880697 899067
5425H99067r3955j4158r8630p4833J1855k4095P5054m7931N6983N1663j58043
5414E82977n1805Q5537M3365l6959q5052O9989K172j05890L1663j5381q454J1395
5402E23557J3263P1258n0343p1725Q2747k4006m9734k2863O099m1178k7458j1253
5390C98364q733m4132k8452R899P1667K6601J07802j08488r5944K3250n0565Q0166
5378C81435L4155L125n3310J5079p1353Q9350m4808o3122P5302j1747N4051O9958
5366D78115m5304p123M4201O9214r3448j7543l3109l3357O2328j4445k106O9379
5354D76802k4476l3856O951P6402L4058j19489L5582Q1390m474o6767K2949j4272
5342D70800J1765j7174r460L6178l5458l8917L0811R5432L2973n5683P6899R0483
$$ plain form
5425 899067 805112 790954 692324 617491 629346 605251 680305 632374 689357 741020 582977
5414 582977 531172 616709 660074 623115 538063 608052 610224 504334 535997 520616 512162 523557
5402 523557 536820 608078 557735 486010 568757 544751 495017 472154 478253 437075 409617 398364
5390 398364 389631 345499 317047 326946 398613 425214 533016 424528 328584 351834 301269 381435
5378 381435 415590 418715 365405 380484 309131 398481 353673 290551 365853 354106 408157 478115
5366 478115 432811 425688 469889 539103 445655 428112 395003 361646 423974 409529 407423 476802
5354 476802 452326 418470 425421 501823 535881 416392 451974 533364 528890 462123 485072 470800
5342 470800 482565 465391 455931 492109 456651 417734 448545 543977 576950 521267 598166 688649
5330F88649m8041m4943j8409K3316N848M5544K4099k5717K8671n7306m7431K8115
5318F02395P4071l3161r9847K2150M0796j24086R5205O2618L2569J6962q7636
5307F02036O3949l2594J1642p634p6619O8775Q6088N3923M4709j1921M170m184
5295H02340l2230j94j7765k292K2679j4484L1810J0575P8051p696q8981J0713
5283G92526K1112K7854r0363m6751J51738K8244N8531l043r2989n2014P7450P0773
5271I43068J3861R1356O9747n0401k2499p551l6833q2915P1906J67737n7445j5105
5259A084926j24403j3315O6490j1235O8561N8514p876k3260O4210L9406O5646
5248A267664m156l7644J00166R1619N9671o399m9386N3725P5341J5722k7978j8166
$$ plain form
5330 688649 640608 595665 577256 600572 606420 651964 676063 650346 679017 621711 574280 602395
5318 602395 676466 643305 543458 565608 606404 482318 577523 640141 672710 689672 602036
5307 602036 665985 633391 645033 637399 560780 629555 715643 769566 814275 802354 806524 802340
5295 802340 770110 769916 752151 749859 772538 758054 789864 800439 878490 870794 781813 792526
5283 792526 813638 841492 751129 704378 856116 884360 942891 939848 846859 794845 872295 943068
5271 943068 956929 1048285 1118032 1067631 1045132 1037581 1000748 917833 989739 1157476 1100031 1084926
5259 1084926 960523 947208 1013698 1002463 1071024 1129538 1121662 1098402 1162612 1202018 1267664
5248 1267664 1263508 1225864 1326030 1417649 1477320 1470921 1421535 1475260 1550601 1566323 1538345 1520179
5236A520179J07598P578J16534j2212j6425K3794K8572N7886M9219M3864R3006
5225B019593j2187n4993j7522L5139J1668O666J02054m5308O9971O2200N7893
5214B235174Q6600J4864O9713J29972J85932J10328p6682r456l4237R6595P4225
5203B883028K00255m0147m466J23849Q8531J11106M4881K3940J44175N4431J39599
5192C769182M1453q4598R5590R187J76401K52300O7605J33509J21151N7717M3079
5181D682576J24885J66277J14393J61842J43211K67671K18887J26696J01225J45253
5171F252916K40841K68628K41561J67695L06808L44537L10105K30099K59101L00254
5161H922545L22673M46143K01078M43597N88336N12265O29018P87252O01244Q08247
$$ plain form
5236 1520179 1627777 1635355 1751889 1739677 1723252 1747046 1775618 1833504 1882723 1926587 2019593
5225 2019593 2007406 1952413 1934891 1970030 1981698 1988364 2090418 2045110 2115081 2177281 2235174
5214 2235174 2321774 2336638 2406351 2536323 2722255 2832583 2755901 2746445 2712208 2808803 2883028
5203 2883028 3083283 3043136 3038670 3162519 3251050 3362156 3407037 3430977 3575152 3629583 3769182
5192 3769182 3810635 3726037 3821627 3830814 4007215 4259515 4327120 4460629 4581780 4639497 4682576
5181 4682576 4807461 4973738 5088131 5249973 5393184 5660855 5879742 6006438 6107663 6252916
5171 6252916 6493757 6762385 7003946 7171641 7478449 7822986 8133091 8363190 8622291 8922545
5161 8922545 9245218 9691361 9892439 10336036 10924372 11436637 12065655 12852907 13454151 14262398
5151A4262398R40360R06793R75299J129978J349979J521920J701425J891407K123649
5142B6803208K404422K674968K763482K646693K421806J750428Q75683k57130
5134D2083560j290316j997264k322165k188036j823024j595659j123962r54723
5126B8788411p48009n45467j90393J59365K62640O47606P06772Q27822J161208
5117C1069955J558085J582935J830988K370688K619540L027796L549437M223893
5109E1833317M791634N231732N669338N223230M466960K917430N08798k397577
5101G8244862n052054o559667o822843o050592n214080m308814l439136l048581
5093C7749095k323837j909000j621549j360562j049222q19815n25033k74082k15025
$$ plain form
5151 14262398 15202758 16109551 17084850 18214828 19564807 21086727 22788152 24679559 26803208
5142 26803208 29207630 31882598 34646080 37292773 39714579 41465007 42340690 42083560
5134 42083560 40793244 38795980 36473815 34285779 32462755 30867096 29743134 28788411
5126 28788411 28040402 27494935 27304542 27463907 27726547 28374153 29080925 29908747 31069955
5117 31069955 32628040 34210975 36041963 38412651 41032191 44059987 47609424 51833317
5109 51833317 56624951 61856683 67526021 72749251 77216211 80133641 80642439 78244862
5101 78244862 73192808 66633141 59810298 53759706 48545626 44236812 40797676 37749095
5093 37749095 35425258 33516258 31894709 30534147 29484925 28665110 28140077 27865995 27650970
5084B7650970K6286K98243N14423O93531Q26699J166894J335309J626105J967433
5075C6105893J933189K053024J849302J220101L70333o98032j911605k878231
5067C8043974l405346l428865l052099k559606k241480j950175j839105j435182
5059A8132116j328062j132878r69377j018466o82248p04199o64555o10453n31247
5050A0490631m83395m26813m05535l87427l28626l31851l72739k78440k06670
5041G269135j66665j97309j74482k19861l60864k11453k53224k47631n5975j50372
5031E231299o5659k08643j84061r1439q6767r6528j82371j26452j07398m5385
5021D036596j5101k18300o6867m9777j72306q5927r735k0570o0999j65205r8623
$$ plain form
5084 27650970 27677256 27975499 28489922 29183453 30010152 31177046 32512355 34138460 36105893
5075 36105893 38039082 40092106 41941408 43161509 43531842 42833810 40922205 38043974
5067 38043974 34638628 31209763 28157664 25598058 23356578 21406403 19567298 18132116
5059 18132116 16804054 15671176 14701799 13683333 13001085 12296886 11632331 11021878 10490631
5050 10490631 10007236 9580423 9174888 8787461 8458835 8126984 7754245 7475805 7269135
5041 7269135 7102470 6905161 6730679 6510818 6149954 5938501 5685277 5437646 5381671 5231299
5031 5231299 5165640 4956997 4772936 4681497 4594730 4498202 4315831 4189379 4081981 4036596
5021 4036596 4021495 3803195 3736328 3686551 3514245 3428318 3418583 3398013 3337014 3171809 3073186
5010C073186m0817j73773l0850L2783j52221q1085k8070q6319m4498l0560K5718
4999B463494p6318L003n0221K0064n6894J321L7427j38155j24367R8486j3867
4988B163973p1364j52092q6066j7890M0205l5908r3647j51944p0370j6887o0703
4977A447307j01198o128M743m727o1710j12091J7125Q2026J3506o61k4548L5071
4965A288715n3922p1872q0313n7582R4133j6377K8891q7901O209M485o7657K3621
4953A010430R5949J4361p2254n9557m8792L9494k8007n968J07767q7615n9614
4942I06194L4572J0242j821M554j21065L7759L6670k9752n8429j6592O8990L9812
4930I11134r6503j02065n9626J11486N7651J6031L7783k6717J9313j13918o3830
$$ plain form
5010 3073186 3032369 2858596 2827746 2860529 2708308 2627223 2599153 2512834 2468336 2437776 2463494
4999 2463494 2387176 2390179 2339958 2360022 2303128 2304449 2341876 2203721 2079354 2177840 2163973
4988 2163973 2092609 1940517 1854451 1836561 1876766 1840858 1747211 1595267 1524897 1508010 1447307
4977 1447307 1346109 1339981 1344724 1339997 1278287 1166196 1183321 1265347 1278853 1278192 1253644 1288715
4965 1288715 1234793 1162921 1082608 1025026 1119159 1102782 1131673 1043772 1049981 1054466 986809 1010430
4953 1010430 1106379 1120740 1048486 988929 940137 979631 951624 945656 1053423 965808 906194
4942 906194 940766 951008 949187 953741 832676 870435 907105 877353 818924 802332 871322 911134
4930 911134 814631 712566 652940 764426 822077 838108 875891 849174 868487 754569 690739
4919F90739K9193l9973n0798R954n7470K6998J35608K1186j1813J8629j23297
4908F48956q5364j3662K8408l704Q979q103J2295K523L2355n8674K9561J28005
4896G21575p1471k3043o0940J17309o8601o4330Q7422l1498K5870k7483q680J4276
4884F10406p8865m1990q1355K3208Q715j6885o6629K8594Q6784j06925J25382
4873D90440J11580l6915N1210l0040m6260J9920J4801j7906r3474J30720Q4494
4862F78570j03019K1989j0445l5958J24855j533j46171M5757m293n2730n3217
4851D63805n6015J76344K643j52977Q8027Q3627q1096r136q754Q3876l6219l6029
4839E18096n6408l1193P8718J30692p5928n1609k1917K795Q3205M629M3719J6703
$$ plain form
4919 690739 719932 679959 629161 639115 581645 608643 744251 765437 753624 772253 648956
4908 648956 563592 549930 578338 574634 583613 575510 587805 590328 622683 564009 593570 721575
4896 721575 650104 627061 566121 683430 614829 550499 637921 606423 632293 604810 596130 610406
4884 610406 531541 489551 408196 431404 440119 423234 356605 385199 471983 365058 490440
4873 490440 602020 565105 616315 586275 540015 559935 574736 556830 463356 594076 678570
4862 678570 575551 597540 587095 551137 675992 674459 528288 574045 569752 517022 463805
4851 463805 407790 584134 586777 433800 521827 605454 524358 515222 506468 590344 554125 518096
4839 518096 461688 430495 509213 639905 563977 512368 490451 493246 576451 581080 624799 641502
4827F41502L0975r226k3580K1681L9738o1222r3318L2136K4580j4880j5736p136
4815E65514P6142M5469k6031j12934n1664J6790N0775k5532N6061J01380L911
4804F99881P254P4337n6708j8957J5869J20159N1749l4205J04617M3428k3088
4793I84336m3669J0045L4781q4582J01724L0138j2518K8521L9928l0434N9025
4782A117295k5382l4257m3279L7959J19520L9448o8987o9855J7802o6284P4577
4771A098557j11294J3359k989O9812N7694j02178M8553j18321P4417J4060o7758
4760I73912l2431q5513K5048q5540q3121J3177K8166J1955k2627M1523L5885r0885
4748G29549q9798q4068o6186K6503P2976n7949Q3599L6207l503j4454K2866j470
$$ plain form
4827 641502 672477 663251 639671 661352 701090 639868 546550 578686 603266 588386 572650 565514
4815 565514 641656 687125 661094 548160 496496 513286 564061 538529 594590 695970 699881
4804 699881 707135 781472 724764 705807 721676 841835 893584 859379 963996 1007424 984336
4793 984336 940667 950712 985493 900911 1002635 1032773 1020255 1048776 1088704 1058270 1117295
4782 1117295 1091913 1057656 1014377 1052336 1171856 1211304 1142317 1072462 1090264 1023980 1098557
4771 1098557 987263 1000622 997633 1067445 1125139 1022961 1071514 953193 1027610 1041670 973912
4760 973912 941481 855968 881016 795476 712355 725532 753698 765653 743026 784549 820434 729549
4748 729549 639751 555683 489497 516000 588976 531027 614626 650833 647330 632876 655742 654272
4736F54272L0009j27007J33331J01320j52527n0689L3883M5074P1107p5381k54
4725F63138L1888m8709j2934o8494p464J10203K2957r009r9356k089k0224k1153
4713E38754k1439l9334L1660K7825K8738L179k2163M1227l7437p2229K1438j1409
4701D88810Q0822O3946j0701n4874o0643j3737J06231k660N4265J8523m9889P5230
4689F95323j8648n2437l3043M5392n8090m2060Q8546n3966Q6210j3138L823j5092
4677F32820l5215J3570L263O4009R3450p9705J7418q4516K533R4220k5435M5155
4665G41567n3771p1218Q4322r6339R4250J54720O6950J1102M3775j09292M1774
4654I07840M0298n0657p7624O1206N4591M388j2951j8151o8285r075J09428m1061
$$ plain form
4736 654272 684281 557274 690605 791925 639398 588709 622592 667666 738773 663392 663138
4725 663138 695026 646317 633383 564889 557425 667628 690585 681576 582220 580131 559907 538754
4713 538754 517315 477981 509641 537466 566204 569383 547220 588447 551010 478781 500219 488810
4701 488810 569632 633578 622877 568003 507360 493623 599854 597194 651459 669982 620093 695323
4689 695323 676675 624238 591195 636587 578497 536437 624983 571017 657227 644089 647912 632820
4677 632820 597605 611175 614438 678447 771897 692192 709610 625094 627627 721847 696412 741567
4665 741567 687796 616578 700900 604561 698811 853531 920481 931583 975358 866066 907840
4654 907840 948138 897481 819857 881063 935654 940042 927091 908940 840655 831580 941008 899947
4642H99947r2679m3045J11095O952o3973L5780l3090M5213P5230j6082L5904l1908
4630I29344m3724M4675k1102O2542J56390p4282q7522n8661r849J04287N5748
4619A057846r4836L8571p1969J26556m3588k9812J31922m162n417N2940j0761
4608A147290P6204m2676r725R3002O2248O3954K5304q064l0128K158M6778R407
4596A435752J60219j7140J9121p5554K8524L6647k1350R8785P2698P3979Q2473
4585A894154q8686j2671K1187L4939N8797K0097K4762q8377P7722J6174P9552
4574B037650k2863K6023Q3529J08751Q021q861O8223l1025n666J01412J71831
4563B537025O1738k8406K0181n5751N7582Q8522O8274J47224O004P9717K6560
$$ plain form
4642 899947 807268 764223 875318 882270 818297 854077 820987 866200 941430 925348 961252 929344
4630 929344 885620 930295 909193 971735 1128125 1053843 966321 907660 897811 1002098 1057846
4619 1057846 963010 1001581 929612 1056168 1012580 982768 1114690 1110528 1105111 1158051 1147290
4608 1147290 1223494 1180818 1171093 1264095 1326343 1390297 1415601 1407537 1377409 1379567 1426345 1435752
4596 1435752 1595971 1578831 1597952 1522398 1550922 1587569 1566219 1665004 1737702 1811681 1894154
4585 1894154 1805468 1792797 1813984 1848923 1907720 1927817 1952579 1864202 1941924 1958098 2037650
4574 2037650 2014787 2040810 2124339 2233090 2241111 2232250 2300473 2269448 2263782 2365194 2537025
4563 2537025 2598763 2570357 2590538 2534787 2592369 2680891 2749165 2896389 2902393 2982110 3008670
4552C008670Q2937J06503L4409O2255P0258J49134N0710k3388Q4474O2642J49113
4541C837717J46543k8926N3270R7450J56165Q4875J58578J00631M5594Q9750J00965
4530D842612J28577J28943O3031L02633K07327J33799J35668J38310J1519J13066
4520F205485J45894q886K04737O1123J34699K86622R0418J39411J52925K04939
4510G617367J26540K26484J48313K04805L58377K33798L64697K72661K94478M91553
4500A0339073K66912M15923M58579N05229O46278O50063O91295O79794Q18414
4491A5471560Q26635P93992P30041O53187O86175N96860P32758P66989R66662
4482B2224859J087253J247880J506469J554252J818791J933516K294671K431975
$$ plain form
4552 3008670 3091607 3198110 3232519 3294774 3365032 3514166 3564876 3541488 3625962 3688604 3837717
4541 3837717 3984260 3955334 4008604 4106054 4262219 4347094 4505672 4606303 4651897 4741647 4842612
4530 4842612 4971189 5100132 5163163 5465796 5673123 5806922 5942590 6080900 6092419 6205485
4520 6205485 6351379 6342493 6547230 6608353 6743052 7029674 7120092 7259503 7412428 7617367
4510 7617367 7743907 7970391 8118704 8323509 8681886 8915684 9280381 9553042 9847520 10339073
4500 10339073 10605985 11021908 11480487 11985716 12631994 13282057 13973352 14653146 15471560
4491 15471560 16298195 17092187 17822228 18475415 19161590 19758450 20491208 21258197 22224859
4482 22224859 23312112 24559992 26066461 27620713 29439504 31373020 33667691 36099666
4474C6099666K775878L297463L736098M130279M603317N102915N518182N995793
4466G1259591O213803O157544O307485O133035N759490N275746M632980L541096
4458A15280770K251512L63861j906687l923272n263722o095155o168465o133729
4450H8405113n917398n830453n946097n841861n494314n208850m820890m342092
4442D5003158l876761l307648k813193k490994k329869j914367j756798j646859
4434B4866669j450185j343152j229292j028767q89432r36964p99084o47953n77363
4425A5964477n94262o68212m55255n28070n58754n63432n72699m52507m03744
4416A1167542m48496m11376m03596m20496l67169k97687l11074l07508k29788
$$ plain form
4474 36099666 38875544 42173007 45909105 50039384 54642701 59745616 65263798 71259591
4466 71259591 77473394 83630938 89938423 96071458 101830948 107106694 111739674 115280770
4458 115280770 117532282 117896143 115989456 112066184 106802462 100707307 94538842 88405113
4450 88405113 82487715 76657262 70711165 64869304 59374990 54166140 49345250 45003158
4442 45003158 41126397 37818749 35005556 32514562 30184693 28270326 26513528 24866669
4434 24866669 23416484 22073332 20844040 19815273 18925841 17988877 17189793 16541840 15964477
4425 15964477 15370215 14702003 14246748 13718678 13159924 12596492 12023793 11571286 11167542
4416 11167542 10719046 10307670 9904074 9483578 9116409 8818722 8507648 8200140 7970352
4407G970352k03136j94920k54619j60651k37966k18405n7604r9496j82177j72235
4397F189143o6196j30556j92488j63152p9750j13214p9715k09766j83714r9172
4387D871420l6663j50787j45965n7504j10845j5060j14305j09716p8894j46430
4377C905251K7560o9549r0801k3221j65707q3608m9912J7856r2284j12308q1633
4366C181644j36246j3611j7887J0312j06105j24176j22930m4998k1105p4662r9106
4355B431130q4919q2837J4902J1314L9423j10741l0274O3799j02801k6438j0861
4344B111697K7488L3921r3396m1900P2155J7965n6952o7841K049J27482K522j54718
4332A980472m9902M9767o3143L2102K8013j22900j11609l9094J06752m2267q9665
$$ plain form
4407 7970352 7767216 7572296 7317677 7157026 6919060 6700655 6643051 6543555 6361378 6189143
4397 6189143 6122947 5992391 5799903 5636751 5557001 5443787 5364072 5154306 4970592 4871420
4387 4871420 4834757 4683970 4538005 4480501 4369656 4354596 4240291 4130575 4051681 3905251
4377 3905251 3932811 3863262 3772461 3749240 3583533 3499925 3450013 3467869 3375585 3263277 3181644
4366 3181644 3045398 3031787 3013900 3024212 2918107 2793931 2671001 2626003 2604898 2530236 2431130
4355 2431130 2346211 2263374 2278276 2289590 2329013 2218272 2187998 2251797 2148996 2122558 2111697
4344 2111697 2139185 2173106 2079710 2037810 2109965 2127930 2070978 2003137 2005186 2132668 2135190 1980472
4332 1980472 1930570 1980337 1917194 1949296 1977309 1854409 1742800 1703706 1810458 1768191 1678526
4321A678526o7426p482j15441K1567o2042N5464n9438j26570J43615m476j48974
4310A307323o8374J00043N0558l3753L0308J2208m126J1432j12833r9241J27800
4299A321345M6974j71614k4081K9674j15477K6176m6331q9320J80667O7248K3794
4288A249055q0796p0497l5534Q682L7354L067m4160J2737R8281l0880m8946m7491
4276A050872l1458K052m3913P6928Q961L0117M2773L1488j38271o7129P2035q589
4264A025866J5496k0710j2764N818l7616o4954L1881K3170m6384m6900O6783l6558
4252I03128K454k8317l2451p3539J00657j992P745o992P668O1758l2889l7896
4240H69334O601n4177n3758M5854j09007J5824O9374N571p121k6493j06034j9351
$$ plain form
4321 1678526 1611100 1603618 1488177 1509744 1447702 1503166 1443728 1317158 1460773 1456297 1307323
4310 1307323 1238949 1338992 1389550 1355797 1386105 1398313 1394187 1405619 1292786 1193545 1321345
4299 1321345 1368319 1196705 1172624 1202298 1086821 1112997 1066666 977346 1158013 1225261 1249055
4288 1249055 1168259 1097762 1062228 1070910 1108264 1111331 1067171 1079908 1178189 1147309 1098363 1050872
4276 1050872 1019414 1021466 977553 1054481 1063442 1093559 1136332 1167820 1029549 962420 1034455 1025866
4264 1025866 1041362 1020652 1007888 1013706 976090 911136 943017 966187 919803 872903 939686 903128
4252 903128 905582 877265 844814 771275 871932 869940 877685 870693 878361 940119 907230 869334
4240 869334 875935 821758 768000 813854 704847 720671 790045 795616 788495 762002 655968 636617
4228F36617j973P9922N4426j01650k4921o4635N3206K5364m943n4372J05782J7462
4216G20285L4422L4613q1592L8737J5501m3690P8082L5395n0414J63253L5796
4205I80388o5822n818p2472k6474R040k0686l1185r2952K8826J11181O0444q5387
4193G89083o2991o3155K2823O4475P014k9292M9059k9959p3912J11649l6395o3790
4181F84609M607j4907K2005K3069L8754l9240N9075n2575J3751J7749n7934K8745
4169G27708J5050J26473k0541j00154P812N202N009P358J4553o055m0908k6703
4157G14804K4166p7146L9695Q4526L3139M4899Q4318Q6118N9225j8545m7502j1617
4145A016080m2700m5056M3517J12045P0205j12969O9397Q9142K1797k1667j5366
$$ plain form
4228 636617 634644 714566 768992 667342 642421 577786 630992 656356 651413 597041 702823 720285
4216 720285 754707 789320 707728 746465 761966 718276 796358 831753 781339 944592 980388
4205 980388 914566 908748 836276 809802 818842 798156 766971 674019 702845 814026 874470 789083
4193 789083 726092 662937 685760 750235 757249 727957 777016 747057 673145 784794 748399 684609
4181 684609 689216 674309 696314 719383 758137 718897 777972 725397 739148 756897 698963 727708
4169 727708 742758 869231 848690 748536 756348 761550 766559 773917 788470 782415 741507 714804
4157 714804 738970 661824 701519 786045 819184 864083 948401 1034519 1093744 1075199 1027697 1016080
4145 1016080 973380 928324 971841 1083886 1154091 1041122 1110519 1199661 1221458 1199791 1184425
4134A184425P521p8984N5087j8936j20L5160j3310j0763m9605M5683m9562r230
4122A097366K3838Q654j9683N3287J14340o2890k6656J9681k6898J19327P7939
4111A378305j4846j6433j01034j32144o6291r0711j6442K6381n0457m7905k5214
4100H43209K2467L6909K420r5880J4722q6842K5313L531j3873k2617K8918q794
4088G49483M786O4072L7977R5975L6766l870K4042m9948K7376j2416l9254M7663
4076I82652k2971k4271j937J699J6293p5214O8958J4499k8218P7104Q653J12623
4064A129870Q8962j02486O6272J14713N8634J4135j50986j33687J34514O8379
4054A288320O4826R5150J8496J25617R2504l173M0449L9831R1820k4192j17802
$$ plain form
4134 1184425 1191946 1112962 1168049 1149113 1148993 1184153 1170843 1160080 1110475 1156158 1106596 1097366
4122 1097366 1121204 1129858 1110175 1163462 1277802 1214912 1188256 1207937 1181039 1300366 1378305
4111 1378305 1363459 1347026 1245992 1113848 1047557 956846 940404 966785 916328 868423 843209
4100 843209 865676 902585 905005 809125 823847 737005 762318 765849 751976 729359 758277 749483
4088 749483 754269 818341 856318 952293 989059 985189 1009231 959283 986659 974243 934989 982652
4076 982652 959681 935410 933473 935172 951465 876251 945209 959708 931490 1008594 1017247 1129870
4064 1129870 1218832 1116346 1182618 1297331 1355965 1370100 1219114 1085427 1219941 1288320
4054 1288320 1353146 1448296 1466792 1592409 1684913 1681740 1722189 1762020 1853840 1829648 1711846
4043A711846K0530l4060l9016q4287p8343p407R9512j16967r803j9260j6802N141
4031A431084P96R877r8896m527J06086J02390L1287R8504j28445k1690J09621
4020A636087J5633j64989o1112N3441N1192M6722n8617M8637M3795R248m4577
4009A575460J27191m2612J4020R419q4834O1714N4962J740j7373J2856l7155Q7307
3997A762695n16N7541L5130K6189j02634n396k3206j63537K8060N746r7086M0219
3985A563205j2356M4087O0961o0966Q2415P697K8296m1311m1688J07458M6519
3974A784317J8010N7876q4613m2033L3443l4801q8989P6431j4631n3192k0842
3963A630976k0958J56123R687m1451n897J4467L7888n8410J09506J4618O1534
$$ plain form
4043 1711846 1732376 1698316 1659300 1575013 1496670 1489263 1588775 1471808 1462005 1442745 1425943 1431084
4031 1431084 1431880 1441757 1342861 1338334 1444420 1546810 1578097 1676601 1548156 1526466 1636087
4020 1636087 1651720 1486731 1425619 1479060 1530252 1576974 1518357 1566994 1610789 1620037 1575460
4009 1575460 1702651 1660039 1674059 1683478 1598644 1660358 1715320 1717060 1699687 1712543 1675388 1762695
3997 1762695 1762179 1819720 1854850 1881039 1778405 1773009 1749803 1586266 1614326 1620072 1522986 1563205
3985 1563205 1550849 1594936 1655897 1594931 1677346 1685043 1713339 1672028 1630340 1737798 1784317
3974 1784317 1802327 1860203 1775590 1733557 1767000 1732199 1643210 1719641 1705010 1651818 1630976
3963 1630976 1610018 1766141 1775828 1734377 1728480 1742947 1780835 1722425 1831931 1846549 1908083
3952A908083o0019L1422N5277n9264M2943O1521j1849j5624M7333n794J2429J40869
3940B147327M5025q6368o9834L5875K5925J328O6156J1094M0892L438K426k7601
3928B195683l7Q8405K4407J5308L9471P0865R6739Q8207m721O0696L3910J24995
3916B833928M4882J0390K1224l3N2339p125L9316j01209R1468l1988k6437N7487
3904B984242o6363n8824Q3941q5396j5938Q0403N5745J27253j3873K4608N0925
3893C166723j1858J65321J35953J4863R1272R0463N5764o7456J2675R8448P6983
3882C829151N1402J76770M9026Q2836R1038M1407M8397Q2724Q1487J4601J84741
3871D733580N8838R5734k8633R0249K11386L0218M6550J48667J91475P2845J7029
$$ plain form
3952 1908083 1848064 1879486 1934763 1875499 1918442 1979963 1968114 1952490 1999823 1994029 2006458 2147327
3940 2147327 2192352 2105984 2036150 2072025 2097950 2099278 2165434 2176528 2217420 2220858 2223284 2195683
3928 2195683 2195646 2284051 2308458 2323766 2363237 2434102 2530841 2619048 2614327 2675023 2708933 2833928
3916 2833928 2878810 2889200 2910424 2910391 2962730 2955605 2994921 2893712 2985180 2953192 2926755 2984242
3904 2984242 2917879 2859055 2942996 2857600 2841662 2922065 2977810 3105063 3091190 3115798 3166723
3893 3166723 3154865 3320186 3456139 3471002 3562274 3652737 3708501 3641045 3653720 3752168 3829151
3882 3829151 3880553 4057323 4106349 4189185 4280223 4321630 4370027 4452751 4534238 4548839 4733580
3871 4733580 4792418 4888152 4859519 4949768 5161154 5191372 5237922 5386589 5578064 5650909 5667938
3860E667938J49486J17184P0348J10162M3791K3052R6419O9451J18884J60455
3850F627170J94346J16327O7490Q4885O5572J37770J21036O5129J11743Q7528
3840G678996J51637J18850K31732K35923J11016J20999K27168K61709L07968K30934
3830I676932K57252K70111K70106K30343J45904J97939K25797K65516K15080K67606
3820A2022586K19765L02924L84342M79623N47753N41212N11891N50750N18616
3811A6079462M35476M90257N65585M95339M99061N56896O86387O61554P13048
3802B1183065J018614J072033J323833J512388J695973K006988K006970K374392
3794C4194256K665752K967221L538249M423761N535560O901432Q737552J0380221
$$ plain form
3860 5667938 5817424 5934608 6004956 6115118 6158909 6181961 6278380 6347831 6466715 6627170
3850 6627170 6821516 6937843 7005333 7090218 7155790 7293560 7414596 7479725 7591468 7678996
3840 7678996 7830633 7949483 8181215 8417138 8528154 8649153 8876321 9138030 9445998 9676932
3830 9676932 9934184 10204295 10474401 10704744 10850648 11048587 11274384 11539900 11754980 12022586
3820 12022586 12242351 12545275 12929617 13409240 13956993 14498205 15010096 15560846 16079462
3811 16079462 16514938 17005195 17570780 18066119 18565180 19122076 19808463 20470017 21183065
3802 21183065 22201679 23273712 24597545 26109933 27805906 29812894 31819864 34194256
3794 34194256 36860008 39827229 43365478 47789239 53324799 60226231 68963783 79344004
3786G9344004J1573357J2250797J1044958P283590O71172o506515j2726790j5510472
3778H7424101j4400721j1237604p555806n190201l765751k821543k231456j807115
3770C8413904j542537j162956q46248p48147m15210k77921m7296m6025M26o019
3760C3321971p880J35090J62444K14419L32878M05014M48042N83557O71037O65533
3750C6932105Q27781Q34581R27239R70562R52710R79165R10141R39836R18698
3741D5192818Q80873Q48148R49321J054042J120209J360992J441449J835893K340004
3732E7023749K622500K972276L381224L672381L957140M248895M676795N251963
3724H7806923N776687O782476Q199744R728304J1071804J2303721J3274570J3030618
$$ plain form
3786 79344004 90917361 103168158 114213116 121496706 122167878 115661363 102934573 87424101
3778 87424101 73023380 61785776 54229970 49039769 45274018 42452475 40221019 38413904
3770 38413904 36871367 35708411 34862163 34114016 33698806 33420885 33373589 33327564 33327990 33321971
3760 33321971 33314091 33449181 33611625 33826044 34158922 34563936 35011978 35595535 36266572 36932105
3750 36932105 37759886 38594467 39521706 40492268 41444978 42424143 43334284 44274120 45192818
3741 45192818 46073691 46921839 47871160 48925202 50045411 51406403 52847852 54683745 57023749
3732 57023749 59646249 62618525 65999749 69672130 73629270 77878165 82554960 87806923
3724 87806923 93583610 100366086 108565830 118294134 129365938 141669659 154944229 167974847
3716A67974847J0273845M172315k119113n950832r209272j1980926j1608350q304634
3708A33247880m908026k674903j339339m82721Q6796N26249P94841Q41193R97325
3699A27089295Q98843P66556N75691L74775J96316L46751M77478N93865L53440
3690A31673010Q2321l15938j160590k042387l113575m138033m929761n404410
3682A10650637n701453n337778m760688l833395k837256j890963q32743l1225
3674H5425136N02291J017203J023002O65921n08202k042996l714306m868067n551937
3665G1948045n434436m850749m254796l548994l060329k640873k182022j903517
3657D4072329j610614j427098j262693j118664p60801o00925n60702l58666m30230
$$ plain form
3716 167974847 178248692 182421007 180301894 174351062 165141790 153160864 141552514 133247880
3708 133247880 128339854 125664951 124325612 123842891 123929687 124455936 125250777 126091970 127089295
3699 127089295 127988138 128754694 129330385 129705160 129901476 130248227 130725705 131319570 131673010
3690 131673010 131755331 131439393 130278803 128236416 125122841 120984808 116055047 110650637
3682 110650637 104949184 99611406 94850718 91017323 88180067 86289104 85456361 85425136
3674 85425136 85927427 86944630 87967632 88633553 88125351 86082355 82368049 77499982 71948045
3665 71948045 66513609 61662860 57408064 53859070 50798741 48157868 45975846 44072329
3657 44072329 42461715 41034617 39771924 38653260 37892459 37291534 36730832 36372166 35941936
3648C5941936l55174k88762l71517p22487q59563r82944j105484j095845j115044
3639B9045116j051611r05651q57461q15952p11513n36325n96555m98378n14220
3630B2557450m32044m30096n35782o11393p17717o95994p06800o84409o98439
3621A7044776p42105m90435m52751m66668m14510l97409k13164k44728j78745
3612A3444261k06433j65133j16473j81170j50283k21915j30392j36809l18954
3603A1816699k33837k91835l46708k37235k67838l16356l31980j77533k34148
3594I379229j48971k48195k16105j15102j95174k68546r8056l7836k4223j36073
3584G890948k12032o4366J2343r2383n8709j25642m9839p6572k2316l3182k07689
$$ plain form
3648 35941936 35586762 35298000 34926483 34203996 33344433 32361489 31256005 30160160 29045116
3639 29045116 27993505 27087854 26230393 25414441 24702928 24166603 23570048 23071670 22557450
3630 22557450 22125406 21695310 21159528 20548135 19830418 19134424 18427624 17743215 17044776
3621 17044776 16302671 15812236 15359485 14892817 14478307 14080898 13867734 13623006 13444261
3612 13444261 13237828 13072695 12956222 12775052 12624769 12402854 12272462 12135653 11816699
3603 11816699 11582862 11291027 10944319 10707084 10439246 10122890 9790910 9613377 9379229
3594 9379229 9230258 8982063 8765958 8650856 8455682 8187136 8089080 8051244 8027021 7890948
3584 7890948 7678916 7614550 7626893 7534510 7475801 7350159 7300320 7223748 7201432 7168250 6960561
3573F960561m8731O7168K0890j05472j30870j18361o5998o4931p724m3223p2548
3562F390761l3226R359j27556P6723o9048k4844L5572j31134M1375L8738j25903
3551F080817M1219R346L3391R7416L8113k4128n4432l8477L5129l087J31487J37506
3539F484300j3748p6178o4557J09070n1308o3256j1150j4716m2524j4382q3376
3528F158175l554N5397O3805n3811o4032l859J85431J30859J7761R9257l4435
3517F550994J49012K04416k0061K2484O3240L2819J39856J03802J63400Q5332
3507G495294j4152Q0914J23917l4639J00053J24975J21899J37043M2263L997Q7064
3496H268628J03267P5922J10843R2693Q3818J61197M9068O6730J61698M7033N2293
$$ plain form
3573 6960561 6911830 6978998 6999888 6894416 6763546 6645185 6579187 6514256 6506532 6463309 6390761
3562 6390761 6357535 6366894 6239338 6316061 6247013 6222169 6257741 6126607 6167982 6206720 6080817
3551 6080817 6122036 6131382 6164773 6262189 6300302 6276174 6221742 6183265 6218394 6215307 6346794 6484300
3539 6484300 6470552 6394374 6329817 6438887 6387579 6324323 6313173 6298457 6255933 6241551 6158175
3528 6158175 6154621 6210018 6273823 6220012 6155980 6152121 6337552 6468411 6486172 6585429 6550994
3517 6550994 6700006 6904422 6884361 6906845 6970085 7002904 7142760 7246562 7409962 7495294
3507 7495294 7481142 7562056 7685973 7651334 7751387 7876362 7998261 8135304 8177567 8181564 8268628
3496 8268628 8371895 8447817 8558660 8651353 8735171 8896368 8945436 9012166 9173864 9220897 9273190
3485I273190J32934J91579J42977J53558J47140J54420K05036K30241J36671K23260
3475A0991006K03296J43265K32712K38255J72504K00030K40666J02840K78699
3466A2803273L39443L26485L05389K84117L02207L12260L53867M01083M53536
3457A5881660L67198L47785N12505N00532N26521N93204N81198O34544N90794
3448B0535941O96231Q20249P49620O32668Q18480R98859R31812J120281J219258
3439B8523399J152524J286370J326112J239759J284825J414179J525599J524203
3431C9276970J706763J998452K215009K606669K960744L526418L812106M419887
3423F2523018M791642N160022N787902O476490P355899Q396658R761816J1794261
$$ plain form
3485 9273190 9406124 9597703 9740680 9894238 10041378 10195798 10400834 10631075 10767746 10991006
3475 10991006 11194302 11337567 11570279 11808534 11981038 12181068 12421734 12524574 12803273
3466 12803273 13142716 13469201 13774590 14058707 14360914 14673174 15027041 15428124 15881660
3457 15881660 16248858 16596643 17109148 17609680 18136201 18729405 19310603 19945147 20535941
3448 20535941 21232172 22052421 22802041 23434709 24253189 25252048 26183860 27304141 28523399
3439 28523399 29675923 30962293 32288405 33528164 34812989 36227168 37752767 39276970
3431 39276970 40983733 42982185 45197194 47803863 50764607 54291025 58103131 62523018
3423 62523018 67314660 72474682 78262584 84739074 92094973 100491631 110253447 122047708
3415A22047708J4245211J6640677J8874220K0284164K0337596J8510042J3692427
3408B44632045M996106p163799j9082550k5614743k5810246k2402876j8294804
3401A31259133j4504367j1437326r272864p830384o588592n611961m805584m273536
3393F6934519l779226l223916k846507k519505k107376j976840j774314j530700
3385D7176135j386890j305452j269311r84208p68589p20560o23728n58040m41050
3376C9118307l91567m53251m68846j74078o4242j15304P5580O3804J73755K14535
3366C7978693L88384N81028N73911P30694R28487J182514J266021J642862J989875
3357D7262469K218515K636185L006618L246407L219738K983231K295560J407023
$$ plain form
3415 122047708 136292919 152933596 171807816 192091980 212429576 230939618 244632045
3408 244632045 249628151 242464352 223381802 197767059 171956813 149553937 131259133
3401 131259133 116754766 105317440 96044576 88214192 81625600 76013639 71208055 66934519
3393 66934519 63155293 59931377 57084870 54565365 52457989 50481149 48706835 47176135
3385 47176135 45789245 44483793 43214482 42230274 41461685 40741125 40117397 39559357 39118307
3376 39118307 38726740 38273489 37804643 37630565 37566323 37451019 37526599 37590403 37764158 37978693
3366 37978693 38367077 38948105 39522016 40252710 41181197 42363711 43629732 45272594 47262469
3357 47262469 49480984 52117169 55123787 58370194 61589932 64573163 66868723 68275746
3349F8275746L07401r37904j772786k319346k205940j742222j472589j001771
3341E7130589n05069j12729J53935O01170P91583J130526J424796J713267J957257
3332F4285325K126061K403101K795453L131365L572738M163057M956535N772032
3324I3205667O851307P996133R059133R772026J0036210R670311Q500312O387106
3316A61478205L852201J918706J924649L698904O494187J0284352J3854600J6625152
3308B20130956J8115633J7266246J3221305P056462n2227p735742j5198071k0679321
3300B32125241k3297324k3642911k1678725j7858366j3883771j0553377p987902
3293A13222865o132471m736567l559890k712772k060870j677748j437087j672054
$$ plain form
3349 68275746 68583147 67645243 65872457 63553111 61347171 59604949 58132360 57130589
3341 57130589 56625520 56512791 56666726 57267896 58059479 59190005 60614801 62328068 64285325
3332 64285325 66411386 68814487 71609940 74741305 78314043 82477100 87433635 93205667
3324 93205667 100056974 108053107 117112240 126884266 136920476 146590787 155091099 161478205
3316 161478205 165330406 167249112 169173761 172872665 179366852 189651204 203505804 220130956
3308 220130956 238246589 255512835 268734140 275790602 275738375 268002633 252804562 232125241
3300 232125241 208827917 185185006 163506281 145647915 131764144 121210767 113222865
3293 113222865 107090394 102353827 98793937 96081165 94020295 92342547 90905460 89233406
3285H9233406k184326k971323m003639m852896n031601n054923m671076m241834
3277E6221788l626835l102835k762990k272779k156217j985014j746185j656598
3269C6912335j389731j383243j317969j231518j177765j112181j073842q51572
3261B7374514p88110q07054p41737o90235o28238o70032n67529l71018n44342
3252B1566219m93566m70093n26546m32669m94421m01275m69311m89446l74318
3243A7414574l02545l38530k51659l32004l49787j58171k37893j33486j29489
3234A5181010j55508j66172r2073j07566p9428j46847k44656l72272l93636j44561
3224A3278291k98915l02767l68294l70773k55003l04422k98111k38974j38603
$$ plain form
3285 89233406 87049080 84077757 80074118 75221222 70189621 65134698 60463622 56221788
3277 56221788 52594953 49492118 46729128 44456349 42300132 40315118 38568933 36912335
3269 36912335 35522604 34139361 32821392 31589874 30412109 29299928 28226086 27374514
3261 27374514 26586404 25779350 25037613 24347378 23719140 23049108 22481579 22110561 21566219
3252 21566219 21072653 20602560 20076014 19643345 19148924 18747649 18278338 17788892 17414574
3243 17414574 17112029 16773499 16521840 16189836 15840049 15681878 15443985 15310499 15181010
3234 15181010 15025502 14859330 14767257 14659691 14580263 14433416 14188760 13816488 13422852 13278291
3224 13278291 12979376 12676609 12308315 11937542 11682539 11378117 11080006 10841032 10702429
3215A0702429k03970j88087j59425k18758k99635r5570j88938j39339j49499n0489
3205I008719o6997j56565o9904j92399j25787n5248m6068n7110N6158k2304r6303
3194H176192l9238j25827q9513k03038q7850r1135j81510p7706j24350j26123
3184G029902j14797r9181n3053j4149p2036j25589r628q0277o7221k7671j16656
3173F249644l1641L1005m4838m985J6448M9499O2337P4600O4630L1341M6565p554
3161F537051J42927j7135o9179n7721n6548R2408p8510N61k7198n0949J4068o6712
3149F363063J1724L4382M2142l3420n1216n0693K0727J00750O8405n090r2757
3138F408017k1524L4790O6050J07641J24534N9495O3762Q75o0212Q7954K19225
$$ plain form
3215 10702429 10498459 10310372 10150947 9932189 9632554 9536984 9348046 9208707 9059208 9008719
3205 9008719 8941722 8785157 8715253 8522854 8397067 8341819 8295751 8238641 8294799 8272495 8176192
3194 8176192 8136954 8011127 7921614 7718576 7630726 7539591 7358081 7280375 7156025 7029902
3184 7029902 6915105 6815924 6762871 6748722 6676686 6551097 6541469 6461192 6393971 6366300 6249644
3173 6249644 6218003 6249008 6204170 6199185 6215633 6265132 6327469 6402069 6466699 6498040 6544605 6537051
3161 6537051 6679978 6662843 6593664 6535943 6479395 6571803 6493293 6493854 6466656 6415707 6429775 6363063
3149 6363063 6374787 6409169 6451311 6417891 6366675 6315982 6336709 6437459 6505864 6500774 6408017
3138 6408017 6386493 6421283 6487333 6594974 6719508 6779003 6842765 6843640 6783428 6871382 7090607
3127G090607K29879N1793K15428J81746R8489K12654K51254K60933L01971L60320
3117I255074M60069N90141N88135O36679P04405Q44410O97843K76795l01784r61382
3107A2790385j255075j124875q76439n64912m36347k15350k20545j07250R000
3098G998592j5479K8912j7314l2751J7462R755J73558J19317R087K4528o9063
3087H246604p6348j06974k09971j90469k64367l14632q6498j9977j13995q5548
3077F777825p6485p3060m7476j5770P3858j4403o4285o7961Q2848q5318n6019
3066F433754L6103N8035o4833k8488J12891j3473l1956O6736N480l5581J37936
3055F676604N6212p3788l4309J0899J23493j0971R414R9438L25180K95955K11055
$$ plain form
3127 7090607 7320486 7372279 7587707 7769453 7867942 8080596 8331850 8592783 8894754 9255074
3117 9255074 9715143 10305284 10893419 11530098 12234503 13078913 13776756 14053551 13751767 12790385
3107 12790385 11535310 10410435 9533996 8969084 8532737 8317387 8096842 7989592 7998592
3098 7998592 7983113 8012025 7994711 7961960 7979422 7989177 8162735 8282052 8291139 8315667 8246604
3087 8246604 8170256 8063282 7853311 7662842 7398475 7083843 6997345 6977368 6863373 6777825
3077 6777825 6701340 6628280 6580804 6565034 6638892 6624489 6560204 6492243 6575091 6489773 6433754
3066 6433754 6469857 6527892 6463059 6434571 6547462 6533989 6502033 6568769 6574249 6538668 6676604
3055 6676604 6732816 6659028 6624719 6635618 6759111 6748140 6757554 6856992 7182172 7478127 7689182
3044G689182K71498L51733K56881L39940K27137J23122j82820m20425j67698o6441
3034H422109j42032j9086p5134J896O8567j4426J0638l7283R7651M4231P8297
3023H435428Q6919M8399j9799J68693Q8742J37629J06883K0926R4050L9652J06596
3012I314118J00403J25270J32072Q5811J21461K67119K48452J83789J68954K49682
3002A0997131K32179J10514J92108J55374J66153K44796M3084N7066R2404J06326
2992A2397135K27794J15572J96443J64026K96998K59213K43049K96198J79300
2983A4375728K31325L18089L68242L83852L78388L67201L37534L28304L73298
2974A7461961M84699L21629L25723M80721L88507K83563M17237L84874M10105
$$ plain form
3044 7689182 7960680 8312413 8569294 8909234 9136371 9259493 9076673 8656248 8488550 8422109
3034 8422109 8280077 8260991 8185857 8187753 8256320 8241894 8252532 8215249 8312900 8357131 8435428
3023 8435428 8522347 8570746 8550947 8719640 8808382 8946011 9052894 9073820 9167870 9207522 9314118
3012 9314118 9414521 9539791 9671863 9757674 9879135 10146254 10394706 10578495 10747449 10997131
3002 10997131 11229310 11339824 11531932 11687306 11853459 12098255 12141339 12198405 12290809 12397135
2992 12397135 12624929 12740501 12936944 13100970 13397968 13657181 13900230 14196428 14375728
2983 14375728 14607053 14925142 15293384 15677236 16055624 16422825 16760359 17088663 17461961
2974 17461961 17946660 18268289 18594012 19074733 19463240 19746803 20164040 20548914 20959019
2965B0959019M52248M62583L73549M39672M71998M86624M61635N94186N96195
2956B5297709O12744O99672O97003O92861P00531P00710O22178O97821P56361
2947C1477590J034072J048419Q90285J071311J228500J126842J333286J421447
2939D0631752J509536J532073J657688J824022J735596J998390K177981K253128
2931E5320166K334680K495012K459156K581529K656719K636112K667227K619114
2923G5769715K475547K385767K343128K180975K030019J996609J844534J816090
2915I2842384J894130J829650J721355J549822J556157J315412J219634J179094
2907A05107638J101408J000110Q94768Q10786Q28826P26117N38332K87211J47564
$$ plain form
2965 20959019 21411267 21873850 22247399 22687071 23159069 23645693 24107328 24701514 25297709
2956 25297709 25910453 26610125 27307128 27999989 28700520 29401230 30023408 30721229 31477590
2947 31477590 32511662 33560081 34450366 35521677 36750177 37877019 39210305 40631752
2939 40631752 42141288 43673361 45331049 47155071 48890667 50889057 53067038 55320166
2931 55320166 57654846 60149858 62609014 65190543 67847262 70483374 73150601 75769715
2923 75769715 78245262 80631029 82974157 85155132 87185151 89181760 91026294 92842384
2915 92842384 94736514 96566164 98287519 99837341 101393498 102708910 103928544 105107638
2907 105107638 106209046 107209156 108103924 108914710 109743536 110469653 111007985 111295196 111442760
2898A11442760O4232j82276m45708o69250p51999q52794q43541r09819r65812
2889A05885793r77385j090166j189332j297233j426993j691168j773204k054443
2881I4385869k065769k098428k122338k172779k126340j952008j868109j859497
2873G8120601j819651j924799j885394j892790j988066k080799k196137k224572
2865F2108393k164397k186607k100574k115508j947302j882469j696320j704562
2857D6310654j580350j498658j590888j286716j500702j430273j358100j327585
2849C4737382j278399j229732j152352j028771r94448j045034r04702p43529o40241
2840B5720174o01812n00404m64096n39273m37524l13634m05084l59691k35143
$$ plain form
2898 111442760 111506992 111324716 110879008 110209758 109457759 108604965 107761424 106851605 105885793
2889 105885793 104908408 103818242 102628910 101331677 99904684 98213516 96440312 94385869
2881 94385869 92320100 90221672 88099334 85926555 83800215 81848207 79980098 78120601
2873 78120601 76300950 74376151 72490757 70597967 68609901 66529102 64332965 62108393
2865 62108393 59943996 57757389 55656815 53541307 51594005 49711536 48015216 46310654
2857 46310654 44730304 43231646 41640758 40354042 38853340 37423067 36064967 34737382
2849 34737382 33458983 32229251 31076899 30048128 29053680 28008646 27103944 26360415 25720174
2840 25720174 25118362 24617958 24153862 23614589 23177065 22863431 22458347 22098656 21863513
2831B1863513l06876k07609k32620j88380k50663j67762j08880k68136j55814
2822A9976773K3747j48005j13670j55481r5325q9393j70028j34839j169m2698
2812A9049912J2777r8972j10046n8305p7404N5754N4969p3685R3592J44008j4679
2801A8977921J68521P9774M4871N0743N9482J27243J19736K46418P0211J13350
2791B0058270K40050K59006J30665K55064K88219J94351J98221K65494L40024
2782B2229364K81799L45474K52936L85106K83604M16220L38184M61606M96718
2773B5491011M17633N11567M86358N78760N64225N31097O28972P57425Q23064
2764C0790112R14776J011238Q84309R79079J136781J271777J382084J449927J372685
$$ plain form
2831 21863513 21556637 21349028 21116408 20928028 20677365 20509603 20400723 20132587 19976773
2822 19976773 20000520 19852515 19738845 19583364 19488039 19398646 19228618 19093779 19092610 19049912
2812 19049912 19062689 18963717 18853671 18795366 18717962 18773716 18828685 18755000 18848592 18992600 18977921
2801 18977921 19146442 19226216 19271087 19321830 19381312 19508555 19628291 19874709 19944920 20058270
2791 20058270 20298320 20557326 20687991 20943055 21231274 21425625 21623846 21889340 22229364
2782 22229364 22511163 22856637 23109573 23494679 23778283 24194503 24532687 24994293 25491011
2773 25491011 25908644 26420211 26906569 27485329 28049554 28580651 29209623 29967048 30790112
2764 30790112 31704888 32716126 33600435 34579514 35716295 36988072 38370156 39820083 41192768
2755D1192768J588456J650402J784885J832187J982400K260575K410268K607677
2747E7309618K969782L233554L650865M160821M385388N045979N622604O278022
2739I2656633O954478P692885Q649473R649502J0752789J2338037J3758058J5133563
2731A77585418J6355134J7181132J7352581J6550661J4660296J1764460Q039744
2724B79489426M200429Q94816j550540l106894l620916l489315k818219j988157
2716B68010630j399773q02982o36760r53972k017768l565785n640168q403560
2708B44589862j1103090j3634635j5304422j6124720j6054871j5083906j3729107
2701A43555111j2194976j0654512r384413q148400p180050o456117n725420n001489
$$ plain form
2755 41192768 42781224 44431626 46216511 48048698 50031098 52291673 54701941 57309618
2747 57309618 60279400 63512954 67163819 71324640 75710028 80756007 86378611 92656633
2739 92656633 99611111 107303996 115953469 125602971 136355760 148693797 162451855 177585418
2731 177585418 193940552 211121684 228474265 245024926 259685222 271449682 279489426
2724 279489426 283689855 284584671 283034131 279927237 276306321 272817006 269998787 268010630
2716 268010630 266610857 265807875 265171115 264217143 262199375 258633590 252993422 244589862
2708 244589862 233486772 219852137 204547715 188422995 172368124 157284218 143555111
2701 143555111 131360135 120705623 111321210 103172810 95992760 89536643 83811223 78809734
2693G8809734m559094m109606l732803l235469l078686k856000k435611k407735
2685E2394730k145437j877442j972923j792643j512747j536160j270688j255274
2677C9031416j185232j106512r86304q70452q58062r97003p30879o88358o63725
2668C0944889o67010n74990o08022m77108n73991n82506m57275n35413m01648
2659B6066926l97963m12451l04633k97030k33261l59929k44427k94403l43221
2650B3179608l10666k45452j25965j57631l09286k79169p2440j58452j33245j60223
2640B1227079k59662k26197l1685j55068j67482p3127m7811k7166n8427r5552
2630B0084902o2746o1289M5156L0828o180r598J07350J58705J12882M9902J77111
$$ plain form
2693 78809734 74250640 70141034 66408231 63172762 60094076 57238076 54802465 52394730
2685 52394730 50249293 48371851 46398928 44606285 43093538 41557378 40286690 39031416
2677 39031416 37846184 36739672 35753368 34882916 34024854 33027851 32296972 31608614 30944889
2668 30944889 30277879 29702889 29094867 28617759 28043768 27461262 27003987 26468574 26066926
2659 26066926 25668963 25256512 24951879 24654849 24421588 24061659 23817232 23522829 23179608
2650 23179608 22868942 22623490 22497525 22339894 22030608 21751439 21678999 21520547 21387302 21227079
2640 21227079 20967417 20741220 20709535 20554467 20386985 20313858 20266047 20238881 20180454 20084902
2630 20084902 20022156 19960867 20006023 20036851 20030671 20021073 20128423 20287128 20400010 20449912 20627023
2619B0627023J49945K67837K82176K04554K51030L54404M04157M86535M68062
2610B3495723M89615M41194M86125P44266P19055P19959Q44346R32316R43488
2601B9816087R48890Q94878P91541Q35750Q13721R44682P76079Q00089J127781
2592C7749498J066716J078986J280715J145870J108006J099194J055228J034148
2584D6618361Q15381P63817N43797N16431M60923M07348M67129O58863O67538
2575E1919588O58166P88095Q13011P30800P77902O50968N80033N46000M62378
2566E7926941M79476M71894M34263O56984O94856Q99883J191549J157617J465193
2557F5378656J457265J629028J990337K200242K431412K740645L049925L511206
$$ plain form
2619 20627023 20776968 21044805 21326981 21531535 21782565 22136969 22541126 23027661 23495723
2610 23495723 23985338 24426532 24912657 25656923 26375978 27095937 27940283 28872599 29816087
2601 29816087 30764977 31659855 32451396 33287146 34100867 35045549 35821628 36621717 37749498
2592 37749498 38816214 39895200 41175915 42321785 43429791 44528985 45584213 46618361
2584 46618361 47433742 48197559 48741356 49257787 49718710 50126058 50593187 51252050 51919588
2575 51919588 52577754 53365849 54178860 54909660 55687562 56338530 56918563 57464563 57926941
2566 57926941 58406417 58878311 59312574 59969558 60664414 61564297 62755846 63913463 65378656
2557 65378656 66835921 68464949 70455286 72655528 75086940 77827585 80877510 84388716
2549H4388716L939900M215837M883440N453690O214840P043629P876397Q795352
2541A32811801R537099R955247J0271596J0118741R284941P951576O359219M838531
2533B01128751L581986L124929L162844L920217N081685O106227O972632P548931
2525B40628202P687536P159459N802111L760186J188468j548408m114910o533158
2517B54029486q211100r157588r274636q978527q258150p272472o469790n588895
2509A90818328n138987n084301n313243n849553o678036p654366q656412r396498
2501A37046932r820197r609832r106636q259746p380942o510134n829516n168584
2493G5361345m527245m164103l746223l417436k912059k675440k620011k306733
$$ plain form
2549 84388716 88328616 92544453 97427893 102881583 109096423 116140052 124016449 132811801
2541 132811801 142348900 152304147 162575743 172694484 181979425 189931001 196290220 201128751
2533 201128751 204710737 207835666 210998510 214918727 220000412 226106639 233079271 240628202
2525 240628202 248315738 255475197 261277308 265037494 266225962 264677554 260562644 254029486
2517 254029486 245818386 236660798 227386162 218407635 210149485 202877013 196407223 190818328
2509 190818328 185679341 180595040 175281797 169432244 162754208 155099842 146443430 137046932
2501 137046932 127226735 117616903 108510267 100250521 92869579 86359445 80529929 75361345
2493 75361345 70834100 66669997 62923774 59506338 56594279 53918839 51298828 48992095
2485D8992095k118483j937126j723439j596857j599991j474502j376085j260962
2477C5904650j094843j072539j093827j043786r82449q47850r33275o81206o72995
2468B7481880p24665o50779o52841n30216o13668n00995o17473m53142m89263
2459B2248838n36851l85702n48491n16331n34971l68428k89892m25941m63076
2450A8179155l22152k47999k69434m35153m17821l06208m22850k88009k69351
2441A5200178k88000m25315k85437l71800k68807k86335l11888k47118j59955
2432A2555523l15216j59698l03369k83415j53717k15209j87163j46577k96665
2423A0494494q2837j15512j26970r4759j86322r2830k5573m8294j54654k09458
$$ plain form
2485 48992095 46873612 44936486 43213047 41616190 40016199 38541697 37165612 35904650
2477 35904650 34809807 33737268 32643441 31599655 30617206 29769356 28836081 28154875 27481880
2468 27481880 26757215 26106436 25453595 24923379 24309711 23808716 23191243 22738101 22248838
2459 22248838 21711987 21326285 20777794 20261463 19726492 19358064 19068172 18642231 18179155
2450 18179155 17857003 17609004 17339570 16904417 16486596 16180388 15757538 15469529 15200178
2441 15200178 14912178 14486863 14201426 13829626 13560819 13274484 12962596 12715478 12555523
2432 12555523 12240307 12080609 11777240 11493825 11340108 11124899 10937736 10791159 10494494
2423 10494494 10411657 10296145 10169175 10074416 9888094 9795264 9769691 9721397 9566743 9357285
2413I357285j66143j8820j98094j10791j12815j34991r5728j49906q4833n1814
2403H233350k53669j78556r5363m2975j71696j38436j31335j09921r5443j84577
2393F831379j78367j73571j37030r1873j59280m6317k38430j13740l1850r2858
2383E568063m2037k27830j74313Q548m3145j00460q939j0627p8524j12061q6291
2372D692384J1990j08843p131j64098j58119Q0030r4030l7992l2595j88694N6414
2361D049316n7035j45016j17416P9055P7063K2704q9272p8726J2513r9280K1802
2350C675708k0550K91o1527o4730j51019j6013l5717k3623K3070l6993l1334j16473
2338C141090L8269k0527k4288q0674Q4688q5080o8461Q1649j68020m287j8153
$$ plain form
2413 9357285 9191142 9172322 8974228 8863437 8750622 8615631 8519903 8369997 8285164 8233350
2403 8233350 7979681 7801125 7705762 7662787 7491091 7352655 7221320 7111399 7015956 6831379
2393 6831379 6653012 6479441 6342411 6250538 6091258 6044941 5806511 5692771 5660921 5568063
2383 5568063 5526026 5298196 5123883 5132431 5089286 4988826 4979887 4969260 4890736 4778675 4692384
2372 4692384 4704374 4595531 4588400 4424302 4266183 4346213 4252183 4214191 4181596 3992902 4049316
2361 4049316 3992281 3847265 3729849 3808904 3885967 3908671 3819399 3740673 3753186 3653906 3675708
2350 3675708 3655158 3655449 3593922 3529192 3378173 3362160 3326443 3302820 3325890 3288897 3257563 3141090
2338 3141090 3179359 3158832 3134544 3053870 3138558 3053478 2985017 3066666 2898646 2894359 2876206
2327B876206r1229j3565j3930q3184M7721K6652p2780j03224q4413O4361L7485
2316B590100o583m955l7644N367q7764j8383r234J2961Q5675j16815m4533P2070
2304B440262o5123n9587j3392N4505L9532p5779R774J3182m5766j27998O8457
2293B238067L2822j6676Q1980r1542n4763j6631J0747l8235R5665m9139j32413
2282B059882Q6408J7141J03516j7082l3134K0560o2563M3152P735m8343r2384
2271B084888K1148o3972o5612L905J25069j8227o4721L1271P0231L5509O140q4168
2259B081461j49L1110J00489k7549j72743J21805J00168k8596O4126j964J16205
2248B384363O9380r5670j13346O1246n6771P1556l8724O3948N8645r0918R5838
$$ plain form
2327 2876206 2784977 2771412 2757482 2674298 2722019 2748671 2675891 2572667 2488254 2552615 2590100
2316 2590100 2583517 2578562 2540918 2546285 2458521 2440138 2430904 2443865 2529540 2412725 2368192 2440262
2304 2440262 2375139 2315552 2302160 2356665 2396197 2320418 2330192 2343374 2297608 2169610 2238067
2293 2238067 2270889 2254213 2336193 2244651 2189888 2173257 2184004 2145769 2241434 2192295 2059882
2282 2059882 2146290 2163431 2266947 2249865 2216731 2237291 2174728 2217880 2225615 2177272 2084888
2271 2084888 2106036 2042064 1976452 1980357 2105426 2087199 2022478 2053749 2123980 2159489 2165629 2081461
2259 2081461 2081312 2112422 2212911 2185362 2012619 2134424 2234592 2205996 2270122 2268158 2384363
2248 2384363 2453743 2358073 2244727 2305973 2249202 2320758 2282034 2345982 2404627 2313709 2409547
2237B409547k1047j5289J89236J8036r6494K6153O0919N8867n9713N4254j9832
2226B604637K9524R1143N6896q381k6477k0904L8219J10595P347o7128J11663
2215B927134j8610k5630L1237L4130L8251k1953k5448j10082l150L600j05027
2204B724452l5514m5782L1552P636J7384p9881j2855q6164M2358Q3268l127m82
2192B642845k3593n8763l8645n2983j594k7622P1863N9936j4978P7880M8310m019
2180B678637J08116Q2126L9010n4497o8328N9993J02602K2969J5300k4136j22472
2169B839320q2451r2577m8970n0819q2562l8505k8341m9399L6919l5124o984q090
2157B352417p0102Q5888o4741j5869J011K7133J11253J78457j9461J07588R4966
$$ plain form
2237 2409547 2388500 2373211 2562447 2580483 2483989 2510142 2571061 2629928 2570215 2624469 2604637
2226 2604637 2634161 2725304 2782200 2773819 2747342 2726438 2764657 2875252 2882599 2815471 2927134
2215 2927134 2908524 2882894 2914131 2948261 2986512 2964559 2939111 2829029 2825879 2829479 2724452
2204 2724452 2688938 2643156 2674708 2682344 2699728 2619847 2606992 2520828 2563186 2646454 2643327 2642845
2192 2642845 2619252 2560489 2521844 2468861 2467267 2439645 2511508 2571444 2556466 2634346 2682656 2678637
2180 2678637 2786753 2868879 2907889 2853392 2785064 2845057 2947659 2970628 2985928 2961792 2839320
2169 2839320 2756869 2664292 2615322 2564503 2481941 2443436 2415095 2365696 2402615 2367491 2360507 2352417
2157 2352417 2282315 2368203 2303462 2287593 2288604 2315737 2426990 2605447 2585986 2693574 2788540
2146B788540J204K35073K01660J56827Q3118J02106J47828q6298l71957k84260
2136B973841l71181r2040j24282l1341K9856j31418n4949K6596k8575q6886M7386
2125B157007O8181M3552l0756l4225P034O8372J79026j5511N3641J08575J17278
2114B722174J69694K60170K82519L92372L68004L41840L90871L16756L1942m00055
2104D876287o66800n89801m57592l56043p7552j78903q9495r9215j25707j40596
2094B094583J8216N4676p7955l2721L3421J46500n0245j77651P66k6352n9150
2083A924088O2336m7370K5882J23611J56920J56686J23422K19995J84104K20432
2073C150106M6862o1417k73812k91455k90619k37940j33541j65064j24104q371
$$ plain form
2146 2788540 2789744 3024817 3226477 3383304 3466422 3568528 3716356 3630058 3258101 2973841
2136 2973841 2602660 2510620 2386338 2354997 2384853 2253435 2198486 2225082 2196507 2109621 2157007
2125 2157007 2225188 2268740 2237984 2203759 2210793 2279165 2458191 2442680 2496321 2604896 2722174
2114 2722174 2891868 3152038 3434557 3826929 4194933 4536773 4927644 5244400 5276342 4876287
2104 4876287 4209487 3619686 3162094 2806051 2728499 2549596 2460101 2360886 2235179 2094583
2094 2094583 2112799 2167475 2089520 2056799 2090220 2236720 2186475 2008824 2009590 1983238 1924088
2083 1924088 1986424 1939054 1964936 2088547 2245467 2402153 2525575 2745570 2929674 3150106
2073 3150106 3196968 3135551 2861739 2570284 2279665 2041725 1908184 1743120 1619016 1610645
2063A610645j7187j3542q198n0109P449j54752k0402K9961m2965p3007m392n631
2051A257870O0349n521J05535k9949L327q8886k5868j08172p2458P9695m4589
2040A131333k8327P8845m9093J2800r6964O7492J4180o8382k541r2019M7029O7764
2028A082117K0629p7658K6710K5898j3608M3177K0252o301n1438o8462J11014
2017A112330M7922N6792o3867L573Q2311q5349p2283L3320m2577l3332R681l7973
2005A010548O6714M8728M4952M3404r5952j1305K1921L2267R632o4583K6394O5046
1993A197766j09371M6156J3952J8616L8523J2909K9525m2931l4482N5223o8990
1982A156896J07393J6374o8762j7634K4370k5362Q1886l7050J366J36672j25895
$$ plain form
2063 1610645 1593458 1579916 1571718 1521609 1529058 1374306 1353904 1383865 1340900 1267893 1263501 1257870
2051 1257870 1318219 1312698 1418233 1388284 1391611 1302725 1276857 1168685 1096227 1175922 1131333
2040 1131333 1103006 1181851 1132758 1145558 1048594 1116086 1130266 1061884 1059343 967324 1014353 1082117
2028 1082117 1102746 1025088 1051798 1077696 1064088 1107265 1127517 1121216 1069778 1001316 1112330
2017 1112330 1160252 1217044 1153177 1156750 1239061 1153712 1081429 1114749 1072172 1038840 1048521 1010548
2005 1010548 1077262 1125990 1170942 1214346 1118394 1107089 1129010 1161277 1170909 1106326 1132720 1197766
1993 1197766 1088395 1134551 1148503 1167119 1205642 1218551 1248076 1205145 1170663 1225886 1156896
1982 1156896 1264289 1280663 1211901 1194267 1218637 1193275 1275161 1238111 1239477 1376149 1250254
1971A250254M6112J09253k5362J13013q0700k3819P880M1304K8245r2228J32645
1960A506597l0770Q7840P9462l9000l8916N2733O2243R0430R1119J6475m2336
1949A835877L6836M9989j3545J42662j325J37897P8183q8169Q9967J14622O6027
1938B449021J81859k3252J73778J43528K1631P9127J74473K38043Q2645J74030
1928C694883J76434L09016K53666K38986K42750K86935L32415K80682K32130K02108
1918F250005K07760J17252J377l9328m2249j18150r4444l3143K0338o901j86320
1907F076197J2749m8641k24574j40255j65609j49409n3273j4423O8930Q2432M6700
1896E490824J64420J96914J78156K34949L16318K82383L33165M94080M85165N62476
$$ plain form
1971 1250254 1296366 1405619 1380257 1493270 1412570 1388751 1396631 1437935 1466180 1373952 1506597
1960 1506597 1475827 1563667 1643129 1604129 1565213 1617946 1680189 1770619 1861738 1878213 1835877
1949 1835877 1872713 1922702 1909157 2051819 2050494 2188391 2266574 2178405 2268372 2382994 2449021
1938 2449021 2630880 2607628 2781406 2924934 2946565 3025692 3200165 3438208 3520853 3694883
1928 3694883 3871317 4180333 4433999 4672985 4915735 5202670 5535085 5815767 6047897 6250005
1918 6250005 6457765 6575017 6576394 6537066 6494817 6376667 6282223 6249080 6269418 6262517 6076197
1907 6076197 6088946 6040305 5815731 5675476 5509867 5360458 5307185 5292762 5361692 5444124 5490824
1896 5490824 5655244 5852158 6030314 6265263 6581581 6863964 7197129 7691209 8176374 8738850
1886H738850O26737N97545N38471P34218O77488M69596K93297J32712j6267k71042
1876A2521605n39645n48757m67226k67825k98947l10855k99122l01673m39837
1867I047718n09090o71080o67767n76037k75504l01273k44758r2683K5223r9395
1857E635354q4494N9259N4976O1412P1536J31273J80326J66818K48143L83724
1847F908327K21687K98682M38149L23707O6162K3012J8536j32495k54845j09231
1837G801691l23523l02119k61259l27695k55397j92141l41651k19285l78905l09852
1827D889864m36252l74697k41881k57385k88485j95977r7591r7028j02030j95004
1817B603534q4325o943q4974o6824m2244j30823R4176K6297j01695k00064k72
$$ plain form
1886 8738850 9365587 9963132 10501603 11235821 11913309 12382905 12676202 12808914 12792647 12521605
1876 12521605 11981960 11433203 10965977 10698152 10399205 10088350 9789228 9487555 9047718
1867 9047718 8538628 7867548 7199781 6623744 6348240 6046967 5802209 5709526 5734749 5635354
1857 5635354 5550860 5610119 5665095 5726507 5798043 5929316 6109642 6276460 6524603 6908327
1847 6908327 7130014 7428696 7866845 8190552 8256714 8279726 8298262 8165767 7910922 7801691
1837 7801691 7478168 7176049 6914790 6587095 6331698 6139557 5797906 5578621 5199716 4889864
1827 4889864 4453612 4078915 3837034 3579649 3291164 3095187 2997596 2900568 2798538 2603534
1817 2603534 2519209 2512266 2427292 2360468 2318224 2187401 2281577 2307874 2206179 2006115 2005843
1806B005843J3843j3420j78908K0214o7393j04986J7218M902q4345m7788N5276
1795A620456l0989n4066l6092M817M2146P7338j31431p7218L816k3221j8011Q569
1783A386114p1057j7450M3157n9802j06312n4738p7302Q6636q8467l5353P4358
1772A079784k5460l4609O3198L7808K5886j45034k7994L0601J0040P5497j0098
1761A079619o1494l5846n0992L4326l5219K7481k5614n3663k1645k1515J4785
1750H50223n0263L6703J11340n4881n3165K506M2446o1339j11268k2554m5924
1739F43824O4279o6810j420P8964N304n1179J015l7759O5258k4172l5524K2714
1727F64494n4018j1085M5574l6831N845K3295k5003N731o7042P407O191k114q931
$$ plain form
1806 2005843 2019686 2006266 1827358 1847572 1780179 1675193 1692411 1697313 1612968 1565180 1620456
1795 1620456 1589467 1535401 1499309 1504126 1546272 1623610 1492179 1414961 1418777 1395556 1377545 1386114
1783 1386114 1315057 1297607 1340764 1280962 1174650 1119912 1042610 1129246 1040779 1005426 1079784
1772 1079784 1054324 1019715 1082913 1120721 1146607 1001573 973579 1004180 1014220 1089717 1079619
1761 1079619 1018125 982279 931287 965613 930394 957875 932261 878598 856953 835438 850223
1750 850223 799960 836663 948003 893122 839957 842463 884909 823570 712302 689748 643824
1739 643824 708103 641293 639873 718837 724141 672962 673977 636218 701476 677304 641780 664494
1727 664494 610476 599391 644965 608134 613979 637274 612271 618002 550960 558367 564558 562444 553513
1714E53513M1563o7627n2362k3345M7940N0952j40817N7915j5387J06171j4531
1703E43985r063P443k5475J7220l3011p2274j423P1571j9974m2343R1661N1195
1691E79512K2722J4497j48512o234J14082m4500p0450J9813O8280P9754o563j53361
1679D69040q9398J04468L0993m4152N2787q5841N4609p0m3183M2757l797j3029
1667D75184j1720J0951J6500n9243k8268J8612L6128K4442k3320L4143J5018K0972
1655E29399k8517K1037j7454j09483L6291M0333N1091K3792j23839m114o4828
1644C53708m65J3410P946L9432k5155n1621O9037l5824o51N1500m7409N2380J9093
1631D45381m0218l9806J1382J9887j7242J30724M4736k5047p8128O6509m4065
$$ plain form
1714 553513 595076 527449 475087 451742 499682 550634 409817 467732 452345 558516 543985
1703 543985 534922 542365 516890 534110 501099 428825 427402 498973 478999 436656 528317 579512
1691 579512 602234 616731 468219 461985 576067 531567 461117 480930 549210 628964 622401 469040
1679 469040 379642 484110 515103 470951 523738 437897 492506 492436 449253 492010 488213 475184
1667 475184 463464 474415 490915 431672 403404 422016 458144 482586 459266 493409 508427 529399
1655 529399 500882 521919 504465 394982 431273 471606 522697 546489 422650 418536 353708
1644 353708 353243 366653 374599 414031 388876 337255 406292 370468 369817 421317 373908 426288 445381
1631 445381 405163 365357 376739 396626 379384 510108 554844 529797 451669 518178 474113
1620D74113n435k660j7844J5939M7091R4226j04833j2111L1452p4006r094J22396
1608E59234N47J2659O5702m4525p5083L2997L8674M8877m3145l3888m7702O9818
1596E84165p033k8327R7427r921o1717l8886P4720l3972j4584M9849p4128k6847
1584E10746J25225L274J0006J29368m0743K1473J7623O4690N3737N3781J3457
1573I62637K9759j558k5494j9959J05276j3425n8331J07107P923n6463J7264J2402
1561A067138P5824J5579p6957J73088J8475M6911O0077Q0757j4537L1493Q4051
1550A561899O3578J7038J14228Q2634k1174J15473R3599j9196J76434J5358j9323
1539B180548p746K1750M5784J0199p929q6540J58341J26508r7170j9828J76173
$$ plain form
1620 474113 468678 466018 448174 464113 511204 605430 500597 488486 519938 445932 436838 559234
1608 559234 559781 572440 638142 593617 518534 551531 590205 639082 595937 562049 514347 584165
1596 584165 577132 548805 646232 636311 574594 535708 610428 576456 561872 611721 537593 510746
1584 510746 635971 639245 649251 778619 737876 759349 776972 841662 895399 949180 962637
1573 962637 992396 990838 965344 945385 1050661 1037236 978905 1086012 1093935 1037472 1054736 1067138
1561 1067138 1142962 1158541 1081584 1254672 1273147 1320058 1380135 1460892 1446355 1477848 1561899
1550 1561899 1625477 1642515 1756743 1839377 1818203 1933676 2027275 2008079 2184513 2199871 2180548
1539 2180548 2172802 2194552 2240336 2250535 2242606 2156066 2314407 2440915 2343745 2323917 2500090
1528B500090L228J10769L4905J9467O4268J56671J14516P4158R5598J25390J79219
1517C478279O9888J20719O1703K0820J05746J4876j337r452O8596J23580K5910
1506D079328N2919k8265N4650K913L2832k623r2456J21436n1188j5098M585j7701
1494D141332L3504N2215k6900M1606J1207M380M7506M3551J52614J30381J33153
1483D764549J54649J99676J23011K52012O6389k3571L0518o2899j03890j85676
1473E214768n4974j84468j35636j8351m6236n815j53386j56099n0496n1738q4513
1462D273056l6016m8502J8365k173R2486J991j71570l1751p3738K4325p3185o8261
1450C905027N1263m8496o9380Q1642J42215m1540J82131J05155l4051O989R7977
$$ plain form
1528 2500090 2503318 2614087 2648992 2668459 2732727 2889398 3003914 3078072 3173670 3299060 3478279
1517 3478279 3548167 3668886 3730589 3751409 3857155 3872031 3870694 3861242 3929838 4053418 4079328
1506 4079328 4132247 4103982 4158632 4161545 4194377 4191754 4099298 4220734 4169546 4154448 4159033 4141332
1494 4141332 4174836 4227051 4200151 4241757 4252964 4257344 4304850 4348401 4501015 4631396 4764549
1483 4764549 4919198 5118874 5241885 5493897 5560286 5536715 5567233 5504334 5400444 5214768
1473 5214768 5159794 4975326 4839690 4821339 4775103 4769288 4615902 4459803 4409307 4357569 4273056
1462 4273056 4237040 4188538 4206903 4204730 4297216 4299207 4127637 4095886 4022148 4046473 3973288 3905027
1450 3905027 3956290 3907794 3838414 3920056 4062271 4020731 4202862 4308017 4273966 4280955 4378932
1439D378932l7052j34065j25631j58029k18898k29061j51642j41199j96842j57325
1429B829188j00160o0095m2294j11875p9592l9004N4168o8200o5448R3029M7767
1418B457484m4632m5966j07117j28203j33998J0739Q199q0417K7958o1278m7048
1407A855721P1276q2067r7093n254N3006j0098r3289o1418K7393m8631j16107
1396A493439o0106p4288p2263j80537l5858j6548n8075K6231k2379q6138l8156
1385H75322O4594M9397n0251r2151J0277M0107n0783K0814n9605p6o1446j57157
1373E89042Q854P760J00961K6627j48289q2876J387l6332P1822m7237m6978K939
1361D47680J2311j2985j5085k9332j9563P9628L1902J4420o984q2107o1794M227
$$ plain form
1439 4378932 4341880 4207815 4082184 3924155 3705257 3476196 3324554 3183355 2986513 2829188
1429 2829188 2729028 2668933 2626639 2514764 2435172 2396168 2450336 2382136 2316688 2409717 2457484
1418 2457484 2412852 2366886 2259769 2131566 1997568 2008307 2016506 1936089 1964047 1902769 1855721
1407 1855721 1926997 1844930 1747837 1742583 1795589 1785491 1692202 1630784 1658177 1609546 1493439
1396 1493439 1433333 1359045 1286782 1106245 1070387 1053839 995764 1021995 999616 913478 875322
1385 875322 939916 989313 939062 846911 857188 897295 846512 867326 807721 807645 746199 589042
1373 589042 597896 605656 706617 733244 584955 502079 503466 467134 538956 491719 444741 447680
1361 447680 459991 447006 431921 402589 383026 462654 494556 508976 501992 419885 358091 362318
1349C62318j0512m8812k6002N5815K5735n2067K9896k4580J9056m4425n3644R6485
1337C29263K0724L4512M5146j11418l5946m0928J0651K2565K6983K8618l6767
1326B93403m1207M1691Q429J7731N2775R004k4578m2179K2514r0581o5234J16348
1314B98116Q388j8840j7861O3286q4798q7636Q9305L412Q0075q3369O320N1057
1302C07455l9235J422j2898j19670J7841l6233k0982N4224l4080n9624j5625J4795
1290E7390J17565K8721n2377N4973O4155J5984n4059p3882J2859N5208m6399q8339
1278I1799R7189k6585L2269L6169o88M8698o9909k8017L6698k5211j3468J1958
1266A90902L8325p0786Q2599l7269o7136P9682J36901l3341q7661l1444K2622
$$ plain form
1349 362318 351806 302994 276992 332807 358542 306475 336371 311791 330847 286422 232778 329263
1337 329263 349987 384499 429645 318227 282281 241353 252004 274569 301552 330170 293403
1326 293403 252196 293887 302316 320047 372822 381826 357248 315069 337583 247002 181768 298116
1314 298116 306504 287664 269803 333089 248291 160655 249960 253372 333447 250078 256398 307455
1302 307455 268220 269642 256744 137074 154915 118682 97700 151924 117844 58220 42595 57390
1290 57390 174955 203676 151299 206272 270427 286411 232352 158470 171329 226537 180138 91799
1278 91799 188988 162403 194672 230841 230153 278851 208942 180925 217623 192412 178944 190902
1266 190902 229227 158441 241040 203771 136635 216317 353218 319877 232216 200772 223394
1255B23394K6625K7813J9673j17389M0744l788J73461n775k3339n3918L012J2542
1243C23055J6850p4885l7491O4607p1238O585m7018J7677k9665k3483J0956r117
1231A46833P8027J18103k7760l4294k087r2267l2052N8952J9468k780l1174l0715
1219A68254M1792J0795J5269l5803L9570K8425n5284k0253p3833n8038k2491P1481
1207A09884J04777K518R8967l8183m4931J9067n557q7840P9053k5702k7741M3865
1195B28177n655J213J4382O461n4473L1302N1353j9693L104j3841N128n440k6548
1182B15470M4573N2704k2019n2630L039n2552n8247j39992J14411L6433Q619R0935
1170B40744M4924N9550j33794j9296j5790M3232k2288p091P330j32271J7433j561
$$ plain form
1255 223394 250019 277832 297505 180116 220860 217072 390533 384758 361419 307501 310513 323055
1243 323055 339905 265020 227529 292136 220898 227483 180465 198142 168477 144994 155950 146833
1231 146833 224860 342963 315203 280909 278822 186555 154503 213455 232923 230143 198969 168254
1219 168254 210046 220841 236110 200307 239877 268302 213018 192765 118932 60894 38403 109884
1207 109884 214661 217179 316146 277963 233032 252099 246542 158702 237755 212053 184312 228177
1195 228177 222522 223735 238117 244578 190105 221407 272760 253067 256171 242330 247458 242018 215470
1182 215470 260043 312747 290728 238098 241137 188585 130338 -9654 104757 141190 149809 240744
1170 240744 285668 345218 211424 192128 176338 219570 197282 190191 197521 65250 82683 81122
1158H1122K3623J29202k0003K739K3423p8848m4666J8105N1591m7507O4332L8067
1146B41180J2069k7848j07663K6815L5303j5290Q1473j00687k1100k390K9120
1135A50982R1293m0644j3478J0263l8645L5594K7619o1114j5573O7810q7625L3353
1123A59835m310Q0029N051l3121O2268j06518l621J8376N7650O3276P9707q1643
1111B96979q3491o2772q4189O0412O4439M9146J17662q7761j9538P5900J3938
1100C40725q9209R2760P5208j27317j00994N666P3954K9679M7099L7166J8937
1089D03674M9719Q998j29009M0963l7818J6989o1809m4656Q3408M8286M490r3399
1077B89836L9326L2942K3700J9656j1622l6670q4749N5169L6691L88J75227K102
$$ plain form
1158 81122 104745 233947 213944 216683 240106 161258 116592 134697 186288 138781 203113 241180
1146 241180 253249 225401 117738 144553 179856 164566 246039 145352 124252 121862 150982
1135 150982 242275 201631 188153 198416 159771 195365 222984 161870 146297 214107 126482 159835
1123 159835 155525 235554 240605 207484 269752 163234 159613 177989 235639 298915 378622 296979
1111 296979 213488 150716 66527 126939 191378 240524 358186 270425 250887 326787 340725
1100 340725 251516 344276 419484 292167 191173 196839 270793 300472 347571 384737 403674
1089 403674 453393 462391 333382 374345 336527 353516 291707 247051 330459 378745 383235 289836
1077 289836 329162 362104 385804 405460 393838 357168 272419 327588 364279 364667 539894 541996
1065E41996j15594o4741K6335j8545N9394l0260Q0967j1167m107l3065K1116J3623
1053D65952P28N2507p201O1359L8495j0863j786k7591O6551l3451J1205n306o0537
1040E50062M4764p063P1428m284M9973N8001J7113P4948k5519m1345J52876k6008
1028I14946M292J36160J1201J8732Q424j1780r6843l9194J15622O1743O0175L1927
1016A215405M452q3995L1829p229J7282R5039n0049R6269J4098k450M9565l8399
1004A341817K4038N6308J63304P9898J27975N3272J03276J56055J53970O7468
994B327381R3058K02668R1058M3649J50381J34409K19848J14369J51028P6377
984C604226J71358L46266L83497K31933M32913O20059N30641M47045L87500M47439
$$ plain form
1065 541996 426402 361661 387996 369451 428845 398585 479552 468385 464278 431213 452329 465952
1053 465952 466680 519187 511986 573345 611840 600977 599191 571600 638151 604700 615905 610599 550062
1040 550062 594826 587763 659191 654907 704880 762881 779994 854942 829423 788078 940954 914946
1028 914946 919238 1055398 1066599 1085331 1093755 1081975 985132 945938 1061560 1123303 1183478 1215405
1016 1215405 1219857 1135862 1167691 1160462 1177744 1272783 1222734 1319003 1333101 1330651 1380216 1341817
1004 1341817 1365855 1422163 1585467 1665365 1793340 1846612 1949888 2105943 2259913 2327381
994 2327381 2420439 2623107 2714165 2757814 2908195 3042604 3262452 3376821 3527849 3604226
984 3604226 3775584 4121850 4505347 4737280 5170193 5790252 6320893 6767938 7155438 7602877
974G602877N64468O16124Q28218R74164J405997J821230K340272L205019L574769
965B2933138L887198M618090M010756L288560K73114o021413p691213n607584
957A9690646l523603k354368j766921j294282j091756r07238p18967n87982m85924
948F959605m09445k80760l13217j94182l27382m04519n47654k60599j01411k77262
938C843174k34118j97462k09882j44329j41204r2098q2722j63994k14250n9108
928B304007n4858q6021N5440j21418j08014o3954o1490j04121q1351k6761l2659
917A618800l2842n0156q3518N7204j25226j00702J1969O5826j33830j25757l4757
906A067011m4749N0229J5657J01708j52993J345j3015l5248k2705L5561l685L0302
$$ plain form
974 7602877 8167345 8783469 9611687 10585851 11991848 13813078 16153350 19358369 22933138
965 22933138 26820336 31438426 35449182 38737742 39010856 32989443 25298230 19690646
957 19690646 16167043 13812675 12045754 10751472 9659716 8752478 8033511 7445529 6959605
948 6959605 6550160 6269400 5956183 5762001 5434619 5030100 4482446 4221847 4120436 3843174
938 3843174 3609056 3411594 3201712 3057383 2916179 2824081 2741359 2577365 2363115 2304007
928 2304007 2249149 2163128 2218568 2097150 1989136 1925182 1863692 1759571 1678220 1651459 1618800
917 1618800 1585958 1535802 1452284 1509488 1384262 1283560 1295529 1361355 1227525 1101768 1067011
906 1067011 1022262 1072491 1088148 1189856 1036863 1038208 1025193 989945 967240 1002801 999116 1029418
894A029418j23152K9481n6706q2080j171o6118o2587K2498J17113j20931K3910
883G09675J1030k4137N082M9406q1404n0909N6271J0076j20750k5100j1740j28469
871C99031n2089N6157P2534P6093l9919p0861n124K5301r7775k0002J73639j29860
859C87125k1511P7422j4067p2658o6723l1662R909m9745j7729K8592P617n4687
847A81883O1995R3685J5432O09l9829j3777q4852k2905q163K4125Q9745M791p602
834B95137j9752k0663o765o6004M6948m9698L7892P3510j3352j36540j5970O5138
822A89881L2262K1735l8843m7368r493O6949o660P639M2026j19308j4161n451
810A19208J1366R4818j16897l3078K677K1021J02602o5207m7872l6663J15849
$$ plain form
894 1029418 906266 935747 879041 796961 795790 729672 667085 689583 806696 685765 709675
883 709675 720705 696568 701650 751056 669652 618743 675014 685090 564340 539240 527500 399031
871 399031 346942 403099 475633 551726 511807 440946 435822 461123 363348 343346 516985 387125
859 387125 365614 443036 428969 356311 289588 257926 267835 218090 200361 228953 236570 181883
847 181883 243878 337563 352995 353604 313775 299998 215146 192241 184078 208203 297948 302739 295137
834 295137 275385 254722 247957 181953 228901 179203 217095 290605 277253 140713 124743 189881
822 189881 222143 243878 205035 157667 148174 215123 208463 216102 258128 138820 124659 119208
810 119208 130574 225392 108495 75417 78094 99115 201717 136510 88638 51975 167824
799A67824o140o7653l9P617Q0543O2109l0270J9626j1576K8420j0551j09984j3470
786A16456N9008J3125j0840q4527M5632k6640j5551O5278o6812k1302R012R726
774I2565J9966k6753j8435O7140m9274o6478N3914j7157O3301n5130n0012J3735
762B7382L2936M7140L8119k5204n6693N511J1348R0500k9628K2634K00J2057l8767
749A37535l7481o9810j1937o541N8583O2592p6382o1538p3574M2702J50394r25
737A13618o895O5075l1936k0646m888q5916K8428J22849m7846p826o83j03745
725A9589j7625N8715L743k6672L078N3411k9293q6143n030l8307J66225M6651
713A48342j03833l9333M5066J3700M6482r9657M5236k8676l82K1062n2376P7641
$$ plain form
799 167824 161684 94031 93992 101609 182152 244261 213991 233617 222041 250461 239910 129926 116456
786 116456 175464 188589 177749 93222 138854 112214 96663 161941 95129 73827 82839 92565
774 92565 112531 85778 67343 134483 85209 18731 72645 55488 118789 63659 13647 27382
762 27382 60318 107458 145577 120373 63680 69191 80539 171039 141411 164045 164245 176302 137535
749 137535 100054 30244 18307 11766 70349 132941 56559 -4979 -78553 -35851 114543 113618
737 113618 106723 171798 139862 119216 114328 28412 56840 179689 131843 124017 123334 19589
725 19589 1964 60679 64422 37750 40828 94239 64946 -21197 -26227 -64534 101691 148342
713 148342 44509 5176 50242 63942 110424 10767 56003 27327 26945 48007 -4369 73272
701G3272J5546r4681K6567O6613j8129P3023l8754J0326L469p5976K2846l8787
689B5335m4361j1488R503O0714j5561O654M6673J9709Q9415J2494J06242k5755
677B79574j32810J0732J7801L2313J9128n0449j4835j828l7334j06785K888n2638
665c4243R7829P3147l3425K4057K775n9899j00707K1061r8573O0197M7637j5044
653a5188Q3315j5655n6027l0007R0927Q9835o9538o6415o9358m593O388o5289
641a21605O1452L1458k9786N3681K6578L0923m7356O3255k5367l0676j4635l3743
629c5821m9094J0173P930J05909j0991r4501J7325M4402k3895j2156o823j6403
617f3945p902J20911k4339q354o6705o4066O1432R591k5126J4760L090Q727M5950
$$ plain form
701 73272 88818 -5863 20704 87317 69188 142211 103457 113783 117252 41276 64122 25335
689 25335 -19026 -30514 -21011 39703 24142 30796 77469 97178 186593 199087 305329 279574
677 279574 146764 157496 175297 207610 226738 176289 161454 159626 122292 15507 18395 -34243
665 -34243 63586 136733 103308 127365 130140 70241 -30466 -9405 -107978 -47781 -144 -15188
653 -15188 68127 52472 -3555 -33562 57365 147200 77662 11247 -58111 -62704 -56316 -121605
641 -121605 -60153 -28695 -58481 -4800 21778 52701 5345 68600 43233 12557 -2078 -35821
629 -35821 -84915 -74742 -66812 39097 28106 -66395 -49070 -4668 -28563 -40719 -47542 -63945
617 -63945 -71847 49064 24725 16371 -50334 -114400 -52968 -43377 -68503 -53743 -50653 -41926 4024
604D024n421k8572K5030l3680L2655K1063j0515L174j6019K0025q5826K1446K4228
591b8388L9109n8441m463K5907p2893K212K3609m2289J0828P0079K8932j6279
579b2077r5069L9957l4127J7300J7225K3453K6653k0603J37781M2349o0541r9707
567b7406m3410l4871J4304M9247l3043k0824M9361J2822L3658n1049j4496k395
555f8102m3018k3036J0989R4151L1528o0407k50r19k7493r862M9956J1457p8288
542a13294k8157J42276k8907m3449Q6153o5758j14344L806P7190J29828l1504
531A3840j2746L9829n0760O392Q765M0130j550p1317m064O8960n2904l5315n672
518e6412j4047j0391N796K8934q5862l2346J16505q3198K7542J9341L460l6977
$$ plain form
604 4024 -1397 -29969 -4939 -38619 -5964 15099 4584 7758 -8261 11764 -74062 -52616 -28388
591 -28388 10721 -47720 -52183 -26276 -99169 -96957 -73348 -115637 -104809 -34730 -5798 -22077
579 -22077 -117146 -77189 -111316 -94016 -76791 -53338 -26685 -47288 90493 132842 72301 -27406
567 -27406 -70816 -105687 -91383 -42136 -75179 -96003 -46642 -33820 -162 -51211 -65707 -68102
555 -68102 -111120 -134156 -123167 -29016 2512 -57895 -58145 -59064 -86557 -96419 -46463 -35006 -113294
542 -113294 -141451 825 -28082 -71531 14622 -51136 -165480 -161674 -84484 45344 13840
531 13840 1094 40923 -9837 -3445 5320 45450 43900 -27417 -31481 37479 -15425 -50740 -56412
518 -56412 -70459 -80850 -75054 -46120 -131982 -164328 -47823 -131021 -103479 -84138 -80678 -117655
506a17655J6310M5322j04219O0012Q4491M4133M5262j1683o0409l9449Q455k6215
494e5645l0732P4590j03523P3536Q1358q071j7096q0915P3591R9513l2026K8523
482A03103o7090m4864J1941n9864m257K3733o640R6803o6427j24060O2608r531
470h4545q1171J24405P16K4992K421l8249q4428j02884K6913M7969M3729k1759
458a41891J10928N7739j30249J5066m32o6502O3002L7021Q9273K0342k1317j13451
446h0471k5886P2069m7028J0082l2546m4667O8829n634j2328J9470j9370j9429
434a16909J5181k5230R137K2293L3679o6932K9213J05514J9391n2707j33903n6702
422b17975M5889O9411R29K2475J30696n1095j8405p2879K9537n4621K8625p860
$$ plain form
506 -117655 -101345 -56023 -160242 -100230 -15739 28394 73656 61973 1564 -37885 -29430 -55645
494 -55645 -86377 -11787 -115310 -41774 39584 31513 14417 -66498 7093 106606 74580 103103
482 103103 36013 -8851 3090 -56774 -61031 -37298 -43938 52865 -13562 -137622 -75014 -84545
470 -84545 -165716 -41311 -40595 -15603 -13182 -51431 -135859 -238743 -211830 -163861 -120132 -141891
458 -141891 -30963 26776 -103473 -88407 -88839 -155341 -92339 -55318 33955 54297 32980 -80471
446 -80471 -106357 -34288 -81316 -71234 -103780 -148447 -79618 -85252 -97580 -78110 -97480 -116909
434 -116909 -101728 -126958 -117821 -95528 -61849 -128781 -99568 5946 25337 -27370 -161273 -217975
422 -217975 -172086 -102675 -101746 -79271 51425 330 -18075 -90954 -61417 -116038 -87413 -95273
410i5273q7793N3530m4558K1612J11859J5710j1196n6257m6593P8827P957r4407
398a46582K1266N2563N6205N601j03181M5840m5064q1096m8644K0193P6957N6552
386h9390l1787n7794j0070l8732L7276K0949P0431k5583J0583R5922o9899k676
374i0770q284n3877N007K3160M3249M0706j8980q1637m8896K8494M285j0593p887
361a76023L3731j19147J20246J40695r8592L2039J4737l6100M6438k3795m0855
350a06626K2798j076o7818N7269L7038o380K621L7637k0243o2417J085p8517j09594
337b94223J43208L0890m8906q077k0087m772l1722L1265N278J2157K1841R3804
325f9344k8693n5490j1372J7165L1897J284J4018n3682p6872M9069J40681j18038
$$ plain form
410 -95273 -183066 -129536 -174094 -152482 -40623 -24913 -36109 -92366 -138959 -60132 -52175 -146582
398 -146582 -125316 -72753 -16548 -10947 -114128 -68288 -113352 -194448 -243092 -222899 -145942 -89390
386 -89390 -121177 -178971 -189041 -227773 -190497 -169548 -99117 -124700 -114117 -18195 -88094 -90770
374 -90770 -99054 -152931 -147924 -124764 -81515 -40809 -59789 -141426 -190322 -161828 -157543 -168136 -176023
361 -176023 -142292 -261439 -141193 -498 -99090 -67051 -52314 -88414 -41976 -65771 -106626
350 -106626 -83828 -84904 -152722 -95453 -58415 -64795 -62174 -24537 -44780 -107197 -106112 -184629 -294223
337 -294223 -151015 -120125 -169031 -177108 -197195 -201967 -233689 -202424 -197146 -184989 -163148 -69344
325 -69344 -98037 -153527 -164899 -147734 -115837 -114553 -100535 -154217 -231089 -182020 -41339 -159377
313a59377o4795M7459L6967j224j5764O9114j815k7584r4289Q5663n4573k2701
301b02919m0782Q0220j2369j1264Q2897J8338K7200m6040q9851K1085L6678m9655
289a86462J0339p3925M3020P5310l1290n086j0886J0354N175p2839J9920M1496
277a74874k6531P3705l3763J23831o141m02k0639k9416P5420m3250K9528n5634
265h8166l3290r5114j2896L7400n645N5442l1430k3191o681n7254N5828J9043
253a85954K7940M491o166k888q991P4952m95q3232N7057R1639L3552o1361o9891
240a29347m9368K7386N7414O1961m5389j38704K5220M9617l1955K713J499J490
228a67463P2601N2397p8474o7076l2009R621o6690N1575k0308p2001Q928Q4503
$$ plain form
313 -159377 -224172 -176713 -139746 -140970 -156734 -87620 -89435 -117019 -211308 -125645 -180218 -202919
301 -202919 -243701 -163481 -175850 -187114 -104217 -85879 -58679 -104719 -194570 -173485 -136807 -186462
289 -186462 -176123 -250048 -207028 -131718 -163008 -168094 -178980 -168626 -163451 -236290 -216370 -174874
277 -174874 -201405 -127700 -161463 -37632 -43773 -44175 -64814 -94230 -18810 -62060 -32532 -88166
265 -88166 -121456 -216570 -229466 -192066 -197711 -142269 -173699 -196890 -203571 -260825 -204997 -185954
253 -185954 -158014 -153523 -159689 -162577 -171568 -96616 -97111 -180343 -123286 -31647 1905 -59456 -129347
240 -129347 -178715 -151329 -93915 -31954 -77343 -216047 -190827 -141210 -173165 -170452 -168953 -167463
228 -167463 -94862 -42465 -120939 -188015 -220024 -210403 -277093 -225518 -245826 -317827 -308899 -224396
216b24396k4257k0014J20738q7191n0449j150J13435q953o1436Q4898o935o5212
204b30922m3606L7127L5323j1974n9982O4450j9945J13266n591l8752j860p3833
192b36299n7630P749K5529r090M3604Q7715N7095R742n4292n140m7282k3239J7480
179a84058q1407K8272o9533K1448O6837N981l477M4404N2292m8150k423q672O3106
166a15380L4991q1923p0536M6633P6333j7025n532K7163q3195p5220m0110j3547
154c17348J37883l2776n5438N4133L4430M1320n5452M0576n9836n0856Q9641r3088
142b66811j3848K5946P1500P3461r211p6204m3049k6872L6212R70J500J440L0775
129a94191n5396l7562m8717M2455M1488L2198L7982M7195n9736m0363k9732M8432
$$ plain form
216 -224396 -248653 -268667 -147929 -235120 -285569 -286719 -173284 -182237 -243673 -158775 -165710 -230922
204 -230922 -274528 -237401 -202078 -214052 -274034 -209584 -229529 -116263 -121854 -160606 -162466 -236299
192 -236299 -293929 -286180 -260651 -269741 -226137 -138422 -81327 -71585 -125877 -131017 -178299 -201538 -184058
179 -184058 -265465 -237193 -306726 -285278 -218441 -212460 -215937 -171533 -119241 -167391 -169814 -178486 -115380
166 -115380 -80389 -162312 -232848 -186215 -109882 -126907 -132439 -105276 -188471 -263691 -303801 -317348
154 -317348 -179465 -212241 -267679 -213546 -179116 -137796 -193248 -152672 -212508 -263364 -173723 -266811
142 -266811 -280659 -254713 -183213 -109752 -118963 -195167 -238216 -265088 -228876 -227906 -226406 -224966 -194191
129 -194191 -249587 -287149 -335866 -293411 -251923 -219725 -181743 -134548 -194284 -234647 -264379 -215947
117b15947O3525J913q7453M6125L8934K9461q8907o9066K7774K3607K078p138
105b35094K1006J6441K7437J9935l4741k5982P227k7689L8349k5007k4m7019n3072
92c18233Q1857l3365K5061M7399N1982l2655o889j9803q0481M7386P2161J6527
80a49053k3825Q333l1336r1210k8270P1303M0664Q5951m6111k0310j2979j5100
68b11943m836r010r63J7163o4820K0533p5362M0787K3970Q1715l0872n5205K0771
55b48072j3973m0624M1166J0061k7679N3550r837k0479j7050k7361M9686m0446
43b91058L3313L9723n244m259n9277m2589m842L7836K6242k0035L7934L7489n455
30b20222K2785J4852r8682l6770N031O2835k749q7102R328Q1960P933k6666k1338
$$ plain form
117 -215947 -152422 -150509 -237962 -191837 -152903 -123442 -212349 -281415 -253641 -230034 -227956 -235094
105 -235094 -214088 -197647 -170210 -150275 -185016 -210998 -203771 -231460 -193111 -218118 -218142 -265161 -318233
92 -318233 -236376 -269741 -244680 -197281 -145299 -177954 -184843 -204646 -285127 -237741 -165580 -149053
80 -149053 -172878 -164545 -195881 -287091 -315361 -244058 -203394 -117443 -163554 -183864 -196843 -211943
68 -211943 -216779 -225789 -226752 -209589 -274409 -253876 -329238 -288451 -264481 -182766 -213638 -268843 -248072
55 -248072 -262045 -302669 -261503 -251442 -279121 -225571 -235408 -255887 -272937 -300298 -250612 -291058
43 -291058 -257745 -218022 -223266 -227525 -286802 -329391 -334233 -296397 -270155 -290190 -252256 -214767 -220222
30 -220222 -197437 -182585 -281267 -318037 -313006 -250171 -252920 -340022 -330694 -248734 -240801 -267467 -288805
17b88805J6133n104K1136J5237N188N525n3210N6460J1879p0189j7577J19722
5a83605k1763j7459l7698J0384Q0220
0a69921
$$ plain form
17 -288805 -272672 -277776 -256640 -241403 -236215 -230690 -283900 -227440 -215561 -285750 -303327 -183605
5 -183605 -205368 -222827 -260525 -250141 -169921
0 -169921
$$ Imaginary data points
##PAGE= N=2
##DATA TABLE= (X++(I..I)), XYDATA
16383c345350P2172N1628J150N9590Q2183M330Q2706O746K0725J39574r249k28
16371b834023M3202Q0856O5469j5933J411N4367R5420L6287k8739O3824M9785
16360b388074O1719n4339K9327R3572m7179K2643J55344K6779l0544L7416Q2843
16349b010493J29565P898l7741M0873O2017L4299O9948J6369P8108M2662L649
16338a562846P6538J2173L5067j400K0592J50451N2615j433k4250M2387J9397
16327a180709L1977R022l0977L6015N6416Q6284K7173N821P0956k1589K3898R080
16315h76633q845P1581P613J09883M258O3083Q0777J3426J2410K4169j3765O6686
16303d45357R3219R0130N4218l1575p8819J07190M3736j7277m498m820L0582P619
$$ plain form
16383 -3345350 -3273178 -3221550 -3220400 -3160810 -3078627 -3074297 -2991591 -2984845 -2964120 -2824546 -2833795 -2834023
16371 -2834023 -2790821 -2709965 -2644496 -2660429 -2659018 -2604651 -2509231 -2472944 -2501683 -2437859 -2388074
16360 -2388074 -2326355 -2380694 -2351367 -2257795 -2304974 -2282331 -2126987 -2100208 -2130752 -2093336 -2010493
16349 -2010493 -1880928 -1873030 -1910771 -1869898 -1807881 -1773582 -1703634 -1687265 -1609157 -1566495 -1562846
16338 -1562846 -1486308 -1474135 -1439068 -1440468 -1419876 -1269425 -1216810 -1218243 -1242493 -1200106 -1180709
16327 -1180709 -1148732 -1139710 -1170687 -1134672 -1078256 -991972 -964799 -958978 -888022 -909611 -885713 -876633
16315 -876633 -885478 -813897 -806284 -696401 -692143 -629060 -548283 -534857 -522447 -498278 -512043 -445357
16303 -445357 -352138 -262008 -207790 -239365 -318184 -210994 -167258 -184535 -189033 -193853 -163271 -155652
16291a55652Q8478M1065L4945K1296K6914J2264K3198K6183P9385j5086Q557K3865
16279B15412R6560P1259Q1199Q199l6018J3745J459M0443N0890K2259J8577j2134
16267E71850L3620J0771L0943m4985N1979J36119M9302k6795r6065J05566Q1743
16256I04048r866M2496l1971L5569J2160n9457R4444P3462J4085p4238J3732L6051
16244A050515N0151p196J1895J12355j7211J5420M9319m2963R6098O0945k9596
16233A349732j0634K6947N8260r2174J11450J14246L0524J2459j2198N8940K1571
16222A669123M3008n0098r2232K0050l6078O208R1333Q3802k3021o2853O8353
16211A717595J11070R6973k7592n9862n0092J4580J0893n901L4027j0910Q476
$$ plain form
16291 -155652 -67174 -26109 8836 30132 57046 69310 92508 118691 198076 182990 191547 215412
16279 215412 311972 383231 464430 472629 436611 450356 451815 492258 543148 565407 583984 571850
16267 571850 605470 616241 647184 602199 654178 790297 839599 812804 716739 822305 904048
16256 904048 894182 936678 904707 940276 952436 892979 987423 1060885 1074970 1000732 1014464 1050515
16244 1050515 1100666 1093470 1105365 1217720 1200509 1215929 1265248 1222285 1318383 1379328 1349732
16233 1349732 1339098 1366045 1424305 1332131 1443581 1557827 1588351 1600810 1588612 1647552 1669123
16222 1669123 1712131 1662033 1569801 1589851 1553773 1559981 1651314 1735116 1712095 1649242 1717595
16211 1717595 1828665 1925638 1898046 1838184 1788092 1802672 1813565 1807664 1841691 1830781 1839257
16200A839257Q3644r96J9048m6344R789M0369L0981l1744J5305L5181J02607K8929
16188B126026q3715K602O826P3974K8829j15841M4822l6735n433P4019l8442r0584
16176A986348N5188J8482O8467k9792O8268J9104m9888P9102L6982r3030N5110
16165B214341R0417J3738O141K068o0193Q9428o0450R072J21253p2887P9297p2970
16153B359255l658N1816k7071n8584J6637O1319K337n9619J17259n3596k645l098
16141B400352j794K1799L7630l1739N6697Q017n9003L3639J08655n6971l8003
16130B479279k2703R1815J7348J3941n8089J6943J6817l1553J02310n5235o5945
16119B504928K5962j3165L2352l9709j1490P4468l0669N7679l7179P0011M0864
$$ plain form
16200 1839257 1922901 1921905 1940953 1894609 1904398 1944767 1975748 1944004 1959309 1994490 2097097 2126026
16188 2126026 2042311 2044913 2051739 2125713 2154542 2038701 2083523 2046788 2041355 2115374 2076932 1986348
16176 1986348 2041536 2060018 2128485 2098693 2166961 2186065 2136177 2215279 2252261 2159231 2214341
16165 2214341 2304758 2318496 2324637 2326705 2266512 2355940 2295490 2304562 2425815 2352928 2432225 2359255
16153 2359255 2355597 2407413 2380342 2321758 2338395 2399714 2402051 2342432 2459691 2406095 2403450 2400352
16141 2400352 2398558 2420357 2457987 2426248 2482945 2490962 2431959 2465598 2574253 2517282 2479279
16130 2479279 2456576 2548391 2565739 2579680 2521591 2538534 2555351 2523798 2626108 2570873 2504928
16119 2504928 2530890 2517725 2550077 2510368 2498878 2573346 2542677 2600356 2563177 2633188 2674052
16108B674052p6203M431n3472l8978K0866P8502q956o3138O3432M6509j7557R5282
16096B724770k2761o1890j1949M3059p8666j8326L4556o5940J07057N9582m1568
16085B667924L9185m7953q6509P0273P1061o5773M342p97m1681J4295M3436O7264
16073B735067j70428Q207l629K1850Q8430q0192K3407j5398O283N4085O5350j3225
16061B719807k6278m2535m6400L6705n5553L5741J5409o9047P0087P8732Q342
16050B725010o1030M9247M191k2888K3836j6893J8247L7028n7255j8725J2942
16039B693710P699j27834q4534J89592j6371Q627m454j4966L175O7295K1663m1500
16027B702102l5495O5994o1349n186R7210P265r2580n8120J9230K7779N6656o4880
$$ plain form
16108 2674052 2597849 2602280 2548808 2509830 2530696 2609198 2600242 2537104 2600536 2647045 2629488 2724770
16096 2724770 2702009 2640119 2628170 2671229 2592563 2574237 2608793 2542853 2649910 2709492 2667924
16085 2667924 2707109 2659156 2572647 2642920 2713981 2648208 2652550 2651753 2610072 2624367 2667803 2735067
16073 2735067 2564639 2572846 2569217 2591067 2679497 2599305 2622712 2607314 2613597 2667682 2733032 2719807
16061 2719807 2693529 2650994 2604594 2641299 2585746 2621487 2636896 2567849 2637936 2716668 2725010
16050 2725010 2663980 2713227 2717418 2694530 2718366 2701473 2719720 2756748 2699493 2680768 2693710
16039 2693710 2701409 2573575 2489041 2678633 2662262 2670889 2666435 2651469 2654644 2721939 2743602 2702102
16027 2702102 2666607 2732601 2671252 2666066 2763276 2770541 2677961 2619841 2639071 2666850 2723506 2658626
16015B658626L4721p4940P390R5285p3267R0623L2426k7996m3006M5121o8586
16004B676397l50k6445j03940K7816O0633L401M1082j1270q492O4109l1981l5780
15992B655180j9167J02199K7295r982j8596n8974Q5250q903q2665O6336K7838
$$ plain form
16015 2658626 2693347 2618407 2625797 2721082 2647815 2738438 2770864 2742868 2699862 2744983 2676397
16004 2676397 2676047 2649602 2545662 2573478 2634111 2637512 2678594 2667324 2658832 2722941 2690960 2655180
15992 2655180 2636013 2738212 2765507 2755525 2736929 2677955 2763205 2754302 2671637 2737973 2765811
$$ [...]
##END NTUPLES=NMR SPECTRUM
##END=
