##TITLE=1H_EC-3243p
 CDCl3,8 sc, 
 8.02.2021
##JCAMPDX= 6.0         $$ Bruker NMR JCAMP-DX V2.0
##DATA TYPE= NMR SPECTRUM
##DATA CLASS= NTUPLES
##ORIGIN= UXNMR, Bruker Analytische Messtechnik GmbH
##OWNER= root
$$ XWIN-NMR		Version 3.5
$$ Mon Feb  8 11:56:39 2021 Russian Standard Time (UT+4h)  she@DPX200
##.OBSERVE FREQUENCY= 200.1315066352
##.OBSERVE NUCLEUS= ^1H
##.ACQUISITION MODE= SIMULTANEOUS
##.ACQUISITION SCHEME= undefined
##.AVERAGES= 8
##.DIGITISER RES= 18
##SPECTROMETER/DATA SYSTEM= spect
##.PULSE SEQUENCE= zg30
##.SOLVENT NAME= CDCl3
##.SHIFT REFERENCE= (INTERNAL, CDCl3, 0, 15.9937)
##AUDIT TRAIL= $$ (NUMBER, WHEN, WHO, WHERE, WHAT)
$$ ##TITLE= Audit trail, XWIN-NMR		Version 3.5
$$ ##JCAMPDX= 5.01
$$ ##ORIGIN= Bruker BioSpin GmbH
$$ ##OWNER= she
$$ F:/spectra/data/she/nmr/H-F/1/pdata/1/auditp.txt
$$ ##AUDIT TRAIL=  $$ (NUMBER, WHEN, WHO, WHERE, WHAT)
(   1,<2021-02-08 11:55:24.12 +0400>,<she>,<DPX200>,
      <created by zg, POWCHK disabled, PULCHK disabled
       configuration hash MD5:
       00 E9 B6 7A A2 85 ED C7 34 08 36 98 17 FE 4E 26
       data hash MD5: 16K
       04 74 81 E4 EA 1C DE 05 C2 92 FB 17 4F A9 E1 10>)
(   2,<2021-02-08 11:55:26.78 +0400>,<she>,<DPX200>,
      <Start of raw data processing
       efp BC_mod = 2 LB = 0.24 FT_mod = 6 PKNL = 1 PHC0 = -10754.79 PHC1 = 9.40094 SI = 16K 
       data hash MD5: 16K
       95 31 10 CE 44 41 46 B5 3A 61 4A 1B 93 97 15 30>)
(   3,<2021-02-08 11:55:41.73 +0400>,<she>,<DPX200>,
      <pk PHC0 = -3.96775 PHC1 = 4.4 
       data hash MD5: 16K
       CC C2 58 88 5F AE 6D 45 99 4E 15 74 BE 0B 50 0C>)
(   4,<2021-02-08 11:55:44.79 +0400>,<she>,<DPX200>,
      <abs ABSG = 5 
       data hash MD5: 16K
       B0 C2 A2 36 8D 86 A1 C9 9F A2 A3 1D 29 AB F2 ED>)
$$ ##END=
$$ 
$$ hash MD5
$$ 0E C4 7A 57 84 2F 7A F1 D5 A6 89 DA D7 EE 88 DE
##$RELAX= 
##$RELAX= 
##$RELAX= 
##$RELAX= 
##$RELAX= 
##$RELAX= 
$$ Bruker specific parameters
$$ --------------------------
##$DU= <F:/spectra>
##$EXPNO= 1
##$NAME= <H-F>
##$PROCNO= 1
##$TYPE= <nmr>
##$USER= <she>
##$AMP= (0..31)
100 100 100 100 100 100 100 100 100 100 100 100 100 100 100 100 100 100 
100 100 100 100 100 100 100 100 100 100 100 100 100 100 
##$AQSEQ= 0
##$AQ_mod= 1
##$AUNM= <au_zg>
##$AUTOPOS= <>
##$BF1= 200.13
##$BF2= 200.13
##$BF3= 200.13
##$BF4= 200.13
##$BF5= 200.13
##$BF6= 200.13
##$BF7= 200.13
##$BF8= 200.13
##$BYTORDA= 1
##$CFDGTYP= 0
##$CFRGTYP= 5
##$CHEMSTR= <none>
##$CNST= (0..31)
1 1 145 1 1 1 1 1 1 1 1 1 1 1 1 1 1 1 1 1 1 1 1 1 1 1 1 1 1 1 1 1 
##$CPDPRG= <>
##$CPDPRG1= <>
##$CPDPRG2= <>
##$CPDPRG3= <>
##$CPDPRG4= <mlev>
##$CPDPRG5= <mlev>
##$CPDPRG6= <mlev>
##$CPDPRG7= <mlev>
##$CPDPRG8= <mlev>
##$CPDPRGB= <>
##$CPDPRGT= <>
##$D= (0..31)
0 1.2 0 0 0 0 0 0 0 0.06 0 0.03 0 0 0 0 0.0002 0 0 0 0 0 0 0 0 0 0 0 0 
0 0 0 
##$DATE= 1612770923
##$DBL= (0..7)
120 120 120 120 120 120 120 120 
##$DBP= (0..7)
150 150 150 150 150 150 150 150 
##$DBP07= 0
##$DBPNAM0= <>
##$DBPNAM1= <>
##$DBPNAM2= <>
##$DBPNAM3= <>
##$DBPNAM4= <>
$$ [...]
##$SUBNAM3= <"">
##$SUBNAM4= <"">
##$SUBNAM5= <"">
##$SUBNAM6= <"">
##$SUBNAM7= <"">
##$SUBNAM8= <"">
##$SUBNAM9= <"">
##$SW= 16.9725356469052
##$SWIBOX= (0..15)
0 0 2 0 0 0 0 0 0 0 0 0 0 0 0 0 
##$SW_h= 3396.73913043478
##$TD= 16384
##$TD0= 1
##$TE= 0
##$TE2= 300
##$TE3= 300
##$TEG= 300
##$TL= (0..7)
0 120 120 120 120 120 120 120 
##$TP= (0..7)
150 150 150 150 150 150 150 150 
##$TP07= 0
##$TPNAME0= <>
##$TPNAME1= <>
##$TPNAME2= <>
##$TPNAME3= <>
##$TPNAME4= <>
##$TPNAME5= <>
##$TPNAME6= <>
##$TPNAME7= <>
##$TPOAL= (0..7)
0.5 0.5 0.5 0.5 0.5 0.5 0.5 0.5 
##$TPOFFS= (0..7)
0 0 0 0 0 0 0 0 
##$TUNHIN= 0
##$TUNHOUT= 0
##$TUNXOUT= 0
##$USERA1= <user>
##$USERA2= <user>
##$USERA3= <user>
##$USERA4= <user>
##$USERA5= <user>
##$V9= 5
##$VALIST= <valist>
##$VCLIST= <CCCCCCCCCCCCCCC>
##$VD= 0
##$VDLIST= <DDDDDDDDDDDDDDD>
##$VPLIST= <PPPPPPPPPPPPPPP>
##$VTLIST= <TTTTTTTTTTTTTTT>
##$WBST= 1024
##$WBSW= 4
##$XGAIN= (0..3)
0 0 0 0 
##$XL= 0
##$YL= 0
##$YMAX_a= 253376
##$YMIN_a= -290385
##$ZGOPTNS= <>
##$ZL1= 120
##$ZL2= 120
##$ZL3= 120
##$ZL4= 120
##$ABSF1= 15.95227
##$ABSF2= -1.020392
##$ABSG= 5
##$ABSL= 3
##$ALPHA= 0
##$AQORDER= 0
##$ASSFAC= 0
##$ASSFACI= 0
##$ASSFACX= 0
##$ASSWID= 0
##$AUNMP= <proc_1d>
##$AZFE= 0.1
##$AZFW= 0.1
##$BCFW= 0
##$BC_mod= 2
##$BYTORDP= 0
##$COROFFS= 0
##$CY= -3
##$DATMOD= 1
##$DC= 0
##$DFILT= <>
##$DTYPP= 0
##$F1P= 0
##$F2P= 0
##$FCOR= 1
##$FTSIZE= 16384
##$FT_mod= 6
##$GAMMA= 0
##$GB= 0
##$INTBC= 1
##$INTSCL= 2.992141e-10
##$ISEN= 128
##$LB= 0.24
##$LEV0= 0
##$LPBIN= 0
##$MAXI= 10000
##$MC2= 0
##$MEAN= 0
##$ME_mod= 0
##$MI= 1.114404
##$NCOEF= 0
##$NC_proc= -6
##$NLEV= 6
##$NOISF1= 3.799351
##$NOISF2= 2.8
##$NSP= 0
##$NTH_PI= 0
##$NZP= 0
##$OFFSET= 15.99371
##$PC= 1
##$PHC0= -10758.76
##$PHC1= 13.80094
##$PH_mod= 1
##$PKNL= yes
##$PPARMOD= 0
##$PSCAL= 0
##$PSIGN= 0
##$REVERSE= no
##$SF= 200.130004183212
##$SI= 16384
##$SIGF1= 3
##$SIGF2= 2
##$SINO= 5.538805
##$SIOLD= 16384
##$SREGLST= <1H.CDCl3>
##$SSB= 0
##$STSI= 16384
##$STSR= 0
##$SW_p= 3396.73913043478
##$SYMM= 0
##$S_DEV= 0
##$TDeff= 16384
##$TDoff= 0
##$TI= <>
##$TILT= no
##$TM1= 0
##$TM2= 0
##$TOPLEV= 0
##$USERP1= <user>
##$USERP2= <user>
##$USERP3= <user>
##$USERP4= <user>
##$USERP5= <user>
##$WDW= 1
##$XDIM= 16384
##$YMAX_p= 374724248
##$YMIN_p= -441502
$$ End of Bruker specific parameters
$$ ---------------------------------
##NTUPLES= NMR SPECTRUM
##VAR_NAME=  FREQUENCY,     SPECTRUM/REAL,   SPECTRUM/IMAG
##SYMBOL=    X,             R,               I
##VAR_TYPE=  INDEPENDENT,   DEPENDENT,       DEPENDENT
##VAR_FORM=  AFFN,          ASDF,            ASDF
##VAR_DIM=   16384,         16384,           16384
##UNITS=     HZ,            ARBITRARY UNITS, ARBITRARY UNITS
##FACTOR=    0.207333158178281, 1,           1
##FIRST=     3200.82116199022, 0,            0
##LAST=      -195.917968444558, 0,           0
##MIN=       -195.917968444558, -441502,     0
##MAX=       3200.82116199022, 374724248,    0
$$ Real data points
##PAGE= N=1
##DATA TABLE= (X++(R..R)), XYDATA
$$ [...]
$$ plain form
6141 15116182 15305000 15696738 15909291 15910310 16141434 16533834 16727499 17014004 17229168 17231135
6131 17231135 17310613 17530651 17527394 17600821 17729046 17751416 17761968 17719079 17765226 17737037 17740954
6120 17740954 17742726 17667898 17569449 17495699 17314196 17072445 16891963 16650645 16479255 16222421
6110 16222421 15824250 15506835 15234154 14907895 14613568 14408522 14185159 13920900 13597154
6101 13597154 13397115 12990930 12769856 12690820 12277169 11971208 11777663 11483213 11221266 10840039
6091 10840039 10642787 10459300 10293300 10077632 9747600 9443162 9184611 9041816 8812195
6082 8812195 8548143 8457701 8206313 7945393 7740007 7466723 7426367 7316557 7201297 6956645
6072 6956645 6778918 6833069 6769001 6524753 6290898 6094865 5986020 5896915 5723343 5500703
$$ packed form
6141A5116182J88818L91738K12553J019K31124L92400J93665K86505K15164J967
6131A7231135P9478K20038l257P3427J28225K2370J0552m2889M6147k8189L917
6120A7740954J772p4828r8449p3750j81503k41751j80482k41318j71390k56834
6110A6222421l98171l17415k72681l26259k94327k05046k23363k64259l23746
6101A3597154k00039m06185k21074p9036m13651l05961j93545k94450k61947l81227
6091A0840039j97252j83487j66000k15668l30032l04438k58551j42795k29621
6082H812195k64052r0442k51388k60920k05386k73284m0356j09810j15260k44652
6072F956645j77727N4151o4068k44248k33855j96033j08845q9105j73572k22640
$$ plain form
6062 5500703 5306895 5211472 5058762 4947817 4883714 4754783 4604441 4563301 4540654 4448066
6052 4448066 4445320 4425091 4276214 4175910 4194807 4115229 4004662 3982607 3827453 3813756 3804793
6041 3804793 3924366 3725604 3498098 3410554 3284234 3206519 3232276 3099685 2918712 2828502
6031 2828502 2726545 2615671 2812831 2904258 2747667 2773376 2666883 2615419 2729917 2714395
6021 2714395 2640597 2474146 2431312 2265572 2157492 2123153 2119304 2081277 2103510 2084008 1951180
6010 1951180 2049356 2164414 2259465 2133593 2067225 2085740 1901731 1827655 2003480 1787611
6000 1787611 1702047 1755068 1646358 1578014 1616455 1619961 1555973 1503910 1533803 1526966 1518517 1503386
5988 1503386 1646259 1502118 1460787 1595149 1470419 1335520 1320470 1313584 1375732 1453750 1410930
$$ packed form
6062E500703j93808r5423j52710j10945o4103j28931j50342m1140k2647r2588
6052D448066k746k0229j48877j00304J8897p9578j10567k2055j55154j3697q963
6041C804793J19573j98762k27506q7544j26320p7715K5757j32591j80973r0210
6031B828502j01957j10874J97160R1427j56591K5709j06493n1464J14498j5522
6021B714395p3798j66451m2834j65740j08080l4339l849l8027K2233j9502j32828
6010A951180R8176J15058R5051j25872o6368J8515j84009p4076J75825k15869
6000A787611q5564N3021j08710o8344L8441L506o3988n2063K9893o837q449j5131
5988A503386J42873j44141m1331J34362j24730j34899j5050o886O2148P8018m2820
$$ plain form
5977 1410930 1287584 1197362 1223205 1352731 1327126 1168963 1136938 1077932 1057100 1079972 1175431
5966 1175431 1153901 1123994 1110735 1057177 1105210 1145557 1079854 1134396 1092433 1033126 1015176
5955 1015176 1045350 994676 1045000 1115880 969069 1046764 1004110 987220 1030475 1098279 1163727
5944 1163727 1093786 896660 926288 956877 1010167 812887 742567 800242 734029 691248 725609
5933 725609 819216 812775 753251 743023 786330 800641 782543 732295 606065 712427 750471
5922 750471 653760 605314 522174 604527 609483 632729 592060 663405 643417 706938 847896 833816
5910 833816 763971 837145 760536 636323 551118 542539 669603 702865 700221 592589 594613 659136
5898 659136 566955 619082 678821 570114 652170 595383 540447 570970 614412 633183 495334
$$ packed form
5977A410930j23346r0222K5843J29526k5605j58163l2025n9006k0832K2872R5459
5966A175431k1530k9907j3259n3558M8033M0347o5703N4542m1963n9307j7950
5955A015176L0174n0674N0324P0880j46811P7695m2654j6890M3255O7804O5448
5944A163727o9941j97126K9628L0589N3290j97280p0320N7675o6213m2781L4361
5933G25609R3607o441n9524j0228M3307J4311j8098n0248j26230J06362L8044
5922G50471r6711m8446q3140Q2353M956K3246m0669P1345j9988O3521J40958j4080
5910H33816o9845P3174p6609j24213q5205q579J27064L3262k644j07632K024O4523
5898F59136r2181N2127N9739j08707Q2056n6787n4936L0523M3442J8771j37849
$$ plain form
5887 495334 439847 470967 543717 520588 444216 379537 436397 567486 536379 410446 334306
5876 334306 298037 358621 344479 321310 373752 394972 285352 277092 314758 346332 438810 521753
5864 521753 395996 191900 274865 337817 292521 279258 246425 172027 160332 199647 212973
5853 212973 313649 377576 366899 234271 136261 146806 134848 211909 187819 26110 92690
5842 92690 255612 179347 211996 233334 233334 263402 337003 281724 313225 381344 271720 237635
5830 237635 185563 155761 178906 220507 16772 -74884 -22855 98896 99723 182251 246511 187254
5818 187254 174019 78394 3760 76747 266348 219497 160326 53616 22102 -4655 -54019
5807 -54019 18074 2878 -15314 129644 214576 83639 75349 119195 151543 176180 140686 151585
$$ packed form
5887D95334n5487L1120P2750k3129p6372o4679N6860J31089l1107j25933p6140
5876C34306l6269O0584j4142k3169N2442K1220j09620q260L7666L1574R2478Q2943
5864E21753j25757k04096Q2965O2952m5296j3263l2833p4398j1695L9315J3326
5853B12973J00676O3927j0677j32628r8010J0545j1958P7061k4090j61709O6580
5842I2690J62922p6265L2649K1338%L0068P3601n5279L1501O8119j09624l4085
5830B37635n2072k9802K3145M1601k03735r1656N2029J21751Q27Q2528O4260n9257
5818A87254j3235r5625p4634P2987J89601m6851n9171j06710l1514k6757m9364
5807e4019P2093j5196j8192J44958Q4932j30937q290M3846L2348K4637l5494J0899
$$ plain form
5795 151585 30932 -95405 -2784 26810 -59274 40060 -7710 -331733 -188818 171072 238492
5784 238492 255269 189735 84813 138960 317201 350984 70080 19008 41000 -22283 -96996
5773 -96996 -152827 -28562 -23066 -113987 -120066 -6153 -1178 -3420 124095 76317 61015 148423
5761 148423 110406 180981 132209 26555 154629 15423 -79344 -19387 -23977 97946 166315
5750 166315 8409 -23582 89737 191854 -51527 -27162 -338 -104601 -154303 -144224 -86759
5739 -86759 -29563 -45082 -185680 -66335 -14802 67112 174898 248171 104893 163639 75319
5728 75319 45400 96732 17474 942 45026 -71046 -227824 -264483 -264941 -76038 -38291 -36331
5716 -36331 -61100 -51620 49697 81516 174313 216051 171336 108015 41361 -80477 -88328 -22776
$$ packed form
5795A51585j20653j26337R2621K9594q6084R9334m7770l24023J42915L59890O7420
5784B38492J6777o5534j04922N4147J78241L3783k80904n1072K1992o3283p4713
5773i6996n5831J24265N496r0921o079J13913M975k242J27515m7778j5302Q7408
5761A48423l8017P0575m8772j05654J28074j39206r4767N9957m590J21923O8369
5750A66315j57906l1991J13319J02117k43381K4365K6824j04263m9702J0079N7465
5739h6759N7196j5519j40598J19345N1533Q1914J07786P3273j43278N8746q8320
5728G5319k9919N1332p9258j6532M4084j16072j56778l6659m58J88903L7747J960
5716c6331k4769R480J01317L1819R2797M1738m4715o3321o6654j21838p851O5552
$$ plain form
5704 -22776 37963 -40891 -76003 -146454 -235617 -17853 36592 -41880 -91667 75599 12523
5693 12523 -221264 33731 81487 -28106 -459 -198143 -212972 1949 14493 154880 112517
5682 112517 -31255 -31176 4117 40642 -3758 -25304 -15974 -214819 -146668 40394 99955 52278
5670 52278 -107445 -235640 -250568 -85126 3567 -57493 -97581 -88679 27038 8610 -10554
5659 -10554 94530 41969 -34478 -30040 -156638 -152868 -36582 -39055 65990 -67387 -42930
5648 -42930 25586 -107075 -125061 -186333 -232934 -156173 -85265 -125094 -194733 -39562 -15976
5637 -15976 -10821 52981 35796 -195800 -238580 -120187 -144186 754 124335 77618 -38296
5626 -38296 -69688 -134581 -73539 -4575 -99044 -168774 -262161 -150723 -2710 -22419 -135133
$$ packed form
5704b2776O0739p8854l5112p0451q9163K17764N4445p8472m9787J67266o3076
5693A2523k33787K54995M7756j09593K7647j97684j4829K14921J2544J40387m2363
5682A12517j43772P9L5293L6525m4400k1546R330j98845O8151J87062N9561m7677
5670E2278j59723j28195j4928J65442Q8693o1060m0088Q902J15717j8428j9164
5659a0554J05084n2561p6447M438j26598L770J16286k473J05045j33377K4457
5648d2930O8516j32661j7986o1272m6601P6761P0908l9829o9639J55171K3586
5637a5976N155O3802j7185k31596m2780J18393k3999J44940J23581m6717j15914
5626c8296l1392o4893O1042O8964r4469o9730r3387J11438J48013j9709j12714
$$ plain form
5615 -135133 -174014 -98141 15807 77839 -23097 88796 44220 -145574 -78211 195 147989
5604 147989 218168 103033 -70389 -261116 -284800 -219358 -216250 -87121 27490 -4954 -145902
5593 -145902 -193964 75135 224257 85127 22977 -73803 -62387 -179620 -85956 -73675 -191985
5582 -191985 -86528 -176218 -266348 -206872 -239053 -58534 -95890 -65691 131054 -71894 -79211
5571 -79211 60099 23345 117779 -15752 -202346 -221664 -315843 -222988 -142899 -95900 -39972
5560 -39972 -190543 -88939 28452 62522 52692 -42927 -74559 5759 -8036 73932 36191
5549 36191 71072 -33903 -164710 -166537 -337832 -281626 -233318 -41427 -109945 -309295 -230404
5538 -230404 -101640 -172203 -40488 -156553 -176868 -129116 -177770 -105971 -61659 -51185 -83264
$$ packed form
5615a35133l8881P5873J13948O2032j00936J11893m4576j89794O7363P8406J47794
5604A47989P0179j15135j73422j90727k3684O5442L108J29129J14611l2444j40948
5593a45902m8062K69099J49122j39130o2150r6780J1416j17233R3664J2281j18310
5582a91985J05457q9690r0130N9476l2181J80519l7356L0199J96745k02948p317
5571g9211J39310l6754R4434j33531j86594j9318r4179R2855Q0089M6999N5928
5560c9972j50571J01604J17391L4070r830r5619l1632Q0318j3795Q1968l7741
5549C6191L4881j04975j30807j827j71295N6206M8308J91891o8518j99350P8891
5538b30404J28764p0563J31715j16065k0315M7752m8654P1799M4312J0474l2079
$$ plain form
5527 -83264 -176489 -153547 -163317 -139305 -87658 26929 -55396 -162827 -224733 -247690 -293022 -186455
5515 -186455 -90076 -96772 -164936 -288252 -126112 31255 5055 139228 51491 -128828 -150544
5504 -150544 -158262 -166564 -258280 -147870 -144522 -243758 -230075 -208079 -278174 -131341 -175844 -295403
5492 -295403 -189064 -112740 -88004 -20124 55162 -126566 -138411 -2406 -90941 -240288 -219898
5481 -219898 32067 -78713 -271647 -62619 -40673 -78937 44648 -85802 -215806 -192784
5471 -192784 -141816 -106186 -191250 -173695 -22686 -81769 -281728 -188274 -71887 -86424 30141
5460 30141 -64546 -148383 3237 41377 -10598 -96642 -166357 -159676 -130239 -91862 -94569 -224313
5448 -224313 -144699 -135121 -133743 -92862 -116765 38326 -39838 -77460 -100708 -181801 -184824 -135096
$$ packed form
5527h3264r3225K2942r770K4012N1647J14587q2325j07431o1906k2957m5332J06567
5515a86455R6379o696o8164j23316J62140J57367k6200J34173q7737j80319k1716
5504a50544p718q302r1716J10410L348r9236J3683K1996p0095J46833m4503j19559
5492b95403J06339P6324K4736O7880P5286j81728j1845J36005q8535j49347K0390
5481b19898K51965j10780j92934K09028K1946l8264J23585j30450j30004K3022
5471a92784N0968L5630q5064J7555J51009n9083j99959R3454J16387j4537J16565
5460C0141r4687q3837J51620L8140n1975q6044o9715O681K9437L8377k707j29744
5448b24313P9614R578J378M0881k3903J55091p8164l7622k3248q1093l023M9728
$$ plain form
5436 -135096 -151022 -206677 -82412 11545 -136072 -134227 26917 63087 -66232 -233183 -238926
5425 -238926 -124849 -22813 -157880 -280118 -305890 -301944 -201707 -152257 -207642 -253173 -173349
5414 -173349 -46971 -41618 -13412 -5570 -8582 -107033 -173744 -144643 -146171 -16637 -33942 -85966
5402 -85966 -3832 -50948 -162884 -250972 -255171 -106793 60218 82400 -44718 -61654 -16267
5391 -16267 -53123 -109215 -68590 -181809 -140715 -85433 -195076 -316194 -188316 -77071 29282
5380 29282 57616 -173922 -272464 -145869 -25318 70367 102884 -39613 -83358 -19354 -12335
5369 -12335 11819 -10499 -145587 -233816 -375744 -248115 -96582 -266262 -197331 -61915 -236326
5358 -236326 -130807 18057 -108052 -143190 -51914 -31167 -55436 -82828 1574 -6415 -56806
$$ packed form
5436a35096j5926n5655J24265R3957j47617J845J61144L6170j29319j66951n743
5425b38926J14077J02036j35067j22238k5772L946J00237M9450n5385m5531P9824
5414a73349J26378N353K8206P842l012r8451o6711K9101j528J29534j7305n2024
5402h5966Q2134m7116j11936q8088m199J48378J67011K2182j27118j6936M5387
5391a6267l6856n6092M0625j13219M1094N5282j09643j21118J27878J11245J06353
5380B9282K8334k31538r8542J26595J20551R5685L2517j42497m3745O4004P019
5369a2335K4154k2318j35088q8229j41928J27629J51533j69680O8931J35416j74411
5358b36326J05519J48864j26109l5138R1276K0747k4269k7392Q4402p989n0391
$$ plain form
5347 -56806 34591 -19333 -102509 -84010 -114787 -184542 -168740 -17815 -192923 -225336 -36086
5336 -36086 -1293 -49213 -1359 -54967 -129028 -16714 -37027 -102188 -195850 -178668 -249471 -242928
5324 -242928 -238812 -143458 -224879 -325718 -301786 -293928 -299112 -167697 -138256 -255836 -131355
5313 -131355 -78679 -44905 -95983 -171361 -100562 -214477 -191220 -169938 -226390 -208200 -163992
5302 -163992 -151994 -154454 -60028 -109931 -173195 -193323 -139182 -2860 12201 14204 -83317 -220711
5290 -220711 -227665 -158098 -152889 -248543 -358589 -399160 -230296 -172382 -53820 -144355 -200314
5279 -200314 -82013 -119798 -65906 133543 19357 -110430 -184726 -172441 -76541 64717 -44233
5268 -44233 -56992 -107699 -202200 -111684 -76964 -76655 -208812 -162991 -38158 -29151 -1945 -100053
$$ packed form
5347e6806R1397n3924q3176J8499l0777o9755J5802J50925j75108l2413J89250
5336c6086L4793m7920M7854n3608p4061J12314k0313o5161r3662J7182p0803O543
5324b42928M116R5354q1421j00839K3932P858n184J31415K9441j17580J24481
5313a31355N2676L3774n1078p5378P0799j13915K3257K1282n6452J8190M4208
5302a63992J1998k460R4426m9903o3264k0128N4141J36322J5061K003r7521j37394
5290b20711o954O9567N209r5654j10046m0571J68864N7914J18562r0535n5959
5279b00314J18301l7785N3892J99449j14186j29787p4296J2285R5900J41258j08950
5268d4233j2759n0707r4501R0516L4720L09j32157M5821J24833R007K7206r8108
$$ plain form
5256 -100053 -175658 -324262 -375822 -239731 -93440 73313 -7558 -6715 183604 232843 219563
5245 219563 101818 -124930 -242237 -277450 -174207 -316124 -378225 -291651 -441091 -277247
5235 -277247 -50291 -41516 43570 28756 -131241 -26327 235483 225552 179520 1622 -255163
5224 -255163 -329278 -281974 -326775 -243615 -256013 -290513 -131847 -81845 -44005 -2250 -101793
5213 -101793 -1865 -142191 -147259 -11925 -70921 -213012 -262961 -97434 -137272 -81384 -89278
5202 -89278 -143024 -68253 -71831 -10757 43049 -61606 -87753 -186998 -145958 -63084 -74976 -86145
5190 -86145 -176231 -216418 -124820 -47089 30424 -923 -109567 -77185 -132680 9238 70040
5179 70040 -67977 -147098 -179582 -129823 -163164 -111176 -163831 -189264 -157038 -123889 -25717 74396
$$ packed form
5256a00053p5605j48604n1560J36091J46291J66753q0871Q43J90319M9239j3280
5245B19563j17745k26748j17307l5213J03243j41917o2101Q6574j49440J63844
5235b77247K26956Q775Q5086j4814j59997J04914K61810r931m6032j77898k56785
5224b55163p4115M7304m4801Q3160j2398l4500J58666N0002L7840M1755r9543
5213a01793R9928j40326n068J35334n8996j42091m9949J65527l9838N5888p894
5202h9278n3746P4771l578O1074N3806j04655k6147r9245M1040Q2874j1892j1169
5190h6145r0086m0187R1598P7731P7513l1347j08644L2382n5495J41918O0802
5179G0040j38017p9121l2484M9759l3341N1988n2655k5433L2226L3149R8172J00113
$$ plain form
5167 74396 -4065 -74370 -67423 -180350 -53650 -85430 -237898 -343789 -324600 -193998 -100032
5156 -100032 -129857 -68298 -46099 -125873 -75743 -27567 -138461 -115260 19818 -4866 -85692
5145 -85692 -106963 -56363 -136206 -160013 -33395 -107963 -99328 -66248 -239138 -242037 -166866 -229402
5133 -229402 -204245 -140971 -221683 -117123 -121275 -195398 -97660 -30172 105171 132770 -6692
5122 -6692 -29222 -102092 -65153 16092 -101318 -260087 -301073 -389730 -246415 -244142 -310374 -229985
5110 -229985 -281481 -258074 -37400 64552 -16754 -27474 13780 72649 154961 209344 130107
5099 130107 -53926 -132717 -189186 -116562 -148335 -242535 -240097 -265067 -96393 -98439 -110224 29087
5087 29087 -322 -64943 -56445 -153594 -138364 -119282 50413 52830 -118662 -39162 -117271 -207191
$$ packed form
5167G4396p8461p0305O947j12927J26700l1780j52468j05891J9189J30602R3966
5156a00032k9825O1559K2199p9774N0130M8176j10894K3201J35078k4684q0826
5145h5692k1271N0600p9843k3807J26618p4568Q635L3080j72890k899P5171o2536
5133b29402K5157O3274q0712J04560m152p4123R7738O7488J35343K7599j39462
5122f692k2530p2870L6939Q1245j17410j58769m0986q8657J43315K273o6232Q0389
5110b29985n1496K3407K20674J01952q1306j0720M1254N8869Q2312N4383p9237
5099A30107j84033p8791n6469P2624l1773r4200K438k4970J68674k046j1785J39311
5087B9087k9409o4621Q498r7149J5230J9082J69695K417j71492P9500p8109q9920
$$ plain form
5075 -207191 -192724 -271871 -196366 -268937 -306727 -163327 -134644 -244626 -149918 2738 -56985
5064 -56985 -38735 26456 -131757 -148845 -57758 -44890 20269 -101045 -243104 -286528 -254425
5053 -254425 -150363 -100351 -129999 -152137 -96836 -112651 41305 47391 -13401 -31259 -10481
5042 -10481 -22006 -165344 -70853 -181682 -223172 -18515 -69737 -184040 -58506 13498 -16758
5031 -16758 -40067 -164893 -147756 -159022 -230768 -76474 -30742 -108744 -75245 -74293 -10393 27929
5019 27929 -3425 141473 28133 -138056 -127365 10825 -43593 9168 71714 -85572 -202673
5008 -202673 -218843 -147898 -173212 -172886 -44426 -156283 -242397 -73405 -146816 -121136 -40494
4997 -40494 -41053 85418 100998 121776 59010 -40719 119221 216849 46397 -40142 -154383
$$ packed form
5075b07191J4467p9147P5505p2571l7790J43400K8683j09982R4708J52656n9723
5064e6985J8250O5191j58213j7088R1087J2868O5159j21314j42059m3424L2103
5053b54425J04062N0012k9648k2138N5301j5815J53956O086o0792j7858K0778
5042a0481j1525j43338R4491j10829m1490K04657n1222j14303J25534P2004l0256
5031a6758k3309j24826J7137j1266p1746J54294M5732p8002L3499R52O3900L8322
5019B7929l1354J44898j13340j66189J0691J38190n4418N2761O2546j57286j17101
5008b02673j6170P0945k5314L26J28460j11857q6114J68992p3411K5680Q0642
4997d0494n59J26471J5580K0778o2766r9729J59940R7628j70452q6539j14241
$$ plain form
4986 -154383 -190912 -157608 -146865 -177126 -112362 -232624 -259939 -182166 -135584 41771 113098
4975 113098 65053 562 -13778 76013 168665 144259 134256 108830 7497 -56507 -84680
4964 -84680 -130691 -155925 -129618 -249243 -322204 -175294 -78466 -31182 -51521 -25165 13100
4953 13100 114993 91708 -79963 -42625 -1384 -156783 -180621 -164096 -175712 -144042 -52470
4942 -52470 -68796 -83801 -201429 -84683 9320 -129060 -158329 -95189 -18991 31229 -20209
4931 -20209 -56983 -15161 11414 -47303 -65576 16816 41029 -63008 -71238 -27158 -64051 -99285
4919 -99285 -72057 -167492 -269304 -104739 25215 13066 -24110 68453 -107735 -147953 49731
4908 49731 -34081 -105825 -88898 -26009 -187445 -200449 -70767 -135963 -100733 -160876 -126860
$$ packed form
4986a54383l6529L3304J0743l0261O4764j20262k7315P7773M6582J77355P1327
4975A13098m8045o4491j4340Q9791R2652k4406j0003k5426j01333o4004k8173
4964h4680m6011k5234K6307j19625p2961J46910R6828M7284k0339K6356L8265
4953A3100J01893k3285j71671L7338M1241j55399k3838J6525j1616L1670R1572
4942e2470j6326j5005j17628J16746R4003j38380k9269O3140P6198N0220n1438
4931b0209l6774M1822K6575n8717j8273Q2392K4213j04037q230M4080l6893l5234
4919i9285K7228r5435j01812J64565J29954j2149l7176R2563j76188m0218J97684
4908D9731q3812p1744J6927O2889j61436j3004J29682o5196L5230o0143L4016
$$ plain form
4897 -126860 -79510 7351 31257 -26891 32138 26007 -103951 -212978 -87888 -153010 -120587
4886 -120587 -81906 -32467 86138 15473 -35964 -105068 -144089 -68925 -42542 -102477 -87274
4875 -87274 -256441 -263221 -141100 -123119 -127252 -14180 -78188 -243751 43425 99666 67127
4864 67127 237316 81267 -46284 48689 67222 -68280 -226302 -307714 -441502 -324868
4854 -324868 -282414 -251129 -313952 -350450 -278197 -86689 140232 139031 83446 -10373 -89191
4843 -89191 1874 -14521 76973 -1490 -182277 -198068 -206500 -127194 -203762 -123612 -177326 -203585
4831 -203585 -18932 47555 35119 88970 -57451 -124412 -224154 -148475 -61056 -106229 -164382
4820 -164382 -136190 -10595 -5135 137660 138965 68869 -91702 -150534 -151919 -117732 53480
$$ packed form
4897a26860M7350Q6861K3906n8148N9029o131j29958j09027J25090o5122L2423
4886a20587L8681M9439J18605p0665n1437o9104l9021P5164K6383n9935J5203
4875h7274j69167o780J22121J7981m133J13072o4008j65563K87176N6241l2539
4864F7127J70189j56049j27551R4973J8533j35502j58022q1412j33788J16634
4854c24868M2454L1285o2823l6498P2253J91508K26921j201n5585r3819p8818
4843h9191R1065j6395R1494p8463j80787j5791q432P9306p6568Q0150n3714k6259
4831b03585J84653O6487j2436N3851j46421o6961r9742P5679Q7419m5173n8153
4820a64382K8192J25595N460J42795J305p0096j60571n8832j385L4187J71212
$$ plain form
4809 53480 -13499 -126397 -298375 -279394 -110742 -182754 -106399 -92686 -111554 -64316 -86586
4798 -86586 -88677 -96121 9716 -42799 -69794 -11534 26206 -54869 -54480 38766 127006 126240 14994
4785 14994 -24756 -75408 -159979 -73994 23721 -152745 -337960 -274182 -261543 -246968 -211158
4774 -211158 -183267 -194389 -56930 208729 135130 61053 224631 180371 100802 36500 2136
4763 2136 -86652 -125884 -153937 -190523 -288633 -293652 -194549 -221206 -138983 51882 -124485 -61477
4751 -61477 126116 29598 -24931 119904 183705 18511 -130896 -186525 -160269 -185157 -147737
4740 -147737 -332436 -408361 -295874 -205303 -56136 101008 83931 8842 -116326 -88374 40881
4729 40881 140879 182764 123209 -45659 -123864 -25161 -48139 -114137 -46318 -171692 -203776
$$ packed form
4809E3480o6979j12898j71978J8981J68652p2012P6355J3713j8868M7238k2270
4798h6586k091p444J05837n2515k6995N8260L7740q1075L89R3246Q8240p66j11246
4785A4994l9750n0652q4571Q5985R7715j76466j85215O3778J2639J4575L5810
4774b11158K7891j1122J37459K65659p3599p4077J63578m4260p9569o4302l4364
4763B136q8788l9232k8053l6586r8110n019R9103k6657Q2223J90865j76367O3008
4751f1477J87593r6518n4529J44835O3801j65194j49407n5629K6256k4888L7420
4740a47737j84699p5925J12487R0571J49167J57144j7077p5089j25168K7952J29255
4729D0881R9998M1885n9555j68868p8205R8703k2978o5998O7819j25374l2084
$$ plain form
4718 -203776 -222345 -123025 35990 71832 92699 -13357 -70461 35583 39964 -143432 -261838
4707 -261838 -104209 -137249 -78565 -43676 -204172 -298391 -209005 -143014 -48092 -68812 -39359
4696 -39359 -41106 29506 92650 127819 184076 -2056 -202391 -160291 -137243 -140742 -38782 -51924
4684 -51924 -132115 -86849 31192 136888 222703 -23042 -93263 -37627 -10201 121037 199578
4673 199578 97136 54213 -75371 -153128 -79174 -70252 -75588 -83169 -17321 -14295 -24882 -5888
4661 -5888 119821 70271 110223 126221 -40816 -55279 25254 -4517 -87566 -32153 -116040 -72708
4649 -72708 -91299 -241556 -196305 -160215 -140964 -29523 -76278 -19289 77458 132112 47695
4638 47695 56587 11632 -22915 89085 28894 -60804 -52650 -121489 -90418 -14705 -135517 -104497
$$ packed form
4718b03776j8569R9320J59015L5842K0867j06056n7104J06044M381j83396j18406
4707b61838J57629l3040N8684L4889j60496r4219Q9386O5991R4922k0720K9453
4696c9359j747P0612O3144L5169N6257j86132k00335M2100K3048l499J01960j3142
4684e1924q0191M5266J18041J05696Q5815k45745p0221N5636K7426J31238P8541
4673A99578j02442m2923j29584p7757P3954Q922n336p581O5848L026j0587J8994
4661e888J25709m9550L9952J5998j67037j4463Q0533k9771q3049N5413q3887M3332
4649g2708j8591j50257M5251L6090J9251J11441m6755N6989R6747N4654q4417
4638D7695Q892m4955l4547J12000o0191q9698Q154o8839L1071P5713j20812L1020
$$ plain form
4626 -104497 144333 53253 -41705 99092 200850 134170 120230 188052 114992 26078 29670
4615 29670 -109645 -99767 -78294 -87598 -14849 -89559 -42801 57569 100612 -2359 -170900
4604 -170900 -25965 166778 97358 16162 180835 138208 46964 271515 179314 2918 84253
4593 84253 143212 79948 135171 118136 92909 256672 181747 116174 160224 153220 156302 249715
4581 249715 268536 245942 310685 122189 147082 272027 296940 313772 226075 111147 115517
4570 115517 152326 272029 156957 36736 167334 158685 160713 137844 257946 339089 408853
4559 408853 533005 559175 493271 540908 604235 512460 459531 399714 259110 285502 285281 205136
4547 205136 281254 238683 147990 234503 246361 270899 367064 339696 287295 441815 479377
$$ packed form
4626a04497K48830r1080r4958J40797J01758o6680j3940O7822p3060q8914L592
4615B9670j39315R878K1473r304P2749p4710M6758J00370M3043j02971j68541
4604a70900J44935J92743o9420q1196J64673m2627r1244K24551r2201j76396Q1335
4593H4253N8959o3264N5223j7035k5227J63763p4925o5573M4050p004L082R3413
4581B49715J8821k2594O4743j88496K4893J24945K4913J6832q7697j14928M370
4570A15517L6809J19703j15072j20221J30598q649K028k2869J20102Q1143O9764
4559D08853J24152K6170o5904M7637O3327r1775n2929n9817j40604K6392k21q0145
4547B05136P6118m2571r0693Q6513J1858K4538R6165k7368n2401J54520L7562
$$ plain form
4536 479377 382370 284087 174394 165996 181915 240216 190012 202271 270545 431472 444262
4525 444262 407247 453970 618842 504367 399762 396789 358891 419098 447599 540513 416745
4514 416745 334155 352935 290343 395632 411474 307376 261894 258006 315381 313828 314402 338194
4502 338194 284487 226331 224681 276111 182239 199852 102603 118807 309817 226700 234091 310907
4490 310907 269451 293650 384949 507681 345693 268438 266142 293975 408856 423215 232320
4479 232320 318177 379876 273290 291231 232253 246635 286581 303389 275377 191398 207883
4468 207883 237169 110612 65119 6833 75050 105237 90289 144464 111868 118934 31769 -80332
4456 -80332 47880 38069 101590 -23659 -94710 -137466 -40390 36750 -19247 -47824 25455 24404
$$ packed form
4536D79377r7007r8283j09693q398J5919N8301n0204J2259O8274J60927J2790
4525D44262l7015M6723J64872j14475j04605k973l7898O0207K8501R2914j23768
4514D16745q2590J8780o2592J05289J5842j04098m5482l888N7375j553N74K3792
4502C38194n3707n8156j650N1430r3872J7613r7249J6204J91010q3117P391P6816
4490C10907m1456K4199R1299J22732j61988p7255k296K7833J14881J4359j90895
4479B32320Q5857O1699j06586J7941n8978J4382L9946J6808k8012q3979J6485
4468B07883K9286j26557m5493n8286O8217L0187j4948N4175l2596P066q7165j12101
4456h0332J28212r811O3521j25249p1051m2756R7076P7140n5997k8577P3279j051
$$ plain form
4444 24404 -3214 11922 38965 47503 33984 27326 83553 33637 76474 68324 -58517 -108063
4432 -108063 40156 98251 -61799 33848 19543 -19180 79029 87176 55346 82789 141590
4421 141590 194202 153287 -75632 -1773 28403 -4025 -17121 -163258 -51854 -10813 -52604
4410 -52604 25347 129047 117020 79148 59690 12913 -23434 33644 108359 134836 149283 142129
4398 142129 -60314 -198081 -148999 -61354 136562 235732 27160 6683 -66495 4958 79912
4387 79912 1815 2635 -30463 -193793 -20389 -65330 -168462 -11176 114139 70516 -79066
4376 -79066 45704 152210 107663 129885 93931 5848 -64598 -91195 -86762 -117146 7910
4365 7910 -130769 -190852 42022 49383 113030 57687 999 92901 3318 193872 257336 6061
$$ packed form
4444B4404k7618J5136K7043Q538j3519o658N6227m9916M2837q150j26841m9546
4432a08063J48219N8095j60050R5647j4305l8723R8209Q147l1830K7443N8801
4421A41590N2612m0915k28919P3859L0176l2428j3096j46137J11404M1041m1791
4410e2604P7951J03700j2027l7872j9458m6777l6347N7078P4715K6477J4447p154
4398A42129k02443j37767M9082Q7645J97916R9170k08572k0477p3178P1453P4954
4387G9912p8097Q20l3098j63330J73404m4941j03132J57286J25315m3623j49582
4376g9066J24770J06506m4547K2222l5954q8083p0446k6597M433l0384J25056
4365G910j38679o0083K32874P361O3647n5343n6688R1902q9583J90554O3464k51275
$$ plain form
4353 6061 31210 -7355 -7515 112554 -4547 -16620 -93709 -52091 -2921 12563 52632 59173
4341 59173 3923 23033 21568 127819 93415 -3781 -73168 -180731 -93708 -98471 -107040 -114586
4329 -114586 -114396 33224 91318 38624 69815 -17782 30144 124335 90718 69307 68785 -111153
4317 -111153 -205423 -74125 -33788 12499 162051 9095 -81391 -139238 -9495 110936 86458
4306 86458 122928 13958 -104206 -15527 -50273 -14331 53512 -34080 -16979 -45565 -40737 -3748
4294 -3748 72618 13229 -21009 -29192 -62140 -59830 -47475 -69153 -136392 -162657 -88739 -58962
4282 -58962 11476 38344 69187 43899 97644 29855 68609 250701 156742 61475 43561 -77217
4270 -77217 -72281 -52039 64088 105901 103727 133405 100372 119821 274450 315628 96601 19989
$$ packed form
4353F061K5149l8565j60J20069j17101j2073p7089M1618M9170J5484M0069O541
4341E9173n5250J9110j465J06251l4404r7196o9387j07563Q7023m763q569p546
4329a14586J90J47620N8094n2694L1191q7597M7926R4191l3617k1411n22j79938
4317a11153r4270J31298M0337M6287J49552j52956r0486n7847J29743J20431k4478
4306H6458L6470j08970j18164Q8679l4746L5942O7843q7592J7101k8586M828L6989
4294c748P6366n9389l4238q183l2948K310J2355k1678o7239k6265P3918K9777
4282e8962P0438K6868L0843k5288N3745o7789L8754J82092r3959r5267j7914j20778
4270g7217M936K0242J16127M1813k174K9678l3033J9449J54629M1178k19027p6612
$$ plain form
4258 19989 605 23143 50030 73488 151823 216087 253223 217749 131991 97016 144354 159722
4246 159722 114899 143330 172801 56389 116431 117860 58045 97570 40536 135476 44496 108843
4234 108843 201973 252234 284959 173934 146948 185696 121108 52436 38871 101967 -46532
4223 -46532 -30171 19327 -92478 5933 124384 125219 97727 101606 173668 205617 194947 169766
4211 169766 34689 101728 136092 60147 12669 -5897 56452 138362 58947 15040 -103492
4200 -103492 18183 135628 62494 119752 75785 38720 74726 65789 81967 9959 38556
4189 38556 96642 47851 22463 -57384 -56046 59723 24919 44435 29933 -72986 -29519 48212
4177 48212 102381 57100 115568 64349 -11394 147094 230310 205619 169161 38905 127465
$$ packed form
4258A9989j9384K2538K6887K3458P8335O4264L7136l5474q5758l4975M7338J5368
4246A59722m4823K8431K9471j16412O0042J429n9815L9525n7034R4940r0980O4347
4234A08843R3130N0261L2725j11025k6986L8748o4588o8672j3565O3096j48499
4223d6532J6361M9498j11805R8411J18451Q35k7492L879P2062L1949j0670k5181
4211A69766j35077O7039L4364p5945m7478j8566O2349Q1910p9415m3907j18532
4200a03492J21675J17445p3134N7258m3967l7065L6006q937J6178p2008K8597
4189C8556N8086m8791k5388p9847J338J15769l4804J9516j4502j02919M3467P7731
4177D8212N4169m5281N8468n1219p5743J58488Q3216k4691l6458j30256Q8560
$$ plain form
4166 127465 112957 66500 82039 38184 35375 16454 118917 84063 46326 36326 79377 64844
4154 64844 22034 14431 -33533 -37881 -73148 -4859 49779 80001 5572 25032 15452 -17136
4142 -17136 82727 181195 254738 264820 202519 130416 38638 160972 178297 37488 6915
4131 6915 -33858 -136571 -148362 -43744 -49300 -123481 -40605 64923 177509 305635 268795
4120 268795 196366 154988 107316 118694 150050 126332 39543 139573 107121 55184 38870
4109 38870 -126231 -98188 59508 73667 -80178 13448 36035 21768 93513 34435 -3171
4098 -3171 148049 240929 141176 144810 185424 95332 54919 21698 20637 -53392 -161887 -21316
4086 -21316 -16038 72533 96699 -183534 15825 166105 210441 275938 394205 218539 141344
$$ packed form
4166A27465j4508m6457J5539m3855k809j8921J02463l4854l7737j0000M3051j4533
4154F4844m2810p603m7964m348l5267O8289N4638L0222p4429J9460r580l2588
4142a7136R9863R8468P3543J0082o2301p2103r1778J22334J7325j40809l0573
4131F915m0773j02713j1791J04618n556p4181Q2876J05528J12586J28126l6840
4120B68795p2429m1378m7672J1378L1356k3718q6789J00030l2452n1937j6314
4109C8870j65101K8043J57696J4159j53845R3626K2587j4267P1745n9078l7606
4098c171J51220R2880r9753L634M0614r0092m0413l3221j061p4029j08495J40571
4086b1316N278Q8571K4166k80233J99359J50280M4336O5497J18267j75666p7195
$$ plain form
4075 141344 186672 157684 80373 3580 -95527 -82857 27264 -33792 15713 -36687 -27712 62823
4063 62823 213826 221333 192052 318271 416861 419750 441010 262055 4180 -34405 86036
4052 86036 219451 148611 36820 31643 92888 171374 463338 418024 210306 190598 32116
4041 32116 99271 201825 74566 93161 275390 241700 150833 249985 123862 190359 411405
4030 411405 347849 392186 280879 294756 444951 381750 305695 216000 149798 151299 192595
4019 192595 112056 90425 215394 276723 290108 330054 190902 81736 123779 295221 331705
4008 331705 332432 197212 83999 209383 216428 275466 280616 144434 60675 171470 248941
3997 248941 403621 273439 66173 183656 237465 71964 229633 280926 172770 233724
$$ packed form
4075A41344M5328k8988p7311p6793r9107J2670J10121o1056M9505n2400Q975R0535
4063F2823J51003P507k9281J26219R8590K889K1260j78955k57875l8585J20441
4052H6036J33415p0840j11791n177O1245P8486K91964m5314k07718j9708j58482
4041C2116O7155J02554j27259J8595J82229l3690r0867R9152j26123O6497K21046
4030D11405o3556M4337j11307J3877J50195o3201p6055q9695o6202J501M1296
4019A92595q0539k1631J24969O1329J3385L9946j39152j09166M2043J71442L6484
4008C31705P27j35220j13213J25384P045N9038N150j36182q3759J10795P7471
3997B48941J54680j30182k07266J17483N3809j65501J57669N1293j08156O0954
$$ plain form
3987 233724 443493 382063 395704 325318 207982 357224 370850 329739 358189 189806 178130
3976 178130 221829 83608 143876 231621 143058 144297 279002 340719 390281 256435 273342
3965 273342 297914 285843 233351 97917 205472 244226 181284 105621 116278 341649 339482
3954 339482 303791 230601 -4224 -56030 39499 170627 221106 156803 179116 71163 170067
3943 170067 247610 199604 277740 228018 111598 113309 134507 246295 300208 97017 83231
3932 83231 114674 123323 -79235 -122221 -24136 -14502 68393 115239 59347 35209 140655 249739
3920 249739 222970 192948 191709 116663 94995 116495 24585 -13436 74089 -109156 -252571
3909 -252571 -187062 9553 43088 40833 -74001 -136140 27473 148731 130008 169571 157034
$$ packed form
3987B33724K09769o1430J3641p0386j17336J49242J3626m1111K8450j68383j1676
3976A78130M3699j38221O0268Q7745q8563J239J34705O1717M9562j33846J6907
3965B73342K4572j2071n2492j35434J07555L8754o2942p5663J0657K25371k167
3954C39482l5691p3190k34825n1806R5529J31128N0479o4303K2313j07953R8904
3943A70067P7543m8006P8136m9722j16420J711K1198J11788N3913k03191j3786
3932H3231L1443Q649k02558m2986R8085R634Q2895M6846n5892k4138J05446J09084
3920B49739k6769l0022j239p5046k1668K1500r1910l8021Q7525j83245j43415
3909b52571O5509J96615L3535k255j14834o2139J63613J21258j8723L9563j2537
$$ plain form
3898 157034 193352 102030 78555 137864 71836 169637 23131 -87544 -101230 -145940 -74368
3887 -74368 -7734 -80294 -67530 81134 167060 120972 -32550 -48694 51501 165930 189233
3876 189233 88758 38033 22122 9731 55880 -51272 -8332 75001 18556 -76908 -144301
3865 -144301 70933 60363 93360 78549 18051 190899 109673 105876 34954 -50843 27166
3854 27166 32490 -110045 -48216 -1007 -91070 50300 155767 191406 244232 211618 173965
3843 173965 114590 141118 100454 103321 99717 35137 31254 59666 39471 -91314 -262132 -163868
3831 -163868 49640 25943 15393 43961 -64583 41689 160735 51951 181605 188315 145073
3820 145073 5771 11361 34176 -126731 -53634 61884 -66203 -1735 -50744 -21995 -13744
$$ packed form
3898A57034L6318r1322k3475N9309o6028R7801j46506j10675j3686m4710P1572
3887g4368O6634p2560J2764J48664Q5926m6088j53522j6144J00195J14429K3303
3876A89233j00475n0725j5911j2391M6149j07152M2940Q3333n6445r5464o7393
3865a44301K15234j0570L2997j4811o0498J72848q1226l797p0922q5797P8009
3854B7166N324j42535O1829M7209r0063J41370J05467L5639N2826l2614l7653
3843A73965n9375K6528m0664K867l604o4580l883K8412k0195j30785j70818R8264
3831a63868K13508k3697j0550K8568j08544J06272J19046j08784J29654O710m3242
3820A45073j39302N590K2815j60907P3097J15518j28087O4468m9009K8749Q251
$$ plain form
3809 -13744 -3493 149530 135296 51851 91177 65975 131581 187884 131490 23549 -145015
3798 -145015 -72841 -5606 -34279 -187216 -290956 -17514 49300 69004 159697 141655 369229
3787 369229 381131 332673 398065 161450 48390 211063 174415 34667 -37510 -112743 -163934
3776 -163934 -137607 10293 139394 104758 135598 67714 209199 401089 298968 287312 173277
3765 173277 61033 -15212 2910 85448 -48910 31166 218355 152627 155029 203430 410303
3754 410303 464547 333543 299058 148619 183103 351913 410523 289049 186803 146462 106810
3743 106810 155532 274544 387390 327000 237192 237818 280296 542857 490739 332236 257804
3732 257804 186270 214792 275859 334529 271015 328167 400773 364464 459526 344055 289857
$$ packed form
3809a3744J0251J53023j4234q3445L9326k5202O5606N6303n6394j07941j68564
3798a45015P2174O7235k8673j52937j03740K73442O6814J9704R0693j8042K27574
3787C69229J1902m8458O5392k36615j13060J62673l6648j39748p2177p5233n1191
3776a63934K6327J47900J29101l4636L0840o7884J41485J91890j02121j1656j14035
3765A73277j12244p6245J8122Q2538j34358Q0076J87189o5728K402M8401K06873
3754D10303N4244j31004l4485j50439L4484J68810N8610j21474j02246m0341l9652
3743A06810M8722J19012J12846o0390q9808O26M2478K62561n2118j58503p4432
3732B57804p1534K8522O1067N8670o3514N7152P2606l6309R5062j15471n4198
$$ plain form
3721 289857 254593 220422 252646 305472 192295 275197 339936 259963 326087 344857 275609
3710 275609 311884 328197 275216 377029 337161 181805 240572 311584 142236 83427 94490
3699 94490 71796 160247 222187 72178 170670 298103 397388 495188 326747 176404 139000
3688 139000 167653 268478 232595 128746 44157 106459 -36544 86302 222785 127046 78081
3677 78081 84156 52343 128230 369357 233586 248034 228113 125426 273856 114333 14281
3666 14281 3075 2484 111203 214138 234089 86604 43964 111813 81312 158588 153313 51673
3654 51673 104209 57999 24671 122605 84213 108492 199245 145391 55211 116643 129800 84158
3642 84158 108227 24564 37658 148280 148195 205740 205610 57756 95061 68668 -46488 101679
$$ packed form
3721B89857l5264l4171L2224N2826j13177Q2902O4739p9973O6124J8770o9248
3710B75609L6275J6313n2981J01813l9868j55356N8767P1012j69348n8809J1063
3699I4490k2694Q8451O1940j50009R8492J27433R9285R7800j68441j50343l7404
3688A39000K8653J00825l5883j03849q4589O2302j43003J22846J36483r5739m8965
3677G8081O075l1813P5887K41127j35771J4448j9921j02687J48430j59523j00052
3666A4281j1206n91J08719J02935J9951j47485m2640O7849l0501P7276n275j01640
3654E1673N2536m6210l3328R7934l8392K4279R0753n3854r0180O1432J3157m5642
3642H4158K4069q3663J3094J10622q5N7545j30j47854L7305k6393j15156J48167
$$ plain form
3630 101679 157169 96881 126477 169730 221400 313068 188135 -8599 94186 184147 230086
3619 230086 259791 139712 27092 77901 58050 27246 81783 76750 -28412 87534 40896
3608 40896 115946 193735 21244 118182 159270 203668 262156 181894 154511 94803 171420 165531
3596 165531 62037 88468 -21311 1585 99103 114744 193525 229148 303660 334640 285735
3585 285735 230743 244617 328394 423009 266161 229831 269458 152731 144983 112527 -45855
3574 -45855 25433 48997 146509 -54527 -110330 87499 115966 156380 202417 275397 225839
3563 225839 214288 167221 141046 219907 252730 196330 168723 92408 -10047 16313 125398
3552 125398 148092 129842 101585 289782 217393 176743 263914 184205 187853 198904 110000 206447
$$ packed form
3630A01679N5490o0288K9596M3253N1670R1668j24933j96734J02785Q9961M5939
3619B30086K9705j20079j12620N0809j9851l0804N4537n033j05162J15946m6638
3608D0896P5050P7789j72491R6938M1088M4398N8488q0262k7383n9708P6617n889
3596A65531j03494K6431j09779K2896R7518J5641P8781L5623P4512L0980m8905
3585B85735n4992J3874Q3777R4615j56848l6330L9627j16727p748l2456j58382
3574d5855P1288K3564R7512k01036n5803J97829K8467M0414M6037P2980m9558
3563B25839j1551m7067k6175P8861L2823n6400k7607p6315j02455K6360J09085
3552A25398K2694j8250k8257J88197p2389m0650Q7171p9709L648J1051q8904R6447
$$ plain form
3540 206447 182158 146538 212606 229329 341697 425655 380561 246089 245877 308512 292597 327163
3528 327163 224997 164619 191875 173904 210825 149951 129694 129877 143543 170132 203023 303949
3516 303949 337898 265908 224838 336350 418163 404648 362130 285501 168027 166258 185814
3505 185814 216533 127345 124671 14292 66794 231399 268619 335114 419843 306370 270134
3494 270134 392015 434947 462474 320378 202653 227637 246812 232778 272321 310364 114449
3483 114449 6962 98022 357265 491344 365360 194120 210854 350796 380289 480640
3473 480640 302208 203581 254399 104610 171871 443708 328325 150409 77979 194860
3463 194860 329639 377561 283049 350400 373914 377851 415471 318297 316242 356551 334971 279990
$$ packed form
3540B06447k4289l5620O6068J6723J12368Q3958m5094j34472k12O2635j5915L4566
3528C27163j02166o0378K7256j7971L6921o0874k0257J83J3666K6589L2891J00926
3516C03949L3949p1990m1070J11512Q1813j3515m2518p6629j17474j769J9556
3505A85814L0719q9188k674j10379N2502J64605L7220O6495Q4729j13473l6236
3494B70134J21881M2932K7527j42096j17725K4984J9175j4034L9543L8043j95915
3483A14449j07487R1060K59243J34079j25984j71240J6734J39942K9493J00351
3473D80640j78432r8627N0818j49789O7261K71837j15383j77916p2430J16881
3463A94860J34779M7922r4512O7351K3514L937L7620r7174k055M0309k1580n4981
$$ plain form
3451 279990 280385 112572 180435 331607 317631 320936 437421 406696 374446 426312 389985 358473
3439 358473 381430 480106 361937 385599 374106 224787 300416 398149 473963 445121 225072
3428 225072 311602 405242 542246 654473 490970 240003 231361 374355 457409 414975 365202
3417 365202 213076 232280 335724 332877 494289 501750 324153 378504 327036 416235 626512
3406 626512 559408 538814 460710 297642 277045 288361 346517 350484 347847 252380 334759 475109
3394 475109 393403 522389 609546 604110 581989 559355 419734 475277 553637 407173 334873
3383 334873 450126 391665 424126 488085 483548 601551 663435 651053 606125 431767 472160
3372 472160 601898 486926 494248 570444 320561 350202 399788 401411 505997 570497 565490
$$ packed form
3451B79990L95j67813O7863J51172j3976L305J16485l0725l2250N1866l6327l1512
3439C58473K2957R8676j18169K3662j1493j49319P5629R7733P5814k8842k20049
3428B25072Q6530R3640J37004J12227j63503k50967q642J42994Q3054m2434m9773
3417C65202j52126J9204J03444k847J61412P461j77597N4351n1468Q9199K10277
3406F26512o7104k0594p8104j63068k0597J1316N8156L967k637r5467Q2379J40350
3394D75109q1706J28986Q7157n436k2121k2634j39621N5543P8360j46464p2300
3383C34873J15253n8461L2461O3959m537J18003O1884j2382m4928j74358M0393
3372D72160J29738j14972P322P6196k49883K9641M9586J623J04586O4500n007
$$ plain form
3361 565490 513376 547823 527582 562652 639015 567788 479689 418789 284235 434350 449483
3350 449483 400241 488780 470082 425510 373471 350785 541688 699931 512914 572695 744354
3339 744354 720476 680467 771193 647790 568275 760867 786272 586192 608352 584112 556703
3328 556703 614991 546788 673000 751295 800686 841888 898157 888287 956314 939232 907036 1031800
3316 1031800 1074296 1134982 1130160 995753 927943 1001622 943432 833892 970295 1035928 970935
3305 970935 1048059 1030671 1071367 1085554 1163380 1190903 1069240 1238593 1326220 1286245 1311368
3294 1311368 1320425 1330137 1242413 1187478 1241294 1154668 1261509 1452285 1376097 1493595 1630187
3283 1630187 1612984 1640236 1745943 1718518 1698696 1699310 1436887 1351362 1467380 1572292 1612276
$$ packed form
3361E65490n2114L4447k0241L5070P6363p1227q8099o0900j34554J50115J5133
3350D49483m9242Q8539j8698m4572n2039k2686J90903J58243j87017N9781J71659
3339G44354k3878m0009R0726j23403p9515J92592K5405k00080K2160k4240k7409
3328E56703N8288o8203J26212P8295M9391M1202N6269r870O8027j7082l2196J24764
3316A031800M2496O0686m822j34407o7810P3679n8190j09540J36403O5633o4993
3305I70935P7124j7388M0696J4187P7826K7523j21663J69353Q7627l9975K5123
3294A311368R057R712q7724n4935N3816q6626J06841J90776p6188J17498J36592
3283A630187j7203K7252J05707k7425j9822O14k62423q5525J16018J04912L9984
$$ plain form
3272 1612276 1626937 1654741 1679535 1714072 1814436 1872660 1856532 1891730 1979420 1964061 2024795
3261 2024795 2019024 1959082 2145559 2123879 2053849 1973539 1985457 2081550 1975353 2018601 2082734
3250 2082734 1992493 2001541 2180630 2176636 2214451 2303704 2381724 2370342 2331742 2503457 2702527
3239 2702527 2792924 2932129 2855588 2834672 2974384 3065214 3117717 3143436 3210913 2987263 2913952
3228 2913952 3024117 3125004 3294758 3214787 3083453 3039982 2986138 3136300 3134441 3135555 3263926
3217 3263926 3148270 3138316 2966204 2827670 2826106 2727260 2719101 2775777 2636667 2528108 2420203
3206 2420203 2300368 2365407 2362446 2162136 2184158 2131391 2053976 2075607 2096816 2270992 2289538
3195 2289538 2219488 2223734 2282906 2312191 2346162 2428185 2427907 2507777 2405949 2416789 2464248 2394978
$$ packed form
3272A612276J4661K7804K4794L4537J00364N8224j6128L5198Q7690j5359O0734
3261B024795n771n9942J86477k1680p0030q0310J1918R6093j06197M3248O4133
3250B082734r0241R048J79089l994L7815Q9253P8020j1382l8600J71715J99070
3239B702527R0397J39205p6541k0916J39712R0830N2503K5719O7477k23650p3311
3228B913952J10165J00887J69754p9971j31334m3471n3844J50162j859J114J28371
3217C263926j15656r954j72112j38534j564r8846q159N6676j39110j08559j07905
3206B420203j19835O5039k961k00310K2022n2767p7415K1631K1209J74176J8546
3195B289538p0050M246N9172K9285L3971Q2023k78P9870j01828J0840M7459o9270
$$ plain form
3183 2394978 2477780 2410249 2418640 2534105 2461733 2507104 2523810 2393581 2436017 2529637 2590048
3172 2590048 2625283 2652458 2598115 2647142 2667606 2694855 2729402 2773493 2869111 2823761 2680457
3161 2680457 2711198 2781893 3000724 3043761 3031944 2921305 2847624 2823907 3016204 3144402 3151151
3150 3151151 3072987 3045094 2966540 3116059 3156046 3210362 3284395 3183477 3249873 3247512 3218832
3139 3218832 3311390 3392868 3423708 3433907 3561323 3501712 3553033 3655480 3608438 3767205 3672024
3128 3672024 3569097 3547962 3718448 3771290 3714333 3791599 3838056 3990672 4216885 4297767 4267618
3117 4267618 4320155 4499781 4573433 4825570 5000030 4899684 4978163 5004757 4966039 4981132 5330371
3106 5330371 5482271 5386372 5573276 5699981 5862345 5927553 6108575 6192352 6302124 6603125
$$ packed form
3183B394978Q2802o7531Q391J15465p2372M5371J6706j30229M2436R3620O0411
3172B590048L5235K7175n4343M9027K0464K7249L4547M4091R5618m5350j43304
3161B680457L0741P0695K18831M3037j1817j10639p3681k3717J92297J28198O749
3150C151151p8164k7893p8554J49519L9987N4316P4033j00918O6396k361k8680
3139C218832R2558Q1478L0840J0199J27416n9611N1321J02447m7042J58767r5181
3128C672024j02927k1135J70486N2842n6957P7266M6457J52616K26213Q0882l0149
3117D267618N2537J79626P3652K52137J74460j00346P8479K6594l8718J5093L49239
3106E330371J51900r5899J86904J26705J62364O5208J81022Q3777J09772L01001
$$ plain form
3096 6603125 6722021 6698698 6867825 7022953 7284051 7471488 7597258 7756999 7836411 8002440
3086 8002440 8191439 8241659 8192367 8399464 8609163 8504724 8448684 8508493 8645355 8685960
3076 8685960 8688058 8658135 8668136 8698787 8848789 8881518 9003835 9068228 9043759 9089341 9296048
3065 9296048 9342417 9441943 9481908 9460283 9459059 9576365 9763368 9772499 9785287 9840046 9992434
3054 9992434 10377125 10717814 10647122 10790393 11099273 11324601 11475638 11769753 11936752 12057559
3044 12057559 12380299 12578292 12711552 13082283 13258743 13481168 13794967 14091988 14472492
3035 14472492 14730341 15069142 15427639 15651336 16084841 16619599 16865594 17187329 17632905
3026 17632905 17989437 18429228 18804184 19407331 19912008 20521152 21110166 21595449 22345090
$$ packed form
3096F603125J18896k3323J69127J55128K61098J87437J25770J59741P9412J66029
3086H002440J88999N0220m9292K07097K09699j04439n6040N9809J36862M0605
3076H685960K098k9923J0001L0651J50002L2729J22317O4393k4469M5582K06707
3065I296048M6369R9526L9965k1625j224J17306J87003R131J2788N4759J52388
3054I992434L84691L40689p0692J43271L08880K25328J51037K94115J66999J20807
3044A2057559L22740J97993J33260L70731J76460K22425L13799K97021L80504
3035A4472492K57849L38801L58497K23697M33505N34758K45995L21735M45576
3026A7632905L56532M39791L74956O03147N04677O09144N89014M85283P49641
$$ plain form
3017 22345090 23331086 24117162 24845945 25579724 26376147 27341757 28381333 29370170 30164463
3008 30164463 31171278 32381671 33638879 34851910 36142784 37542453 39006576 40585359
3000 40585359 42331041 43919811 45856388 47796888 49467062 51421753 53474560 55238701
2992 55238701 57193722 59287714 61299250 63537782 65854083 68176296 70484597 73015625
2984 73015625 75691656 78508472 81287232 83843366 86620349 89214020 91856723 94395135
2976 94395135 96693773 99042767 101267816 103394007 105558668 107718559 109822351 112217869
2968 112217869 114476765 116519590 118655306 120787712 122802311 124846159 126566892 127929900
2960 127929900 129198114 130498275 131641049 132941788 134361852 135673005 137152884 138741408
$$ packed form
3017B2345090R85996P86076P28783P33779P96423R65610J039576R88837P94293
3008C0164463J006815J210393J257208J213031J290874J399669J464123J578783
3000D0585359J745682J588770J936577J940500J670174J954691K052807J764141
2992E5238701J955021K093992K011536K238532K316301K322213K308301K531028
2984G3015625K676031K816816K778760K556134K776983K593671K642703K538412
2976I4395135K298638K348994K225049K126191K164661K159891K103792K395518
2968A12217869K258896K042825K135716K132406K014599K043848J720733J363008
2960A27929900J268214J300161J142774J300739J420064J311153J479879J588524
$$ plain form
2952 138741408 140234372 142065366 143806710 145514488 147548710 149727766 151975015 154720879
2944 154720879 157742611 161334993 165855087 171159735 177492281 184823537 193365875 203274421
2936 203274421 214714273 227926597 242949113 260037773 278785417 298658335 318940660
2929 318940660 338029546 354276810 366272795 373236288 374724248 370996832 363252433 352474822
2921 352474822 339949231 327000439 314397130 302740805 292188401 282546167 273362800
2914 273362800 263925785 253794487 242595749 229971858 216387301 202056139 187210637
2907 187210637 172722814 158902620 145914517 134240783 123692504 114199697 105713301
2900 105713301 98172492 91350867 85408534 80012352 75188140 70854549 66791023 63205562
$$ packed form
2952A38741408J492964J830994J741344J707778K034222K179056K247249K745864
2944A54720879L021732L592382M520094N304648O332546P331256Q542338R908546
2936B03274421J1439852J3212324J5022516J7088660J8747644J9872918K0282325
2929C18940660J9088886J6247264J1995985O963493J487960l727416p744399j0777611
2921C52474822j2525591j2948792j2603309j1656325j0552404r642234r183367
2914B73362800r437015j0131298j1198738j2623891j3584557j4331162j4845502
2907A87210637j4487823j3820194j2988103j1673734j0548279r492807q486396
2900A05713301p540809o821625n942333n396182m824212m333591m063526l585461
$$ plain form
2892 63205562 60197428 57536107 55053233 52632367 50465355 48665737 47002778 45322057
2884 45322057 43747762 42248841 40893882 39624625 38485834 37373125 36247774 35317557
2876 35317557 34506650 33529364 32719034 32004092 31262486 30572276 29996593 29408586 28704975
2867 28704975 28087172 27448702 26830405 26207605 25684471 25155784 24433101 23999436 23523264
2858 23523264 23094681 22641297 22095541 21676978 21231486 20862069 20419017 19901851 19470312
2849 19470312 19133200 18782649 18331419 17826928 17506721 17301438 16971844 16664305 16281469
2840 16281469 15896293 15668119 15528488 15335483 15041936 14726474 14417477 14120428 13974100
2831 13974100 13969221 13838262 13531001 13316499 13127294 12917412 12959795 12794275 12424968 12257002
$$ packed form
2892F3205562l008134k661321k482874k420866k167012j799618j662959j680721
2884D5322057j574295j498921j354959j269257j138791j112709j125351r30217
2876C5317557q10907r77286q10330p14942p41606o90210n75683n88007p03611
2867B8704975o17803o38470o18297o22800n23134n28687p22683m33665m76172
2858B3523264m28583m53384n45756m18563m45492l69417m43052n17166m31539
2849A9470312l37112l50551m51230n04491l20207k05283l29594l07539l82836
2840A6281469l85176k28174j39631j93005k93547l15462l08997k97049j46328
2831A3974100m879j30959l07261k14502j89205k09882M2383j65520l69307j67966
$$ plain form
2821 12257002 12157339 12068762 12050266 11858673 11644901 11575021 11559915 11484028 11302533 11170542
2811 11170542 11235048 11188733 11149668 11104955 11081782 10925195 11003033 11003291 10863724 10939783 11039829
2800 11039829 11056481 10882554 10867075 10924331 10876780 10876312 10900513 10820123 10711413 10558904 10470362
2789 10470362 10522749 10496719 10339886 10099504 9876177 9810973 9720557 9774244 9795989 9386008
2779 9386008 9309015 9330405 9267359 9078564 8952788 8747355 8713160 8639290 8443157 8283991
2769 8283991 8252058 8204181 8144556 7951573 7789472 7850534 7814638 7777584 7851027 7827195 7745275
2758 7745275 7606643 7569916 7630652 7472531 7443401 7218024 6982992 6881372 6794751 6921165
2748 6921165 6984403 6741111 6575462 6568486 6505564 6620343 6460032 6252522 6376872 6322084
$$ packed form
2821A2257002r9663q8577j8496j91593k13772o9880j5106p5887j81495j31991
2811A1170542O4506m6315l9065m4713k3173j56587P7838K58j39567P6059J00046
2800A1039829J6652j73927j5479N7256m7551m68K4201q0390j08710j52509q8542
2789A0470362N2387k6030j56833k40382k23327o5204r0416N3687K1745m09981
2779I386008p6993K1390o3046j88795j25776k05433l4195p3870j96133j59166
2769H283991l1933m7877n9625j92983j62101O1062l5896l7054P3443k3832q1920
2758G745275j38632l6727O0736j58121k9130k25377k35032j01620q6621J26414
2748F921165O3238k43292j65649o976o2922J14779j60311k07510J24350n4788
$$ plain form
2738 6322084 6297487 6368117 6359279 6353210 6354601 6208311 6165094 6164536 6164613 6220172 6228798 6142498 6263448
2725 6263448 6328689 6147847 6207271 6349376 6269590 6322668 6517314 6435539 6294027 6354572 6444161
2714 6444161 6359228 6538732 6728790 6464828 6484260 6478310 6542345 6785912 6912666 6820241 6850838
2703 6850838 6918351 7045393 7295486 7435891 7392470 7440642 7478292 7553227 7779130 7856399 7915135
2692 7915135 7931789 7882233 8005073 8273518 8537906 8799871 8860234 8950560 9195388 9469041
2682 9469041 9824094 10099204 10282569 10384186 10593768 10711311 10880876 11074351 11202429 11437445
2672 11437445 11741253 11923031 12219448 12590625 12874067 13129976 13426898 13794733 14246398
2663 14246398 14680434 14914086 15181114 15615831 15953615 16259230 16717092 16926886 17166843
$$ packed form
2738F322084k4597P0630q838o069J391j46290m3217n58P7N5559Q626q6300J20950
2725F263448O5241j80842N9424J42105p9786N3078J94646q1775j41512O0545Q9589
2714F444161q4933J79504J90058k63962J9432n950O4035K43567J26754r2425L0597
2703F850838O7513J27042K50093J40405m3421M8172L7650P4935K25903P7269N8736
2692G915135J6654m9556J22840K68445K64388K61965O0363R0326K44828K73653
2682I469041L55053K75110J83365J01617K09582J17543J69565J93475J28078K35016
2672A1437445L03808J81778K96417L71177K83442K55909K96922L67835M51665
2663A4246398M34036K33652K67028M34717L37784L05615M57862K09794K39957
$$ plain form
2654 17166843 17610747 17990726 18425862 18869650 19321200 19630282 20040249 20503706 20879659
2645 20879659 21425727 21859326 22301008 22710318 23203222 23736459 24118979 24666879 25180577
2636 25180577 25623112 26223798 26883317 27378575 27827497 28350612 28981263 29826606 30721701
2627 30721701 31576679 32441802 33345613 34376615 35392616 36608737 37854649 39070527 40447940
2618 40447940 41883575 43300038 44985544 46893295 48763071 50944084 53183248 55686168
2610 55686168 58569045 61751167 65064422 68891592 73157187 77785421 83050385 88928167
2602 88928167 95334977 102772177 111056288 120447416 130928424 142284798 154078743 165698538
2594 165698538 176625738 185890913 193519938 199782477 204872198 209521496 214535055 220215030
$$ packed form
2654A7166843M43904L79979M35136M43788M51550L09082M09967M63457L75953
2645B0879659N46068M33599M41682M09310M92904N33237L82520N47900N13698
2636B5180577M42535O00686O59519M95258M48922N23115O30651Q45343Q95095
2627C0721701Q54978Q65123R03811J031002J016001J216121J245912J215878J377413
2618D0447940J435635J416463J685506J907751J869776K181013K239164K502920
2610E5686168K882877L182122L313255L827170M265595M628234N264964N877782
2602H8928167O406810P437200Q284111R391128J0481008J1356374J1793945J1619795
2594A65698538J0927200R265175P629025O262539N089721M649298N013559N679975
$$ plain form
2586 220215030 226822357 234632945 243390921 252511374 261560617 269736594 275906214 279499614
2578 279499614 280156878 277447513 271753670 264059433 254855682 244842716 235045328 225918399
2570 225918399 217669053 210747030 204842584 199257801 193746409 187777813 180570486 171902149
2562 171902149 161722313 150402549 138917952 127700811 117098457 107601864 99046387
2555 99046387 91356312 84466909 78288014 72791932 67836145 63500212 59601071 56022322
2547 56022322 53031139 50216031 47635667 45363446 43104789 41189442 39541361 37942043
2539 37942043 36469417 35190726 33759965 32332109 31270729 30219871 29208038 28187482
2531 28187482 27299442 26459951 25499166 24693972 23978264 23369536 22847639 22365735 21752249
$$ packed form
2586B20215030O607327P810588Q757976R120453R049243Q175977O169620L593400
2578B79499614O57264k709365n693843p694237r203751j0012966r797388r126929
2570B25918399q249346o922023n904446n584783n511392n968596p207327q668337
2562A71902149j0179836j1319764j1484597j1217141j0602354r496593q555477
2555I9046387p690075o889403o178895n496082m955787m335933l899141l578749
2547E6022322k991183k815108k580364k272221k258657j915347j648081j599318
2539C7942043j472626j278691j430761j427856j061380j050858j011833j020556
2531B8187482q88040q39491r60785q05194p15708o08728n21897m81904o13486
$$ plain form
2522 21752249 21130086 20817149 20303667 19783604 19388820 18647300 18137309 17752633 17250856
2513 17250856 16818558 16503219 16047529 15697470 15410814 14998964 14612736 14424675 14050575
2504 14050575 13530369 13425190 13161828 12726181 12535734 12262848 11940028 11568264 11212623
2495 11212623 10940301 10574792 10412320 10294193 10093208 9816672 9515035 9474305 9256924 9141947
2485 9141947 9114244 8808580 8702625 8498262 8236486 8223571 8026497 7993509 7683750 7257892
2475 7257892 7231969 7068263 6973186 6963083 6645347 6528644 6431213 6277565 6217165 6154867 6044817
2464 6044817 5938978 5831995 5752269 5626587 5476791 5380997 5215268 5120597 5173723 5031785
2454 5031785 4883817 4816124 4717498 4636523 4711849 4631163 4402817 4442692 4361749 4296504 4313255
$$ packed form
2522B1752249o22163l12937n13482n20063l94784p41520n09991l84676n01777
2513A7250856m32298l15339m55690l50059k86656m11850l86228j88061l74100
2504A4050575n20206j05179k63362m35647j90447k72886l22820l71764l55641
2495A1212623k72322l65509j62472j18127k00985k76536l01637m0730k17381j14977
2485I141947k7703l05664j05955k04363k61776j2915j97074l2988l09759m25858
2475G257892k5923j63706r5077j0103l17736j16703r7431j53648o0400o2298j10050
2464F044817j05839j06983p9726j25682j49796r5794j65729r4671N3126j41938
2454E031785j47968o7693r8626q0975P5326q0686k28346L9875q0943o5245J6751
$$ plain form
2443 4313255 4317457 4200651 3785954 3761176 3839420 3781880 3764856 3745361 3640887 3458326 3489363
2432 3489363 3517886 3582390 3618171 3571883 3387755 3104263 3085430 3060752 3028530 3088197 3001771
2421 3001771 2871200 2659102 2708474 2784539 2796439 2701049 2699370 2742808 2599968 2569024 2610699
2410 2610699 2572011 2582205 2538945 2457663 2535044 2365876 2163007 2225793 2250120 2263711 2275359
2399 2275359 2234938 2069404 2079339 2222633 2117565 2050514 2114630 1930814 1897827 2022334 2028098
2388 2028098 1878129 1775655 1875870 1849557 1689563 1625208 1625936 1713004 1655711 1724074 1698625
2377 1698625 1606359 1655853 1608238 1636164 1762926 1646350 1592659 1521100 1607795 1540385 1288371
2366 1288371 1278065 1280715 1209325 1232381 1356169 1345597 1146307 1234523 1375237 1137003 1254957
$$ packed form
2443D313255M202j16806m14697k4778P8244n7540j7024j9495j04474j82561L1037
2432C489363K8523O4504L5781m6288j84128k83492j8833k4678l2222N9667q6426
2421C001771j30571k12098M9372P6065J1900r5390j679M3438j42840l0944M1675
2410B610699l8688J0194m3260q1282P7381j69168k02869O2786K4327J3591J1648
2399B275359m0421j65534R935J43294j05068o7051O4116j83816l2987J24507N764
2388B028098j49969j02474J00215k6313j59994o4355P28Q7068n7293O8363k5449
2377A698625r2266M9494m7615K7926J26762j16576n3691p1559Q6695o7410k52014
2366A288371j0306K650p1390K3056J23788j0572j99290Q8216J40714k38234J17954
$$ plain form
2355 1254957 1306125 1136425 1213801 1302874 1190154 1110029 1108273 1082054 1092742 1116983 1024766
2344 1024766 1011960 1080871 1020548 1167989 1120614 1077079 1135633 1066331 984595 982883 1013317
2333 1013317 952568 1010561 1009172 977721 1000817 957794 938907 1017064 1054750 1079435 916859
2322 916859 796976 791947 812463 913207 1052851 910114 726477 681888 841632 899610 1002189
2311 1002189 1150971 1014217 897776 999625 893650 1009734 1108570 990014 993333 930715
2301 930715 937728 931806 993079 997656 979086 990622 972534 1088837 1107411 1108978 1232664 1382253
2289 1382253 1452679 1546355 1535042 1660164 1694446 1651131 1687736 1541291 1627866 1632937 1445104
2278 1445104 1517811 1715434 1695631 1699873 1635847 1729139 1711671 1810148 1979887 1999181 2058534
$$ packed form
2355A254957N1168j69700P7376Q9073j12720q0125j756k6219J0688K4241r2217
2344A024766j2806O8911o0323J47441m7375m3535N8554o9302q1736j712L0434
2333A013317o0749N7993j389l1451K3096m3023j8887P8157L7686K4685j62576
2322I16859j19883n029K0516J00744J39644j42737j83637m4589J59744N7978J02579
2311A002189J48782j36754j16441J01849j05975J16084R8836j18556L319o2618
2301I30715P013n922O1273M577j8570J1536j8088J16303J8574J567J23686J49589
2289A382253P0426R3676j1313J25122L4282m3315L6605j46445Q6575N071j87833
2278A445104P2707J97623j9803M242o4026R3292j7468R8477J69739J9294N9353
$$ plain form
2267 2058534 1907593 1764883 1675142 1600991 1682824 1622273 1543457 1492724 1320952 1227152 1308161
2256 1308161 1508472 1370544 1103950 1059342 1195087 1202833 1150497 1038486 940584 843820 873681
2245 873681 1009306 988634 805181 830071 777474 653392 629939 661478 728035 731472 744422
2234 744422 714033 484471 509615 524925 558414 669293 783264 733475 686421 706568 746250
2223 746250 648498 675693 696640 532245 571068 596643 573552 597220 620862 648697 703217
2212 703217 676238 668276 531316 505933 614834 626571 527551 556183 500980 597846 589352 649358
2200 649358 630774 510854 470035 455487 643205 818806 803062 750535 645036 745747 779039
2189 779039 726331 719906 751076 683335 821460 825169 808491 842200 1000002 1063203 1109319 1084543
$$ packed form
2267B058534j50941j42710q9741p4151Q1833o0551p8816n0733j71772r3800Q1009
2256A308161K00311j37928k66594m4608J35745P746n2336j12011r7902r6764K9861
2245H73681J35625k0672j83453K4890n2597j24082k3453L1539O6557L437J2950
2234G44422l0389k29562K5144J5310L3489J10879J13971m9789m7054K0147L9682
2223G46250r7752K7195K0947j64395L8823K5575k3091K3668K3642K7835N4520
2212G03217k6979p962j36960k5383J08901J1737r9020K8632n5203R6866q494O0006
2200F49358j8584j19920m0819j4548J87718J75601j5744n2527j05499J00711L3292
2189G79039n2708o425L1170o7741J38125L709j6678L3709J57802O3201M6116k4776
$$ plain form
2177 1084543 949584 848460 1125418 1137500 1039010 1106838 999258 1083233 1028983 1086961 1104807
2166 1104807 1063947 1088129 1090175 1157726 955776 924912 1062914 945871 948305 1047283 1021077
2155 1021077 842907 867617 988703 1178231 1063352 1004593 1206268 1195255 1224969 1282699
2145 1282699 1114458 930921 884792 818854 735532 628233 547487 544176 551376 581663 491624
2134 491624 445900 433328 475992 466719 418797 494738 483175 494060 493564 345438 230097 141451
2122 141451 276374 384298 436101 470131 607768 534847 582212 635123 615337 572260 586450
2111 586450 450594 316820 250376 337651 353199 322192 318317 186931 264213 362638 310158
2100 310158 301722 388789 379011 354515 373371 349929 296279 196490 210335 259248 275403 258039
$$ packed form
2177A084543j34959j01124K76958J2082r8490O7828j07580Q3975n4250N7978J7846
2166A104807m0860K4182K046O7551k01950l0864J38002j17043K434R8978k6206
2155A021077j78170K4710J21086J89528j14879n8759K01675j1013K9714N7730
2145A282699j68241j83537m6129o5938q3322j07299q0746l311P200L0287r0039
2134D91624m5724j2572M2664r273m7922P5941j1563J0885m96j48126j15341q8646
2122A41451J34923J07924N1803L4030J37637p2921M7365N2911j9786m3077J4190
2111E86450j35856j33774o6444Q7275J5548l1007l875j31386P7282R8425n2480
2100C10158q436Q7067r778k4496J8856k3442n3650r9789J3845M8913J6155j7364
$$ plain form
2088 258039 222132 345523 351744 295399 321063 292035 296702 121027 31035 39047 -96466 40806
2076 40806 169114 176874 245293 200489 256283 367491 277333 158888 251313 320402 188498
2065 188498 99909 77113 60243 32094 61823 39507 49273 84710 103338 156233 168595 250901
2053 250901 310560 84077 105640 217297 234661 200713 176204 14643 -76996 -65892 -2684
2042 -2684 18128 84123 69456 132194 212295 125067 169564 186341 145234 198013 38783 -78955
2030 -78955 21512 -51752 -150940 -12250 -91233 -183897 -88558 65839 144318 88155 31060
2019 31060 153014 125706 44982 3195 -160432 -190418 -67712 -979 32871 69698 -24502
2008 -24502 -52106 63726 182758 194465 10887 -77779 -80301 -34957 11505 -102020 -105710
$$ packed form
2088B58039l5907J23391O221n6345K5664k9028M667j75675q9992Q012j35513J37272
2076D0806J28308P760O8419m4804N5794J11208r0158j18445R2425O9089j31904
2065A88498q8589k2796j6870k8149K9729k2316R766L5437J8628N2895J2362Q2306
2053B50901N9659k26483K1563J11657J7364l3948k4509j61561r1639J1104O3208
2042b684K0812O5995j4667O2738Q0101q7228M4497J6777m1107N2779j59230j17738
2030g8955J00467p3264r9188J38690p8983r2664R5339J54397P8479n6163n7095
2019C1060J21954k7308q0724m1787j63627k9986J22706O6733L3850L6827r4200
2008b4502k7604J15832J19032J1707j83578q8666k522M5344M6462j13525l690
$$ plain form
1997 -105710 -138578 -311449 -207187 5764 21510 34866 69196 22056 -18387 99106 106459
1986 106459 141027 -13534 -6293 -177367 -339948 -143784 -58500 -181790 -103674 11841 -21174
1975 -21174 29075 186253 85309 86445 161501 -29439 187340 243349 27076 -74921 -135131
1964 -135131 -45855 -138447 -128217 -105406 -146580 -172910 -43239 14150 -38843 -66125 -91860
1953 -91860 37416 -68673 -54097 -42081 -143494 -42665 -88144 -38124 31885 14963 -93418
1942 -93418 -241311 -169614 -77828 -60609 34873 54417 -4559 -66723 -4252 128238 49665
1931 49665 58372 51715 87305 93744 31629 99030 157213 -1299 -9645 -172925 -245881 -37100
1919 -37100 -66499 -51072 12908 10024 133586 111135 75561 52959 7523 124627 78037 107376
$$ packed form
1997a05710l2868j72871J04262K12951J5746J3356L4330m7140m0443J17493P353
1986A06459L4568j54561P241j71074j62581J96164Q5284j23290P8116J15515l3015
1975b1174N0249J57178j00944J136P5056j90940K16779N6009k16273j01997o0210
1964a35131Q9276r2592J0230K2811m1174k6330J29671N7389n2993k7282k5735
1953i1860J29276j06089J4576J2016j01413J00829m5479N0020P0009j6922j08381
1942i3418j47893P1697R1786J7219R5482J9544n8976o2164O2471J32490p8573
1931D9665Q707o657L5590O439o2115O7401N8183j58512q346j63280p2956K08781
1919c7100k9399J5427O3980k884J23562k2451l5574k2602m5436J17104m6590K9339
$$ plain form
1907 107376 98422 90048 104209 -73241 -19048 45315 13324 71900 9926 66730 198831 447040
1895 447040 512994 249807 206248 115393 17405 19862 -72822 90130 -13251 -223686 -135850
1884 -135850 -53766 17791 21600 33185 59157 74092 185493 200500 237405 188553 148098 261987
1872 261987 199412 12013 -148656 -106754 5322 130404 163989 55691 31111 253308
1862 253308 330964 307616 393095 384955 219714 199893 251205 316649 245156 119105 -24594
1851 -24594 -101342 48168 100328 29574 85074 -29123 12344 225496 301811 302050 381657 415735
1839 415735 315476 163005 82940 158518 249021 133483 62493 46281 40933 199829 264831
1828 264831 267456 215693 195041 281529 389623 450978 465464 489987 407916 348778 253272 198100
$$ packed form
1907A07376q954q374J4161j77450N4193O4363l1991N8576o1974N6804J32101K48209
1895D47040O5954k63187m3559r0855r7988K457r2684J62952j03381k10435Q7836
1884a35850Q2084P1557L809J1585K5972J4935J11401J5007L6905m8852m0455J13889
1872B61987o2575j87399j60669M1902J12076J25082L3585j08298k4580K22197
1862B53308P7656k3348Q5479q140j65241j9821N1312O5444p1493j26051j43699
1851b4594p6748J49510N2160p0754N5500j14197M1467K13152P6315K39P9607L4078
1839D15735j00259j52471q0065P5578R0503j15538p0990j6212n348J58896O5002
1828B64831K625n1763k0652Q6488J08094O1355J4486K4523q2071n9138r5506n5172
$$ plain form
1816 198100 133446 64000 109272 159997 172092 202155 237764 126329 75186 221437 454729
1805 454729 414166 331727 417871 463156 448433 679310 637594 394155 293158 326870 302259
1794 302259 331975 385174 146664 118636 105141 181432 260173 239524 301814 122932 8538
1783 8538 112023 175167 257233 313091 158664 198789 81471 92196 138915 31876 75033
1772 75033 19804 -86837 32811 103744 199131 172286 154008 176421 193140 182978 147861
1761 147861 213268 162845 150859 211273 120935 8436 -96549 -226830 -139402 -81464 -105019
1750 -105019 -122522 -39030 96777 184574 216082 168994 134591 138762 100918 -18750 -790
1739 -790 -112737 -188381 -65952 -141716 -245873 -211180 -156173 -137883 -41301 18707 -51758 -30492
$$ packed form
1816A98100o4654o9446M5272N0725J2095L0063L5609j11435n1143J46251K33292
1805D54729m0563q2439Q6144M5285j4723K30877m1716k43439j00997L3712k4611
1794C02259K9716N3199k38510k8028j3495P6291P8741k0649O2290j78882j14394
1783H538J03485O3144Q2066N5858j54427M0125j17318J0725M6719j07039M3157
1772G5033n5229j06641J19648P0933R5387k6845j8278K2413J6719j0162l5117
1761A47861O5407n0423j1986O0414r0338j12499j04985j30281Q7428N7938k3555
1750a05019j7503Q3492J35807Q7797L1508m7088l4403M171l7844j19668J7960
1739g90j11947p5644J22429p5764j04157L4693N5007J8290R6582O0008p0465K1266
$$ plain form
1727 -30492 -51622 -74 96842 -25510 53964 -151795 -198931 -88243 -89850 -92062 -87060 -185475
1715 -185475 -223116 -204956 -146923 -11577 21724 -94892 -116044 -135292 -81144 9523 37170
1704 37170 58766 -52989 -86866 -94817 -138540 -176285 -139559 -127067 -89507 -37187 -24630 -12110
1692 -12110 -5013 -53968 -8224 -145659 -198821 -213023 -172843 -193463 -204586 -149050 -94148 -155632
1680 -155632 -206957 -134622 -51489 -66908 -19366 -90220 -174532 -40760 12123 -31274 -101546
1669 -101546 -82675 -122678 -180121 -99342 -76047 -133621 -66873 3364 -52678 -126670 -82544 -88605
1657 -88605 -218576 -191606 -201765 -303207 -209154 -185719 -116752 -161965 -139746 -118160 -159691
1646 -159691 -231213 -109629 -149382 -193947 -59278 63835 35632 78359 28790 -26237 -30888
$$ packed form
1727c0492k1130N1548R6916j22352P9474k05759m7136J10688j607k212N002r8415
1715a85475l7641J8160N8033J35346L3301j16616k1152j9248N4148R0667K7647
1704C7170K1596j11755l3877p951m3723l7745L6726J2492L7560N2320J2557J2520
1692a2110P097m8955M5744j37435n3162j4202M0180k0620j1123N5536N4902o1484
1680a55632n1325P2335Q3133j5419M7542p0854q4312J33772N2883m3397p0272
1669a01546J8871m0003n7443Q0779K3295n7574O6748P0237n6042p3992M4126o061
1657h8605j29971K6970j0159j01442R4053K3435O8967m5213K2219K1586m1531
1646a59691p1522J21584l9753m4565J34669J23113k8203M2727m9569n5027m651
$$ plain form
1635 -30888 -13385 -58460 -201454 -319338 -224966 -85705 -142835 -71887 -62362 -120133 -101559
1624 -101559 -269284 -201145 -62492 -61612 -107244 -34441 35090 -109802 -139396 -99379 -180476
1613 -180476 -169164 -101550 -122116 -321380 -314585 -205577 -139116 24489 -103795 -206846 -224699
1602 -224699 -159488 -37314 16502 -51152 -43132 -155774 -81854 -63324 -80825 -117468 -165189
1591 -165189 -224345 -72558 16880 -111747 -113475 -114979 -47546 155387 70904 14481 15351 -73371
1579 -73371 -27760 111452 -29880 28304 -7385 -134858 -113777 -231231 -146328 -170604 -313837
1568 -313837 -153439 -131133 -78036 -48625 -23584 -102746 -40188 -90565 -173522 -10722 -93817
1557 -93817 -99825 -304668 -346702 -195444 -118561 -78357 -70391 -120299 -204680 -154741 -118542 -55698
$$ packed form
1635c0888J7503m5075j42994j17884R4372J39261n7130P0948R525n7771J8574
1624a01559j67725O8139J38653Q80m5632P2803O9531j44892k9594M0017q1097
1613a80476J1312O7614k0566j99264O795J09008O6461J63605j28284j03051j7853
1602b24699O5211J22174N3816o7654Q020j12642P3920J8530j7501l6643m7721
1591a65189n9156J51787Q9438j28627j728j504O7433K02933q4483n6423Q70q8722
1579g3371M5611J39212j41332N8184l5689j27473K1081j17454Q4903k4276j43233
1568c13837J60398K2306N3097K9411K5041p9162O2558n0377q2957J62800q3095
1557i3817o008k04843m2034J51258P6883M0204P966m9908q4381M9939L6199O2844
$$ plain form
1545 -55698 -72723 -153814 -160242 -193908 14920 180728 56413 69388 21520 -144579 -20230
1534 -20230 -228893 -292115 -138189 -125529 -198722 -246332 -220808 -199349 -176626 -154148 -67659
1523 -67659 -17588 -55805 -187388 -84167 6162 -57614 -65299 -51376 -195588 -261339 -158278
1512 -158278 -218749 -225079 -189360 -246686 -113609 32393 66573 24330 62476 207742 244013
1501 244013 57705 -102172 -137930 -227301 -95502 -105146 -215819 -171363 -138015 -114742 41952
1490 41952 104481 98535 182002 265525 172009 125576 138281 76037 -85339 -188509 -207305 -198232
1478 -198232 -346303 -343872 -247960 -159897 -198457 -152695 -47933 -9590 28649 97511 106736 133954
1466 133954 49920 -74218 -81295 -141792 -120381 -152076 -183589 -111079 -81169 -141949 14662
$$ packed form
1545e5698j7025q1091o428l3666K08828J65808j24315J2975m7868j66099J24349
1534b0230k08663o3222J53926J2660p3193m7610K5524K1459K2723K2478Q6489
1523f7659N0071l8217j31583J03221R0329o3776p685J3923j44212o5751J03061
1512a58278o0471o330L5719n7326J33077J46002L4180m2243L8146J45266L6271
1501B44013j86308j59877l5758q9371J31799r644j10673M4456L3348K3273J56694
1490D1952O2529n946Q3467Q3523r3516m6433J2705o2244j61376j03170j8796R073
1478a98232j48071K431R5912Q8063l8560M5762J04762L8343L8239O8862R225K7218
1466A33954q4034j24138p077o0497K1411l1695l1513P2510K9910o0780J56611
$$ plain form
1455 14662 16370 121038 179890 44204 65717 90824 -53595 -127472 -147682 -249729 -298543
1444 -298543 -209420 -154743 -147491 -178661 -153835 16722 93379 67496 92485 -23912 28913
1433 28913 -75944 -170763 -60065 -218649 -212239 -92700 -25121 -70359 -97018 -118811 -233343
1422 -233343 -156250 13201 36586 48405 78339 -59 26593 198954 35977 -45622 -58276
1411 -58276 -80180 -105569 -171976 -273688 -336633 -119351 -234002 -253268 -118599 -123254 19621
1400 19621 -82272 -301699 -248665 -106489 -23414 106200 85930 35270 -12579 -27152 83195
1389 83195 17301 -220009 -245336 -201445 -239217 -112724 56913 4938 -163667 -108992 -29935
1378 -29935 105600 143808 -105385 -179210 -132189 -61985 -34487 -168272 -278829 -345751 -209474
$$ packed form
1455A4662J708J04668N8852j35686K1513K5107j44419p3877k0210j02047m8814
1444b98543Q9123N4677P252l1170K4826J70557P6657k5883K4989j16397N2825
1433B8913j04857r4819J10698j58584O410J19539O7579m5238k6659k1793j14532
1422b33343P7093J69451K3385J1819K9934p8398K6652J72361j62977q1599j2654
1411e8276k1904k5389o6407j01712o2945K17282j14651j9266J34669m655J42875
1400A9621j01893k19427N3034J42176Q3075J29614k0270n0660m7849j4573J10347
1389H3195o5894k37310k5327M3891l7772J26493J69637n1975j68605N4675P9057
1378b9935J35535L8208k49193p3825M7021P0204K7498j33785j10557o6922J36277
$$ plain form
1367 -209474 -117635 -6479 -47047 -105065 43396 104302 7438 -28340 18698 -28822 -134844
1356 -134844 -83095 -24635 -135402 -74400 -128095 -168568 -73590 -86303 -140423 -178829 -91881
1345 -91881 -37438 92133 51626 51588 29913 -11094 168520 1450 -163811 -26757 -79248
1334 -79248 -110463 -133190 -113253 -31279 -15573 -131573 -137728 -203439 -260150 -257250 -193841 -100898
1322 -100898 -77785 -16170 -107162 -104977 4574 12543 51054 -1145 -88564 35650 -61652 -81811
1310 -81811 -21167 -5089 1531 -94680 -69070 -270391 -269320 -166929 -132616 -27727 -74393 -188211
1298 -188211 -145845 -102154 -89962 31737 -74979 -152874 -266035 -194996 -12856 -9972 -78970
1287 -78970 -110649 -69030 -47433 -131867 -119529 -200039 -153612 -2790 -130532 -179346 -112959
$$ packed form
1367b09474R1839J11156m0568n8018J48461O0906r6864l5778M7038m7520j06022
1356a34844N1749N8460j10767O1002n3695m0473R4978j2713n4120l8406Q6948
1345i1881N4443J29571m0507l8k1675m1007J79614j67070j65261J37054n2491
1334g9248l1215k2727J9937Q1974J5706j16000o155o5711n6711K900O3409R2943
1322a00898K3113O1615r0992K185J09551P969L8511n2199q7419J24214r7302k0159
1310h1811O0644J6078O620r6211K5610k01321J071J02391L4313J04889m6666j13818
1298a88211M2366M3691J2192J21699j06716p7895j13161P1039J82140K884o8998
1287g8970l1679M1619K1597q4434J2338q0510M6427J50822j27742m8814O6387
$$ plain form
1276 -112959 -211656 -154552 -148766 -171291 -164035 -115946 7681 103842 116898 90490 118351 88580
1264 88580 -17867 -13381 -105625 -185865 -90298 -3746 -79033 -31486 -80903 -77888 -70510 16650
1252 16650 50036 15779 82916 76086 134572 196927 201933 108242 40827 -63997 62403 101717
1240 101717 -12922 17632 -13499 136803 285556 138902 237378 305436 260192 238300 268268
1229 268268 382563 427568 322245 143330 196654 161629 134693 223202 76337 -60201 -53482
1218 -53482 -84598 -18105 102223 170591 242002 194587 50177 19754 50515 194423 247473
1207 247473 44712 -73811 -155909 -114785 -8768 -77946 -23174 -29596 -76108 -59625 -6653
1196 -6653 81828 118038 153855 197378 157597 -13160 21743 -3416 -62261 80705 109271 -88146
$$ packed form
1276a12959r8697N7104N786k2525P256M8089J23627R6161J3056k6408K7861k9771
1264H8580j06447M486r2244q0240R5567Q6552p5287M7547m9417L015P378Q7160
1252A6650L3386l4257O7137o830N8486O2355N006r3691o7415j04824J26400L9314
1240A01717j14639L0554l1131J50302J48753j46654R8476O8058m5244k1892K9968
1229B68268J14295M5005j05323j78915N3324l5025k6936Q8509j46865j36538O719
1218e3482l1116O6493J20328O8368P1411m7415j44410l0423L0761J43908N3050
1207B47473k02761j18523q2098M1124J06017o9178N4772o422m6512J6483N2972
1196f653Q8481L6210L5817M3523l9781j70757L4903k5159n8845J42966K8566j97417
$$ plain form
1184 -88146 -127829 -154400 -68153 154625 112528 6515 16086 -86001 57701 88614 89040 141435
1172 141435 217664 120818 100684 37615 -22321 101332 138768 194322 152075 14448 57545
1161 57545 41697 58801 58078 -55038 -198912 -177797 -59761 13342 154169 217660 185153
1150 185153 85962 113418 217139 91921 166608 166247 82560 116888 -1157 -70881 75830
1139 75830 27600 38187 67417 -15059 15105 214874 321201 257216 232525 91077 281683
1128 281683 221336 197108 215755 131253 -48579 -562 83355 142347 113576 3458 82534
1117 82534 208541 216031 245191 106337 155468 374291 403894 343033 86627 59280 111025
1106 111025 35663 249293 289415 155012 85472 29221 238724 342782 414613 531082 425484
$$ packed form
1184h8146l9683k6571Q6247K22778m2097j06013R571j02087J43702L0913M26N2395
1172A41435P6229r6846k0134o3069n9936J23653L7436N5554m2247j37627M3097
1161E7545j5848J7104p23j13116j43874K1115J18036P3103J40827O3491l2507
1150A85153r9191K7456J03721j25218P4687l61q3687L4328j18045o9724J46711
1139G5830m8230J0587K9230q2476L0164J99769J06327o3985k4691j41448J90606
1128B81683o0347k4228J8647q4502j79832M8017Q3917N8992k8771j10118P9076
1117H2534J26007P490K9160j38854M9131K18823K9603o0861k56406k7347N1745
1106A11025p5362K13630M0122j34403o9540n6251K09503J04058P1831J16469j05598
$$ plain form
1095 425484 406902 306970 373906 438083 436633 440111 258780 290497 218496 241527 353169 370085
1083 370085 462279 411203 327854 308888 312264 384019 449433 274228 134710 209906 175700
1072 175700 318851 342797 498764 597055 596115 737829 566734 519042 559112 548899 550389
1061 550389 507870 478514 517704 463222 378675 353192 334562 269031 406558 494691 573098
1050 573098 804757 703759 598055 678268 600667 709035 703994 711846 629474 453063 519385
1039 519385 703068 700117 827141 899607 832606 926825 976785 937417 1114660 1260730 1191156
1028 1191156 1256756 1266603 1153131 1108519 1172786 1268640 1284995 1218838 1207293 1216075 1260590 1385359
1016 1385359 1451337 1557662 1599213 1526356 1570612 1445206 1494146 1456910 1513551 1627739 1635348
$$ packed form
1095D25484j8582r9932O6936O4177j450L478j81331L1717p2001K3031J11642J6916
1083C70085R2194n1076q3349j8966L376P1755O5414j75205j39518P5196l4206
1072A75700J43151K3946J55967R8291r40J41714j71095m7692M0070j0213J490
1061E50389m2519k9356L9190n4482q4547k5483j8630o5531J37527Q8133P8407
1050E73098K31659j00998j05704Q0213p7601J08368n041P852q2372j76411O6322
1039E19385J83683k951J27024P2466o7001R4219M9960l9368J77243J46070o9574
1028A191156O5600R847j13472m4612O4267R5854J6355o6157j1545Q782M4515J24769
1016A385359O5978J06325M1551p2857M4256j25406M8940l7236N6641J14188P609
$$ plain form
1005 1635348 1566385 1510886 1637748 1813436 1822815 1847589 1866631 2123500 2152838 2189166 2354887
994 2354887 2297624 2352296 2398135 2366458 2413183 2330162 2370493 2599369 2746400 2804574 2854407
983 2854407 2895148 3105424 3396137 3617146 3665737 3879205 4140842 4319088 4519837 4882517
973 4882517 5146325 5365722 5633620 5831310 6078253 6425768 6771740 7157121 7756827 8542074
963 8542074 9287016 10089346 10655920 11256881 11837535 12876196 14254602 15571170 17260956
954 17260956 19393001 21701795 24754188 28486873 33644687 40183519 48692686 58619658
946 58619658 65709045 64722463 53289262 41320632 33182369 27586443 23461101 20273653
938 20273653 17598956 15434566 13898595 12630515 11514229 10711915 10135823 9664097 9322149
$$ packed form
1005A635348o8963n5499J26862J75688R379K4774J9042K56869K9338L6328J65721
994B354887n7263N4672M5839l1677M6725q3021M0331K28876J47031N8174M9833
983B854407M0741K10276K90713K21009M8591K13468K61637J78246K00749L62680
973D882517K63808K19397K67898J97690K46943L47515L45972L85381N99706P85247
963H542074P44942Q02330N66574O00961N80654J038661J378406J316568J689786
954A7260956K132045K308794L052393L732685N157814O538832Q509167R926972
946E8619658P089387r86582j1433201j1968630q138263n595926m125342l187448
938B0273653k674697k164390j535971j268080j116286q02314n76092m71726l41948
$$ plain form
929 9322149 8820424 7980740 7179575 6663163 6276595 5883682 5375725 5112739 4998525 4743282
919 4743282 4512556 4209918 3815293 3733909 3517455 3481282 3361302 3059361 2967653 2699304
909 2699304 2672169 2760976 2700268 2757178 2526113 2195268 2192949 2293151 2172662 2116676 1953504
898 1953504 1831659 1894161 1756373 1559077 1551597 1485706 1476671 1498211 1480833 1392000 1447456
887 1447456 1503392 1520456 1343821 1231789 1338520 1277150 1141585 1206430 1077598 1076283 1138907
876 1138907 1041814 978628 958392 822074 703708 788509 921439 919776 885905 795924 771862
865 771862 874840 1028765 968040 830526 873013 778232 719122 749818 649173 676248 698077
854 698077 670628 705395 588821 561689 734756 808747 845919 892124 763052 664516 524327
$$ packed form
929I322149n01725q39684q01165n16412l86568l92913n07957k62986j14214k55243
919D743282k30726l02638l94625q1384k16454l6173j19980l01941r1708k68349
909B699304k7135Q8807o0708N6910k31065l30845k319J00202j20489n5986j63172
898A953504j21845O2502j37788j97296p480o5891r035K1540j7378q8833N5456
887A447456N5936J7064j76635j12032J06731o1370j35565O4845j28832j315O2624
876A138907r7093o3186k0236j36318j18366Q4801J32930j663l3871q9981k4062
865G71862J02978J53925o0725j37514M2487r4781n9110L0696j00645K7075K1829
854F98077k7449L4767j16574k7132J73067P3991L7172M6205j29072r8536j40189
$$ plain form
843 524327 516329 474158 532670 459213 366895 293878 359927 437689 354300 271477 383479 397023
831 397023 526560 657427 514327 425214 503915 469752 365204 304349 371227 211820 215174
820 215174 248800 123417 298075 375687 355296 439477 460116 401254 469099 450863 437432
809 437432 327774 378374 342062 340937 311274 356908 338115 208945 177234 239489 194954 197142
797 197142 270159 165964 145139 303872 403093 260094 17971 -135189 -60034 184197 337188
786 337188 296040 167589 65278 200124 283885 279392 356920 171037 40855 146520 141435
775 141435 129896 50786 -33267 -83457 -35058 128237 272810 246168 88574 201332 243331
764 243331 198224 260621 134331 68329 116001 49931 76146 68543 -12710 9978 -32983 -39207
$$ packed form
843E24327p998m2171N8512p3457r2318p3017O6049P7762q3389q2823J12002J3544
831C97023J29537J30867j43100q9113P8701l4163j04548o0855O6878j59407L354
820B15174L3626j25383J74658P7612k0391Q4181K0639n8862O7845j8236j3431
809D37432j09658N0600l6312j125k9663M5634j8793j29170l1711O2255m4535K188
797A97142P3017j04195k0825J58733R9221j42999k42123j53160P5155K44231J52991
786C37188m1148j28451j02311J34846Q3761m493P7528j85883j30182J05665n085
775A41435j1539p9110q4053n0190M8399J63295J44573k6642j57594J12758M1999
764B43331m5107O2397j26290o6002M7672o6070K6215p603q1253K2688m2961o224
$$ plain form
752 -39207 -4462 -17187 124678 148060 163351 216474 129832 190726 343090 251650 61989
741 61989 -3856 -92454 -109712 1168 13745 2322 -56690 -16481 287758 310000 301679 317349
729 317349 224793 270229 192516 32011 39233 -28733 -118659 -93893 -195149 -133301 -143848 -80856
717 -80856 -97115 21756 78768 -21211 -49613 -71141 103289 161352 101914 -51680 -193020
706 -193020 -206162 -53396 -28395 -1633 12787 -38216 55520 176790 142230 86420 129384
695 129384 204927 2046 49817 96169 26513 -47406 -180437 -92682 43831 62203 -75952
684 -75952 -32263 61441 150456 163497 272884 302759 202202 167104 154110 127152 124207 129523
672 129523 50132 -159212 -157939 56846 158258 248196 113259 -24897 99625 415735 376430
$$ packed form
752c9207L4745j2725J41865K3382J5291N3123q6642O0894J52364r1440j89661
741F1989o5845q8598j7258J10880J2577j1423n9012M0209L04239K2242q321J5670
729C17349r2556M5436p7713j60505P222o7966q9926K4766j01256O1848j0547O2992
717h0856j6259J18871N7012r9979k8402k1528J74430N8063n9438j53594j41340
706a93020j3142J52766K5001K6762J4420n1003R3736J21270l4560n5810M2964
695A29384P5543k02881M7771M6352o9656p3919j33031Q7755J36513J8372j38155
684g5952M3689R3704Q9015J3041J09387K9875j00557l5098j2994k6958k945N316
672A29523p9391k09344J273K14785J01412Q9938j34937j38156J24522L16110l9305
$$ plain form
661 376430 233833 193831 162687 236867 271654 216015 285383 111078 -101059 11602 111771
650 111771 3763 147690 208182 36104 41050 -10007 31948 -52024 -184089 -147273 14029
639 14029 77755 69739 36760 -27202 123895 135306 98909 70979 88496 -29569 -167679 -65872
627 -65872 43158 -16919 1739 -12060 -101840 -136004 -64257 65887 15363 52668 124546 -13117
615 -13117 -44003 123390 70590 -41018 -11725 -98035 -240893 -199520 -94808 -2974 2255
604 2255 -51494 -81397 -35582 -94814 -22629 11405 -14806 -35154 -798 -82896 -18311 1884
592 1884 -83427 21332 98045 119262 10390 -115097 -102024 -153869 -69944 -126135 -111091 -137327
580 -137327 -136270 -46703 31949 70276 -23650 63081 120643 132066 93188 61316 163622 140024
$$ packed form
661C76430j42597m0002l1144P4180L4787n5639O9368j74305k12137J12661J00169
650A11771j08008J43927O0492j72078M946n1057M1955q3972j32065L6816J61302
639A4029O3726q016l2979o3962J51097J1411l6397k7930J7517j18065j38110J01807
627f5872J09030o0077J8658j3799q9780l4164P1747J30144n0524L7305P1878j37663
615a3117l0886J67393n2800j11608K9293q6310j42858M1373J04712R1834N229
604B255n3749k9903M5815n9232P2185L4034k6211k0348L4356q2098O4585K0195
592A884q5311J04759P6713K1217j08872j25487J3073n1845Q3925n6191J5044k6236
580a37327J057Q9567P8652L8327r3926Q6731N7562J1423l8878l1872J02306k3598
$$ plain form
568 140024 60247 48559 -53903 -34894 -113292 -67763 -101833 26396 40511 -116772 6517
557 6517 -18534 -14426 4248 44172 -42345 -77078 35232 13719 63419 -57877 -164523 -74121
545 -74121 -45714 -162805 -155369 45358 25791 -26675 83564 56077 62767 -48937 -45250 -29727
533 -29727 -63263 42751 -98378 -115495 32537 -10219 -166800 -70179 56936 -81672 -120716
522 -120716 50734 33894 38131 57533 52592 -50606 -80952 -231212 -211557 -510 52043
511 52043 -5815 -98465 -74452 12374 39496 147974 102910 148484 72424 -44606 117343
500 117343 51708 -16081 -75779 -34129 36230 -64947 -79557 -37385 -102120 -86228 -35487 4293
488 4293 -15061 112822 81907 -4616 4995 68687 1875 113158 150199 -8263 -86919 -173879
$$ packed form
568A40024p9777j1688j02462J9009p8398M5529l4070J28229J4115j57283J23289
557F517k5051M108J8674L9924q6517l4733J12310k1513M9700j21296j06646R0402
545g4121K8407j17091P436K00727j9567n2466J10239k7487O690j11704L687J5523
533b9727l3536J06014j41129j7117J48032m2756j56581R6621J27115j38608l9044
522a20716J71450j6840M237J9402m941j03198l0346j50260J9655K11047N2553
511E2043n7858r2650K4013Q6826K7122J08478m5064M5574p6060j17030J61949
500A17343o5635o7789n9698M1650P0359j01177j4610M2172o4735J5892N0741L9780
488D293j9354J27883l0915q6523R611O3692o6812J11283L7041j58462p8656q6960
$$ plain form
476 -173879 -71004 105973 62123 126501 -1139 -148204 -111070 68053 66699 -91821 26968
465 26968 -8128 -12772 21732 -191181 -92303 -100049 -84386 44316 48661 18909 -24381 -109384
453 -109384 6395 4667 1845 59721 -18928 -81138 -78593 16685 51825 32097 -78439 -121906
441 -121906 -102875 23734 -17345 -23172 71176 126184 72973 -11859 -59583 55066 78295 23942
429 23942 44262 -437 -98794 27803 80982 -86029 -30971 -120256 -191188 4434 -32146
418 -32146 -170510 -209147 -79029 -61582 -68321 -143605 -31368 43941 15495 76065 88434 60727
406 60727 127839 93126 125088 -5851 -136585 -94060 -150315 -233882 -124187 -99496 -214434
395 -214434 -112857 9665 -34266 4460 38428 20597 27066 217005 245436 64630 125792
$$ packed form
476a73879J02875J76977m3850O4378j27640j47065L7134J79123j354j58520J18789
465B6968l5096m644L4504k12913R8878p746J5663J28702M345k9752m3290q5003
453a09384J15779j728k822N7876p8649o2210K545R5278L5140j9728j10536m3467
441a21906J9031J26609m1079n827R4348N5008n3211q4832m7724J14649K3229n4353
429B3942K0320m4699r8357J26597N3179j67011N5058q9285p0932J95622l6580
418c2146j38364l8637J30118J7447o739p5284J12237P5309k8446O0570J2369k7707
406F0727O7112l4713L1962j30939j30734M2525n6255q3567J09695K4691j14938
395b14434J01577J22522m3931L8726L3968j7831O469J89939K8431j80806O1162
$$ plain form
384 125792 96351 63663 58946 -123476 -223114 -29451 -106890 -144495 -97644 -185040 -68662
373 -68662 84349 41913 -2330 -15827 100265 143033 -8216 -24523 -25560 -17497 -35919 -192111
361 -192111 -208880 -56092 -34488 -145111 -85908 -52826 -27491 105206 5794 -63305 16842
350 16842 16924 -15488 -80358 -61231 -25423 -3225 30681 -9878 4095 81676 91280 -65550 -53777
337 -53777 -42686 -105716 -33315 -34643 -70110 -86131 -85044 -117179 -62870 -38862 114431 55612
325 55612 31792 113403 16482 -61654 58348 -22750 -20406 41928 27917 -3901 -61588 51125
313 51125 72525 104005 138725 44341 32842 69710 93155 -226 23604 -16224 -165207 -249940
301 -249940 -300367 -149618 12695 22729 -9841 -91546 -103821 53493 67633 149113 251608
$$ packed form
384A25792k9441l2688m717j82422r9638J93663p7439l7605M6851q7396J16378
373f8662J53011m2436m4243j3497J16092M2768j51249j6307j037Q063j8422j56192
361a92111j6769J52788K1604j10623N9203L3082K5335J32697r9412o9099Q0147
350A6842Q2l2412o4870J9127L5808K2198L3906m0559J3973P7581R604j56830J1773
337e3777J1091o3030P2401j328l5467j6021J087l2135N4309K4008J53293n8819
325E5612k3820Q1611r6921p8136J20002q1098K344O2334j4011l1818n7687J12713
313E1125K1400L1480L4720r4384j1499L6868K3445r3381K3830l9828j48983q4733
301b49940n0427J50749J62313J0034l2570q1705j2275J57314J4140Q1480J02495
$$ plain form
290 251608 185774 110024 208032 48784 -106720 -126971 -127553 -175677 -271588 -153140 -179913 -146916
278 -146916 47904 25370 -78845 -14439 105091 -1274 -41289 30262 -72374 -30917 -1125
267 -1125 -179693 -149154 -153564 -74405 -2620 -59565 -36942 -46712 -69627 -67692 -50361 115136
255 115136 124366 -111808 -215723 -237675 -110484 30263 -41262 -34250 -73083 -154012 -70755
244 -70755 -44033 58460 89651 24113 -23186 -103233 -87442 -130526 -55228 74014 105198 -53678
232 -53678 -124408 -14327 9268 -12873 50804 16824 -122127 -121653 -48052 -14124 34604 -50898
220 -50898 -111684 -63447 -74752 -77592 -6443 111941 -69154 -72803 -96538 -174034 -79428 -8869
208 -8869 -106643 -83316 -10505 -140361 -131641 -126621 -109758 -23000 37590 -47592 -54704 -13114 145449
$$ packed form
290B51608o5834p5750R8008j59248j55504k0251n82m8124r5911J18448k6773L2997
278a46916J94820k2534j04215O4406J19530j06365m0015P1551j02636M1457K9792
267a125j78568L0539m410P9159P1785n6945K2623r770k2915J935J7331J65497
255A15136R230k36174j03915k1952J27191J40747p1525P012l8833q0929Q3257
244g0755K6722J02493L1191o5538m7299q0047J5791m3084P5298J29242L1184j58876
232e3678p0730J10081K3595k2141O3677l3980j38951M74P3601L3928M8728q5502
220e0898o0786M8237j1305k840P1149J18384j81095l649k3735p7496R4606P0559
208h869r7774K3327P2811j29856Q720N020J6863Q6758O0590q5182p112M1590J58563
$$ plain form
195 145449 43048 13185 62014 -102987 -117904 -100570 -171303 -143083 -67681 -23865 -179889
184 -179889 -296747 -219258 -109988 36874 10293 -19928 28947 28773 84365 91290 100266 62420
172 62420 -81830 -112773 -108967 -130899 94 -92164 -173379 -146568 -223361 69527 1348 8767
160 8767 28154 -20198 64552 45153 -42474 50486 -6053 -20600 -56615 -114944 -104767 -182659
148 -182659 -158884 -137620 -71477 -10999 -18184 -38261 -41780 93682 139534 57047 -43317 -55053
136 -55053 -67796 -97358 -111118 -106921 -127520 -95511 -30438 -126014 -92610 -80296 -128470 80028
124 80028 150043 17188 81632 -4901 -63443 23117 -21054 -9209 -105555 -93102 33049 93759
112 93759 43173 -113482 -151202 -149285 -42291 -3506 -5082 -52682 -45606 -151805 -164431 -95763
$$ packed form
195A45449j02401k9863M8829j65001j4917J7334p0733K8220P5402M3816j56024
184a79889j16858P7489J09270J46862k6581l0221M8875j74N5592O925Q976l7846
172F2420j44250l0943L806k1932J30993r2258q1215K6811p6793K92888o8179P419
160H767J9387m8352Q4750j9399q7627R2960n6539j4547l6015n8329J0177p7892
148a82659K3775K1264O6143O0478p185k0077l519J35462M5852q2487j00364j1736
136e5053j2743k9562j3760M197k0599L2009O5073r5576L3404J2314m8174K08498
124H0028P0015j32855O4444q6533n8542Q6560m4171J1845r6346J2453J26151O0710
112I3759n0586j56655l7720J917J06994L8785j576m7600P076j06199j2626O8668
$$ plain form
100 -95763 -112956 -160519 -63966 -60432 -178074 -186326 -93728 -74245 13339 20379 -50692 -20074
88 -20074 -19649 -66609 -87700 -32890 -97576 -191154 -103051 -41245 -43852 -3842 -106944 -194708 -206833
75 -206833 -95115 -155457 -159958 -129841 -198767 -46181 -8893 -51032 34920 12450 38279 34007
63 34007 -12677 -7973 -81668 -140770 -130436 -128878 -135037 -101053 -89164 -182210 -172268 -76333 -42696
50 -42696 -12880 -4273 21909 -7657 -52674 -38085 21763 -74718 -65333 -25548 -72832 -133160 -127787
37 -127787 -137487 -127177 -131529 -191619 -226290 -132571 -125538 5010 56074 53066 -4961 26304 115189
24 115189 -10345 -8022 -3378 -63131 -78814 -116654 -143444 -183635 -192975 -217814 -140758 -75536
12 -75536 -85381 -105905 -105273 -120253 -146236 45244 69107 -3031 -7076 -34510 -133537 -173014
$$ packed form
100i5763j7193m7563R6553L534j17642q252R2598J9483Q7584P040p1071L0618
88b0074M25m6960k1091N4810o4686r3578Q8103O1806k607M0010j03102q7764j2125
75b06833J11718o0342m501L0117o8926J52586L7288m2139Q5952k2470K5829m272
63C4007m6684M704p3695n9102J0334J558o159L3984J1889r3046R942R5935L3637
50d2696K9816Q607K6182k9566m5017J4589N9848r6481R385L9785m7284o0328N373
37a27787r700J0310m352o0090l4671R3719P033J30548N1064l008n8027L1265Q8885
24A15189j25534K323M644n9753j5683l7840k6790m0191r340k4839P7056O5222
12g5536r845k0524O32j4980k5983J91480K3863p2138m045k7434r9027l9477
$$ plain form
0 -173014
$$ packed form
0a73014
$$ Imaginary data points
##PAGE= N=2
##DATA TABLE= (X++(I..I)), XYDATA
$$ plain form
16383 -1824434 -1881690 -1765386 -1776600 -1844472 -1714718 -1722607 -1702120 -1633342 -1626778 -1566321 -1556603
16372 -1556603 -1540337 -1585922 -1592407 -1638369 -1602538 -1571167 -1528862 -1559372 -1577424 -1515417 -1353413
16361 -1353413 -1332680 -1400067 -1313755 -1324724 -1202978 -1094836 -1146972 -1289793 -1276649 -1152558
16351 -1152558 -1080709 -1126616 -1142957 -1142849 -1254653 -1177450 -1128982 -1140452 -1105599 -1088289 -1087080 -1101965
16339 -1101965 -954087 -949484 -908502 -858063 -920847 -859123 -726424 -728557 -824117 -800510 -749629
16328 -749629 -844084 -857115 -923964 -946248 -876201 -794721 -832507 -712720 -617099 -582344 -442004
16317 -442004 -429336 -565454 -576273 -569641 -443128 -387939 -506696 -440782 -415065 -474090 -423320
16306 -423320 -473364 -439966 -349339 -347012 -302303 -192312 -234922 -357815 -294223 -255486 -241908
$$ packed form
16383a824434n7256J16304j1214o7872J29754p889K0487O8778O564O0457R718
16372a556603J6266m5585o485m5962L5831L1371M2305l0510j8052O2007J62004
16361a353413K0733o7387Q6312j0969J21746J08142n2136j42821J3144J24091
16351a152558P1849m5907j6341J08j11804P7203M8468j1470L4853J7310J209j4885
16339a101965J47878M603M0982N0439o2784O1724J32699k133r5560K3607N0881
16328g49629r4455j3031o6849k2284P0047Q1480l7786J19787R5621L4755J40340
16317d42004J2668j36118j0819O632J26513N5189j18757O5914K5717n9025N0770
16306d23320n0044L3398R0627K327M4709J09991m2610j22893O3592L8737J3578
$$ plain form
16295 -241908 -226129 -328898 -296448 -285125 -261425 -106323 -18184 -96331 -103662 -165552 -75202
16284 -75202 55429 -26233 -63055 -76851 -22991 -12009 -40816 -26813 -15656 -23038 60046 -3399
16272 -3399 17335 54354 147074 272920 289613 289953 276362 291498 234528 222320 227945 240870
16260 240870 272910 178116 144707 271322 375630 408727 476673 453605 343759 356131 286176
16249 286176 300977 390607 479757 460413 305927 373726 368056 433688 493125 533445 590156
16238 590156 496144 483955 679774 671320 589913 558782 599362 575918 522365 539757 635133
16227 635133 660913 677795 735721 700109 794099 795802 681507 682418 741763 790201 693246 583127
16215 583127 603067 637496 731709 779413 771228 633743 525949 683579 967174 961474 894441
$$ packed form
16295b41908J5779j02769L2450J1323K3700J55102Q8139p8147p331o1890R0350
16284g5202J30631q1662l6822j3796N3860J0982k8807J4003J1157p382Q3084o3445
16272c399K0734L7019R2720J25846J6693L40j3591J5136n6970j2208N625J2925
16260B40870L2040r4794l3409J26615J04308L3097O7946k3068j09846J2372o9955
16249B86176J4801Q9630Q9150j9344j54486O7799n670O5632N9437M0320N6711
16238E90156r4012j2189J95819q454q1407l1131M0580k3444n3553J7392R5376
16227F35133K5780J6882N7926l5612R3990J703j14295R11N9345M8438r6955j10119
16215E83127J9940L4429R4213M7704q185j37485j07794J57630K83595n700o7033
$$ plain form
16204 894441 925576 908788 860590 857996 843133 811016 952589 844725 721740 758475 818826
16193 818826 845008 824831 823915 908849 904742 819856 847255 892876 923959 926325 903917 970717
16181 970717 1038496 1096261 1150563 1017324 876550 971690 1108023 1171148 1065890 1047918 1097489
16170 1097489 954613 1076492 1015869 964984 997148 894514 859676 901562 855965 902836 981433
16159 981433 1049291 1110668 1099367 1055792 1015835 1155185 1219945 1227003 1246057 1159308 1082961
$$ packed form
16204H94441L1135j6788m8198k594j4863l2117J41573j07864j22985L6735O0351
16193H18826K6182k0177r16Q4934m107q4886K7399M5621L1083K366k2408O6800
16181I70717O7779N7765N4302j33239j40774R5140J36333O3125j05258j7972M9571
16170A097489j42876J21879o0623n0885L2164j02634l4838M1886m5597M6871P8597
16159I81433O7858O1377j1301m3575l9957J39350O4760P058J9054q6749p6347
$$ [...]
##END NTUPLES=NMR SPECTRUM
##END=
