##TITLE=1H_EC-3243(4)
 CDCl3, 8 sc, 
 9.04.2021
##JCAMPDX= 6.0         $$ Bruker NMR JCAMP-DX V2.0
##DATA TYPE= NMR SPECTRUM
##DATA CLASS= NTUPLES
##ORIGIN= UXNMR, Bruker Analytische Messtechnik GmbH
##OWNER= root
$$ XWIN-NMR		Version 3.5
$$ Fri Apr  9 10:39:56 2021 Russian Standard Time (UT+4h)  she@DPX200
##.OBSERVE FREQUENCY= 200.131506
##.OBSERVE NUCLEUS= ^1H
##.ACQUISITION MODE= SIMULTANEOUS
##.ACQUISITION SCHEME= undefined
##.AVERAGES= 8
##.DIGITISER RES= 18
##SPECTROMETER/DATA SYSTEM= spect
##.PULSE SEQUENCE= zg30
##.SOLVENT NAME= CDCl3
##.SHIFT REFERENCE= (INTERNAL, CDCl3, 0, 15.9885)
##AUDIT TRAIL= $$ (NUMBER, WHEN, WHO, WHERE, WHAT)
$$ ##TITLE= Audit trail, XWIN-NMR		Version 3.5
$$ ##JCAMPDX= 5.01
$$ ##ORIGIN= Bruker BioSpin GmbH
$$ ##OWNER= she
$$ F:/spectra/data/she/nmr/H-F/1/pdata/1/auditp.txt
$$ ##AUDIT TRAIL=  $$ (NUMBER, WHEN, WHO, WHERE, WHAT)
(   1,<2021-04-09 10:38:34.35 +0400>,<she>,<DPX200>,
      <created by zg, POWCHK disabled, PULCHK disabled
       configuration hash MD5:
       00 E9 B6 7A A2 85 ED C7 34 08 36 98 17 FE 4E 26
       data hash MD5: 16K
       02 9E 34 C5 BE 6B A1 B7 1F 0D 84 04 D2 35 F4 5D>)
(   2,<2021-04-09 10:38:36.54 +0400>,<she>,<DPX200>,
      <Start of raw data processing
       efp BC_mod = 2 LB = 0.24 FT_mod = 6 PKNL = 1 PHC0 = -11118.71 PHC1 = 12.60092 SI = 16K 
       data hash MD5: 16K
       C5 80 96 C2 52 02 C1 D0 EE 51 0D 7F A8 0F 7F 52>)
(   3,<2021-04-09 10:38:52.17 +0400>,<she>,<DPX200>,
      <pk PHC0 = 0.1914524 PHC1 = -2.4 
       data hash MD5: 16K
       09 55 E3 E6 54 D9 4C 6F A4 FD 6E BF C5 B2 F8 65>)
(   4,<2021-04-09 10:38:55.73 +0400>,<she>,<DPX200>,
      <abs ABSG = 5 
       data hash MD5: 16K
       85 96 91 9F DC 73 8E 3F 97 1F 8A 88 BB 3E 39 AD>)
(   5,<2021-04-09 10:39:21.45 +0400>,<she>,<DPX200>,
      <abs ABSG = 5 
       data hash MD5: 16K
       F5 5C E8 96 93 DF F0 E0 BF B0 0A 35 BC B2 12 FA>)
$$ ##END=
$$ 
$$ hash MD5
$$ AC B7 54 AB 6B 6C A6 F7 9F AB 61 10 AF 74 40 99
##$RELAX= 
##$RELAX= 
##$RELAX= 
##$RELAX= 
##$RELAX= 
##$RELAX= 
$$ Bruker specific parameters
$$ --------------------------
##$DU= <F:/spectra>
##$EXPNO= 1
##$NAME= <H-F>
##$PROCNO= 1
##$TYPE= <nmr>
##$USER= <she>
##$AMP= (0..31)
100 100 100 100 100 100 100 100 100 100 100 100 100 100 100 100 100 100 
100 100 100 100 100 100 100 100 100 100 100 100 100 100 
##$AQSEQ= 0
##$AQ_mod= 1
##$AUNM= <au_zg>
##$AUTOPOS= <>
##$BF1= 200.13
##$BF2= 200.13
##$BF3= 200.13
##$BF4= 200.13
##$BF5= 200.13
##$BF6= 200.13
##$BF7= 200.13
##$BF8= 200.13
##$BYTORDA= 1
##$CFDGTYP= 0
##$CFRGTYP= 5
##$CHEMSTR= <none>
##$CNST= (0..31)
1 1 145 1 1 1 1 1 1 1 1 1 1 1 1 1 1 1 1 1 1 1 1 1 1 1 1 1 1 1 1 1 
##$CPDPRG= <>
##$CPDPRG1= <>
##$CPDPRG2= <>
##$CPDPRG3= <>
##$CPDPRG4= <mlev>
##$CPDPRG5= <mlev>
##$CPDPRG6= <mlev>
##$CPDPRG7= <mlev>
##$CPDPRG8= <mlev>
##$CPDPRGB= <>
##$CPDPRGT= <>
##$D= (0..31)
0 1.2 0 0 0 0 0 0 0 0.06 0 0.03 0 0 0 0 0.0002 0 0 0 0 0 0 0 0 0 0 0 0 
0 0 0 
##$DATE= 1617950313
##$DBL= (0..7)
$$ [...]
##$SUBNAM3= <"">
##$SUBNAM4= <"">
##$SUBNAM5= <"">
##$SUBNAM6= <"">
##$SUBNAM7= <"">
##$SUBNAM8= <"">
##$SUBNAM9= <"">
##$SW= 16.9725357007746
##$SWIBOX= (0..15)
0 0 2 0 0 0 0 0 0 0 0 0 0 0 0 0 
##$SW_h= 3396.73913043478
##$TD= 16384
##$TD0= 1
##$TE= 0
##$TE2= 300
##$TE3= 300
##$TEG= 300
##$TL= (0..7)
0 120 120 120 120 120 120 120 
##$TP= (0..7)
150 150 150 150 150 150 150 150 
##$TP07= 0
##$TPNAME0= <>
##$TPNAME1= <>
##$TPNAME2= <>
##$TPNAME3= <>
##$TPNAME4= <>
##$TPNAME5= <>
##$TPNAME6= <>
##$TPNAME7= <>
##$TPOAL= (0..7)
0.5 0.5 0.5 0.5 0.5 0.5 0.5 0.5 
##$TPOFFS= (0..7)
0 0 0 0 0 0 0 0 
##$TUNHIN= 0
##$TUNHOUT= 0
##$TUNXOUT= 0
##$USERA1= <user>
##$USERA2= <user>
##$USERA3= <user>
##$USERA4= <user>
##$USERA5= <user>
##$V9= 5
##$VALIST= <valist>
##$VCLIST= <CCCCCCCCCCCCCCC>
##$VD= 0
##$VDLIST= <DDDDDDDDDDDDDDD>
##$VPLIST= <PPPPPPPPPPPPPPP>
##$VTLIST= <TTTTTTTTTTTTTTT>
##$WBST= 1024
##$WBSW= 4
##$XGAIN= (0..3)
0 0 0 0 
##$XL= 0
##$YL= 0
##$YMAX_a= 245278
##$YMIN_a= -291095
##$ZGOPTNS= <>
##$ZL1= 120
##$ZL2= 120
##$ZL3= 120
##$ZL4= 120
##$ABSF1= 15.98853
##$ABSF2= -0.9841337
##$ABSG= 5
##$ABSL= 3
##$ALPHA= 0
##$AQORDER= 0
##$ASSFAC= 0
##$ASSFACI= 0
##$ASSFACX= 0
##$ASSWID= 0
##$AUNMP= <proc_1d>
##$AZFE= 0.1
##$AZFW= 0.1
##$BCFW= 0
##$BC_mod= 2
##$BYTORDP= 0
##$COROFFS= 0
##$CY= -3
##$DATMOD= 1
##$DC= 0
##$DFILT= <>
##$DTYPP= 0
##$F1P= 0
##$F2P= 0
##$FCOR= 1
##$FTSIZE= 16384
##$FT_mod= 6
##$GAMMA= 0
##$GB= 0
##$INTBC= 1
##$INTSCL= 3.559346e-10
##$ISEN= 128
##$LB= 0.24
##$LEV0= 0
##$LPBIN= 0
##$MAXI= 10000
##$MC2= 0
##$MEAN= 0
##$ME_mod= 0
##$MI= 1.114404
##$NCOEF= 0
##$NC_proc= -6
##$NLEV= 6
##$NOISF1= 3.799351
##$NOISF2= 2.8
##$NSP= 0
##$NTH_PI= 0
##$NZP= 0
##$OFFSET= 15.98853
##$PC= 1
##$PHC0= -11118.52
##$PHC1= 10.20092
##$PH_mod= 1
##$PKNL= yes
##$PPARMOD= 0
##$PSCAL= 0
##$PSIGN= 0
##$REVERSE= no
##$SF= 200.130004585128
##$SI= 16384
##$SIGF1= 3
##$SIGF2= 2
##$SINO= 5.538805
##$SIOLD= 16384
##$SREGLST= <1H.CDCl3>
##$SSB= 0
##$STSI= 16384
##$STSR= 0
##$SW_p= 3396.73913043479
##$SYMM= 0
##$S_DEV= 0
##$TDeff= 16384
##$TDoff= 0
##$TI= <>
##$TILT= no
##$TM1= 0
##$TM2= 0
##$TOPLEV= 0
##$USERP1= <user>
##$USERP2= <user>
##$USERP3= <user>
##$USERP4= <user>
##$USERP5= <user>
##$WDW= 1
##$XDIM= 16384
##$YMAX_p= 370641443
##$YMIN_p= -464467
$$ End of Bruker specific parameters
$$ ---------------------------------
##NTUPLES= NMR SPECTRUM
##VAR_NAME=  FREQUENCY,     SPECTRUM/REAL,   SPECTRUM/IMAG
##SYMBOL=    X,             R,               I
##VAR_TYPE=  INDEPENDENT,   DEPENDENT,       DEPENDENT
##VAR_FORM=  AFFN,          ASDF,            ASDF
##VAR_DIM=   16384,         16384,           16384
##UNITS=     HZ,            ARBITRARY UNITS, ARBITRARY UNITS
##FACTOR=    0.207333158178282, 1,           1
##FIRST=     3199.78461402944, 0,            0
##LAST=      -196.954516405347, 0,           0
##MIN=       -196.954516405347, -464467,     0
##MAX=       3199.78461402944, 370641443,    0
$$ Real data points
##PAGE= N=1
##DATA TABLE= (X++(R..R)), XYDATA
$$ [...]
$$ plain form
6176 6346922 6444669 6626138 6809950 6938639 7048239 7121879 7292185 7332153 7493105 7736287
6166 7736287 7960514 8070995 8182941 8349524 8496023 8684147 8848921 8929058 9178412 9472543
6156 9472543 9620699 9881870 10122399 10256191 10428725 10665672 10806685 11029970 11220113 11514461
6146 11514461 11738071 11884017 12041674 12355375 12592678 12852440 13155254 13509203 13675104
6137 13675104 13854422 14039821 14172847 14435277 14743275 14974491 15176850 15378867 15528757
6128 15528757 15700936 16034992 16227953 16276412 16386952 16485044 16701128 16801142 16728404 16839286
6118 16839286 17050324 16939088 16812448 16700033 16876671 16885919 16685769 16588471 16503475 16409593
6108 16409593 16147864 15804832 15765039 15649883 15381022 15168197 14920116 14749656 14538549 14235454
$$ packed form
6176F346922R7747J81469J83812J28689J09600P3640J70306L9968J60952K43182
6166G736287K24227J10481J11946J66583J46499J88124J64774Q0137K49354K94131
6156I472543J48156K61171K40529J33792J72534K36947J41013K23285J90143K94348
6146A1514461K23610J45946J57657L13701K37303K59762L02814L53949J65901
6137A3675104J79318J85399J33026K62430L07998K31216K02359K02017J49890
6128A5528757J72179L34056J92961M8459J10540R8092K16084J00014p2738J10882
6118A6839286K11038j11236j26640j12415J76638R248k00150r7298q4996r3882
6108A6409593k61729l43032l9793j15156k68861k12825k48081j70460k11107l03095
$$ plain form
6098 14235454 14026555 13690883 13373954 13240188 12933390 12707447 12414183 12140714 11929143
6089 11929143 11635871 11365317 11165314 10911950 10680937 10427797 10217639 10002950 9826254
6080 9826254 9668346 9310152 9007101 8876110 8596913 8336764 8149860 8140735 8014571 7646710
6070 7646710 7528644 7268768 7036834 6876952 6794172 6716732 6573416 6400276 6166695 6040413
6060 6040413 5988999 5766493 5679144 5703190 5550471 5550376 5445367 5161700 5026650 4993845 4970475
6049 4970475 4906476 4674423 4642932 4642214 4590166 4369267 4218924 4205506 4136592 3981210 3821792
6038 3821792 3841212 3812153 3643730 3447608 3379523 3322538 3464973 3427857 3205876 3117084 3165464
6027 3165464 3115050 2984692 2833356 3019803 3052436 2852908 2683303 2726457 2931284 2788822
$$ packed form
6098A4235454k08899l35672l16929j33766l06798k25943k93264k73469k11571
6089A1929143k93272k70554k00003k53364k31013k53140k10158k14689j76696
6080I826254j57908l58194l03051j30991k79197k60149j86904r125j26164l67861
6070G646710j18066k59876k31934j59882q2780p7440j43316j73140k33581j26282
6060F040413n1414k22506q7349K4046j52719r5j05009k83667j35050l2805k3370
6049D970475o3999k32053l1491p18n2048k20899j50343j3418o8914j55382j59418
6038C821792J9420k9059j68423j96122o8085n6985J42435l7116k21981q8792M8380
6027C165464n0414j30358j51336J86447L2633j99528j69605M3154K04827j42462
$$ plain form
6017 2788822 2630553 2598522 2501459 2509942 2448646 2328486 2408925 2397906 2309463 2171183 2063041
6006 2063041 2193514 2144708 2057999 2001405 1968061 1959643 1826170 1730878 1666867 1686562 1837343
5995 1837343 1754006 1669781 1718819 1702325 1762420 1618753 1592421 1742217 1712794 1732071 1588201
5984 1588201 1503025 1648283 1593800 1479064 1461470 1440765 1454166 1352691 1262966 1308890 1293978
5973 1293978 1343452 1230463 1256859 1270332 1127664 1014712 987105 1104497 1177987 1103902 1167267
5962 1167267 1199457 1110712 1089871 1206087 1226839 1207253 1177748 1212531 1081524 1041545 1006735
5951 1006735 942687 1087147 1170221 1087815 1152444 1199107 1093113 911975 847415 878129 918666
5940 918666 983352 923916 847914 758469 772652 851493 722292 684031 736315 759179 811352
$$ packed form
6017B788822j58269l2031r7063Q483o1296j20160Q0439j1019q8443j38280j08142
6006B063041J30473m8806q6709n6594l3344q418j33473r5292o4011J9695J50781
5995A837343q3337q4225M9038j6494O0095j43667k6332J49796k9423J9277j43870
5984A588201q5176J45258n4483j14736j7594k0705J3401j01475q9725M5924j4912
5973A293978M9474j12989K6396J3473j42668j12952k7607J17392P3490p4085O3365
5962A167267L2190q8745k0841J16216K0752j9586k9505L4783j31007l9979l4810
5951A006735o4048J44460Q3074q2406O4629M6663j05994j81138o4560L0714M0537
5940I18666O4686n9436p6002q9445J4183P8841j29201l8261N2284K2864N2173
$$ plain form
5929 811352 828453 864285 829260 648114 599067 703679 644092 652544 664167 785791 807365
5918 807365 758989 745715 751827 776862 695755 602347 634105 830568 871117 785468 794646 875543
5906 875543 917124 826242 763188 820033 886077 759715 556343 486200 674836 704427 642077
5895 642077 579311 538060 542473 461105 256936 271247 467169 564668 519073 541808 500351
5884 500351 390298 307610 267072 351521 434365 537577 524390 492588 391304 341125 248216
5873 248216 269664 327401 406640 344571 357723 287438 202877 288277 130061 77453 171079
5862 171079 260975 255450 405390 294056 189281 182021 126850 300687 283441 168558 238928
5851 238928 273835 266450 245437 223592 217106 163182 110095 156412 176976 258248 265015 285174
$$ packed form
5929H11352J7101L5832l5025j81146m9047J04612n9587Q452J1623J21624K1574
5918H07365m8376j3274O112K5035q1107r3408L1758J96463M0549q5649R178Q0897
5906H75543M1581r0882o3054N6845O6044j26362k03372p0143J88636K9591o2350
5895F42077o2766m1251M413q1368k04169J4311J95922R7499m5595K2735m1457
5884E00351j10053q2688m0538Q4449Q2844J03212j3187l1802j01284n0179r2909
5873B48216K1448N7737P9239o2069J3152p0285q4561Q5400j58216n2608R3626
5862A71079Q9896n525J49940j11334j04775p260n5171J73837j7246j14883P0370
5851B38928L4907p385k1013k1845o486n3924n3087M6317K0564Q1272O767K0159
$$ plain form
5839 285174 154395 136828 212022 103915 140269 130995 255957 315424 188122 45677 140266
5828 140266 169709 167999 217129 215416 201534 29990 78989 126703 131236 137633 109546 171107
5816 171107 227016 104400 -93529 -67633 63292 186578 46827 87074 230122 244712
5806 244712 80908 -43424 46 107713 228829 184932 122413 75745 64201 22815 -46292
5795 -46292 19066 260479 265608 12975 -100713 -28745 -2869 -28418 19603 101100 40136
5784 40136 54097 -21452 -19763 95349 153248 91834 44248 101519 155258 141351 7579 77165
5772 77165 211308 111209 34369 -19682 66135 31103 -59316 -112341 -181442 9605 92780
5761 92780 105006 36316 41586 34714 16610 -16292 -38992 11499 -25879 44292 189104 129692
$$ packed form
5839B85174j30779j7567P5194j08107L6354r274J24962N9467j27302j42445R4589
5828A40266K9443j710M9130j713j3882j71544M8999M7714M533O397k8087O1561
5816A71107N5909j22616j97929K5896J30925J23286j39751M0247J43048J4590
5806B44712j63804j24332M3470J07667J21116m3897o2519m6668j1544m1386o9107
5795d6292O5358K41413N129k52633j13688P1968K5876k5549M8021Q1497o0964
5784D0136J3961p5549J689J15112N7899o1414m7586N7271N3739j3907j33772O9586
5772G7165J34143j00099p6840n4051Q5817l5032r0419n3025o9101J91047Q3175
5761I2780J2226o8690N270o872j8104l2902k2700N0491l7378P0171J44812n9412
$$ plain form
5749 129692 63133 69876 63500 204923 307562 151160 20195 -27881 -58266 -31471 -63171
5738 -63171 66740 173709 54629 -51160 -87766 -102380 -187210 -237399 -181003 -126384 -127997
5727 -127997 -160474 -115222 -179480 -141917 10683 21282 11787 55511 119628 28782 -122580
5716 -122580 -147125 -55164 61900 115079 -6909 76948 61902 15021 -21056 -51486 -140213
5705 -140213 -46838 -14217 -125838 -102529 -51738 -15309 -92737 -119253 -40737 -34991 -85092 -112676
5693 -112676 26072 93870 136352 127982 81472 80086 30501 -22442 -1896 -15709 34127 95085
5681 95085 86009 -2736 -138791 -117215 10876 13687 -14850 -81682 -207534 -172394 -238209 -173339
5669 -173339 -46244 13066 6971 88126 20631 23995 -21606 18828 25830 39502 100259 80135
$$ packed form
5749A29692o6559O743o376J41423J02639j56402j30965m8076l0385K6795l1700
5738f3171J29911J06969j19080j05789l6606j4614q4830n0189N6396N4619j613
5727a27997l2477M5252o4258L7563J52600J0599r495M3724O4117r0846j51362
5716a22580k4545R1961J17064N3179j21988Q3857j5046m6881l6077l0430q8727
5705a40213R3375L2621j11621K3309N0791L6429p7428k6516P8516N746n0101k7584
5693a12676J38748O7798M2482q370m6510j386m9585n2943K0546j3813M9836O0958
5681I5085r076q8745j36055K1576J28091K811k8537o6832j25852L5140o5815O4870
5669a73339J27095N9310o095Q1155o7495L364m5601M0434P002J3672O0757k0124
$$ plain form
5657 80135 -19788 46534 75625 100958 131139 41073 3292 -27834 -2802 -75867 -185771 -105531
5645 -105531 -90876 -45557 -98519 -90823 -30508 -62492 607 -6666 -29307 -77609 -168769 -204489
5633 -204489 -102127 -117840 21770 126781 59383 29883 -72315 -98068 32259 59848 -62386
5622 -62386 -92407 -72594 -84503 -45601 30304 51386 -74526 -152878 -174515 -279209 -249456
5611 -249456 -147814 -52415 -122378 -94761 -97545 -208915 -237224 -246264 -160300 -88555 -128021 -41319
5599 -41319 27213 -198967 -298032 -168050 -45839 -102231 -38966 10690 36442 -135655 -364064
5588 -364064 -274446 -90604 39613 65782 -61548 -79576 -898 -100136 -272884 -155596 -29932
5577 -29932 98341 -109254 -186450 -112511 -186404 -213569 -209368 -162151 -67022 -80778 -55112 -63681
$$ packed form
5657H0135r9923O6322K9091K5333L0181r0066l7781l1126K5032p3065j09904Q0240
5645a05531J4655M5319n2962P696O0315l1984O3099p273k2641m8302r1160l5720
5633b04489J02362j5713J39610J05011o7398k9500j02198k5753J30327K7589j22234
5622f2386l0021J9813j1909L8902P5905K1082j25912p8352k1637j04694K9753
5611b49456J01642R5399o9963K7617k784j11370k8309r040Q5964P1745l9466Q6702
5599d1319O8532k26180r9065J29982J22211n6392O3265M9656K5752j72097k28409
5588c64064Q9618J83842J30217K6169j27330j8028P8678r9238j72748J17288J25664
5577b9932J28273k07595p7196P3939p3893k7165M201M7217R5129j3756K5666q569
$$ plain form
5565 -63681 -162347 -99141 -44632 -57143 -38824 73536 125696 -35569 -214553 -100639 59632
5554 59632 66442 38835 39333 -82323 -130418 -183142 -151983 -98085 29017 49889 2539 -110833
5542 -110833 -72918 -198725 -132373 -51380 -111358 -144380 -198913 -201746 -226985 -180449 -103907 8295
5530 8295 -73907 -131318 3176 -44415 -135238 -140200 -31233 13833 -34942 10310 -65731 -101464
5518 -101464 -13158 -78266 -134382 -40673 8932 -13320 -221948 -142537 4881 -72569 -158512
5507 -158512 -154135 -48801 3612 -189685 -324643 -237362 -155988 -226309 -191854 -210859 -116748
5496 -116748 -136424 -128359 -203617 -173438 -43482 -54547 -38412 -50635 -119918 -219494 -209404 -195303
5484 -195303 -65839 -23555 -25070 -44063 -147151 -87132 -53823 -217761 -216488 -167481 -15513
$$ packed form
5565f3681r8666O3206N4509j2511J8319J12360N2160j61265j78984J13914J60271
5554E9632O810k7607M98j21656m8095n2724L1159N3898J27102K0872m7350j13372
5542a10833L7915j25807O6352Q0993n9978l3022n4533k833k5239M6536P6542J12202
5530H295q2202n7411J34494m7591r0823m962J08967M5066m8775M5252p6041l5733
5518a01464Q8306o5108n6116R3709M9605k2252k08628P9411J47418p7450q5943
5507a58512M377J05334N2413j93297j34958Q7281Q1374p0321L4455j9005R4111
5496a16748j9676Q065p5258L0179J29956j1065J6135j2223o9283r9576J0090J4101
5484a95303J29464M2284j515j8993j03088O0019L3309j63938J273M9007J51968
$$ plain form
5473 -15513 -97163 -77947 -31810 -28629 -71297 -251698 -198414 -47378 -88714 -241952 -261423
5462 -261423 -121864 -99850 -98066 -102449 -72140 -35646 -126721 -159389 -94796 -24427 -31299 -48763
5450 -48763 -62465 -22267 -64595 -95024 -210713 -104020 -41172 -152966 -240006 -153329 -106749
5439 -106749 -17954 -154179 -186021 -164853 -254701 -175663 -74639 -12259 -7160 -12338 -770 -46908
5427 -46908 -83305 -23942 28830 76610 8937 -2665 -15209 -86799 -71998 -83670 -175568 -141231
5415 -141231 -48532 -91115 -67228 -78531 -139921 -111291 -114495 -183552 -189447 -122363 -57321 -48421
5403 -48421 -107004 -30592 -70425 -81445 -255499 -123406 -90066 -129056 -52020 -47365 -15456 117891
5391 117891 -29595 -113666 -112619 -42734 3542 -100399 -111920 -103145 -43948 -239807 -410219
$$ packed form
5473a5513q1650J9216M6137L181m2668j80401N3284J51036m1336j53238j9471
5462b61423J39559K2014J784m383L0309L6494r1075l2668O4593P0369o872j7464
5450d8763j3702M0198m2328l0429j15689J06693O2848j11794q7040Q6677M6580
5439a06749Q8795j36225l1842K1168q9848P9038J01024O2380N099n178J1568m6138
5427d6908l6397N9363N2772M7780o7673j1602j2544p1590J4801j1672r1898L4337
5415a41231R2699m2583K3887j1303o1390K8630l204o9057n895O7084O5042Q900
5403d8421n8583P6412l9833j1020j74054J32093L3340l8990P7036M655L1909J33347
5391A17891j47486q4071J047O9885M6276j03941j1521Q775N9197j95859j70412
$$ plain form
5380 -410219 -208592 -32634 -47606 -120980 -81950 -60764 -276423 -340493 -136416 35003 121344
5369 121344 -88856 -103824 13030 -68726 -133462 -230039 -119455 59707 53335 -33316 -96367
5358 -96367 18278 1471 -168222 -121397 -43091 -11393 -103340 -252535 -317545 -156800 -127607
5347 -127607 -142137 -187785 -97529 -55825 -89912 -236930 -175130 -132923 -179935 -123829 -27427
5336 -27427 -67802 -109916 -185148 -235811 -147824 -51682 71142 40973 -181584 -216565 -219791 -229084
5324 -229084 -234843 18513 134936 9995 -44595 -110252 -118174 -252124 -244779 -17447 109520
5313 109520 -88174 -189745 -64248 -123337 -269345 -268808 -93668 57806 94981 59301 30744
5302 30744 -80783 -248872 -318421 -405383 -233337 -86817 -33029 -109021 -121795 -165361 -356194
$$ packed form
5380d10219K01627J75958j4972p3374L9030K1186k15659o4070K04077J71419Q6341
5369A21344k10200j4968J16854q1756o4736r6577J10584J79162o372q6651o3051
5358i6367J14645j6807j69693M6825P8306L1698r1947j49195o5010J60745K9193
5347a27607j4530m5648R0256M1704l4087j47018O1800M2207m7012N6106R6402
5336b7427m0375m2114p5232n0663Q7987R6142J22824l0169k22557l4981l226r293
5324b29084n759K53356J16423j24941n4590o5657p922j33950P345K27332J26967
5313A09520j97694j01571J25497n9089j46008N37J75140J51474L7175l5680k8557
5302C0744j11527j68089o9549q6962J72046J46520N3788p5992j2774m3566j90833
$$ plain form
5291 -356194 -246419 -160277 -174570 -115910 -280861 -200763 -39148 -132252 -198270 -111098 13829
5280 13829 85257 -21411 -8706 60669 21056 6764 -150136 -197393 -60514 -36002 -35094 -194002
5268 -194002 -118246 -125953 -132866 -115843 -153364 -55838 -90286 -272092 -390848 -392235 -201442 -72898
5256 -72898 -147726 -71467 -18032 -126989 -357039 -282748 -92314 50452 11762 6770 -1394
5245 -1394 -104871 -200495 -262185 -174943 -71009 131459 175322 -25244 -202485 -235541 -267039
5234 -267039 -274854 -186786 42264 46961 -165339 -243752 -283241 -268853 -324863 -278279 -135411
5223 -135411 -83323 -84860 -123401 -128989 -46978 -140266 -206754 -81662 -52724 -55112 -65527 -46912
5211 -46912 -36724 318 14789 -42164 -85034 -99994 -53357 -168426 -229481 -208289 -192052 -265903
$$ packed form
5291c56194J09775Q6142j4293N8660j64951Q0098J61615r3104o6018Q7172J24927
5280A3829P1428j06668J2705O9375l9613j4292j56900m7257J36879K4512R08j58908
5268a94002P5756p707o913J7023l7521R7526l4448j81806j18756j387J90793J28544
5256g2898p4828P6259N3435j08957k30050P4291J90434J42766l8690m992q164
5245a394j03477r5624o1690Q7242J03934K02468M3863k00566j77241l3056l1498
5234b67039p815Q8068K29050M697k12300p8413l9489J4388n6010M6584J42868
5223a35411N2088j537l8541n588Q2011r3288o6488J25092K8938k388j0415J8615
5211d6912J0188L7042J4471n6953m2870j4960M6637j15069o1055K1192J6237p3851
$$ plain form
5199 -265903 -162931 -157320 -212721 -174989 -213053 -125528 -42910 -222541 -331890 -129712 -76071
5188 -76071 -191277 -165657 836 150068 184502 60232 73405 12297 -20599 -29582 -112481
5177 -112481 -62758 48629 67086 -27481 -76356 -118934 -153383 -266928 -312061 -210864 -55206
5166 -55206 -100885 -66994 -89347 -102119 -117359 -252605 -216573 -61388 -61009 -40650 -48372 41999
5154 41999 114137 65226 2704 -135151 -109504 -61495 -71752 -105700 -80453 -32552 81352
5143 81352 -123117 -150602 -46423 -59196 -208270 -192319 -82067 -168339 -165048 -224075 -219582
5132 -219582 -172449 -133620 -221539 -138631 -108546 -215477 -245034 -262188 -178421 -195209 -30724
5121 -30724 80628 37529 24738 2801 -20535 -165167 -105353 -31563 -76772 -177995 -127376
$$ packed form
5199b65903J02972N611n5401L7732l8064Q7525Q2618j79631j09349K02178N3641
5188g6071j15206K5620J66493J49232L4434j24270J3173o1108l2896q983q2899
5177a12481M9723J11387J8457r4567m8875m2578l4449j13545m5133J01197J55658
5166e5206m5679L3891k2353j2772j5240j35246L6032J55185L79K0359p722R0371
5154D1999P2138m8911o2522j37855K5647M8009j0257l3948K5247M7901J13904
5143H1352k04469k7485J04179j2773j49074J5951J10252q6272L291n9027M493
5132b19582M7133L8829q7919Q2908L0085j06931k9557j7154Q3767j6788J64485
5121c0724J11352m3099j2791k1937k3336j44632N9814P3790m5209j01223N0619
$$ plain form
5110 -127376 -29411 -130998 -205801 -154054 -54554 -208141 -113218 -57767 -125070 -125420 -138575 -87519
5098 -87519 -100692 -186227 -171827 -109423 -76957 -117136 -100407 -21596 -5192 -44494 -125338 -107035
5086 -107035 7692 139585 130044 28554 -35179 -149611 -226651 -306454 -213631 -164696 -104696
5075 -104696 -16372 -52069 -81968 -199428 -206812 -165789 -149972 -82317 10935 50056 -19919 -45443
5063 -45443 -129038 -217666 -130190 -40942 -47616 -141918 -3394 34945 -147021 -161997 -74741 -108677
5051 -108677 -198500 -204066 -75789 -75294 -168872 -79100 56763 -46016 -108057 -8070 -47056 -101047
5039 -101047 -199659 -87937 33211 -77155 -61217 41145 6101 -62834 110783 48059 -13304
5028 -13304 -26474 -104202 -71745 -119745 -202124 -180949 -67729 -123001 -162084 -43166 -54029
$$ packed form
5110a27376R7965j01587p4803N1747R9500j53587R4923N5451o7303l50j3155N1056
5098h7519j3173q5535J4400O2404L2466m0179J6729P8811J6404l9302q0844J8303
5086a07035J14727J31893r541j01490o3733j14432p7040p9803R2823M8935O0000
5075a04696Q8324l5697k9899j17460p384M1023J5817O7655R3252L9121o9975k5524
5063d5443q3595q8628Q7476Q9248o674r4302J38524L8339j81966j4976Q7256l3936
5051a08677q9823n566J28277M95r3578Q9772J35863j02779o2041R9987l8986n3991
5039a01047r8612J11722J21148j10366J5938J02362l5044o8935J73617o2724o1363
5028a3304j3170p7728L2457m8000q2379K1175J13220n5272l9083J18918j0863
$$ plain form
5017 -54029 -174191 -237792 -202999 -132296 -169151 -222232 -188672 -99458 -18866 10566 8632 16166
5005 16166 48172 73012 -96465 -145224 -28688 47867 95598 9443 27484 157523 34673
4994 34673 -146041 -85208 -133021 -90089 -112027 -69343 40004 -63288 -202573 -146237 -37900
4983 -37900 -135501 -112364 24414 -31712 -137645 -138769 -104167 -24306 -69532 -140750 93840
4972 93840 275303 89064 7949 -98819 -86927 -154405 -199891 -103995 26248 32771 -40854
4961 -40854 -102222 -134403 -107598 -89894 -241198 -228403 -8029 -39228 -74772 -126652 -161460
4950 -161460 -150046 -91549 -92298 -15505 14450 -4460 66363 -1154 -126621 -54111 51841 -21971
4938 -21971 -220959 -112388 -87127 -117027 -222665 -115934 24233 34988 -72866 -230009
$$ packed form
5017e4029j20162o3601L4793P0703l6855n3081L3560Q9214Q0592K9432j934P534
5005A6166L2006K4840j69477m8759J16536P6555M7731q6155J8041J30039j22850
4994C4673j80714O0833m7813M2932k1938M2684J09347j03292j39285N6336J08337
4983c7900r7601K3137J36778n6126j05933j124L4602P9861m5226p1218K34590
4972I3840J81463j86239q1115j06768J1892o7478m5486R5896J30243O523p3625
4961d0854o1368l2181K6805J7704j51304J2795K20374l1199l5544n1880l4808
4950a61460J1414N8497p49P6793K9955j8910P0823o7517j25467P2510J05952p3812
4938b1971j98988J08571K5261k9900j05638J06731J40167J0755j07854j57143
$$ plain form
4928 -230009 -214525 -129426 -114818 -186645 -10177 113471 74565 -128127 -149162 -168438 -232931
4917 -232931 -126612 -74211 33013 60687 -61663 -112088 -146393 -103243 -68681 -38842 86510
4906 86510 85545 158731 73132 -87205 -234059 -85625 -25089 -31749 137549 79540 30435 -122284
4894 -122284 -256548 -227235 -192869 -23471 86531 58183 51261 41621 14412 -169787 -328830
4883 -328830 -123338 -143655 -134148 18791 -35213 81274 -44491 -104229 -91190 -30337 -107584
4872 -107584 -158599 -144205 -82809 -166876 -148068 -57678 4759 -89352 -136497 -106528 -119047 -151925
4860 -151925 -142587 -102226 -78507 -109448 -194984 -153845 -106578 -147483 27962 43080 11287 9947
4848 9947 8901 10025 38672 89905 -30786 -43156 51995 11772 -141842 -112971 -125355 20951
$$ packed form
4928b30009J5484Q5099J4608p1827J76468J23648l8906k02692k1035j9276o4493
4917b32931J06319N2401J07224K7674j22350n0425l4305M3150L4562K9839J25352
4906H6510r65P3186q5599j60337j46854J48434O0536o660J69298n8009m9105j52719
4894a22284j34264K9313L4366J69398J10002k8348o922r640k7209j84199j59043
4883c28830K05492k0317R507J52939n4004J16487j25765n9738J3039O0853p7247
4872a07584n1015J4394O1396q4067J8808R0390O2437r4111m7145K9969j2519l2878
4860a51925R338M0361K3719l0941q5536M1139M7267m0905J75445J5118l1793j340
4848I947j046J124K8647N1233j20691j2370R5151m0223j53614K8871j2384J46306
$$ plain form
4836 20951 -14388 -108105 -39108 -42363 1232 -22712 -120235 -271041 -395144 -157212 -92059
4825 -92059 -93858 -31158 -57435 54695 -1333 -48566 -110128 -59261 5037 11755 -69327 73920
4813 73920 142520 -39104 -72360 -10890 76147 -2871 -33854 59619 46059 -1095 -103439
4802 -103439 -197110 -156911 -255445 -96500 -57871 -116900 -97059 -102039 -147859 -213785 -149977 -31372
4790 -31372 -88549 -71674 8085 -53770 -167831 -158058 -71993 -20039 26212 120175 174358 92101
4778 92101 36191 -7107 -95161 -100291 -99592 -21486 -150489 -190143 -142361 -63893 -26465 -69565
4766 -69565 -60240 -83454 -67685 -117914 -208576 -199832 -134246 -70344 -48373 -20584 -4295 -8585
4754 -8585 -181136 -79263 63740 26140 374 -92747 -51827 -74502 -167257 -150396 -145341 -37735
$$ packed form
4836B0951l5339r3717O8997l255M3595k3944r7523j50806j24103K37932O5153
4825i2059j799O2700k6277J12130n6028m7233o1562N0867O4298O718q1082J43247
4813G3920O8600j81624l3256O1470Q7037p9018l0983R3473j3560m7154j02344
4802a03439r3671M0199r8534J58945L8629n9029J9841m980m5820o5926O3808J18605
4790c1372n7177J6875P9759o1855j14061R773Q6065N1954M6251R3963N4183q2257
4778I2101n5910m3298q8054n130O99P8106j29003l9654M7782P8468L7428m3100
4766f9565R325k3214J5769n0229r0662Q744O5586O3902K1971K7789J6289m290
4754h585j72551J01873J43003l7600k5766r3121M0920k2675r2755J6861N055J07606
$$ plain form
4742 -37735 113833 64373 -50333 -117237 -187451 -259009 -246407 -138759 28761 -8302 -133019
4731 -133019 -315863 -235536 -78378 -79304 -44498 3739 61873 88006 67216 -67539 -108405
4720 -108405 -49487 -30208 133941 189403 104202 29068 -75814 -145974 -88830 -22392 -4868
4709 -4868 36949 23431 -46332 -143960 -219398 -222279 -157014 -100263 34532 132933 81315 65025
4697 65025 87003 -36046 -48239 14811 -20028 8580 4840 43988 3706 -132291 -141789 49240
4685 49240 34076 12576 72831 98297 -17969 -84305 -13483 -47080 -44477 28861 38797 6595
4673 6595 -21693 -84039 -109895 -86293 -99582 56632 157135 45507 -64278 -145780 -230427
4662 -230427 -123331 -102170 -146573 -123039 -105832 -2483 -146861 -197639 62270 131989 57270
$$ packed form
4742c7735J51568m9460j14706o6904p0214p1558J2602J07648J67520l7063j24717
4731a33019j82844Q0327J57158r26L4806M8237N8134K6133k0790j34755m0866
4720a08405N8918J9279J64149N5462q5201p5134j04882p0160N7144O6438J7524
4709d868M1817j3518o9763r7628p5438k881O5265N6751J34795R8401n1618j6290
4697F5025K1978j23049j2193O3050l4839K8608l740L9148m0282j35997r498J91029
4685D9240j5164k1500O0255K5466j16266o6336P0822l3597K603P3338R936l2202
4673F595k8288o2346k5856K3602j3289J56214J00503j11628j09785q1502q4647
4662b30427J07096K1161m4403K3534J7207J03349j44378n0778K59909O9719p4719
$$ plain form
4651 57270 -8981 -117513 -42911 22799 -58868 -149077 -41265 115146 86328 102287 179705
4640 179705 157263 106754 -49400 20300 127561 92986 139231 143006 66209 -74383 4577
4629 4577 25397 -54083 -64814 38637 98079 -27625 -221350 -83172 -67461 -138758 -116861
4618 -116861 -63571 47021 88240 -158657 -178628 -120369 -59473 139723 209189 229760 198392
4607 198392 52224 -3391 107941 144389 42643 38128 185012 206135 152731 -16579 25761
4596 25761 186151 146142 -102697 -67576 35330 83679 15404 -66822 68882 184503 43686
4585 43686 -39531 21600 85275 60726 68540 93530 158062 134040 159922 100990 144805 129244
4573 129244 138200 235251 130754 205951 98609 145544 74462 83333 50587 75887 199582
$$ packed form
4651E7270o6251j08532P4602O5710q1667r0209J07812J56411k8818J5959P7418
4640A79705k2442n0509j56154O9700J07261l4575M6245L775p6797j40592P8960
4629D577K0820p9480j0731J03451N9442j25704j93725J38178J5711p1297K1897
4618a16861N3290J10592M1219k46897j9971N8259O0896J99196O9466K0571l1368
4607A98392j46168n5615J11332L6448j01746m515J46884K1123n3404j69310M2340
4596B5761J60390m0009k48839L5121J02906M8349o8275q2226J35704J15621j40817
4585D3686q3217O1131O3675k4549P814K4990O4532k4022K5882n8932M3815j5561
4573A29244Q956R7051j04497P5197j07342M6935p1082Q871l2746K5300J23695
$$ plain form
4562 199582 79286 63004 8609 63685 134584 234000 214024 302853 287341 204908 131899
4551 131899 82905 69417 158035 161344 196689 201641 141741 181650 125568 91722 107132 106921
4539 106921 47241 90219 39351 -13577 64592 138362 198478 214904 230932 207726 238505 233348
4527 233348 175020 254631 150285 178255 173155 132527 195900 145430 93458 8964 89058 84336
4515 84336 175930 264613 167928 154352 53654 78803 187363 45744 -36856 145996 300616
4504 300616 194852 200969 133488 26671 14320 20006 28945 140115 201575 142667 125306 109662
4492 109662 92291 68053 57460 102470 171953 226694 175380 80171 70685 142311 119359 107068
4480 107068 199091 200860 299923 238830 189893 121715 77275 93090 77385 59605 161510 136423
$$ packed form
4562A99582j20296j6282n4395N5076P0899R9416j9976Q8829j5512q2433p3009
4551A31899m8994j3488Q8618L309L5345M952n9900L9909n6082l3846J5410k11
4539A06921n9680M2978n0868n2928P8169P3770O0116J6426J6028k3206L0779n157
4527B33348n8328P9611j04346K7970n100m0628O3373n0470n1972q4494Q0094m722
4515H4336R1594Q8683r6685j3576j00698K5149J08560j41619q2600J82852J54620
4504C00616j05764O117o7481j06817j2351N686Q939J11170O1460n8908j7361j5644
4492A09662j7371k4238j0593M5010O9483N4741n1314r5209r486P1626k2952j2291
4480A07068R2023J769R9063o1093m8937o8178m4440J5815j5705j7780J01905k5087
$$ plain form
4468 136423 126543 80216 13272 75600 94227 147926 56697 9572 78317 177436 239675 164648
4456 164648 85382 68913 12952 -57758 -21029 3962 93570 58663 65729 -11593 -103420 -137766
4444 -137766 -108626 -50285 5028 43063 63338 47032 -39296 -42391 -71283 -35264 6178 46438
4432 46438 159606 139314 23910 59442 101649 78128 49593 132894 145232 88376 70047
4421 70047 84167 43097 36028 -39361 37869 78200 -33733 10029 -93315 -168049 -107195 -59515
4409 -59515 -7900 111956 145058 165273 32862 122128 127484 120686 103980 -44948 -18750 16165
4397 16165 145965 194496 111333 66756 67525 39861 32146 82817 74494 108137 125848 124773 82438
4384 82438 -122201 -100739 -31886 -48697 -45542 80447 262806 105470 56255 -24839 -13153
$$ packed form
4468A36423r880m6327o6944O2328J8627N3699r1229m7125O8745R9119O2239p5027
4456A64648p9266j6469n5961p0710L6729K4991Q9608l4907P066p7322r1827l4346
4444a37766K9140N8341N5313L8035K0275j6306q6328l095k8892L6019M1442M0260
4432D6438J13168k0292j15404L5532M2207k3521k8535Q3301J2338n6856j8329
4421G0047J4120m1070p069p5389P7230M0331j11933M3762j03344p4734O0854M7680
4409e9515N1615J19856L3102K0215j32411Q9266N356o798j6706j48928K6198L4915
4397A6165J29800M8531q3163m4577P69k7664p715N0671q323L3643J7711j075m2335
4384H2438k04639K1462O8853j6811L155J25989J82359j57336m9215q1094J1686
$$ plain form
4373 -13153 68717 45204 46906 79199 100592 121698 156379 149685 216105 220509 211434 177950 78079
4360 78079 86345 26659 -60277 -72030 -40657 56751 113388 136047 91266 41449 52807 -74641
4348 -74641 -78847 105322 83977 31402 49377 26205 110957 119584 -69648 13964 51562 212454
4336 212454 253571 176354 205182 171012 169053 46261 30331 221432 112722 128466 139870
4325 139870 171916 224006 118036 26193 151512 324216 219384 113776 204292 169436 149114
4314 149114 52762 -14576 32998 176703 192597 227600 182569 135895 109828 44057 10133
4303 10133 45627 99094 208098 141084 121628 167656 194858 105897 11820 82354 268846
4292 268846 276470 85021 73182 135732 170822 164359 282300 229577 106943 270996 179137
$$ packed form
4373a3153Q1870k3513J702L2293K1393K1106L4681o694O6420M404r075l3484r9871
4360G8079Q266n9686q6936j1753L1373R7408N6637K2659m4781m9817J1358j27448
4348g4641m206J84169k1345n2575J7975k3172Q4752Q627j89232Q3612L7598J60892
4336B12454M1117p7217K8828l4170j959j22792j5930J91101j08710J5744J1404
4325A39870L2046N2090j05970r1843J25319J72704j04832j05608R0516l4856k0322
4314A49114r6352o7338M7574J43705J5894L5003m5031m6674k6067o5771l3924
4303A0133L5494N3467J09004o7014j9456M6028K7202q8961r4077P0534J86492
4292B68846P624j91449j1839O2550L5090o463J17941n2723j22634J64053r1859
$$ plain form
4281 179137 125001 169865 131662 134010 134295 157087 85167 8722 -100588 -30552 -48262 37722
4269 37722 59304 1541 44345 135634 202251 97943 50256 183310 172921 142765 14512
4258 14512 26841 95457 44723 117182 242204 218959 303789 290281 178699 73730 57413
4247 57413 -1457 63798 35089 163973 257584 206757 173790 68772 69205 180381 184522 226321
4235 226321 91272 62099 138348 98989 54257 -944 80351 105290 71099 137559 47197
4224 47197 -58819 70635 43133 181034 194081 86488 147341 203849 149414 60516 64115
4213 64115 131299 183862 149136 258686 156775 233790 242864 146897 185638 103443 99816 74103
4201 74103 32151 -5444 10079 131256 193842 62381 85816 233756 191718 147105 -9324
$$ packed form
4281A79137n4136M4864l8203K348K85K2792p1920p6445j09310P0036j7710Q5984
4269C7722K1582n7763M2804R1289O6617j04308m7687J33054j0389l0156j28253
4258A4512J2329O8616n0734P2459J25022k3245Q4830j3508j11582j04969j6317
4247E7413n8870O5255k8709J28884R3611n0827l2967j05018M33J11176M141M1799
4235B26321j35049k9173P6249l9359m4732n5201Q1295K4939l4191O6460r0362
4224D7197j06016J29454k7502J37901J3047j07593O0853N6508n4435q8898L599
4213F4115O7184N2563l4726J09550j01911P7015R074r5967L8741q2195l627k5713
4201G4103m1952l7595J5523J21177O2586j31461K3435J47940m2038m4613j56429
$$ plain form
4190 -9324 -31610 36685 79349 27501 72096 274940 269758 135490 58890 965 95525 128111
4178 128111 94294 292114 284486 230961 129298 51415 120002 113652 17909 43015 40203 158453
4166 158453 31183 -10751 100692 57241 -24900 67507 100028 128052 81201 124590 200477
4155 200477 42682 120868 166621 183939 169315 63906 103868 156923 116388 115751 108342 87687
4143 87687 89899 125092 226088 270278 212732 161171 152417 122459 100366 30811 25237 58645
4131 58645 224665 154734 167907 187530 6224 -51550 17167 79630 71322 19227 5228 113250
4119 113250 159272 72957 185864 237325 206338 260890 285111 180431 202527 193803 28482
4108 28482 80531 146429 175679 12556 -32273 48674 131003 22020 -52208 20079 72786
$$ packed form
4190i324k2286O8295M2664n1848M4595K02844n182j34268p6600n7925R4560L2586
4178A28111l3817J97820p628n3525j01663p7883O8587o350r5743K5106k812J18250
4166A58453j27270m1934J11443m3451q2141R2407L2521K8024m6851M3389P5887
4155B00477j57795P8186M5753J7318j4624j05409L9962N3055m0535o37p409k0655
4143H7687K212L5193J00996M4190n7546n1561q754k9958k2093o9555n574L3408
4131E8645J66020o9931J3173J9623j81306n7774O8717O2463q308n2095j3999J08022
4119A13250M6022q6315J12907N1461l0987N4552K4221j04680K2096q724j65321
4108B8482N2049O5898K9250j63123m4829Q0947Q2329j08983p4228P2287N2707
$$ plain form
4097 72786 95103 79673 54171 -38267 15524 44650 -10865 2735 37072 169261 247490 202268
4085 202268 250030 269882 189225 142454 172367 257376 194897 -11285 -25472 103321 219876
4074 219876 229589 202402 98233 123298 172322 77885 -68948 11391 63231 98318 122222
4063 122222 44899 177641 143633 16350 72713 121041 85514 127811 73999 134919 251534
4052 251534 314680 386318 390279 312663 298757 276575 198686 207244 180715 201088 293182 212568
4040 212568 83618 82929 84928 8484 -136117 -88001 78039 193860 70942 90445 105116
4029 105116 86476 87237 135178 188533 122160 205685 159299 186400 226371 256686 249386 280338
4017 280338 283537 428355 453215 287337 251188 205156 204906 216341 167308 249734 323651 256170
$$ packed form
4097G2786K2317j5430k5502r2438N3791K9126n5515J3600L4337J32189P8229m5222
4085B02268M7762J9852q0657m6771K9913Q5009o2479k06182j4187J28793J16555
4074B19876R713k7187j04169K5065M9024r4437j46833Q0339N1840L5087K3904
4063A22222p7323J32742l4008j27283N6363M8328l5527M2297n3812O0920J16615
4052B51534O3146P1638L961p7616j3906k2182p7889Q558k6529K0373R2094q0614
4040B12568j28950o89J999p6444j44601M8116J66040J15821j22918J9503J4671
4029A05116j8640P61M7941N3355o6373Q3525m6386K7101L9971L0315p300L0952
4017B80338L199J44818K4860j65878l6149m6032k50J1435m9033Q2426P3917o7481
$$ plain form
4005 256170 102800 132604 147738 193793 167405 129661 110289 133535 91251 28165 -101129
3994 -101129 32017 219553 256425 228969 209874 211193 131980 46195 170103 360041 351067
3983 351067 286365 197160 307747 291231 80614 116679 194406 315648 266639 100668 49612
3972 49612 -6414 -6658 43977 267268 388147 283476 111894 -9067 -44092 -64402 143431
3961 143431 197124 224406 374560 327585 195334 32584 177851 190822 288252 364476 444929
3950 444929 403090 281117 266442 255971 217170 69532 60796 227657 249642 73515 7928
3939 7928 44514 41057 38263 54978 164297 214841 126765 197231 198594 44297 58471 50908
3927 50908 126294 182479 265211 326165 376931 325861 180128 92106 89832 84877 77256 233710
$$ packed form
4005B56170j53370K9804J5134M6055k6388l7744j9372K3246m2284o3086j29294
3994a01129J33146J87536L6872k7456j9095J319p9213q5785J23908J89938q974
3983C51067o4702q9205J10587j6516k10617L6065P7727J21242m9009j65971n1056
3972D9612n6026k44N0635K23291J20879j04671j71582j20961l5025k0310K07833
3961A43431N3693K7282J50154m6975j32251j62750J45267J2971R7430P6224Q0453
3950D44929m1839j21973j4675j0471l8801j47638q736J66861K1985j76127o5587
3939G928L6586l457k794J6715J09319N0544q8076P0466J363j54297J4174p563
3927E0908P5386N6185Q2732O0954N0766n1070j45733q8022k274m955p621J56454
$$ plain form
3915 233710 247899 258643 189954 102096 86352 99555 79780 97305 202049 253339 264097
3904 264097 152984 153056 80733 169933 158672 52028 15518 -58107 -21377 42723 91438 158844
3892 158844 185582 163769 145387 88370 28054 40321 68019 92787 47903 138729 181977 59200
3880 59200 -30045 -89161 -1275 30783 23822 29043 -39991 -54302 -58189 -25889 61242 84106
3868 84106 152725 164397 181760 172493 171858 172227 81843 44869 135895 157421 148360 178525 187172
3855 187172 189034 233522 188500 33443 -6180 9802 90489 164745 124192 130170 218947 139409
3843 139409 6322 27311 125935 118453 172937 216671 200508 175449 162290 167867 60992 83029
3831 83029 114178 122898 155142 122937 167551 159114 188461 181028 61223 183194 242800 207966
$$ packed form
3915B33710J4189J0744o8689q7858j5744J3203j9775J7525J04744N1290J0758
3904B64097j11113P2p2323Q9200j1261j06644l6510p3625L6730O4100M8715O7406
3892A58844K6738k1813j8382n7017o0316J2267K7698K4768m4884R0826M3248j22777
3880E9200q9245n9116Q7886L2058o961N221o9034j4311l887L2300Q7131K2864
3868H4106O8619J1672J7363r267o35L69r0384l6974R1026K1526r061L0165Q647
3855A87172J862M4488m5022j55057l9623J5982Q0687P4256m0553N978Q8777p9538
3843A39409j33087K0989R8624p482N4484M3734j6163k5059j3159N577j06875K2037
3831H3029L1149Q720L2244l2205M4614q437K9347p433j19805J21971N9606l4834
$$ plain form
3819 207966 141512 177595 202763 218483 153741 14543 104577 170651 207134 184545 156001
3808 156001 105621 96829 130431 252929 142638 139035 134469 154237 127821 50530 215525 159320
3796 159320 219400 76943 52752 138900 149815 93487 81533 116632 230714 91454 -25559
3785 -25559 35944 61450 137527 163602 133575 206911 150242 135361 101192 70590 100296 65478
3773 65478 160421 216975 153260 223313 260160 269322 255642 233890 302460 338963 316764 248258
3761 248258 75876 78831 197786 242040 229703 164667 275972 207275 141733 185333 229853
3750 229853 154886 220083 128577 105633 134471 253779 293598 193594 315712 342010 330634
3739 330634 178856 113631 267101 264196 225409 280326 306870 427125 359725 236795 267685
$$ packed form
3819B07966o6454L6083K5168J5720o4742j39198R0034O6074L6483k2589k8544
3808A56001n0380q792L3602J22498j10291l603m566J9768k6416p7291J64995n6205
3796A59320O0080j42457k4191Q6148J0915n6328j1954L5099J14082j39260j17013
3785b5559O1503K5506P6077K6075l0027P3336n6669j4881l4169l0602K9706l4818
3773F5478R4943N6554o3715P0053L6847R162j3680k1752O8570L6503k2199o8506
3761B48258j72382K955J18955M4254j2337o5036J11305o8697o5542M3600M4520
3750B29853p4967O5197r1506k2944K8838J19308L9819j00004J22118K6298j1376
3739C30634j51778o5225J53470k905l8787N4917K6544J20255o7400j22930L0890
$$ plain form
3728 267685 277807 345194 338111 250988 183319 235269 300003 246307 207831 306735 225911 181703
3716 181703 230705 213485 279991 182393 183846 275462 180402 309890 387783 296301 177515
3705 177515 93305 105496 121139 221132 325803 408934 288225 334348 246055 112715 73538
3694 73538 144016 223445 83531 128710 173754 93197 211221 102963 184824 273735 235226
3683 235226 250631 152154 169547 186784 129362 144721 158279 244058 382827 239387 305152
3672 305152 284624 180060 209815 259515 307323 209613 90028 287423 231120 257004 290520
3661 290520 298186 345017 178265 70762 103221 93548 158041 195914 317400 299953 201569
3650 201569 115998 32566 66760 282085 334444 278043 251083 240259 299579 228858 82148
$$ packed form
3728B67685J0122O7387p083q7123o7669N1950O4734n3696l8476R8904q0824m4208
3716A81703M9002j7220O6506r7598J453R1616r5060J29488P7893r1482j18786
3705A77515q4210J2191J5643R9993J04671Q3131j20709M6123q8293j33340l9177
3694G3538P0478P9429j39914M5179M5044q0557J18024j08258Q1861Q8911l8509
3683B35226J5405r8477J7393J7237n7422J5359J3558Q5779J38769j43440O5765
3672C05152k0528j04564K9755M9700M7808r7710j19585J97395n6303K5884L3516
3661B90520P666M6831j66752j07503L2459r673O4493L7873J21486j7447r8384
3650B01569q5571q3432L4194K15325N2359n6401k6960j0824N9320p0721j46710
$$ plain form
3639 82148 168755 368229 279741 253938 188390 144298 169870 151719 206181 265757 302279 319792
3627 319792 196843 -27742 29686 228137 247151 240407 297134 331146 326740 230744 134931
3616 134931 135698 122864 210296 307065 321204 93794 62606 137095 210597 286643 290979 287137
3604 287137 146543 100835 80819 140288 320533 381032 376015 396444 412280 307253 193696
3593 193696 125939 228791 255353 208843 237836 151265 95405 103279 230042 254192 129940
3582 129940 71595 214194 267614 201764 207159 208155 180055 187054 212856 214892 309607 248706
3570 248706 312026 259693 96051 219525 172535 15184 113511 249767 217325 193316 127233
3559 127233 209575 276269 126569 124092 188977 224639 179251 167185 150428 171706 153014 225294
$$ packed form
3639H2148Q6607J99474q8488k5803o5548m4092K5572j8151N4462N9576L6522J7513
3627C19792j22949k24585N7428J98451J9014o744N6727L4012m406r5996r5813
3616A34931P67j2834Q7432R6769J4139k27410l1188P4489P3502P6046M336l842
3604B87137j40594m5708k0016N9469J80245O0499n017K0429J5836j05027j13557
3593A93696o7757J02852K6562m6510K8993q6571n5860P874J26763K4150j24252
3582A29940n8345J42599N3420o5850N395R96k8100O999K5802K036R4715o0901
3570B48706O3320n2333j63642J23474m6990j57351R8327J36256l2442k4009o6083
3559A27233Q2342O6694j49700k477O4885L5662m5388j2066j6757K1278j8692P2280
$$ plain form
3547 225294 310822 416698 300955 194057 155989 164718 239936 414915 496444 376748 295073
3536 295073 195578 127610 231431 159225 217657 371564 271399 218080 269438 306667 274228
3525 274228 193165 221937 387611 312602 293201 270688 282711 260085 275976 364017 511396
3514 511396 599466 442037 328932 295097 304362 352715 471564 527405 549441 560816 407224
3503 407224 314825 237247 256537 318454 298693 444980 312334 243082 255972 288050 327739
3492 327739 370048 502717 519701 401444 324037 347119 307695 279083 426014 531736 553039
3481 553039 397076 348490 330280 311389 354265 332872 416386 439939 334183 382253 400070
3470 400070 343894 337877 299321 384741 405238 506747 425022 436533 460935 408895 377135 508083
$$ packed form
3547B25294Q5528J05876j15743j06898l8068Q729P5218J74979Q1529j19696q1675
3536B95073r9495o7968J03821p2206N8432J53907j00165n3319N1358L7229l2439
3525B74228q1063K8772J65674p5009j9401k2513J2023k2626J5891Q8041J47379
3514E11396Q8070j57429j13105l3835R265M8353J18849N5841K2036J1375j53592
3503D07224r2399p7578J9290O1917j9761J46287j32646o9252J2890L2078L9689
3492C27739M2309J32669J6984j18257p7407K3082l9424k8612J46931J05722K1303
3481E53039j55963m8586j8210j8891M2876k1393Q3514K3553j05756M8070J7817
3470D00070n6176o017l8556Q5420K0497J01509q1725J1511K4402n2040l1760J30948
$$ plain form
3458 508083 504892 613499 451858 328549 442513 349085 287086 349465 316810 420574 515108
3447 515108 504220 332209 336943 485194 453281 370921 399214 392013 375503 460368 566451
3436 566451 589923 450937 405589 471310 363425 360990 480459 636003 509397 447555 484501
3425 484501 391829 281291 369388 528990 605911 548295 583383 592730 408155 476158 524027
3414 524027 565717 570778 598459 560627 569953 399722 458737 549067 599318 663202 675789 547800
3402 547800 369676 486164 461045 404573 400378 563734 737026 562795 372571 433279 533555
3391 533555 455107 480136 545663 620248 611416 466539 465353 489361 556669 562846 486400 597733
3379 597733 611603 481741 443622 500925 580457 562723 657610 889169 773106 716182 642482
$$ packed form
3458E08083l191J08607j61641j23309J13964r3428o1999O2379l2655J03764R4534
3447E15108j0888j72011M734J48251l1913q2360K8293p201j6510Q4865J06083
3436E66451K3472j38986m5348O5721j07885k435J19469J55544j26606o1842L6946
3425D84501r2672j10538Q8097J59602P6921n7616L5088R347j84575O8003M7869
3414E24027M1690N061K7681l7832R326j70231N9015R0330N0251O3884J2587j27989
3402E47800j78124J16488k5119n6472m195J63356J73292j74231j90224O0708J00276
3391E33555p8448K5029O5527P4585q832j44877j186K4008O7308O177p6446J11333
3379E97733J3870j29862l8119N7303P9532j7734R4887K31559j16063n6924p3700
$$ plain form
3368 642482 662358 735998 751918 792971 765425 621680 701067 713182 678751 729150 637771
3357 637771 587030 660343 691101 713884 527161 515821 479853 524232 570451 538331 647541
3346 647541 744363 705431 706218 911401 948472 801399 876360 1032398 1083344 961772 878074
3335 878074 953422 896178 806302 1018942 1057205 846745 980127 1002681 1077062 847964 768678
3324 768678 869928 898323 892919 855155 898928 1040693 1026101 1004121 1101854 1107007 1087308 1022466
3312 1022466 1098364 1242363 1375886 1448067 1321463 1362314 1320248 1142125 1206582 1285593 1484370
3301 1484370 1437785 1332786 1334846 1398453 1350430 1256753 1277613 1354020 1398305 1499334 1532227
3290 1532227 1499115 1510345 1608231 1523290 1633329 1796806 1820980 1907667 1780040 1736344 1653670
$$ packed form
3368F42482J9876P3640J5920M1053k7546j43745P9387J2115l4431N0399r1379
3357F37771n0741P3313L0758K2783j86723j1340l5968M4379M6219l2120J09210
3346F47541R6822l8932P87K05183L7071j47073P4961J56038N0946j21572q3698
3335H78074P5348n7244q9876K12640L8263k10460J33382K2554P4381k29098p9286
3324G68678J01250K8395n404l7764M3773J41765j4592k1980R7733N153j9699o4842
3312A022466P5898J43999J33523P2181j26604M0851m2066j78123O4457P9011J98777
3301A484370m6585j04999K060O3607m8023r3677K0860P6407M4285J01029L2893
3290A532227l3112J1230R7886q4941J10039J63477K4174Q6687j27627m3696q2674
$$ plain form
3279 1653670 1677893 1735907 1771145 1802961 1845276 1895077 1820200 1677391 1687975 1847322 1890405
3268 1890405 1868606 1849145 1802816 1809676 1788569 1814410 1654813 1714351 1876424 1866388 1842206
3257 1842206 1858205 1939410 2048141 2063308 2093065 2093985 2180770 2246874 2301644 2329587 2361491 2492168
3245 2492168 2705933 2683711 2723310 2855241 2999284 3005157 2926347 2841198 2922317 2905100 2906278
3234 2906278 2967704 3221114 3430810 3235342 3164220 3201812 3251375 3193743 3115156 3269746 3420329
3223 3420329 3297924 3099269 3086438 2977291 2796015 2742852 2770509 2780517 2651132 2608788
3213 2608788 2532967 2498470 2492715 2446165 2462148 2384288 2447460 2531208 2618460 2701816 2656892 2623324
3201 2623324 2546770 2527866 2485538 2451444 2490241 2601170 2583698 2635376 2597063 2566049 2534272
$$ packed form
3279A653670K4223N8014L5238L1816M2315M9801p4877j42809J0584J59347M3083
3268A890405k1799j9461m6329O860k1107K5841j59597N9538J62073j0036k4182
3257A842206J5999Q1205J08731J5167K9757R20Q6785O6104N4770K7943L1904J30677
3245B492168K13765k2222L9599J31931J44043N873p8810q5149Q1119j7217J178
3234B906278O1426K53410K09696j95468p1122L7592M9563n7632p8587J54590J50583
3223C420329j22405j98655j2831j09147j81276n3163K7657J0008j29385m2344
3213B608788p5821l4497n755m6550J5983p7860O3172Q3748Q7252Q3356m4924l3568
3201B623324p6554j8904m2328l4094L8797J10929j7472N1678l8313l1014l1777
$$ plain form
3190 2534272 2570087 2572931 2662355 2734668 2738679 2599567 2738873 2621055 2530435 2624318 2658849
3179 2658849 2798790 2870532 2921124 2968666 2958373 2976636 3014648 3070285 3153842 3259154 3233628
3168 3233628 3204998 3231357 3281062 3321979 3238816 3286101 3304489 3271991 3344827 3358798 3408004
3157 3408004 3400058 3385284 3380813 3406418 3447188 3441690 3476946 3571394 3734710 3882729 3955059 3925987
3145 3925987 3892542 3932281 4035303 4106279 4073394 4128698 4196110 4202243 4261061 4171256 4299119
3134 4299119 4420281 4522657 4530980 4620853 4677673 4671332 4541873 4620771 4783404 4868837 4979779
3123 4979779 5043956 5110479 5160800 5340398 5457821 5441442 5523640 5679879 5857191 5892185 5854029
3112 5854029 6001883 6101947 6186812 6330575 6460070 6557205 6635475 6633974 6782723 6980294
$$ packed form
3190B534272L5815K844Q9424P2313M011j39112J39306j17818r0620R3883L4531
3179B658849J39941P1742N0592M7542j0293J8263L8012N5637Q3557J05312k5526
3168C233628k8630K6359M9705M0917q3163M7285J8388l2498P2836J3971M9206
3157C408004p946j4774m471K5605M0770n498L5256R4448J63316J48019P2330k9072
3145C925987l3445L9739J03022P0976l2885N5304O7412O133N8818q9805J27863
3134D299119J21162J02376Q323Q9873N6820o341j29459P8898J62633Q5433J10942
3123D979779O4177O6523N0321J79598J17423j6379Q2198J56239J77312L4994l8156
3112E854029J47854J00064Q4865J43763J29495R7135P8270j501J48749J97571
$$ plain form
3102 6980294 7075949 7154923 7210677 7357934 7529534 7526900 7507680 7572699 7816680 8093359 8162867
3091 8162867 8245359 8315275 8463450 8493048 8524648 8619180 8648111 8832268 8950611 8997533 9232323
3080 9232323 9400301 9434002 9609195 9641947 9835047 9915961 9870822 10048820 10098290 10295979
3070 10295979 10355876 10434528 10549823 10786748 11082768 11274263 11372290 11605882 11869646 12012399
3060 12012399 12233078 12449958 12870409 13196705 13501852 14076970 14556109 15230469 15842359
3051 15842359 16253236 16650606 16463687 16009313 15763217 15731017 15859951 16070157 16326908 16589345
3041 16589345 16778856 17131581 17373164 17604683 17896500 18347811 18732956 19125834 19409691
3032 19409691 19770556 20128877 20519150 20949890 21469556 21966586 22470122 23028435 23599874
$$ packed form
3102F980294R5655P8974N5754J47257J71600k634j9220O5019K43981K76679O9508
3091H162867Q2492O9916J48175K9598L1600R4532K8931J84157J18343M6922K34790
3080I232323J67978L3701J75193L2752J93100Q0914m5139J77998M9470J97689
3070A0295979N9897P8652J15295K36925K96020J91495R8027K33592K63764J42753
3060A2012399K20679K16880M20451L26296L05147N75118M79139O74360O11890
3051A5842359M10877L97370j86919m54374k46096l2200J28934K10206K56751K62437
3041A6589345J89511L52725K41583K31519K91817M51311L85145L92878K83857
3032A9409691L60865L58321L90273M30740N19666M97030N03536N58313N71439
$$ plain form
3023 23599874 24265520 24988905 25714225 26281447 27145663 27975138 28856048 29691320 30698293
3014 30698293 31819345 32846750 33969560 35067464 36156353 37519849 38831686 40192701
3006 40192701 41771044 43190823 44779125 46516429 48335029 50045021 51878611 53962100
2998 53962100 56029746 57810426 59756777 61782902 63982228 66287777 68509539 70984631
2990 70984631 73490724 76091646 78632243 81292124 84022810 86766443 89471002 92042702
2982 92042702 94512121 96939622 99195248 101436195 103720882 105972737 108391782 110691950
2974 110691950 112873432 115006442 116981070 119166039 121279375 123264154 125268021 126961963
2966 126961963 128459848 129734562 130710219 131833286 133067126 134195590 135463255 136867262
$$ packed form
3023B3599874O65646P23385P25320N67222Q64216Q29475Q80910Q35272J006973
3014C0698293J121052J027405J122810J097904J088889J363496J311837J361015
3006D0192701J578343J419779J588302J737304J818600J709992J833590K083489
2998E3962100K067646J780680J946351K026125K199326K305549K221762K475092
2990G0984631K506093K600922K540597K659881K730686K743633K704559K571700
2982I2042702K469419K427501K255626K240947K284687K251855K419045K300168
2974A10691950K181482K133010J974628K184969K113336J984779K003867J693942
2966A26961963J497885J274714R75657J123067J233840J128464J267665J404007
$$ plain form
2958 136867262 138411477 139961128 141488899 143265552 145122503 147299943 149354754 151685481
2950 151685481 154358805 157442458 160929700 165060912 170046558 176068597 182915343 190840220
2942 190840220 200184452 210944561 223331100 237407163 253420744 271139359 289877253
2935 289877253 308991427 327567979 344238001 357710447 366665534 370641443 369304013
2928 369304013 363432115 353927818 341945618 328923912 315878419 303524778 292127610
2921 292127610 281689676 272064512 262566886 252890129 242443541 230838304 218072489
2914 218072489 204400508 190161723 175798317 161669169 148193716 135895281 124714888
2907 124714888 114797442 105887467 97910880 90926381 84739881 79233305 74301592 69821831
$$ packed form
2958A36867262J544215J549651J527771J776653J856951K177440K054811K330727
2950A51685481K673324L083653L487242M131212M985646O022039O846746P924877
2942A90840220R344232J0760109J2386539J4076063J6013581J7718615J8737894
2935B89877253J9114174J8576552J6670022J3472446Q955087L975909j337430
2928C69304013n871898r504297j1982200j3021706j3045493j2353641j1397168
2921B92127610j0437934r625164r497626r676757j0446588j1605237j2765815
2914B18072489j3671981j4238785j4363406j4129148j3475453j2298435j1180393
2907A24714888r917446q909975p976587o984499o186500n506576m931713m479761
$$ plain form
2899 69821831 65732389 62112797 58837417 55893800 53244975 50826021 48568621 46599487
2891 46599487 44808776 43035476 41474305 40067051 38625106 37362236 36143475 35082728
2883 35082728 34028219 32926352 32007728 31126352 30132460 29115010 28164813 27483744 26645430
2874 26645430 25813019 25125209 24351868 23606662 22939553 22409410 21879209 21347199 20931305
2865 20931305 20366114 19751013 19366350 18975249 18515659 18066250 17682682 17328709 16923459
2856 16923459 16547369 16203003 15999699 15890654 15568132 15194157 15037239 14781716 14434739
2847 14434739 14113902 13782425 13588574 13435647 13214306 12927642 12701437 12562791 12316980
2838 12316980 12035697 11856500 11667628 11387478 11152891 11003380 10896459 10801588 10581745 10449689
$$ packed form
2899F9821831m089442l619592l275380k943617k648825k418954k257400j969134
2891D6599487j790711j773300j561171j407254j441945j262870j218761j060747
2883C5082728j054509j101867r18624q81376r93892j017450r50197o81069q38314
2874B6645430q32411o87810p73341p45206o67109n30143n30201n32010m15894
2865B0931305n65191o15101l84663l91101m59590m49409l83568l53973m05250
2856A6923459l76090l44366k03304j09045l22522l73975j56918k55523l46977
2847A4434739l20837l31477j93851j52927k21341k86664k26205j38646k45811
2838A2316980k81283j79197j88872k80150k34587j49511j06921r4871k19843j32056
$$ plain form
2828 10449689 10267252 10083556 9992133 9940724 9850769 9893517 9958912 9797905 9692768 9614857
2818 9614857 9422195 9405499 9428151 9468482 9454743 9330095 9348449 9340348 9197219 9282271 9240949
2807 9240949 9218560 9288793 9275439 9133657 8973947 8898646 8890786 8771411 8717457 8795905 8827800
2796 8827800 8832007 8639383 8638469 8633343 8445723 8307218 8146223 8186138 8110873 7792794 7831844
2785 7831844 7876184 7926750 7988954 7769243 7607527 7590045 7482874 7390385 7396176 7420224 7536879
2774 7536879 7474633 7346294 7338425 7317980 7251636 7138270 7056634 6925225 6956003 7001654 6816869
2763 6816869 6815501 6895723 6763014 6689967 6610707 6582596 6547460 6483081 6443691 6414111 6498299
2752 6498299 6540145 6370568 6195017 6204730 6155239 6089490 5908806 5956256 6059210 6044800 6035611
$$ packed form
2828A0449689j82437j83696r1423n1409q9955M2748O5395j61007j05137p7911
2818I614857j92662j6696K2652M0331j3739j24648J8354q101j43129Q5052m1322
2807I240949k2389P0233j3354j41782j59710p5301p860j19375n3954P8448L1895
2796H827800M207j92624r14n126j87620j38505j60995L9915p5265l18079L9050
2785G831844M4340N0566O2204k19711j61716j7482j07171r2489N791K4048J16655
2774G536879o2246j28339p869k0445o6344j13366q1636j31409L0778M5651j84785
2763F816869j368Q0222j32709p3047p9260k8111l5136o4379l9390k9580Q4188
2752F498299M1846j69577j75551R713m9491o5749j80684M7450J02954j4410r189
$$ plain form
2741 6035611 5996864 6077856 6158610 6008370 6016718 6112658 6126510 5997879 6134340 6359663 6444985
2730 6444985 6433068 6352948 6442644 6446762 6326856 6307381 6486723 6490949 6470378 6548315 6653304
2719 6653304 6628121 6642815 6746057 6934505 6912841 6872694 7004651 7004153 7073189 7076253 7181199
2708 7181199 7371498 7620592 7868265 7897579 8006952 8174380 8166804 8154126 8278361 8480536
2698 8480536 8671649 8730650 8863894 9142379 9246550 9282475 9338528 9392691 9639349 9793010
2688 9793010 10078424 10375095 10621538 10770620 11006416 11147818 11246894 11395594 11629429 11827194
2678 11827194 12155414 12354045 12617711 13064800 13330485 13543598 13835955 14203773 14448733
2669 14448733 14634483 14890819 15276882 15537909 15836704 16199511 16699850 17170783 17366004
$$ packed form
2741F035611l8747Q0992Q0754j50240Q348R5940J3852j28631J36461K25323Q5322
2730F444985j1917q0120Q9696M118j19906j9475J79342M226k0571P7937J04989
2719F653304k5183J4694J03242J88448k1664m0147J31957m98O9036L064J04946
2708G181199J90299K49094K47673K9314J09373J67428p576j2678J24235K02175
2698H480536J91113N9001J33244K78485J04171L5925N6053N4163K46658J53661
2688I793010K85414K96671K46443J49082K35796J41402R9076J48700K33835J97765
2678A1827194L28220J98631K63666M47089K65685K13113K92357L67818K44960
2669A4448733J85750K56336L86063K61027K98795L62807N00339M70933J95221
$$ plain form
2660 17366004 17664629 18008664 18499528 18883369 19230108 19578754 20007081 20390043 20765908
2651 20765908 21162143 21591878 22113253 22561847 23056195 23590026 24126289 24568678 25170923
2642 25170923 25844807 26525019 27078932 27597913 28163271 28705948 29226834 29932366 30757740
2633 30757740 31555066 32345120 33411150 34616927 35653511 36552337 37559930 38842740 40123671
2624 40123671 41398708 42890830 44482204 46218945 47959943 49945391 52075795 54583135
2616 54583135 57082275 59788467 62860076 66251285 70106873 74285912 78870933 84186942
2608 84186942 90032294 96534205 103772412 111861186 121099916 131250018 142193835 153400355
2600 153400355 164672649 175386370 184753130 192671854 199208890 204661882 209466148 214228089
$$ packed form
2660A7366004K98625L44035M90864L83841L46739L48646M28327L82962L75865
2651B0765908L96235M29735N21375M48594M94348N33831N36263M42389O02245
2642B5170923O73884O80212N53913N18981N65358N42677N20886P05532Q25374
2633C0757740P97326P90054J066030J205777J036584Q98826J007593J282810J280931
2624D0123671J275037J492122J591374J736741J740998J985448K130404K507340
2616E4583135K499140K706192L071609L391209L855588M179039M585021N316009
2608H4186942N845352O501911P238207Q088774R238730J0150102J0943817J1206520
2600A53400355J1272294J0713721R366760P918724O537036N452992M804266M761941
$$ plain form
2592 214228089 219507530 225716743 232887070 240841940 249256955 257741251 265593046 271693802
2584 271693802 275281360 275997069 273726160 268594559 261129096 252002081 242071308 232193872
2576 232193872 222908745 214447603 206908101 200317941 194227127 188447943 182438437 175499814
2568 175499814 167356345 157670866 147071671 135801297 124558330 113809148 104144360
2561 104144360 95486524 87615880 80663312 74538935 69152103 64531447 60334882 56608364
2553 56608364 53427572 50449855 47628036 44991063 42538489 40464305 38699282 36936457
2545 36936457 35397880 33915650 32568435 31225291 29865113 28735239 27730863 26683833
2537 26683833 25720402 24850613 24230001 23457218 22520308 21911551 21225097 20605129 20000285
$$ packed form
2592B14228089N279441O209213P170327P954870Q415015Q484296P851795O100756
2584B71693802L587558P15709k270909n131601p465463r127015r930773r877436
2576B32193872r285127q461142p539502o590160o090814n779184o009506o938623
2568A75499814q143469r685479j0599195j1270374j1242967j0749182r664788
2561A04144360q657836p870644o952568o124377n386832m620656m196565l726518
2553E6608364l180792k977717k821819k636973k452574k074184j765023j762825
2545C6936457j538577j482230j347215j343144j360178j129874j004376j047030
2537B6683833r63431q69789o20612p72783r36910o08757o86454o19968o04844
$$ plain form
2528 20000285 19452705 19136008 18619462 18036004 17485551 16961032 16577036 16256806 15955096
2519 15955096 15562889 15163568 14826154 14355353 13733140 13344840 13002709 12691960 12409191
2510 12409191 12108347 11921147 11602422 11221257 10870768 10558627 10494550 10295498 9878054 9607284
2500 9607284 9414498 9215402 8883673 8521593 8453048 8391818 8192331 7894923 7680957 7542052
2490 7542052 7161942 6861969 6717858 6689323 6669460 6460418 6204955 5987179 5815586 5722701
2480 5722701 5466002 5324589 5300219 5160318 4909169 4801803 4756497 4638084 4391884 4369480
2470 4369480 4232122 4085108 3888333 3734630 3693786 3674058 3707703 3711710 3724050 3541702 3434623
2459 3434623 3275820 3225993 3195309 3216682 3145842 3053132 3080704 2936116 2732701 2700820 2661199
$$ packed form
2528B0000285n47580l16697n16546n83458n50453n24519l83996l20230l01710
2519A5955096l92207l99321l37414m70801o22213l88300l42131l10749k82769
2510A2409191l00844j87200l18725l81165l50489l12141o4077j99052m17444k70770
2500I607284j92786j99096l31729l62080o8545o1230j99487k97408k13966j38905
2490G542052l80110k99973j44111k8535j9863k09042k55463k17776j71593r2885
2480E722701k56699j41413k4370j39901k51149j07366m5306j18413k46200k2404
2470D369480j37358j47014j96775j53703m0844j9728L3645M007J2340j82348j07079
2459C434623j58803m9827l0684K1373p0840r2710K7572j44588k03415l1881l9621
$$ plain form
2448 2661199 2677633 2542407 2467197 2498160 2360483 2269181 2215621 2223560 2187052 2165919 2113609
2437 2113609 2165588 2045359 1894273 1930769 1847110 1901116 1853538 1785451 1747210 1721728 1685210
2426 1685210 1692291 1677727 1537239 1629875 1649445 1492770 1455806 1479811 1330343 1209388 1234280
2415 1234280 1277914 1358245 1222149 1071754 1060974 942276 971616 1090822 1071927 1071335 1074172
2404 1074172 1044616 925395 980970 905656 858850 834436 866872 988396 983155 1027286 1070698
2393 1070698 977098 860649 937026 903627 866898 863611 834957 873000 890237 953164 1012129
2382 1012129 966342 887903 787829 726379 708856 802369 818276 861032 758634 789188 820691
2371 820691 810387 823787 880652 964253 971268 896712 832164 786472 699943 783840 800736 696275
$$ packed form
2448B661199J6434j35226p5210L0963j37677r1302n3560P939l6508k1133n2310
2437B113609N1979j20229j51086L6496q3659N4006m7578o8087l8241k5482l6518
2426A685210P081j4564j40488R2636J9570j56675l6964K4005j49468j20955K4892
2415A234280M3634Q0331j36096j50395j0780j18698K9340J19206j8895n92K837
2404A074172k9556j19221N5575p5314m6806k4414L2436J21524n241M4131M3412
2393A070698r3600j16449P6377l3399l6729l287k8654L8043J7237O2927N8965
2382A012129m5787p8439j00074o1450j7523R3513J5907M2756j02398L0554L1503
2371H20691j0304J3400N6865Q3601P015p4556o4548m5692q6529Q3897J6896j04461
$$ plain form
2359 696275 825468 906038 752833 691934 594947 565685 594991 685449 835273 779835 706673
2348 706673 694944 521116 391799 403271 557835 618854 638746 627471 586608 659934 577875
2337 577875 477876 574792 489984 469608 577831 631289 555525 609000 703650 764623 641267
2326 641267 502000 645902 597757 471048 518712 677707 696229 725877 765401 697178 648137
2315 648137 643903 646716 529435 565965 715028 651519 494933 624389 740409 810758 736815
2304 736815 678590 807884 944124 882512 694598 802531 933746 1036245 993479 872807
2294 872807 986182 1177368 1242375 1158439 1063931 1116850 1197228 1347051 1511401 1563295 1589381
2283 1589381 1564231 1471129 1447357 1596839 1796243 1835048 1768535 1688647 1697793 1599899 1491096
$$ packed form
2359F96275J29193Q0570j53205o0899r6987k9262K9306R0458J49824n5438p3162
2348G06673j1729j73828j29317J1472J54564O1019J9892j1275m0863P3326q2059
2337E77875r9999R6916q4808k0376J08223N3458p5764N3475R4650O0973j23356
2326F41267j39267J43902m8145j26709M7664J58995J8522K9648L9524o8223m9041
2315F48137m234K813j17281L6530J49063o3509j56586J29456J16020P0349p3943
2304G36815n8225J29294J36240o1612j87914J07933J31215J02499m2766j20672
2294H72807J13375J91186O5007q3936r4508N2919Q0378J49823J64350N1894K6086
2283A589381k5150r3102k3772J49482J99404L8805o6513p9888R146r7894j08803
$$ plain form
2272 1491096 1557906 1546612 1478996 1511697 1516258 1504452 1383402 1317941 1380073 1339259 1165746
2261 1165746 1282258 1223536 1116696 943227 884135 900894 808699 903118 1010567 1021334 777922
2250 777922 682478 641102 578368 592716 750554 876150 810557 850179 753806 565009 590113
2239 590113 547301 663683 724993 726502 590491 411527 412872 368612 419641 496481 620934
2228 620934 587463 487283 432229 371177 294451 289295 421345 584457 497543 451069 433848
2217 433848 495737 516010 570373 685693 649660 751071 666338 484684 454423 436101 518727
2206 518727 603080 382464 496407 628710 587110 598839 509766 563461 666894 650037 560222
2195 560222 572657 597864 572726 590965 680415 715247 755324 816600 845536 863804 911241 932531
$$ packed form
2272A491096O6810j1294o7616L2701M561j1806j21050o5461O2132m0814j73513
2261A165746J16512n8722j06840j73469n9092J6759r2195R4419J07449J0767k43412
2250G77922r5444m1376o2734J4348J57838J25596o5593L9622r6373j88797K5104
2239E90113m2812J16382O1310J509j36011j78964J345m4260N1029P6840J24453
2228F20934l3471j00180n5054o1052p6726n156J32050J63112q6914m6474j7221
2217D33848O1889K0273N4363J15320l6033J01411q4733j81654l0261j8322Q2626
2206E18727Q4353k20616J13943J32303m1600J1729q9073N3695J03433j6857q9815
2195E60222J2435K5207k5138J8239Q9450L4832M0077O1276K8936J8268M7437K1290
$$ plain form
2183 932531 919733 999348 1198343 1381554 1300116 1310644 1348386 1272420 1216681 1291130 1387614
2172 1387614 1283584 1251070 1197482 1064998 1080304 917029 957045 1034043 925760 860862 919543
2161 919543 908511 853576 958039 1054977 980577 820681 759380 662437 488783 440937 439409
2150 439409 535504 512011 544600 569969 517636 325055 306440 381095 315597 311248 325401 197731
2138 197731 55022 126713 158911 195107 326171 357754 332744 235986 188812 172149 12315
2127 12315 84357 249330 397700 468186 408101 263211 101359 12872 -42644 -8435 170236
2116 170236 278063 260659 173553 113832 80621 -6592 -74845 30875 102625 -31810 -61236
2105 -61236 -52417 -50200 44689 22022 114610 81567 -9103 13857 61735 -5217 -82857 -46975
$$ packed form
2183I32531j2798P9615J98995J83211q1438J0528L7742p5966n5739P4449R6484
2172A387614j04030l2514n3588j32484J5306j63275M0016P6998j08283o4898N8681
2161I19543j1032n4935J04463R6938p4400j59896o1301r6943j73654m7846j528
2150D39409R6095k3493L2589K5369n2333j92581j8615P4655o5498m349J4153j27670
2138A97731j42709P1691L2198L6196J31064L1583k5010r6758m7174j6663j59834
2127A2315P2042J64973J48370P0486o0085j44890j61852q8487n5516L4209J78671
2116A70236J07827j7404q7106n9721l3211q7213o8253J05720P1750j34435k9426
2105f1236Q819K217R4889k2667R2588l3043r0670K2960M7878o6952p7640L5882
$$ plain form
2093 -46975 76218 -26537 10285 126883 140154 -8895 -87393 19866 152119 35753
2083 35753 -20048 -26867 -196810 -123496 -129336 -203852 -185916 -154435 26806 56395 -113612 -78866
2071 -78866 -136345 -177691 -166232 -100029 377 -55806 48324 7780 -193073 -218764 -149992
2060 -149992 -87223 -20640 69578 73712 -79621 -209138 -298030 -259087 -202177 -157581 -85595
2049 -85595 -203709 -163794 -52497 -157091 -194709 -135858 -138968 -79982 -140313 -244854 -304081
2038 -304081 -346754 -173668 -187464 -191000 -21929 -5253 -3417 -53637 -128742 -55100 -132412 -190456
2026 -190456 -209807 -211407 -186564 -306210 -283622 -116570 -91112 -82116 -65572 -139697 -239003 -293779
2014 -293779 -257736 -356503 -253089 -83288 -114772 -263789 -351314 -293730 -168964 -412524 -361727
$$ packed form
2093d6975J23193j02755L6822J16598J3271j49049p8498J07259J32253j16366
2083C5753n5801o819j69943P3314n840p4516J7936L1481J81241K9589j70007L4746
2071g8866n7479m1346J1459O6203J00406n6183J04130m0544k00853k5691O8772
2060a49992O2769O6583R0218M134j53333j29517q8892L8943N6910M4596P1986
2049h5595j18114L9915J11297j04594l7618N8851l110N8986o0331j04541n9227
2038c04081m2673J73086j3796l536J69071J6676J836n0220p5105P3642p7312n8044
2026a90456j9351j600K4843j19646K2588J67052K5458Q996J6544p4125r9306n4776
2014b93779L6043r8767J03414J69801l1484j49017q7525N7584J24766k43560N0797
$$ plain form
2003 -361727 -222461 -133971 -165204 -198383 -168102 -227004 -319926 -247428 -257069 -239919 -2963
1992 -2963 -119456 -112822 -92778 -82590 12627 -28580 -73507 -141263 17137 62050 -116276 -38444
1980 -38444 63273 48472 -64421 -251000 -230196 -174422 -159595 -222955 -293376 -268037 -113810
1969 -113810 -288765 -361414 -269766 -246997 -89600 -242238 -172169 -110449 -119326 -37085 -63821
1958 -63821 -23336 55468 25533 14721 -6482 -98623 -68610 -112677 -60534 722 -5895 -86404
1946 -86404 -187614 -58124 -138435 -248586 -142221 -173457 -246724 -179620 -302506 -267711 -211606
1935 -211606 -38792 66799 75239 39572 -81432 -146955 -221530 -265452 -114646 -65463 -65787
1924 -65787 24377 35264 66908 -5905 -191671 -155959 -111428 -67450 -138076 -329880 -208405
$$ packed form
2003c61727J39266Q8490l1233l3179L0281n8902r2922P2498r641J7150K36956
1992b963j16493O634K0044J0188R5217m1207m4927o7756J58400M4913j78326P7832
1980c8444J01717j4801j12893j86579K0804N5774J4827o3360p0421K5339J54227
1969a13810j74955p2649R1648K2769J57397j52638P0069O1720q877Q2241k6736
1958f3821M0485P8804k9935j0812k1203r2141L0013m4067N2143O1256o617q0509
1946h6404j01210J29490q0311j10151J06365l1236p3267O7104j22886L4795N6105
1935b11606J72814J05591Q440l5667j21004o5523p4575m3922J50806M9183l24
1924f5787R0164J0887L1644p2813j85766L5712M4531M3978p0626j91804J21475
$$ plain form
1913 -208405 -187532 -215978 -251112 -138259 -18517 -65440 -32590 -89559 -150541 -112874 -133799
1902 -133799 -132513 18402 17760 31785 44728 -71885 -52558 -43657 -53882 104815 112373 167958
1890 167958 249205 285527 142537 -14032 -102109 -101840 -105141 -80931 -112150 -53184 17454 -37697
1878 -37697 -22728 -97 63217 52996 54533 99428 146222 26989 43876 65705 113038 265373
1866 265373 341646 424178 408458 298239 252214 150507 54540 160759 293953 215834 294878
1855 294878 271705 244718 89076 101628 161582 159926 182840 171129 249842 172942 28676
1844 28676 16214 -363 31413 77013 137863 197521 324509 406035 460221 329777 363837
1833 363837 403102 491151 479346 438422 521676 469375 480416 472869 317800 385928 411946 301895
$$ packed form
1913b08405K0873k8446l5134J12853J19742m6923L2850n6969o0982L7667k0925
1902a33799J286J50915o42J4025J2943j16613J9327Q901j0225J58697P558N5585
1890A67958Q1247L6322j42990j56569q8077K69l301K4210l1219N8966P0638n5151
1878c7697J4969K2631O3314j0221J537M4895M6794j19233J6887K1829M7333J52335
1866B65373P6273Q2532j5720j10219m6025j01707r5967J06219J33194p8119P9044
1855B94878k3173k6987j55642J2552N9954j656K2914j1711P8713p6900j44266
1844B8676j2462j6577L1776M5600O0850N9658J26988Q1526N4186j30444L4060
1833C63837L9265Q8049j1805m0924Q3254n2301J1041p547j55069O8128K6018j10051
$$ plain form
1821 301895 341512 340328 424847 395517 320552 227339 175620 202048 306057 343274 422881 547250
1809 547250 659734 608221 528836 443574 588728 623525 703872 696035 709555 608419 527999
1798 527999 449789 394294 359210 402217 404257 401714 436355 331013 175300 236657 297167 289191
1786 289191 273405 231778 233260 298491 333810 292020 304859 250720 376778 290361 183959
1775 183959 107803 152936 150606 174697 262981 271937 226194 282788 218711 54833 42591 152644
1763 152644 211782 109325 -78163 -113039 -44759 -14582 -57379 -7379 92160 120913 211597
1752 211597 135650 -43473 -85426 -8648 -30681 -87178 -83793 11350 -19495 -98119 -121986 -129875
1740 -129875 -92958 -68770 -21904 145104 47605 -92548 -112354 -163352 -152651 -224554 -50753
$$ packed form
1821C01895L9617j184Q4519k9330p4965r3213n1719K6428J04009L7217P9607J24369
1809E47250J12484n1513p9385q5262J45154L4797Q0347p837J3520j01136q0420
1798E27999p8210n5495l5084M3007K040k543L4641j05342j55713O1357O0510p976
1786B89191j5786m1627J482O5231L5319m1790J2839n4139J26058q6417j06402
1775A83959p6156M5133k330K4091Q8284Q956m5743N6594o4077j63878j2242J10053
1763A52644N9138j02457j87488l4876O8280L0177m2797N0000R9539K8753R0684
1752B11597p5947j79123m1953P6778k2033n6497L385R5143l0845p8624k3867p889
1740a29875L6917K4188M6866J67008r7499j40153j9806n0998J0701p1903J73801
$$ plain form
1729 -50753 77631 -107130 -214426 -199699 -107116 -107568 -250755 -190404 -129878 -113013 -131342
1718 -131342 -171751 -126524 -196144 -235700 -130266 -158463 -153571 -20333 -36320 -42805 -136293 -209051
1706 -209051 -142685 -183361 -179968 -129589 -59181 -94326 -206401 -137872 -70378 -120605 -83546 -259077
1694 -259077 -327899 -233556 -238130 -228296 -171084 -71665 -58323 -198480 -165508 -144283 -135901 76795
1682 76795 -14335 -29078 -78481 -125536 -206326 -285072 -171370 -190089 -196164 -105120 -3604 -106524
1670 -106524 -239128 -268099 -222316 -164998 -130226 -75756 -107835 -174673 -324383 -266764 -116583
1659 -116583 -134144 -160261 -142210 -107478 -74263 -140717 -200883 -188591 -177805 -72521 -58808
1648 -58808 -79468 -119245 -222076 -186541 -228691 -206619 -135504 -142168 -71490 -75481 -222290 -286420
$$ packed form
1729e0753J28384j84761j07296J4727R2583m52j43187O0351O0526J6865j8329
1718a31342m0409M5227o9620l9556J05434k8197M892J33238j5987o485r3488p2758
1706b09051O6366m0676L393N0379P0408l5145j12075O8529O7494n0227L7059j75531
1694b59077o8822R4343m574R834N7212R9419J3342j40157L2972K1225Q382K12696
1682G6795r1130j4743m9403m7055q0790p8746J13702j8719o075R1044J01516j02920
1670a06524j32604k8971M5783N7318L4772N4470l2079o6838j49710N7619J50181
1659a16583j7561k6117J8051L4732L3215o6454o0166J2292J0786J05284J3713
1648e8808k0660l9777j02831L5535m2150K2072P1115o664P0678l991j46809o4130
$$ plain form
1636 -286420 -325521 -274154 -275319 -298979 -242507 -261858 -182630 -191467 -159165 -102892 -164892 -74398
1624 -74398 -130108 -276188 -247712 -173488 -111450 -248726 -235127 -246369 -150735 -173335 -136265
1613 -136265 -90122 -28057 -17518 -137020 -87188 -10727 -59644 -156815 -156463 -69282 22262 1843
1601 1843 -54349 -149621 -110488 -210680 -205897 -167836 -222044 -93615 -86833 -210993 -244292 -150200
1589 -150200 -130299 -125216 -63643 -44565 -109490 -118753 -130785 -186396 -90144 20602 3448 -118989
1577 -118989 -166561 -130052 -196030 -233878 -45892 -47340 -161315 -172464 -151079 -142394 -255612
1566 -255612 -310078 -196732 -185581 -230173 -210527 -147174 -183382 -128136 -56720 -64469 -102852 29341
1554 29341 -125312 -192901 -228373 -206064 -53128 -83882 -121080 -40131 -128106 -208013 -178176
$$ packed form
1636b86420l9101N1367j165k3660N6472j9351P9228q837L2302N6273o2000R0494
1624g4398n5710j46080K8476P4224O2038j37276J3599j1242R5634k2600L7070
1613a36265M6143O2065J0539j19502M9832P6461m8917r7171L52Q7181R1544k0419
1601A843n6192r5272L9133j00192M783L8061n4208J28429O782j24160l3299R4092
1589a50200J9901N083O1573J9078o4925r263j2032n5611R6252J10746j7154j22437
1577a18989m7572L6509o5978l7848J87986j448j13975j1149K1385Q685j13218
1566b55612n4466J13346J1151m4592J9646O3353l6208N5246P1416p749l8383J32193
1554B9341j54653o7589l5472K2309J52936l0754l7198Q0949q7975p9907K9837
$$ plain form
1543 -178176 -118544 -23669 -55365 -102320 -101416 -76852 -280260 -313954 -220331 -94109 117449
1532 117449 126781 -36226 -65520 -191384 -250101 -196680 -45279 -67885 -144870 -274690 -277309
1521 -277309 -191868 -114621 -99728 -64967 -18736 41315 3468 -204570 -231123 -216462 -107007
1510 -107007 -102129 23131 -8206 -5366 -25304 -221758 -106064 5076 -17135 206645 234352
1499 234352 170005 80907 -32049 -54376 -144523 -91765 41811 -30137 -103700 -64991 25814
1488 25814 39530 -38440 -32722 -76836 -156729 -201842 -211138 -134179 -130212 -74085 134086 32680
1476 32680 -12063 -90499 -113184 -29420 -76185 -100331 -7762 -12394 23476 -10305 -69932 20074
1464 20074 2093 40455 -85633 -85212 58568 -48955 -86176 -116740 -37311 43220 -33430 -142118
$$ packed form
1543a78176N9632R4875l1696m6955R04K4564k03408l3694R3623J26222K11558
1532A17449R332j63007k9294j25864n8717N3421J51401k2606p6985j29820k619
1521b77309Q5441P7247J4893L4761M6231O0051l7847k08038k6553J4661J09455
1510a07007M878J25260l1337K840j9938j96454J15694J11140k2211K23780K7707
1499B34352o4347q9098j12956k2327r0147N2758J33576p1948p3563L8709R0805
1488B5814J3716p7970N718m4114p9893m5113r296P6959L967N6127K08171j01406
1476C2680m4743p8436k2685Q3764m6765k4146R2569m632L5870l3781n9627R0006
1464B0074j7981L8362j26088M21J43780j07523l7221l0564P9429Q0531p6650j08688
$$ plain form
1452 -142118 -129002 -194720 -142753 -77825 -59721 -56966 -78386 -121059 -171463 -146642 -68415 -183675
1440 -183675 -159295 -8336 17718 22717 -37558 -19437 -70925 -129304 928 10517 -79480 90354
1428 90354 39711 -274279 -258444 -130022 -13800 -11801 -11791 -1431 65005 70518 -110160 -202522
1416 -202522 -194905 -114823 -75857 -29831 -78283 -37390 14302 -98811 -77027 -66907 88699
1405 88699 138039 11735 85965 36485 -150276 -122020 -83719 -175086 -157442 -163518 -56012
1394 -56012 -86754 -179355 -269423 -263294 -197051 -203258 -140617 -61417 -212261 -220381 -204294 -194904
1382 -194904 -120527 -133327 -64684 28560 -84889 -27234 31846 -96476 74332 141881 -12004
1371 -12004 -11760 -40390 -192117 -316688 -194658 -55870 7931 -41272 -49450 -57935 -293180 -464467
$$ packed form
1452a42118J3116o5718N1967O4928J8104K755k1420m2673n0404K4821P8227j15260
1440a83675K4380J50959K6054M999o0275J8121n1488n8379J30232R589q9997J69834
1428I0354n0643l13990J5835J28422J16222J999J0J0360O6436N513j80678r2362
1416b02522P617Q0082L8966M6026m8452M0893N1692j13113K1784J0120J55606
1405H8699M9340j26304P4230m9480j86761K8256L8301r1367J7644o076J07506
1394e6012l0742r2601r0068O129O6243o207O2641P9200j50844q120J6087R390
1382a94904P4377j2800O8643R3244j13449N7655N9080j28322J70808O7549j53885
1371a2004K44k8630j51727j24571J22030J38788O3801m9203q178q485k35245j71287
$$ plain form
1359 -464467 -308983 -258807 -152640 -74219 -195569 -196644 -165295 -141021 -245446 -233304 -133941
1348 -133941 3293 32863 -157538 -152259 -84650 -123194 -33702 67101 -22268 49866 75255
1337 75255 -46891 -173651 -236264 -144214 6214 -153510 -216413 -68222 -167285 -245210 -344837
1326 -344837 -321440 -266995 -169959 -214838 -205855 -129332 -123839 -50700 -151364 -228676 -48913 26813
1314 26813 -114031 -131087 -129228 -89907 34426 75897 35043 85104 83343 -39734 -161924
1303 -161924 -127854 -80321 60143 -89369 -198985 -52287 -26178 -93051 -157228 -248020 -243787
1292 -243787 -195707 -205976 -134330 -199622 -108607 50144 27591 -22166 102233 230448 177433
1281 177433 76974 34339 -58370 7368 20380 34423 67099 2500 -72654 -4503 -155775
$$ packed form
1359d64467J55484N0176J06167P8421j21350j075L1349K4274j04425J2142R9363
1348a33941J37234K9570j90401N279O7609l8544Q9492J00803q9369P2134K5389
1337G5255j22146j26760o2613R2050J50428j59724o2903J48191r9063p7925r9627
1326c44837K3397N4445R7036m4879Q983P6523N493P3139j00664p7312J79763P5726
1314B6813j40844j7056J859L9321J24333M1471m0854N0061j761j23077j22190
1303a61924L4070M7533J40464j49512j09616J46698K6109o6873o4177r0792M233
1292b43787M8080j0269P1646o5292R1015J58751k2553m9757J24399J28215n3015
1281A77433j00459m2635r2709O5738J3012J4043L2676o4599p5154O8151j51272
$$ plain form
1270 -155775 -66558 33458 -36635 -91486 -11161 18078 -93140 -141878 -210578 -143461 -166019
1259 -166019 -201985 -83142 10709 -569 -24122 -17053 -23978 160749 129540 84176 134599 117281
1247 117281 38725 -4292 -52595 28349 119634 13250 -33541 23878 67018 103668 151197
1236 151197 214772 144408 163622 82383 -6408 89386 -13176 193590 365461 338591 200922
1225 200922 -7735 -164355 -171975 -25640 92366 162700 183410 157540 -40207 -68326 41823
1214 41823 43303 48547 48104 156005 138111 -74799 -189405 -195436 -84309 32653 -22652 -48441
1202 -48441 -72252 -117710 -163654 -109843 51123 151482 130210 145822 97178 54465 -36948
1191 -36948 -70232 -35995 74526 205946 94235 -8887 101726 111323 96264 72968 -3466
$$ packed form
1270a55775Q9217J00016p0093n4851Q0325K9239j11218m8738o8700O7117k2558
1259a66019l5966J18843R3851j1278k3553P069o925J84727l1209m5364N0423j7318
1247A17281p8556m3017m8303Q0944R1285j06384m6791N7419M3140L6650M7529
1236A51197O3575p0364J9214q1239q8791R5794j02562K06766J71871k6870j37669
1225B00922k08657j56620p620J46335J18006P0334K0710k5870j97747k8119J10149
1214D1823J480N244m43J07901j7894k12910j14606o031J11127J16962n5305k5789
1202d8441k3811m5458m5944N3811J60966J00359k1272J5612m8644m2713r1413
1191c6948l3284L4237J10521J31420j11711j03122J10613R597j5059k3296p6434
$$ plain form
1180 -3466 104132 121875 -60466 -123900 -144608 14697 170737 47817 117403 197250 129019
1169 129019 90579 -166246 -201527 -89542 137593 132431 66935 240390 219190 1993 -17313
1158 -17313 -67261 3641 68268 -34375 35249 77686 80667 -18111 -66612 -38165 -4042 -17784
1146 -17784 75780 115254 -44846 -19004 91479 170041 60415 37028 245219 306984 237301
1135 237301 215570 202993 134820 160509 297235 330479 369002 487407 303632 141838 130751
1124 130751 125973 155204 103790 125290 192763 269156 183598 144785 234235 153995 150029 209579
1112 209579 21687 58730 196492 116780 72347 172441 324154 437273 415174 370432 454971
1101 454971 377669 356227 364890 460228 534306 505417 434131 412682 506616 423401 259588 263166
$$ packed form
1180c466J07598J7743j82341o3434k0708J59305J56040j22920O9586P9847o8231
1169A29019l8440k56825l5281J11985K27135n162o5496J73455k1200k17197j9306
1158a7313m9948P0902O4627j02643O9624M2437K981r8778m8501K8447L4123j3742
1146a7784R3564L9474j60100K5842J10483P8562j09626k3387K08191O1765o9683
1135B37301k1731j2577o8173K5689J36726L3244L8523J18405j83775j61794j1087
1124A30751m778K9231n1414K1500O7473P6393q5558l8813Q9450q0240l966N9550
1112B09579j87892L7043J37762p9712m4433J00094J51713J13119k2099m4742Q4539
1101D54971p7302k1442Q663R5338P4078k8889p1286k1449R3934q3215j63813L578
$$ plain form
1089 263166 268110 341901 329804 247571 247934 315496 312521 175208 184580 187294 157948 142416 247075
1076 247075 362592 433739 521198 456152 391071 302211 474288 438392 332767 397620 400595
1065 400595 444323 513405 590273 642655 707170 657167 504468 482512 492265 631740 655224
1054 655224 419875 324148 462771 475232 332866 376380 459485 588455 652257 507566 552714
1043 552714 537506 594245 672382 742061 804179 914957 976067 936612 852122 815271 877250
1032 877250 895518 958798 1065284 1224244 1231511 1035447 895039 829871 920271 908811 835452
1021 835452 941949 1034848 1149622 1060631 1036502 1086670 1092692 1052745 1038308 1135773 1140653 1273073
1009 1273073 1337597 1356538 1435578 1554504 1544470 1452065 1494477 1544182 1655792 1717072 1619712
$$ packed form
1089B63166M944P3791j2097q2233L63O7562k975j37313R372K714k9346j5532J04659
1076B47075J15517P1147Q7459o5046o5081q8860J72077l5896j05625O4853K975
1065D00595M3728O9082P6868N2382O4515n0003j52699k1956R753J39475K3484
1054F55224k35349r5727J38623J2461j42366M3514Q3105J28970O3802j44691M5148
1043E52714j5208N6739P8137O9679O2118J10778O1110l9455q4490l6851O1979
1032H77250J8268O3280J06486J58960P267j96064j40408o5168R0400j1460p3359
1021H35452J06497R2899J14774q8991k4129N0168O022l9947j4437R7465M880J32420
1009A273073O4524J8941P9040J18926j0034r2405M2412M9705J11610O1280r7360
$$ plain form
998 1619712 1695593 1775472 1744909 1801872 1837049 2035254 2055357 2054946 2184113 2254712 2307405 2350550
986 2350550 2425613 2579081 2645844 2839206 3019000 3040734 3196126 3361527 3468814 3611107
976 3611107 3849396 4079593 4214694 4437338 4919460 5286194 5466530 5819923 6429578 7023892
966 7023892 7528471 8095792 8739249 9234592 9778982 10633819 11593385 12860848 14453547
957 14453547 16494588 19280523 23031254 26763955 30278348 34705665 38987730 41400079
949 41400079 40682055 34323666 26286450 20538341 16732107 14036653 12016038 10513366
941 10513366 9388721 8571316 7985540 7590347 7129255 6660098 6331974 5989611 5632704
932 5632704 5191444 4715346 4411589 4124359 3777691 3435553 3288536 3093384 2974886 2839953
$$ packed form
998A619712P5881P9879l0563N6963L5177J98205K0103m11J29167P0599N2693M3145
986B350550P5063J53468O6763J93362J79794K1734J55392J65401J07287J42293
976C611107K38289K30197J35101K22644M82122L66734J80336L53393O09655N94314
966G023892N04579N67321O43457M95343N44390Q54837R59566J267463J592699
957A4453547K041041K785935L750731L732701L514393M427317M282065K412349
949D1400079p18024o358389q037216n748109l806234k695454k020615j502672
941A0513366j124645q17405n85776l95193m61092m69157l28124l42363l56907
932E632704m41260m76098l03757k87230l46668l42138j47017j95152j18498j34933
$$ plain form
922 2839953 2800624 2745858 2516027 2312433 2310943 2213602 2113757 1983655 1963614 1936833 1721945
911 1721945 1573730 1531164 1500953 1491532 1385453 1285711 1319417 1313311 1275154 1120682 1030355
900 1030355 1141207 1151187 1171375 1106620 1050024 1021973 940851 812344 795142 872696 873423 831502
888 831502 626413 622495 643594 631117 570495 635425 712813 775981 776080 551576 650911 672869
876 672869 516564 563856 654184 692830 689400 543163 407200 486732 533659 460481 389975
865 389975 386092 451027 462750 420807 247796 372320 356535 387895 506375 565518 468547
854 468547 415211 301850 252854 231977 198779 223034 189253 167857 229182 300936 252158 252611
842 252611 253057 236795 233536 319712 232849 211389 291454 279882 205888 205349 286427 171619 82111
$$ packed form
922B839953l9329n4766k29831k03594j490r7341r9845j30102k0041k6781k14888
911A721945j48215m2566l0211r421j06079r9742L3706o106l8157j54472r0327
900A030355J10852R980K0188o4755n6596k8051q1122j28507j7202P7554P27m1921
888H31502k05089l918K1099j2477o0622O4930P7388O3168R9k24504R9335K1958
876F72869j56305M7292R0328L8646l430j46237j35963P9532M6927p3178p0506
865C89975l883O4935J1723m1943j73011J24524j5785L1360J18480N9143r6971
854D68547n3336j13361m8996k0877l3198K4255l3781k1396O1325P1754m8778M53
842B52611M46j6262l259Q6176q6863k1460Q0065j1572p3994n39Q1078j14808q9508
$$ plain form
829 82111 193726 289412 315057 143230 115933 177216 163218 181931 94052 145136 124810 118633
817 118633 89285 138947 188236 189263 154390 192900 227676 51407 53314 147985 105225 33766
805 33766 -5730 106918 78120 39976 133676 79034 205652 125632 -3822 127629 98010
794 98010 -22171 -99497 -84224 168079 121648 -19900 -46471 63966 197421 14995 -67040
783 -67040 101325 155411 233428 144052 23790 32580 -101720 -102049 11204 26945 46835 40162
771 40162 20692 -30581 -35734 127681 184819 108202 193828 115316 78493 -45349 -116617 -24869
759 -24869 30952 203746 180651 81690 40052 -65584 -98215 -79934 12739 98700 109296 134731
747 134731 137804 84892 81817 -9454 106925 239586 226177 204822 144861 17012 -25934 -179575
$$ packed form
829H2111J11615R5686K5645j71827k7297O1283j3998J8713q7879N1084k0326o177
817A18633k9348M9662M9289J027l4873L8510L4776j76269J907R4671m2760p1459
805C3766l9496J12648k8798l8144R3700n4642J26618q0020j29454J31451k9619
794I8010j20181p7326J5273K52303m6431j41548k6571J10437J33455j82426q2035
783f7040J68365N4086P8017q9376j20262Q790j34300l29J13253J5741J9890o673
771D0162j9470n1273n153J63415N7138p6617Q5626p8512l6823j23842p1268R1748
759b4869N5821J72794k3095r8961m1638j05636l2631J8281R2673Q5961J0596K5435
747A34731L073n2912l075r1271J16379J32661j3409k1355n9961j27849m2946j53641
$$ plain form
735 -179575 -69055 162514 159770 264298 213048 107147 -8633 -43332 -39368 11573 88784
724 88784 73232 33799 117962 90606 -74637 -141687 -100276 -30708 33885 49893 40409 -26155
712 -26155 -68221 8173 13073 53222 153402 179672 186088 74903 -58037 22268 35287 160997
700 160997 249941 70025 -86793 -145864 -53555 37830 72194 7934 76373 55192 -44376
689 -44376 -93350 5205 67634 8036 49528 13952 40992 -2062 -146741 -189816 -146273 -50807
677 -50807 -30831 30008 97784 52906 107177 35055 8912 128507 162920 147181 145306 66079
665 66079 105475 198594 262466 323171 305563 290290 152788 55560 89120 127824 84741 111568
653 111568 24156 97179 108378 -20894 -15930 -73672 -63975 79258 58607 44318 55679 202640
$$ packed form
735a79575J10520K31569k744J04528n1250j05901j15780l4699L964N0941P7211
724H8784j5552l9433Q4163k7356j65243o7050M1411O9568O4593J6008r484o6564
712b6155m2066P6394M900M0149J00180K6270O416j11185j32940Q0305J3019J25710
700A60997Q8944j79916j56818n9071R2309R1385L4364o4260O8439k1181r9568
689d4376m8974R8555O2429n9598M1492l5576K7040m3054j44679m3075M3543R5466
677e0807J9976O0839O7776m4878N4271p2122k6143J19595L4413j5739j875p9227
665F6079L9396R3119O3872O0705j7608j5273j37502r7228L3560L8704m3083K6827
653A11568q7412P3023J1199j29272M964n7742R697J43233k0651j4289J1361J46961
$$ plain form
641 202640 168214 115748 151504 139525 73440 -15705 -26648 110473 164858 180625 86622 74493
629 74493 78765 85762 70252 -33268 112431 196429 82783 50873 128005 43751 -43210 -37188
617 -37188 69083 74950 58828 -24016 48421 146822 98879 67586 61045 73385 14777 11367
605 11367 22213 64035 188666 68368 -32974 -83912 -64342 -7292 -62372 21838 74346
594 74346 -13500 32541 -5405 -147623 -71708 72629 127157 92009 -31458 -50907 -61591
583 -61591 -5689 -16790 -40379 136263 97817 81431 149302 145298 129554 124495 111765 -1323
571 -1323 35637 26997 24318 81352 45981 -13023 -82012 -102845 -116501 -138046 -152026 -39936
559 -39936 120691 -1972 42330 114227 68730 -44049 -155005 -86633 50149 61911 9212
$$ packed form
641B02640l4426n2466L5756j1979o6085q9145j0943J37121N4385J5767r4003j2129
629G4493M272O997j5510j03520J45699Q3998j13646l1910P7132q4254q6961O022
617c7188J06271N867j6122q2844P2437R8401m7943l1293o541J2340n8608l410
605A1367J0846M1822J24631j20298j01342n0938J9570N7050n5080Q4210N2508
594G4346q7846M6041l7946j42218P5915J44337N4528l5148j23467j9449j0684
583f1591N5902j1101k3589J76642l8446j6386O7871m004j5744n059j2730j13088
571a323L6960q640k679N7034l5371n9004o8989k0833j3656k1545j3980J12090
559c9936J60627j22663M4302P1897m5497j12779j10956O8372J36782J1762n2699
$$ plain form
548 9212 25602 131159 39716 -85877 -50249 1956 135539 38842 -79892 44280 114176
537 114176 -16533 69106 -92439 -90788 -39196 -19977 -68774 -110165 -94177 -53547 -19764 14016
525 14016 -72997 -71732 -8228 -77860 50587 97410 163704 178258 89885 31885 80439 95944
513 95944 142822 88199 94749 37701 16642 -50843 -61977 -60836 48853 8018 119128 133502
501 133502 26862 -25465 -74966 51704 85699 -2438 42853 156411 202487 127978 19297
490 19297 -14225 -10095 52711 -9480 28156 81800 19173 35502 113693 37443 52823 89488
478 89488 108089 -11678 -56962 -40461 -152400 -50231 20961 31263 77420 -17506 80160
467 80160 85072 45870 56303 27457 109797 82419 58726 61160 118119 42065 66817 63214 74622
$$ packed form
548I212J6390J05557r1443j25593L5628N2205J33583r6697j18734J24172O9896
537A14176j30709Q5639j61545J651N1592J9219m8797m1391J5988M0630L3783L3780
525A4016q7013J265O3504o9632J28447M6823O6294J4554q8373n8000M8554J5505
513I5944M6878n4623O550n7048k1059o7485j1134J141J09689m0835J11110J4374
501A33502j06640n2327m9501J26670L3995q8137M5291J13558M6076p4509j08681
490A9297l3522M130O2806o2191L7636N3644o2627J6329P8191p6250J5380L6665
478H9488J8601j19767m5284J6501j11939J02169P1192J0302M6157r4926R7666
467H0160M912l9202J0433k8846Q2340k7378k3693K434N6959p6054K4752l603J1408
$$ plain form
454 74622 73992 53260 71387 85503 113851 69772 75850 95685 83090 50228 23307 -71747 32653
441 32653 44600 79940 50823 72991 158480 56717 -103315 -123477 -52348 -3151 -104990
430 -104990 -159601 -8097 6615 9183 64430 159119 194661 63802 -9240 23900 17868 10494
418 10494 33213 67354 100553 83123 97050 -69703 -74538 32054 107414 84098 33115 37419
406 37419 99049 40221 -4079 32462 34354 32585 -33831 47286 24306 31017 46002 42639 44218
393 44218 -61750 68733 53502 -39071 -56357 15121 12350 -41799 534 106729 91383 118656
381 118656 108069 32631 93344 72980 54832 29508 -25337 18985 5811 -44970 71828 78487
369 78487 162616 112432 33542 59521 16409 43222 -62579 -104827 20690 54038 89679 8172
$$ packed form
454G4622o30k0732J8127J4116K8348m4079O078J9835j2595l2862k6921r5054J04400
441C2653J1947L5340k9117K2168Q5489j01763j60032k0162P1129M9197j01839
430a04990n4611J51504J4712K568N5247R4689L5542j30859p3042L3140o032p374
418A0494K2719L4141L3199j7430J3927j66753m835J06592P5360k3316n0983M304
406C7419O1630n8828m4300L6541J892j769o6416Q1117k2980O711J4985l363J579
393D4218j05968J30483j5231r2573j7286P1478k771n4149M2333J06195j5346K7273
381A18656j0587p5438O0713k0364j8148k5324n4845M4322j3174n0781J16798O659
369G8487Q4129n0184p8890K5979m3112K6813j05801m2248J25517L3348L5641q1507
$$ plain form
357 8172 10026 122397 64218 85132 265228 154321 65729 48016 94578 124515 30065 -4516
345 -4516 -44874 -27258 11553 46634 109902 39565 -42609 11167 -55459 -58463 85430 132106
333 132106 109775 21590 92182 163443 46750 35690 101059 135236 163449 74385 92663 54354
321 54354 -28550 8903 -4340 93904 113698 -3025 50304 74169 99076 -9431 -12862 -84237
309 -84237 -200484 -155895 -152863 -163351 -96980 -6129 -37395 -28850 109011 146438 22389 19788
297 19788 64764 -15001 -4194 37331 144995 142340 24714 31566 -15173 -96245 -141983 -253216
285 -253216 -141827 24075 -15568 7463 35850 95399 105813 -31573 -125146 -55796 42288
274 42288 -19337 28945 114529 122300 62958 38856 63941 94382 60970 27288 58825 43820
$$ packed form
357H172J854J12371n8179K0914J80096j10907q8592j7713M6562K9937r4450l4581
345d516m0358J7616L8811L5081O3268p0337q2174N3776o6626l004J43893M6676
333A32106k2331q8185P0592P1261j16693j1060O5369L4177K8213q9064J8278l8309
321E4354q2904L7453j3243R8244J9794j16723N3329K3865K4907j08507l431p1375
309h4237j16247M4589L032j0488O6371R0851l1266Q545J37861L7427j24049k601
297A9788M4976p9765J0807M1525J07664k655j17626O852m6739q1072m5738j11233
285b53216J11389J65902l9643K3031K8387N9549J0414j37386r3573O9350R8084
274D2288o1625M8282Q5584P771n9342k4102K5085L0441l3412l3682L1537j5005
$$ plain form
262 43820 208407 128967 29308 60518 96279 16967 -55445 41626 103269 104229 -61243 -121378
250 -121378 -88142 -118684 -128640 63506 191582 181514 146649 109361 -11267 1584 159256
239 159256 119786 67909 99685 185643 175484 87662 -31666 82389 75354 13982 61875 150245
227 150245 170824 96918 -6406 -13566 18787 -8041 -150012 -111591 45415 70775 145891
216 145891 159265 168748 248195 129939 25538 101065 133494 50304 49349 29420 6837 -47102
204 -47102 -32033 40110 76297 56727 30738 -70962 -32324 81002 38774 -110172 -39252
193 -39252 -60770 -162236 -212675 -143804 -76427 -31506 -41520 243051 250041 -47321 -19231 68106
181 68106 122546 135555 248132 172716 190055 150342 30275 -10893 -26546 78473 161543
$$ packed form
262D3820J64587p9440r9659L1210L5761p9312p2412R7071O1643R60j65472o0135
250a21378L3236l0542r956J92146J28076j0068l4865l7288j20628J2851J57672
239A59256l9470n1877L1776Q5958j0159q7822j19328J14055p035o1372M7893Q8370
227A50245K0579p3906j03324p160L2353k6828j41971L8421J57006K5360P5116
216A45891J3374R483P9447j18256j04401P5527L2429q3190r55j9929k2583n3939
204d7102J5069P2143L6187j9570k5989j01700L8638J13326m2228j48946P0920
193c9252k1518j01466n0439O8871O7377M4921j0014K84571O990k97362K8090Q7337
181F8106N4440J3009J12577p5416J7339l9713j20067m1168j5653J05019Q3070
$$ plain form
170 161543 89741 55135 8792 -155691 -272830 -155949 -71090 44498 125840 66488 67448
159 67448 -16713 -73323 -162599 -196614 -1512 177724 268997 210527 98537 34490 -8189
148 -8189 49155 141777 88071 210120 109010 -24599 -81368 20763 64677 136645 39152
137 39152 19492 18445 -77631 -109101 1681 -23758 11202 -20749 -29658 -28402 -93790 -52303
125 -52303 -11134 -27241 -77397 -15963 72845 56350 71742 106562 50870 118126 76637 25666
113 25666 54602 113329 83440 22714 -3440 53851 119647 71866 32514 23527 -5719 -16684
101 -16684 49062 -28660 -71988 -14183 -42709 -3068 -8837 42285 26065 65270 16434 -58178
89 -58178 -27003 40294 136014 63744 40424 41932 49719 20653 31146 52373 65193 94687 91775
$$ packed form
170A61543p1802l4606m6343j64483j17139J16881Q4859J15588Q1342n9352R60
159F7448q4161n6610q9276l4015J95102J79236R1273n8470j11990o4047m2679
148h189N7344R2622n3706J22049j01110j33609n6769J02131M3914P1968r7493
137C9152j9660j047r6076l1470J10782k5439L4960l1951q909J256o5388M1487
125e2303M1169j6107n0156O1434Q8808j6495J5392L4820n5692O7256m1489n0971
113B5666K8936N8727k9889o0726k6154N7291O5796m7781l9352q987k9246j0965
101a6684O5746p7722m3328N7805k8526L9641n769N1122j6220L9205m8836p4612
89e8178L1175O7297R5720p2270k3320J508P787k9066J0493K1227J2820K9494k912
$$ plain form
76 91775 45510 -78760 -76040 -10980 55309 -38104 3173 32335 -71646 -120095 -68100 24722
64 24722 121046 126390 37528 42480 32532 -37561 7514 11550 156164 235713 135844 66127 12276
51 12276 -27075 -12784 49033 181923 119285 143892 80582 52190 12953 36159 37210 82374
39 82374 117114 37075 24912 58950 92058 -17006 25829 35337 -18831 -46247 -26116 -71200
27 -71200 -46890 39771 41722 24164 71417 42451 21855 -27831 -16317 78760 118586 135963
15 135963 97113 65352 76500 80845 -3191 37894 125416 32232 -60805 -90988 -27474 9717
3 9717 37628 -61101 -33484
0 -33484
$$ packed form
76I1775m6265j24270K720O5060O6289r3413M1277K9162j03981m8449N1995R2822
64B4722R6324N344q8862M952r948p0093M5075M036J44614P9549r9869o9717n3851
51A2276l9351J4291O1817J32890o2638K4607o3310k8392l9237K3206J051M5164
39H2374L4740q0039j2163L4038L3108j09064M2835R508n4168k7416K0131m5084
27g1200K4310Q6661J951j7558M7253k8966k0596m9686J1514R5077L9826J7377
15A35963l8850l1761J1148M345q4036M1085Q7522r3184r3037l0183O3514L7191
3I717K7911r8729K7617
0c3484
$$ Imaginary data points
##PAGE= N=2
##DATA TABLE= (X++(I..I)), XYDATA
$$ plain form
16383 -1795001 -1767138 -1761093 -1655218 -1679015 -1681353 -1703828 -1649622 -1525749 -1595109 -1569566 -1542981
16372 -1542981 -1457011 -1521223 -1591850 -1533723 -1425667 -1467666 -1509666 -1461790 -1476092 -1463272 -1481882
16361 -1481882 -1491332 -1410174 -1270276 -1221090 -1258904 -1210407 -1151364 -1200400 -1248638 -1237774 -1116813
16350 -1116813 -1081838 -1062902 -978276 -981175 -932927 -945877 -955858 -1012579 -1070577 -995603 -926446 -975063
16338 -975063 -977918 -944441 -916818 -854934 -845500 -798201 -769627 -717523 -703871 -762175 -800255 -825626
16326 -825626 -823276 -735139 -676372 -612172 -615196 -609151 -655383 -668920 -583442 -462008 -357010 -327084
16314 -327084 -376616 -383909 -314786 -416788 -506710 -446960 -321251 -280632 -286399 -219932 -238621
16303 -238621 -275412 -288180 -229293 -288075 -212895 -180697 -214394 -307209 -351603 -228855 -137510
$$ packed form
16383a795001K7863O045J05875k3797k338k2475N4206J23873o9360K5543K6585
16372a542981Q5970o4212p0627N8127J08056m1999m2000M7876j4302J2820j8610
16361a481882r450Q1158J39898M9186l7814M8497N9043m9036m8238J0864J20961
16350a116813L4975J8936Q4626k899M8248j2950r981n6721n7998P4974O9157m8617
16338i75063k855L3477K7623O1884R434M7299K8574N2104J3652n8304l8080k5371
16326h25626K350Q8137N8767O4200l024O045m6232j3537Q5478J21434J04998K9926
16314c27084m9532p293O9123j02002q9922N9750J25709M0619n767O6467j8689
16303b38621l6791j2768N8887n8782P5180L2198l3697r2815m4394J22748R1345
$$ plain form
16292 -137510 -122995 -162186 -63576 -51338 -118340 -140479 -9939 61085 144172 149288 90321
16281 90321 61174 69016 -8263 -8954 101346 160578 224961 127919 -22645 -17823 -5214 35479
16269 35479 102536 175771 201699 235797 149250 28551 173466 234975 323137 439707 506419
16258 506419 442416 386235 303685 309112 371141 336641 393295 503609 553621 493062 440024
16247 440024 458068 568902 622047 568283 522182 456910 471669 430345 413950 502129 553102
16236 553102 577927 531575 576188 551618 540915 439204 505381 683446 738870 660252 612699
16225 612699 630369 663382 823093 857981 809131 797297 700816 654059 664343 595741 645376
16214 645376 742019 770939 670473 750045 683261 622105 669653 720013 882575 849970 724534
$$ packed form
16292a37510J4515l9191R8610J2238o7002k2139J30540P1024Q3087N116n8967
16281I0321k9147P842p7279o91J10300N9232O4383r7042j50564M822J2609M0693
16269C5479O7057P3235K5928L4098q6547j20699J44915O1509Q8162J16570O6712
16258E06419o4003n6181q2550N427O2029l4500N6654J10314N0012o0559n3038
16247D40024J8044J10834N3145n3764m6101o5272J4759m1324j6395Q8179N0973
16236E53102K4825m6352M4613k4570j0703j01711O6177J78065N5424p8618m7553
16225F12699J7670L3013J59711L4888m8850j1834r6481m6757J0284o8602M9635
16214F45376R6643K8920j00466P9572o6784o1156M7548N0360J62562l2605j25436
$$ plain form
16203 724534 727470 773691 707860 670604 757328 791088 755106 761971 766845 766626 907933 993917
16191 993917 984873 958872 862657 960051 894054 763505 791223 781088 915877 955772 1027626
16180 1027626 1054455 999678 821308 818109 970700 997720 1018451 1049674 998568 856065 927602
16169 927602 917572 855903 905830 910045 1030593 1102469 1023981 1013371 1016804 1131780 1193188
16158 1193188 1091458 1053408 1059853 983668 873823 934295 1062579 1109506 966325 873421 999403
16147 999403 1055683 918339 891073 1007593 1011032 963293 915186 881462 1056479 1169258 1236365
16136 1236365 1271174 1341554 1463321 1298477 1197686 1153939 1279988 1217300 1115869 1124540
$$ packed form
16203G24534K936M6221o5831l7256Q6724L3760l5982O865M874k19J41307Q5984
16191I93917r044k6001r6215R7394o5997j30549K7718j0135J34789L9895P1854
16180A027626K6829n4777j78370l199J52591K7020K0731L1223n1106j42503P1537
16169I27602j0030o1669M9927M215J20548P1876p8488j0610L433J14976O1408
16158A193188j01730l8050O445p6185j09845O0472J28284M6927j43181r2904J25982
16147I99403N6280j37344k7266J16520L439m7739m8107l3724J75017J12779O7107
16136A236365L4809P0380J21767j64844j00791m3747J26049o2688j01431Q671
$$ [...]
##END NTUPLES=NMR SPECTRUM
##END=
