##TITLE=1H_EC-3242-p
 CDCl3,8 sc, 
 3.02.2021
##JCAMPDX= 6.0         $$ Bruker NMR JCAMP-DX V2.0
##DATA TYPE= NMR SPECTRUM
##DATA CLASS= NTUPLES
##ORIGIN= UXNMR, Bruker Analytische Messtechnik GmbH
##OWNER= root
$$ XWIN-NMR		Version 3.5
$$ Wed Feb  3 11:31:19 2021 Russian Standard Time (UT+4h)  she@DPX200
##.OBSERVE FREQUENCY= 200.1315066352
##.OBSERVE NUCLEUS= ^1H
##.ACQUISITION MODE= SIMULTANEOUS
##.ACQUISITION SCHEME= undefined
##.AVERAGES= 8
##.DIGITISER RES= 18
##SPECTROMETER/DATA SYSTEM= spect
##.PULSE SEQUENCE= zg30
##.SOLVENT NAME= CDCl3
##.SHIFT REFERENCE= (INTERNAL, CDCl3, 0, 15.9833)
##AUDIT TRAIL= $$ (NUMBER, WHEN, WHO, WHERE, WHAT)
$$ ##TITLE= Audit trail, XWIN-NMR		Version 3.5
$$ ##JCAMPDX= 5.01
$$ ##ORIGIN= Bruker BioSpin GmbH
$$ ##OWNER= she
$$ F:/spectra/data/she/nmr/H-F/1/pdata/1/auditp.txt
$$ ##AUDIT TRAIL=  $$ (NUMBER, WHEN, WHO, WHERE, WHAT)
(   1,<2021-02-03 11:30:03.31 +0400>,<she>,<DPX200>,
      <created by zg, POWCHK disabled, PULCHK disabled
       configuration hash MD5:
       00 E9 B6 7A A2 85 ED C7 34 08 36 98 17 FE 4E 26
       data hash MD5: 16K
       93 98 EF E9 77 14 0D E6 D2 59 7D 30 B7 6D E1 10>)
(   2,<2021-02-03 11:30:08.15 +0400>,<she>,<DPX200>,
      <Start of raw data processing
       efp BC_mod = 2 LB = 0.24 FT_mod = 6 PKNL = 1 PHC0 = -10415.92 PHC1 = 38.80095 SI = 16K 
       data hash MD5: 16K
       E6 BE 2A F9 FE 73 BE 14 3A EF 1D AA 7F 5C 6F F8>)
(   3,<2021-02-03 11:30:31.00 +0400>,<she>,<DPX200>,
      <pk PHC0 = -138.36 PHC1 = -30 
       data hash MD5: 16K
       CB F2 97 B8 A1 C6 9D ED 25 CC B6 89 88 02 FB 67>)
(   4,<2021-02-03 11:30:34.06 +0400>,<she>,<DPX200>,
      <abs ABSG = 5 
       data hash MD5: 16K
       39 77 1A 32 27 4B E1 F6 19 7F 2A 5B DC 85 D3 C6>)
$$ ##END=
$$ 
$$ hash MD5
$$ 1B 69 6A D1 0C 0D A4 1A 2A C1 C1 5B 75 52 FC CF
##$RELAX= 
##$RELAX= 
##$RELAX= 
##$RELAX= 
##$RELAX= 
##$RELAX= 
$$ Bruker specific parameters
$$ --------------------------
##$DU= <F:/spectra>
##$EXPNO= 1
##$NAME= <H-F>
##$PROCNO= 1
##$TYPE= <nmr>
##$USER= <she>
##$AMP= (0..31)
100 100 100 100 100 100 100 100 100 100 100 100 100 100 100 100 100 100 
100 100 100 100 100 100 100 100 100 100 100 100 100 100 
##$AQSEQ= 0
##$AQ_mod= 1
##$AUNM= <au_zg>
##$AUTOPOS= <>
##$BF1= 200.13
##$BF2= 200.13
##$BF3= 200.13
##$BF4= 200.13
##$BF5= 200.13
##$BF6= 200.13
##$BF7= 200.13
##$BF8= 200.13
##$BYTORDA= 1
##$CFDGTYP= 0
##$CFRGTYP= 5
##$CHEMSTR= <none>
##$CNST= (0..31)
1 1 145 1 1 1 1 1 1 1 1 1 1 1 1 1 1 1 1 1 1 1 1 1 1 1 1 1 1 1 1 1 
##$CPDPRG= <>
##$CPDPRG1= <>
##$CPDPRG2= <>
##$CPDPRG3= <>
##$CPDPRG4= <mlev>
##$CPDPRG5= <mlev>
##$CPDPRG6= <mlev>
##$CPDPRG7= <mlev>
##$CPDPRG8= <mlev>
##$CPDPRGB= <>
##$CPDPRGT= <>
##$D= (0..31)
0 1.2 0 0 0 0 0 0 0 0.06 0 0.03 0 0 0 0 0.0002 0 0 0 0 0 0 0 0 0 0 0 0 
0 0 0 
##$DATE= 1612337402
##$DBL= (0..7)
120 120 120 120 120 120 120 120 
##$DBP= (0..7)
150 150 150 150 150 150 150 150 
##$DBP07= 0
##$DBPNAM0= <>
##$DBPNAM1= <>
##$DBPNAM2= <>
##$DBPNAM3= <>
##$DBPNAM4= <>
$$ [...]
##$SUBNAM3= <"">
##$SUBNAM4= <"">
##$SUBNAM5= <"">
##$SUBNAM6= <"">
##$SUBNAM7= <"">
##$SUBNAM8= <"">
##$SUBNAM9= <"">
##$SW= 16.9725356469052
##$SWIBOX= (0..15)
0 0 2 0 0 0 0 0 0 0 0 0 0 0 0 0 
##$SW_h= 3396.73913043478
##$TD= 16384
##$TD0= 1
##$TE= 0
##$TE2= 300
##$TE3= 300
##$TEG= 300
##$TL= (0..7)
0 120 120 120 120 120 120 120 
##$TP= (0..7)
150 150 150 150 150 150 150 150 
##$TP07= 0
##$TPNAME0= <>
##$TPNAME1= <>
##$TPNAME2= <>
##$TPNAME3= <>
##$TPNAME4= <>
##$TPNAME5= <>
##$TPNAME6= <>
##$TPNAME7= <>
##$TPOAL= (0..7)
0.5 0.5 0.5 0.5 0.5 0.5 0.5 0.5 
##$TPOFFS= (0..7)
0 0 0 0 0 0 0 0 
##$TUNHIN= 0
##$TUNHOUT= 0
##$TUNXOUT= 0
##$USERA1= <user>
##$USERA2= <user>
##$USERA3= <user>
##$USERA4= <user>
##$USERA5= <user>
##$V9= 5
##$VALIST= <valist>
##$VCLIST= <CCCCCCCCCCCCCCC>
##$VD= 0
##$VDLIST= <DDDDDDDDDDDDDDD>
##$VPLIST= <PPPPPPPPPPPPPPP>
##$VTLIST= <TTTTTTTTTTTTTTT>
##$WBST= 1024
##$WBSW= 4
##$XGAIN= (0..3)
0 0 0 0 
##$XL= 0
##$YL= 0
##$YMAX_a= 546492
##$YMIN_a= -584146
##$ZGOPTNS= <>
##$ZL1= 120
##$ZL2= 120
##$ZL3= 120
##$ZL4= 120
##$ABSF1= 16.03294
##$ABSF2= -0.939724
##$ABSG= 5
##$ABSL= 3
##$ALPHA= 0
##$AQORDER= 0
##$ASSFAC= 0
##$ASSFACI= 0
##$ASSFACX= 0
##$ASSWID= 0
##$AUNMP= <proc_1d>
##$AZFE= 0.1
##$AZFW= 0.1
##$BCFW= 0
##$BC_mod= 2
##$BYTORDP= 0
##$COROFFS= 0
##$CY= -3
##$DATMOD= 1
##$DC= 0
##$DFILT= <>
##$DTYPP= 0
##$F1P= 0
##$F2P= 0
##$FCOR= 1
##$FTSIZE= 16384
##$FT_mod= 6
##$GAMMA= 0
##$GB= 0
##$INTBC= 1
##$INTSCL= 2.992141e-10
##$ISEN= 128
##$LB= 0.24
##$LEV0= 0
##$LPBIN= 0
##$MAXI= 10000
##$MC2= 0
##$MEAN= 0
##$ME_mod= 0
##$MI= 1.114404
##$NCOEF= 0
##$NC_proc= -6
##$NLEV= 6
##$NOISF1= 3.799351
##$NOISF2= 2.8
##$NSP= 0
##$NTH_PI= 0
##$NZP= 0
##$OFFSET= 15.98335
##$PC= 1
##$PHC0= -10554.28
##$PHC1= 8.800949
##$PH_mod= 1
##$PKNL= yes
##$PPARMOD= 0
##$PSCAL= 0
##$PSIGN= 0
##$REVERSE= no
##$SF= 200.130006257508
##$SI= 16384
##$SIGF1= 3
##$SIGF2= 2
##$SINO= 5.538805
##$SIOLD= 16384
##$SREGLST= <1H.CDCl3>
##$SSB= 0
##$STSI= 16384
##$STSR= 0
##$SW_p= 3396.73913043478
##$SYMM= 0
##$S_DEV= 0
##$TDeff= 16384
##$TDoff= 0
##$TI= <>
##$TILT= no
##$TM1= 0
##$TM2= 0
##$TOPLEV= 0
##$USERP1= <user>
##$USERP2= <user>
##$USERP3= <user>
##$USERP4= <user>
##$USERP5= <user>
##$WDW= 1
##$XDIM= 16384
##$YMAX_p= 390227196
##$YMIN_p= -287909
$$ End of Bruker specific parameters
$$ ---------------------------------
##NTUPLES= NMR SPECTRUM
##VAR_NAME=  FREQUENCY,     SPECTRUM/REAL,   SPECTRUM/IMAG
##SYMBOL=    X,             R,               I
##VAR_TYPE=  INDEPENDENT,   DEPENDENT,       DEPENDENT
##VAR_FORM=  AFFN,          ASDF,            ASDF
##VAR_DIM=   16384,         16384,           16384
##UNITS=     HZ,            ARBITRARY UNITS, ARBITRARY UNITS
##FACTOR=    0.207333158178281, 1,           1
##FIRST=     3198.74789551193, 0,            0
##LAST=      -197.991234922853, 0,           0
##MIN=       -197.991234922853, -287909,     0
##MAX=       3198.74789551193, 390227196,    0
$$ Real data points
##PAGE= N=1
##DATA TABLE= (X++(R..R)), XYDATA
$$ [...]
5003C253833r5832p5705M1291j64489l3950r4118r0680Q9909J216P7450o6456
4992B842469k6479L7712j52478j48785M3550l9720L8266M119j4900Q8586j9161
4981B653179j13972K7759m2363K8246J20964q0962l6351K6877r7648j9220r4066
4970B372443q8872K7959o4962l1181q5952n9767J25185m3589j7259n4928M903
4959B083980P7613p2001n1782J45321k1555n7745N3221j01762Q053m5357l3203
4948A984783q3273l0949J14351l0088l5979J97605L577m566N4120j12650k3384
4937B033547J43781k2021N1527K8712J09555P4037p0500Q6165R8427o8865O0557
4926B524922k232P913P2910p0546j6501P953l2256l1082m7862l8691O4895q1513
$$ plain form
5003 3253833 3158001 3082296 3123587 2959098 2925148 2831030 2740350 2830259 2831475 2908925 2842469
4992 2842469 2815990 2853702 2701224 2552439 2595989 2556269 2594535 2598654 2583754 2672340 2653179
4981 2653179 2539207 2566966 2524603 2552849 2673813 2592851 2556500 2583377 2485729 2466509 2372443
4970 2372443 2283571 2311530 2246568 2215387 2129435 2069668 2194853 2151264 2134005 2079077 2083980
4959 2083980 2161593 2089592 2037810 2183131 2161576 2103831 2157052 2055290 2063343 2017986 1984783
4948 1984783 1901510 1870561 1984912 1954824 1918845 2116450 2120027 2115461 2169581 2056931 2033547
4937 2033547 2177328 2155307 2206834 2235546 2345101 2419138 2348638 2434803 2533230 2464365 2524922
4926 2524922 2522690 2530603 2603513 2532967 2516466 2524419 2492163 2461081 2413219 2374528 2439423 2357910
4914B357910J55751k242l1402J87017K8091j00612J30793n7524J7471N4628P7096
4903B816977J00706J15751Q5701J01398j4661P8325m8872q6292L6522l6142o6301
4892C083112L5746j67595j05759o0746r6522o1770r3799L6587P4308l5420k4092
4881B584050o8061j3231J34041p7289m8177J37897M5876K1068R4066L6976J21890
4870B969106M975q499K379J8102J03285K0583o1725O4768n4276Q402n71j36705
4858B929824j11605j5746j36900p9000o6704J20454j6279j35227j5870j09928
4848B363019O7817o370r6534K0767L5558l4890m0921k8552J3746K5974j50767
4837B168847k7285L9929N6560L1257p6128l5321J40064l0564j523n0287j14173
$$ plain form
4914 2357910 2513661 2511419 2480017 2667034 2695125 2594513 2725306 2667782 2685253 2739881 2816977
4903 2816977 2917683 3033434 3119135 3220533 3205872 3284197 3235325 3149033 3185555 3149413 3083112
4892 3083112 3118858 2951263 2845504 2784758 2688236 2626466 2532667 2569254 2643562 2608142 2584050
4881 2584050 2515989 2502758 2636799 2559510 2511333 2649230 2695106 2716174 2810240 2847216 2969106
4870 2969106 2974081 2965582 2967961 2986063 3089348 3109931 3048206 3112974 3058698 3067100 3066529 2929824
4858 2929824 2818219 2802473 2665573 2586573 2519869 2640323 2624044 2488817 2472947 2363019
4848 2363019 2430836 2424466 2327932 2348699 2384257 2349367 2308446 2279894 2293640 2319614 2168847
4837 2168847 2141562 2181491 2238051 2269308 2193180 2157859 2297923 2267359 2265836 2215549 2101376
4826B101376O7270j2882o5849m5430j41614J54834p1023m4213J8351k6329l8268
4815A896223P5864r6909M9856m2615K0866P68L6895r952M3451j18334J2019l6509
4803A831623J5612O6295L0598J9483P8707o3602L486K2353Q565R7601o3396K81
4791B047606J43788k2370N1954K165p5673m2516o2254K7385K6656O2298J69483
4780B328522R2508j43537J0968m6056K2366J1465P0820N9919J09775r938L5140
4769B541952q4256R7644Q810L8190J19575J01535L7605J05385j41065l4140L4892
4758B826127J6052j02160o1721k9920Q1677p1819k4559J0216k7241K2027k9588
4747B609091j38388P1137n7981L0157n7647q39q4420J4626k3227n4930N3299P2093
$$ plain form
4826 2101376 2168646 2155764 2089915 2044485 1902871 2057705 1986682 1942469 1960820 1934491 1896223
4815 1896223 1972087 1875178 1925034 1882419 1903285 1904053 1940948 1930996 1974447 1856113 1868132 1831623
4803 1831623 1847235 1913530 1944128 1963611 2042318 1978716 1982202 2004555 2013120 2110721 2047325 2047606
4791 2047606 2191394 2169024 2220978 2223143 2147470 2104954 2042700 2070085 2096741 2159039 2328522
4780 2328522 2421030 2277493 2288461 2242405 2264771 2276236 2347056 2406975 2516750 2506812 2541952
4769 2541952 2457696 2555340 2564150 2602340 2721915 2823450 2861055 2966440 2825375 2791235 2826127
4758 2826127 2842179 2740019 2678298 2648378 2730055 2658236 2633677 2643893 2616652 2638679 2609091
4747 2609091 2470703 2541840 2483859 2514016 2456369 2455530 2371110 2385736 2362509 2307579 2360878 2432971
4735B432971o3951l8537j7813K9173Q7380j7407k9916R6609r3203K8809j0028
4724B404087K4060N3484O3367q3128M8042l1853j3396j8044k4778M4783r581o0368
4712B396675J73538k9762N8614M2638j9776p9555M6210J19552N3442j45001l5692
4701B580883O7932Q29J16156J2331o2322J00458N1206o9184J29436J2546J04123
4690C044394j5102M5855P8221P4375M2082n5685j38574J55353o1350P309O1858
4679C238736Q8718k2160R6890p9661R8226R948P4502L1307P5371Q5137J93740
4668C890754q8513N8267p8599K12O3372N4861R1759J95655r131J41010j232K9545
4656D347960J59741P6489L2388P6265Q6912J83161J621l3848K3635j3244N5428
$$ plain form
4735 2432971 2369020 2330483 2312670 2341843 2429223 2411816 2381900 2478509 2385306 2414115 2404087
4724 2404087 2428147 2481631 2544998 2461870 2509912 2478059 2464663 2446619 2421841 2466624 2457043 2396675
4712 2396675 2570213 2540451 2599065 2641703 2621927 2542372 2588582 2708134 2761576 2616575 2580883
4701 2580883 2648815 2649644 2765800 2778131 2715809 2816267 2867473 2798289 2927725 2940271 3044394
4690 3044394 3029292 3075147 3153368 3227743 3269825 3214140 3075566 3230919 3169569 3176878 3238736
4679 3238736 3327454 3305294 3402184 3322523 3420749 3430697 3505199 3536506 3611877 3697014 3890754
4668 3890754 3802241 3860508 3781909 3782121 3845493 3900354 3992113 4187768 4178637 4319647 4318415 4347960
4656 4347960 4507701 4584190 4616578 4692843 4779755 4962916 4964537 4930689 4954324 4941080 4996508
4645D996508J48760l1430J73638Q6337O1306J65200K0206K4828J86909q880J48400
4634E971782J27926J33486J19800Q3450J64916K34960J33983K22658Q9785J81134
4624G463880L54643K49794K25073L73962J69564J85863K46765K95302M10357M97347
4614A0472550L13933L14646L56435M88227M19915K51778M43185L11611N21837
4605A3894117O52509P45996R59916J064806Q50020Q60055Q84264J333564J482400
4596B2727647J859676J950478J760377R12936K76238k15379p7072p2361j93816
4587B8928724l21973M2342J67135O56622P52948Q16450O19499M61397N17998O25329
4577C3266471P78786J262555J108260J160166Q07097N36131O46636J081214J481320
$$ plain form
4645 4996508 5145268 5113838 5287476 5373813 5435119 5600319 5620525 5645353 5832262 5823382 5971782
4634 5971782 6099708 6233194 6352994 6436444 6601360 6836320 6970303 7192961 7282746 7463880
4624 7463880 7818523 8068317 8293390 8667352 8836916 9022779 9269544 9564846 9975203 10472550
4614 10472550 10786483 11101129 11457564 11945791 12365706 12617484 13060669 13372280 13894117
4605 13894117 14546626 15292622 16252538 17317344 18167364 19027419 19911683 21245247 22727647
4596 22727647 24587323 26537801 28298178 29211114 29487352 29271973 29194901 29122540 28928724
4587 28928724 28606751 28649093 28816228 29472850 30225798 31042248 31661747 32123144 32641142 33266471
4577 33266471 34045257 35307812 36416072 37576238 38383335 38919466 39566102 40647316 42128636
4568D2128636J873352J949188K208394K333529K635656K792502K363259L14982
4560E8599498j679610k781781k669169k053261j986245j865860j679383j357886
4552D2526303r39082o79510o05046r16460j377114j322704j145362q47941n38011
4543C4155073m66416l85791m86081n65304o24014n21747r5739K70236M09544L89175
4533C2078936K59319R5915J57908k2547p67215j561236k110393k068023j509099
4524B4553565j153720q01396p39348p03100p12411q52363o07172m78447l54586
4515A8151022j40596k52933j02139j18356r1250o9363J06420J13145p2146n2323
4505A7471481K19160L1731K42565K73605J35403P4022J87102m2889L028J37111
$$ plain form
4568 42128636 44001988 45951176 48159570 50493099 53128755 55921257 58284516 58599498
4560 58599498 56919888 54138107 51468938 49415677 47429432 45563572 43884189 42526303
4552 42526303 41587221 40907711 40302665 39386205 38009091 36686387 35541025 34693084 34155073
4543 34155073 33688657 33302866 32816785 32251481 31627467 31105720 31009981 31280217 31689761 32078936
4533 32078936 32338255 32434170 32592078 32569531 31802316 30241080 28130687 26062664 24553565
4524 24553565 23399845 22598449 21859101 21156001 20443590 19591227 18984055 18505608 18151022
4515 18151022 18010426 17757493 17655354 17536998 17445748 17376385 17482805 17595950 17523804 17471481
4505 17471481 17690641 17722372 17964937 18238542 18373945 18447967 18635069 18592180 18595208 18732319
4495A8732319K545K9130K62053J06437L25206L03613L77253L64500N32126O24155
4485B1659337O44962O69980P72021N40725O58049N95031M96540L35446M28904
4476B6800995K09744n7169k83187l68519o44941p15818q05791q63431q61245q48334
4466B1562304j029962r13639p58193r07528p83069p30295p09207m57479m80768
4457A4792164m04849l80899k70143k71698l21767k42203k15576j34289l1744j52144
4447A2366852k57195j62642m1833m6112q1518p0430j09219K979j02204N5386l7615
4436A1516449j09690k32631k35171m7405j52316k61412j62598l25320k68718k55558
4426I465630k97700k96967k12266k49997k95737j76376o6139j60646j37658j55597
$$ plain form
4495 18732319 18734864 18763994 19026047 19132484 19457690 19761303 20138556 20503056 21035182 21659337
4485 21659337 22304299 22974279 23746300 24287025 24945074 25540105 26036645 26372091 26800995
4476 26800995 27010739 26953570 26670383 26301864 25656923 24941105 24135314 23271883 22410638 21562304
4466 21562304 20532342 19618703 18860510 17952982 17169913 16439618 15730411 15272932 14792164
4457 14792164 14387315 14006416 13736273 13464575 13142808 12900605 12685029 12550740 12518996 12366852
4447 12366852 12109657 11947015 11905182 11859070 11777552 11707122 11597903 11600882 11498678 11554064 11516449
4436 11516449 11406759 11174128 10938957 10891552 10739236 10477824 10315226 9989906 9721188 9465630
4426 9465630 9167930 8870963 8658697 8408700 8112963 7936587 7870448 7709802 7572144 7416547
4416G416547k07875j28795p9816j85789p0020o6132j52037j57154o861j64081
4406F197987r7856j04963m0266j21905o0145J7193q833k00864j3709r0851n9325
4395E416463p1114r9578o5425L1521O788o8444n8951L6079j16606O0154l2563
4384E038324n4888l5554L5251J5540j7682J0617o5916r7704k2518L4285L5140
4373D874895n3359l3743o5803o6460j0420n1515k7993L0434L87o6497r5979P984
4361D441931N3550l8247j24391j01517q5222j3142J8906M663K2706n8602r8731
4350D021904n9703p6645k148N93q8172k5325n6495Q8601k9593j10787p1322L1247
4338C622155l9156m848M6815J11389j7429M0787j19485j11263P8896l0443k5457
$$ plain form
4416 7416547 7208672 7079877 7000061 6814272 6744252 6678120 6526083 6368929 6362068 6197987
4406 6197987 6100131 5995168 5954902 5832997 5772852 5790045 5781212 5580348 5566639 5475788 5416463
4395 5416463 5345349 5245771 5180346 5211867 5218655 5150211 5091260 5127339 5010733 5070887 5038324
4384 5038324 4983436 4947882 4983133 4998673 4980991 4991608 4925692 4827988 4805470 4839755 4874895
4373 4874895 4821536 4787793 4721990 4655530 4645110 4593595 4565602 4596036 4596423 4529926 4433947 4441931
4361 4441931 4495481 4457234 4332843 4231326 4146104 4132962 4151868 4156531 4179237 4120635 4021904
4350 4021904 3962201 3885556 3883408 3884001 3795829 3770504 3714009 3802610 3773017 3662230 3590908 3622155
4338 3622155 3582999 3578151 3624966 3736355 3718926 3759713 3640228 3528965 3607861 3577418 3551961
4327C551961q0186l6471K7668n6361j9157l1371O1652N4532m9112R681K1485N7072
4315C511393m1791m5924r703r7648O2765l7864K3031N329N1785k9663J3752m1613
4303C363849R344K1478R3170k4526M5398J01670K8734J4887N0912r8563o4827
4292C541526P701P765K6663Q4040K2870j0140o3790N035K1495j5963N8581l1738
4280C654045r5074R8245l1724n4037N5554j42919n6214J3814J3440R2648J10935
4269C658713l1942J4633K2112J10298n4311o1269J34868N9062p6818O4753L9936
4258C880035N82M9228r9338k6056J53135J19648p240M2701J18849J14365M457
4247D350366J33008R5850L868J64264Q3732M2033K03746J48835J21978K24922
$$ plain form
4327 3551961 3471775 3435304 3462972 3406611 3387454 3356083 3417735 3472267 3423155 3432836 3454321 3511393
4315 3511393 3469602 3423678 3413975 3316327 3379092 3341228 3364259 3369588 3421373 3391710 3405462 3363849
4303 3363849 3373193 3394671 3487841 3463315 3508713 3610383 3639117 3654004 3704916 3606353 3541526
4292 3541526 3549227 3556992 3583655 3667695 3690565 3680425 3616635 3621670 3643165 3627202 3685783 3654045
4280 3654045 3558971 3657216 3625492 3571455 3627009 3484090 3427876 3441690 3455130 3547778 3658713
4269 3658713 3626771 3641404 3663516 3773814 3719503 3658234 3793102 3852164 3775346 3840099 3880035
4258 3880035 3880617 3929845 3830507 3804451 3957586 4077234 4069994 4112695 4231544 4345909 4350366
4247 4350366 4483374 4579224 4583092 4747356 4831088 4873121 5076867 5225702 5347680 5572602
4237E572602J80381K91936K19838J85406J62965R1822J52564Q8444m1287J38243
4227G042914L4897m8366Q5320P895l4317j4985j24316j45703p5217r1393j14115
4216F522614m1223k6493n7352j27332j5722r8711j57164J708k2570q5619K8245
4205E920381p7507j82992q9544j28026m9275N8970M8895m5645J13674J38384J18804
4194E826119O6157Q538o8214j59355q2436j33230j21905J7485m1053j14375N9528
4183E257259M210J9385R370N2773P7250Q2675J68946N4582J1678o8829j10920
4172E558379j04838K522J322Q89J14025k5684j42674J06138R92p8514J8761k6941
4160E424377N1376j2833J4031n150m3127j51127o1424m3693J8244Q792o0940J1329
$$ plain form
4237 5572602 5752983 6044919 6264757 6450163 6613128 6704950 6857514 6945958 6904671 7042914
4227 7042914 7077811 7029445 7114765 7122660 7088343 7073358 6949042 6803339 6728122 6636729 6522614
4216 6522614 6481391 6454898 6397546 6270214 6254492 6155781 5998617 6000325 5977755 5892136 5920381
4205 5920381 5842874 5659882 5570338 5442312 5393037 5452007 5500902 5455257 5568931 5707315 5826119
4194 5826119 5892276 5900814 5832600 5673245 5590809 5457579 5335674 5353159 5312106 5197731 5257259
4183 5257259 5261469 5280854 5290224 5342997 5420247 5502922 5671868 5726450 5738128 5669299 5558379
4172 5558379 5453541 5456063 5457385 5458274 5572299 5546615 5403941 5510079 5511071 5432557 5451318 5424377
4160 5424377 5475753 5462920 5476951 5471801 5428674 5277547 5216123 5172430 5190674 5199466 5138526 5149855
4148E149855l568k23197p8831j80448j60823r9923Q575q4150j83291r0741j20828
4137C932630k66638n0143k9459k6553K5144k3898n2928p29L0731O653k0045K5557
4125C550322m4987j4463N2744k0761k8099M991k1415j17116O3873N8284r9877
4114C383496J7179Q3085k7542O0998J25567K2175q3100L2572n3372o0156l3441
4103C467461K8949j04092p9012j3283q685n9666P0109l053L7848K8227N0139M7630
4091C462572K039K921M5847k2679R7699J6518O625K7084J4365m865N7162r72L0279
4078C734595N2026P6066J29325J26534J1060m4232k0445m7903k5492l8213j2342
4067C940979N2742M3556K14m1006L4662Q0746K8684K938J0209r95J64005R0770
$$ plain form
4148 5149855 5146287 4923090 4844259 4663811 4502988 4403065 4411640 4327490 4144199 4053458 3932630
4137 3932630 3665992 3615849 3586390 3559837 3584981 3561083 3508155 3507426 3538157 3544810 3524765 3550322
4125 3550322 3505335 3490872 3543616 3522855 3494756 3499747 3478332 3361216 3425089 3483373 3383496
4114 3383496 3400675 3483760 3456218 3517216 3642783 3664958 3581858 3614430 3561058 3500902 3467461
4103 3467461 3496410 3392318 3313306 3300023 3291338 3231672 3301781 3298728 3336576 3364803 3414942 3462572
4091 3462572 3464611 3467532 3513379 3490700 3588399 3604917 3611542 3638626 3652991 3648126 3705288 3704316 3734595
4078 3734595 3786621 3862687 3992012 4118546 4129606 4085374 4064929 4017026 3991534 3953321 3940979
4067 3940979 3993721 4037277 4037491 3996485 4031147 4111893 4140577 4143515 4153724 4152729 4316734 4407504
4055D407504n3312q6516q0946O1052O6334j2219J14234M8306L5073M9330j11561
4044D437279N3860M0777l8335R6570J12169Q5159N4635o2948o5454j4253n7721
4033D641738M8181P6881J00807R2313J2922K9244J38380Q6095j0929M9022J00817
4022E365471Q8309J21568J11986K9288j069J39290R0252J0350J13462K9238J62675
4011F260820J58016J51335J31592K76181L03616J77831J15320L89281K51203K30691
4001H445886M15010M13339L98035N64625L93417L32312L07698K51823K7508J39344
3991A1688997M8133l5445j88358L2132K1190m1885K25064M0447M1049L18883K45933
3980A2396140J90762J95223J05978o9506r9691l6530k31137k48150j57786k83415
$$ plain form
4055 4407504 4354192 4267676 4186730 4247782 4314116 4301897 4416131 4464437 4499510 4548840 4437279
4044 4437279 4491139 4531916 4493581 4590151 4702320 4787479 4842114 4779166 4713712 4699459 4641738
4033 4641738 4689919 4766800 4867607 4959920 4972842 5002086 5140466 5226561 5215632 5264654 5365471
4022 5365471 5453780 5575348 5687334 5716622 5715553 5854843 5945095 5955445 6068907 6098145 6260820
4011 6260820 6418836 6570171 6701763 6977944 7281560 7459391 7574711 7963992 8215195 8445886
4001 8445886 8860896 9274235 9672270 10236895 10630312 10962624 11270322 11522145 11549653 11688997
3991 11688997 11737130 11701685 11513327 11545459 11566649 11524764 11749828 11790275 11831324 12150207 12396140
3980 12396140 12586902 12782125 12888103 12818597 12718906 12682376 12451239 12203089 12045303 11761888
3970A1761888k20565n6615p8341p0924O6605Q6076M7136K37431K00179K60685
3960A2233555L99342M92582N81294O17709P51050P63997P84874P70840N69678
3951A7964921N37658N75479L35121K78519K04931J43602P0246O4160J38618J45783
3941B0459038K29272K66247J55274M6453j29199k23480m50106p18766q14341r15134
3931A7905258p97631q56786o44712n22372m24582l48276k71575k68196q5588m778
3921A3680762J02050R6160K79615K19396L55997M49513N15242L59611L09556K02739
3911A6570641J24804N4155R2943j50173r1193k13649l39299l22888m11547m42153
3901A4871641m24521o03669n88012o33181l97806l74452m21258l42063l16856
$$ plain form
3970 11761888 11541323 11484708 11406367 11335443 11402048 11488124 11535260 11772691 11972870 12233555
3960 12233555 12632897 13125479 13706773 14324482 15075532 15839529 16624403 17395243 17964921
3951 17964921 18502579 19078058 19413179 19691698 19896629 20040231 20110477 20174637 20313255 20459038
3941 20459038 20688310 20954557 21109831 21156284 21027085 20803605 20353499 19634733 18820392 17905258
3931 17905258 17107627 16250841 15606129 15083757 14659175 14310899 14039324 13771128 13685540 13680762
3921 13680762 13782812 13878972 14158587 14377983 14733980 15183493 15698735 16058346 16367902 16570641
3911 16570641 16695445 16749600 16842543 16692370 16601177 16387528 16048229 15725341 15313794 14871641
3901 14871641 14447120 13843451 13255439 12622258 12224452 11850000 11428742 11086679 10769823
3892A0769823l09830j72844r1223j54389p1926l6730j52103p6728K6955o4190
3882I666815J5017j2461P4548L0840J20753P0995Q0685Q5894K22896K23395K31539
3871A0810916K65091K86758K53149K66094K35854K65937L51419L88536M07494
3862A3531248M22739L88962M10987L83389N25690N61355O76106Q45646Q92536
3853A8638658J004467J159031J410442J628012J746280K253915K500319K806834
3845C3147958L054862L038679K316931J092605p60551k490184l236569l106147
3837C3057584k835032k440905k001579j702587j596164j335634j209801j173929
3829A8761953j000698q38632p90881n46050n73227m54262m65399m08255k57703
$$ plain form
3892 10769823 10459993 10287149 10195926 10041537 9969611 9932881 9780778 9704050 9731005 9666815
3882 9666815 9681832 9669371 9743919 9774759 9895512 9966507 10047192 10133086 10355982 10579377 10810916
3871 10810916 11076007 11362765 11615914 11882008 12117862 12383799 12735218 13123754 13531248
3862 13531248 13953987 14342949 14753936 15137325 15663015 16224370 16900476 17746122 18638658
3853 18638658 19643125 20802156 22212598 23840610 25586890 27840805 30341124 33147958
3845 33147958 36202820 39241499 41558430 42651035 41890484 39400300 36163731 33057584
3837 33057584 30222552 27781647 25780068 24077481 22481317 21145683 19935882 18761953
3829 18761953 17761255 16922623 16131742 15585692 15012465 14558203 14092804 13684549 13426846
3820A3426846k36570k53322j71109k55681k16389j01901k39241j94757p9932j70799
3810A1507145k09881j78323p3193K1241J5288j4983M5422r5282R3501j65q0911
3799A1029859J26078K7757k5595p134O1443J00724M7765R4198P7247q414J58026
3788A1681954K37189J21657J08088J81947o2633j4761n7752j10972j38711l8499
3778A1907507k2268j7977j43107N0902j39808j9436O0717k0335j02736l4911j46295
3767A1372253p334j20226m102k9099q3407K1561M4995K0357Q1633p037j3830J24267
3755A1400031J46935P9675J51992K9036L1216J90498J35798J73781K32209L13482
3745A2884653L34641M06172N77311N84633O01060L44668j16586l61011m61745
$$ plain form
3820 13426846 13190276 12936954 12765845 12510164 12293775 12191874 11952633 11757876 11677944 11507145
3810 11507145 11297264 11118941 11045748 11066989 11082277 11067294 11112716 11017434 11110935 11110770 11029859
3799 11029859 11155937 11183694 11158099 11150965 11212408 11313132 11360897 11455095 11532342 11523928 11681954
3788 11681954 11919143 12040800 12148888 12330835 12268202 12253441 12195689 12084717 11946006 11907507
3778 11907507 11885239 11867262 11724155 11775057 11635249 11615813 11676530 11656195 11553459 11518548 11372253
3767 11372253 11364919 11244693 11240591 11211492 11128085 11149646 11194641 11214998 11296631 11289594 11275764 11400031
3755 11400031 11546966 11626641 11778633 11807669 11838885 12029383 12165181 12338962 12571171 12884653
3745 12884653 13219294 13625466 14202777 14787410 15388470 15733138 15616552 15255541 14793796
3736A4793796l36869j44491k43037o1287q834J6817L5161N1880N7251O8520R8856
3725A4327763Q9380J03269J01599N8665P0508P6638J60705J57064P5125J02479
3715A5323195j8468Q2137K55849R1870J40702K13943L17051L05730K54806N40420
3705A7507235M07786M99732M97587L50789M55579L78171L13924L37076K35579
3696B0983458K97169K11391L59756K44078L40842L80726M77505M62278O10636
3687B4367839Q36129R69662J003984J275338J242341J262557J133843J048418
3679C3140111R62314P34291M41065N4569n10421p19099r82841j101743r89757
3670C1028489r62211q72719o85998n50987k94196j96528j17070R7168J21398L10575
$$ plain form
3736 14793796 14456927 14312436 14069399 14008112 13999278 14016095 14051256 14103136 14160387 14228907 14327763
3725 14327763 14417143 14520412 14622011 14680676 14751184 14827822 14988527 15145591 15220716 15323195
3715 15323195 15304727 15386864 15642713 15734583 15875285 16089228 16406279 16712009 16966815 17507235
3705 17507235 17915021 18414753 18912340 19263129 19718708 20096879 20410803 20747879 20983458
3696 20983458 21280627 21492018 21851774 22095852 22436694 22817420 23294925 23757203 24367839
3687 24367839 25203968 26173630 27177614 28452952 29695293 30957850 32091693 33140111
3679 33140111 34102425 34836716 35277781 35332350 34821929 34102830 33119989 32018246 31028489
3670 31028489 30066278 29193559 28507561 27956574 27662378 27465850 27348780 27445948 27567346 27877921
3660B7877921N10061N08594N96867P31146P32377R90400J020686J107887J316874
3651C5392813J325498J642856J622080J694628K015024J950728K009900K117788
3643D9771315K003292K049093J958901J800284J600662J299776J057939P19079
3635F2260341J76929n4893n54596j193230j505976k176948k524840k664498k908072
3626D8854217k947630k893806k801693k580100k426270k096547j881119j830622
3618B9396430j403001j262160j111071q22283r52738q30902o32062o89891n72699
3609B1119623m87681n28307m13571l76583l08159k84021m33618k20052k30200
3600A7837431l29993j00882k34312k19480j64477k43357j31809j73650k54889
$$ plain form
3660 27877921 28387982 28896576 29493443 30224589 30956966 31947366 32968052 34075939 35392813
3651 35392813 36718311 38361167 39983247 41677875 43692899 45643627 47653527 49771315
3643 49771315 51774607 53823700 55782601 57582885 59183547 60483323 61541262 62260341
3635 62260341 62437270 62382377 61827781 60634551 59128575 56951627 54426787 51762289 48854217
3626 48854217 45906587 43012781 40211088 37630988 35204718 33108171 31227052 29396430
3618 29396430 27993429 26731269 25620198 24797915 23845177 23014275 22382213 21692322 21119623
3609 21119623 20631942 20103635 19690064 19313481 19005322 18721301 18287683 18067631 17837431
3600 17837431 17507438 17406556 17172244 16952764 16788287 16544930 16413121 16239471 15984582
3591A5984582j43682l33336j38482k10290k33982r5169p2287k36957R8850j2013
3581A4607234n0641r9009j39885q8130k8039m7995M3088j02146j46635p026j60716
3570A3780100j29286o6964l37328j22052j47894j81836o5800j28864n3091j09443
3560A2437542q7538n1530r2342j6627J06343l1334k4218L6748m0700k5913j03185
3549A2107246j60773L7514p9367l9937R147o8033J16505o3816q1770q624j23949
3538A1644143j2812j01867j08898L6532j4157k0828r8304q8888J640p5933r4630
3527A1065998o4260l8419j2862P2977O4242m0351J5238J59n1634l3515Q8275J98993
3515A1264841m7069L3828Q8183K9371P8451O2151l7415P139p5128Q6080p2590
$$ plain form
3591 15984582 15840900 15507564 15369082 15158792 14924810 14829641 14757354 14520397 14619247 14607234
3581 14607234 14556593 14457584 14317699 14229569 14201530 14153535 14196623 14094477 13947842 13940816 13780100
3570 13780100 13650814 13583850 13246522 13124470 12976576 12794740 12728940 12600076 12546985 12437542
3560 12437542 12350004 12298474 12206132 12189505 12295848 12264514 12240296 12277044 12236344 12210431 12107246
3549 12107246 11946473 11983987 11904620 11864683 11873830 11805797 11922302 11858486 11776716 11768092 11644143
3538 11644143 11631331 11529464 11420566 11457098 11442941 11422113 11323809 11234921 11236561 11160628 11065998
3527 11065998 11001738 10963319 10950457 11023434 11087676 11047325 11062563 11062722 11011088 10977573 11065848 11264841
3515 11264841 11217772 11251600 11339783 11369154 11447605 11509756 11472341 11479480 11404352 11490432 11417842
3504A1417842j2899m4581r4911J06249R8500j3016J14132l8059r4065l1893Q1752
3493A1489051J466R8271J65376Q9060L2426M047P1470J25302O4049J20165J01767
3482A2362450J88382K36944K20328K21367J22270J41587J89794L45994K21664
3473A4250780K40806L69187J93296K34217L27664L45481L72798N12128N14642
3464A7360999M96480N23911N51711O32750O49893P26743Q62435R59965R81254
3455B3746141J115711J183645J388134J556843J942358K261393K525471K707520
3447C8427216K566565J951882P82881n46474j573778k327274k455156k156652
3439C4669210j877614j409960j205562r58507p21953m59922k76945p2108J51889
$$ plain form
3504 11417842 11404943 11360362 11265451 11371700 11470200 11457184 11571316 11533257 11439192 11407299 11489051
3493 11489051 11490517 11588788 11754164 11843224 11875650 11879697 11951167 12076469 12140518 12260683 12362450
3482 12362450 12550832 12787776 13008104 13229471 13351741 13493328 13683122 14029116 14250780
3473 14250780 14491586 14860773 15054069 15288286 15615950 15961431 16334229 16846357 17360999
3464 17360999 17857479 18381390 18933101 19565851 20215744 20942487 21804922 22764887 23746141
3455 23746141 24861852 26045497 27433631 28990474 30932832 33194225 35719696 38427216
3447 38427216 40993781 42945663 43728544 43182070 41608292 39281018 36825862 34669210
3439 34669210 32791596 31381636 30176074 29217567 28495614 28035692 27758747 27686639 27838528
3430B7838528K82623M50081N43338O26524P89829P05412P17944O05254N59855
3421C3119388N53487M78539O19173N09399M66729N29564M41326O86974Q09967
3412C8214546Q34714J109977J194428J524082J809107K135931K539538L167446
3404E2529769L655498M201484M364350L956953K953181J187741r48813k950241
3396F8949922m368831m559793m452583l985220l354220k926593k628215k169204
3388D0505263k002484j708465j500656j197924r99538r02553p40984n99668n01966
3379C0351025k41559k52657k67120k98434m48174n67802o00639n36435n99065
3370B6539140n34433m86347l99888m34513k99157k17619l57322j12865j74047
$$ plain form
3430 27838528 28121151 28571232 29114570 29741094 30530923 31236335 31954279 32559533 33119388
3421 33119388 33672875 34151414 34770587 35279986 35746715 36276279 36717605 37404579 38214546
3412 38214546 39049260 40159237 41353665 42877747 44686854 46822785 49362323 52529769
3404 52529769 56185267 60386751 64751101 68708054 71661235 72848976 71900163 68949922
3396 68949922 64581091 60021298 55568715 51583495 48229275 45302682 42674467 40505263
3388 40505263 38502779 36794314 35293658 34095734 33096196 32193643 31452659 30852991 30351025
3379 30351025 30109466 29856809 29589689 29291255 28843081 28275279 27674640 27138205 26539140
3370 26539140 26004707 25518360 25118472 24683959 24384802 24167183 23809861 23696996 23522949
3361B3522949k31258k6500o6705o7634O831P5139J30050M4901J09946J75770K3211
3350B3696700J77559J32722J35458K42101L48263L58928N28216P18992P03520
3341B7042459P86218Q21167Q40562Q82659P95178P79891N23419N09346K21824
3332C3202723k24276n18637q08739j031697r05237q06225n86918n16975k94680
3323B7509339j79175j91276K6780l69O3119J65877L0776J6242P0113Q7978L1705
3312B7631109O2714J32197J83155J55722L40838L63383L87309M44042O10776O41729
3302C0952974Q49017R47272J084167J183265J306432J138372Q97583O66071N31058
3293C9556211J72443K08127O6664j57679k52878l31893l80843k78141j06332R9465
$$ plain form
3361 23522949 23291691 23265191 23198486 23130852 23137683 23212822 23342872 23387773 23497719 23673489 23696700
3350 23696700 23874259 24006981 24142439 24384540 24732803 25091731 25619947 26338939 27042459
3341 27042459 27828677 28649844 29490406 30373065 31168243 31948134 32471553 32980899 33202723
3332 33202723 32978447 32459810 31651071 30619374 29714137 28907912 28320994 27804019 27509339
3323 27509339 27330164 27138888 27165668 27165299 27228418 27394295 27425071 27441313 27511426 27599404 27631109
3312 27631109 27693823 27826020 28009175 28164897 28505735 28869118 29256427 29700469 30311245 30952974
3302 30952974 31801991 32749263 33833430 35016695 36323127 37461499 38359082 39025153 39556211
3293 39556211 39728654 39936781 40003445 39845766 39592888 39260995 38880152 38602011 38495679 38595144
3283C8595144K08763K18074M48909M95470O71938Q41064Q28153J044805J215061
3274D4567381J137747J561262J825296K070424K275784K572691L007560L420875
3266F2439020L967301M485032M622220M982510M682179M191124M066777M265412
3258I7701575M943716O343829P736613R340540J1057691J2901613J4093779J3417977
3250A77537333R398891J537964p846967j4163538j5731433j4050382j1256142
3243A25425726r111390q133690p431730p367047o960483o384949n777129m941546
3235F9317762m505253m099540l504605l278554k668123k242397j936955j501351
3227D5580984j386621j251629j000710r55544q34393o24663m81670l41585j96530
$$ plain form
3283 38595144 38803907 39021981 39470890 39966360 40638298 41479362 42307515 43352320 44567381
3274 44567381 45705128 47266390 49091686 51162110 53437894 56010585 59018145 62439020
3266 62439020 66406321 70891353 75513573 80496083 85178262 89369386 93436163 97701575
3258 97701575 102645291 108989120 116725733 126066273 137123964 150025577 164119356 177537333
3250 177537333 186936224 188474188 180627221 166463683 150732250 136681868 125425726
3243 125425726 116314336 108180646 100748916 93381869 86421386 80036437 74259308 69317762
3235 69317762 64812509 60712969 57208364 53929810 51261687 49019290 47082335 45580984
3227 45580984 44194363 42942734 41942024 40986480 40152087 39527424 39045754 38704169 38507639
3218C8507639j21276J09891J10605L56140N43886N58096Q69514Q82480O65075
3209D2482050O89804L48759J21734P0172O1484L48943O54110R02176Q67418J52157
3199D6698807n54781j262166j794538j475785j243644j110798r00860j091473
3191C7264762j529268j594504j742750j564957j532235j289117j142331j042544
3183B5827056q62113o97753q25644m72569m56201m90263k52661j31865j81025
3174B1456962k1365l5111J54812R9411L06129L04642K34605K29857J14879l45038
3164B2499783m20356o14743p47463o13057n47542m33434k22994l05972j67787
3155A8426435j00241L8800J67062P7072J82168O9181k84595l17219n25666o83886
$$ plain form
3218 38507639 38386363 38496254 38606859 38962999 39506885 40064981 40934495 41816975 42482050
3209 42482050 43171854 43520613 43642347 43712519 43774003 44122946 44777056 45679232 46546650 46698807
3199 46698807 46144026 44881860 43087322 41611537 40367893 39257095 38356235 37264762
3191 37264762 35735494 34140990 32398240 30833283 29301048 28011931 26869600 25827056
3183 25827056 24964943 24267190 23441546 22968977 22512776 22022513 21769852 21637987 21456962
3174 21456962 21435597 21400486 21555298 21654709 21960838 22265480 22500085 22729942 22844821 22499783
3164 22499783 22079427 21464684 20717221 20104164 19556622 19123188 18900194 18594222 18426435
3155 18426435 18326194 18364994 18532056 18609128 18791296 18860477 18575882 18258663 17732997 17049111
3145A7049111n40275m84069l97692l52532m45519l99439l58162k78757j72495
3136A3620171k21416j89215j32661j92281j40512j03328j42434o9440j67841n985
3126A2255058r043q7029l0999l5851k8475L1271m3308N219N0781j08575j41237
3115A1857812k93266k41901j79586j90707j05050j60021j96886o8625q5596q2949
3105A0253225O9795n6817k5156m1844p490l7009K1842j18852n9048j71183j03555
3094I723908j42323j35855n6461j52568j37880m6509j21909K0679o3944n2004
3084H835134k651j6060l3135L9936j07749j6745j21214l8347o1647n1154j20436
3073H305932m2193j49407l5034n1370l2731q1697J5713r2068n3223j93873n5857
$$ plain form
3145 17049111 16508836 16024767 15627075 15274543 14829024 14429585 14071423 13792666 13620171
3136 13620171 13398755 13209540 13076879 12884598 12744086 12640758 12498324 12428884 12261043 12255058
3126 12255058 12246015 12158986 12127987 12092136 12063661 12094932 12051624 12056843 12107624 11999049 11857812
3115 11857812 11564546 11322645 11143059 10952352 10847302 10687281 10490395 10421770 10336174 10253225
3105 10253225 10323020 10266203 10241047 10199203 10191713 10154704 10176546 10057694 9998646 9827463 9723908
3094 9723908 9581585 9445730 9389269 9236701 9098821 9052312 8930403 8951082 8887138 8835134
3084 8835134 8832483 8816423 8783288 8823224 8715475 8698730 8577516 8539169 8477522 8426368 8305932
3073 8305932 8263739 8114332 8079298 8027928 7995197 7913500 7929213 7837145 7783922 7590049 7534192
3062G534192p1700J8481k1900n1296L9466m4920J8540K3734o7482N6908J13273
3051G547296j0688K7951J1855j2350j20499r0044k7577q7728m9566P0261m8102
3040G210809n7963o3688l8973j08063N8039N065O4325P7288R7738k8629l886l8018
3028G174044q6207j08720j030j62066n3120N8162j9928p2851k3082m3703k55L9631
3016F700875J15007K1981l1150m9163q0947j2510q06j38952o7763n0150m6006
3005F360416n8434n485q4692m9401o795J9513j1575K5157K5476K1473j32807P979
2993F110825q5340m8893j2154m5413k1548J491r8943m4418o9234Q9698k8376q661
2981E739034l7993N0359K5996M1242j002k1552k6906J6201k8279N2257K630j7450
$$ plain form
3062 7534192 7462492 7480973 7459073 7407777 7447243 7402323 7420863 7444597 7377115 7434023 7547296
3051 7547296 7536608 7564559 7576414 7564064 7443565 7353521 7325944 7238216 7188650 7258911 7210809
3040 7210809 7152846 7089158 7050185 6942122 7000161 7005226 7069551 7146839 7244577 7215948 7212062 7174044
3028 7174044 7087837 6979117 6978087 6816021 6762901 6821063 6801135 6728284 6705202 6661499 6661244 6700875
3016 6700875 6815882 6837863 6806713 6757550 6676603 6664093 6663287 6524335 6456572 6406422 6360416
3005 6360416 6301982 6296497 6211805 6162404 6155609 6175122 6163547 6188704 6214180 6235653 6102846 6110825
2993 6110825 6025485 5976592 5964438 5919025 5897477 5898968 5800025 5755607 5686373 5776071 5747695 5739034
2981 5739034 5701041 5751400 5777396 5818638 5817636 5796084 5769178 5785379 5757100 5809357 5811987 5794537
2969E794537M8968R8524P2142J9037J12039O7877N0594J16143J13900N0226J12216
2958F656203J30430J29344N0709J36531Q4763Q2711J03431L0535N9269M2860m8757
2947G458029k2152q1218m6911o4703n2784L9735M3850N3057R9860k2266P3937
2936G478434j5898J1543N0041J34235J41306K01843Q2692J38940J95710K11839
2926H630685J14661J37326J08950J29775J03851K31671J59292K08343L30804L18172
2916A0473530L49415M51463M70545M19769M13564L25732J93654L4637k233r5761
2906A3034315l09144k80294k57312k73911k23009j71283j87466k1891K3790Q4358
2896A1418153N9181J02957J94102J76899K57782M08165L54915M98739N24969P30742
$$ plain form
2969 5794537 5843505 5942029 6014171 6033208 6145247 6213124 6263718 6379861 6493761 6543987 6656203
2958 6656203 6786633 6915977 6966686 7103217 7187980 7270691 7374122 7404657 7463926 7506786 7458029
2947 7458029 7435877 7354659 7307748 7243045 7190261 7229996 7273846 7326903 7426763 7404497 7478434
2936 7478434 7462536 7474079 7524120 7658355 7799661 8001504 8084196 8223136 8418846 8630685
2926 8630685 8745346 8882672 8991622 9121397 9225248 9456919 9616211 9824554 10155358 10473530
2916 10473530 10822945 11274408 11744953 12164722 12578286 12904018 13097672 13132309 13130076 13034315
2906 13034315 12725171 12444877 12187565 11913654 11690645 11519362 11331896 11310005 11333795 11418153
2896 11418153 11477334 11580291 11774393 11951292 12209074 12617239 12972154 13470893 13995862 14726604
2886A4726604P97276Q61882R81255Q58281P32540N76941L10391J01704r4430l25809
2876A9526635o08502o37642o79848p94059p08544o85922n86546l77236k45599
2867A4202737j69052k31775J8979M4134P5045K60714K42159K86452L51638L30516
2857A5411547L10417J28735J47943Q0118j28756j6815p3744n8324M5654Q4747
2847A5931522J49129K53931K78283J56458J51888J12998O388l7620q7352r5263
2837A6820362l43449k52783j67863j85173K6088J14154J28047K49709Q7948K01343
2827A6678383J95790J19343K28542O2899R6519J30242O3833J65448J30180L1831
2817A7903010N1687q3675j58043k19443k76221l41456l48016l20672k30050k20333
$$ plain form
2886 14726604 15523880 16385762 17367017 18225298 18957838 19534779 19845170 19946874 19852444 19526635
2876 19526635 18918133 18280491 17600643 16806584 16098040 15412118 14825572 14448336 14202737
2867 14202737 14033685 13801910 13820889 13865023 13940068 14200782 14442941 14729393 15081031 15411547
2857 15411547 15721964 15850699 15998642 16078760 15950004 15933189 15859445 15801121 15846775 15931522
2847 15931522 16080651 16334582 16612865 16769323 16921211 17034209 17040597 17002977 16915625 16820362
2837 16820362 16476913 16224130 16056267 15871094 15897182 16011336 16139383 16389092 16477040 16678383
2827 16678383 16874173 16993516 17222058 17284957 17381476 17511718 17575551 17740999 17871179 17903010
2817 17903010 17954697 17871022 17712979 17493536 17217315 16875859 16527843 16207171 15977121 15756788
2807A5756788k37838M4465k01461M7944O4451M9385J70197K12673L18494M39682
2797A6664780L30842N04690K67950L27151M05407K77389M46886N08728M71608
2788B0205431M39738N28274M78365M67056N34376N54374O37153M50671N76824
2779B4872262M78868M23766N73500M66651L37521O25589N48375P28699Q12307
2770B9867538P91594Q41264Q15424J028305J250545J435392J993853K249332K043993
2761D2317240J361269L51909m33254o46761p81297p94200n32241j89656L59963
2752D1012972P82648J286175J474150J359674J407917J182994N65724M01884j5095
2743D9459043k89437j08581j12215l2155K21446N19661P18233Q75592J527405
$$ plain form
2807 15756788 15518950 15563415 15361954 15409898 15474349 15523734 15693931 15906604 16225098 16664780
2797 16664780 16995622 17500312 17768262 18095413 18500820 18778209 19225095 19733823 20205431
2788 20205431 20645169 21173443 21651808 22118864 22653240 23207614 23844767 24295438 24872262
2779 24872262 25351130 25774896 26348396 26815047 27152568 27778157 28326532 29055231 29867538
2770 29867538 30659132 31500396 32315820 33344125 34594670 36030062 38023915 40273247 42317240
2761 42317240 43678509 44030418 43597164 42950403 42169106 41374906 40842665 40653009 41012972
2752 41012972 41795620 43081795 44555945 45915619 47323536 48506530 49072254 49474138 49459043
2743 49459043 49169606 49061025 48948810 48916655 49138101 49657762 50375995 51251587 52778992
2734E2778992K304661L124414L861687L985928K999818M15279k823848m818789
2726F1828142m794944l807436k846932j866345j222263p40201o55084o45609n70948
2717D4678380m41045p3263n7644m13517l98262q51528j361604j632388j760905
2708C7688224j732574j480701j090541o61076k92195J72118L76478L98877N02583
2699C3881193L99389n2509n46730j400162k055235j904868j538737j323666r25881
2690B4532794q39502p10012r04586q12731q79177q25558o33810n24715o03352
2681A7799351m10630l88830k39480k88519j64912l28741k09579j92758j75254
2672A5400648n5984L6990Q503j31392J4314N2709j7671o2273j35980j89615q5524
$$ plain form
2734 52778992 55083653 58208067 62069754 66055682 69055500 69470779 66646931 61828142
2726 61828142 57033198 53225762 50378830 48512485 47290222 46550021 45894937 45249328 44678380
2717 44678380 44237335 44164072 44106428 43692911 43294649 42443121 41081517 39449129 37688224
2708 37688224 35955650 34474949 33384408 32723332 32431137 32603255 32979733 33378610 33881193
2699 33881193 34280582 34228073 33681343 32281181 30225946 28321078 26782341 25458675 24532794
2690 24532794 23693292 22983280 22078694 21265963 20386786 19561228 18927418 18402703 17799351
2681 17799351 17388721 16999891 16760411 16471892 16306980 15978239 15768660 15575902 15400648
2672 15400648 15344664 15381654 15390157 15258765 15273079 15325788 15308117 15245844 15109864 14920249 14834725
2661A4834725k49425k34384k16502j48919j42859j48320k7824K9853n2247N5938
2651A3700036n3110l3008Q5426M6236q5993m4326K5797j3631M2041O8651p5043
2640A3663076K6296m703p981j485R2178o0p7245M1723o0291p6230J18306j9796
2628A3693788L2347o2473L2604J40696M6477J18917L1284J8126J27731J06336
2618A4285833J35790J34639N5152j36437l0846j5864j88586l5582K1535r4855
2608A4130779L36m5118K5584r5436L3963j010j24609m8501L5030l6726N3685J5626
2596A3943603P257k6511L5791o8085n9225O555K2416r6149L3087J8636Q9659J3893
2584A3920927Q5324q5861r321N202k3865N7088M518K4123M6613J99n462j7952
$$ plain form
2661 14834725 14585300 14350916 14134414 13985495 13842636 13694316 13666492 13696345 13644098 13700036
2651 13700036 13646926 13613918 13699344 13745580 13659587 13615261 13641058 13627427 13669468 13738119 13663076
2640 13663076 13689372 13684669 13676688 13675203 13767381 13767321 13690076 13731799 13671508 13595278 13713584 13693788
2628 13693788 13726135 13663662 13696266 13836962 13883439 14002356 14033640 14051766 14179497 14285833
2618 14285833 14421623 14556262 14611414 14474977 14444131 14428267 14239681 14204099 14225634 14130779
2608 14130779 14131115 14085997 14111581 14016145 14050108 14049098 13924489 13875988 13911018 13874292 13927977 13943603
2596 13943603 13950860 13924349 13960140 13892055 13832830 13839385 13861801 13765652 13798739 13817375 13907034 13920927
2584 13920927 14006251 13920390 13911069 13916271 13892406 13949494 13954012 13978135 14024748 14024947 14019485 14001533
2572A4001533l1842J26157j5313k2909L6364O0410L9285N8111M627m8776k4018
2561A4183629m4103M326M2288K0979j7444j25097k2111l7175j2560r006q7273
2550A3896453p1210k7210o9251J4319P360O4523o4437p7339m6627L589o8570M5623
2538A3607223p8975l2995j9950M2578m0869O968J7986k9005m0996n3349o934O887
2526A3378569J205j4146j6235r1543N6882l0624N402L1121l707j0888N6593O8457
2514A3431086j0806L2297K9622n6320K131P2948k9375P8633O6827l0739k3757
2503A3562547k4209j0927Q0787m375J01576L8460M1785J35332Q3317L5174J1389
2492A4050856P017O6430l217J00536M5104L6802K9726Q6450L8079J46833N7783
$$ plain form
2572 14001533 13969691 14095848 14080535 14057626 14093990 14154400 14193685 14251796 14256423 14207647 14183629
2561 14183629 14139526 14143852 14186140 14207119 14189675 14064578 14042467 14005292 13992732 13983726 13896453
2550 13896453 13825243 13798033 13728782 13743101 13750461 13814984 13750547 13673208 13626581 13630170 13561600 13607223
2538 13607223 13528248 13495253 13475303 13517881 13477012 13483980 13501966 13472961 13431965 13378616 13371682 13378569
2526 13378569 13379774 13365628 13349393 13257850 13314732 13284108 13289510 13320631 13316924 13306036 13362629 13431086
2514 13431086 13420280 13452577 13482199 13425879 13428010 13500958 13471583 13550216 13617043 13586304 13562547
2503 13562547 13538338 13527411 13608198 13603823 13705399 13743859 13785644 13920976 14004293 14039467 14050856
2492 14050856 14057873 14124303 14121086 14221622 14266726 14303528 14333254 14419704 14457783 14604616 14662399
2481A4662399N5320R3764J18060K2337J06102L1277M2206R1153L06L1858j1302
2470A5243480L0840O6485p830M865N0108J786J20994J09798N4211P8377R0461
2459A5843575O8599J04q5153Q2660P7014Q9922m1206M7047j2436K0092q2663o2773
2447A5944782O5958O8863K8867K3668K1950K3235q8979m5870k173l2766R5766
2436A6103301M6014J51242K0588k8361k8714k9330J18480K3515R4977J02989N2240
2425A6626941R9154N2060J41130K8026j5659k4544r879J46645K1111J2081j7974
2414A7059092o1509J155k2859K2437P3233j44233P2800J804K3693Q1553P8057
2403A7185223K8664j5154M2900K3125M0584Q2552O3279O1961O9483M3017O7372
$$ plain form
2481 14662399 14717719 14811483 14929543 14951880 15057982 15089259 15131465 15222618 15222924 15254782 15243480
2470 15243480 15274320 15340805 15332975 15337840 15387948 15389734 15510728 15620526 15674737 15753114 15843575
2459 15843575 15912174 15912278 15827125 15909785 15986799 16076721 16035515 16082562 16070126 16090218 16007555 15944782
2447 15944782 16010740 16079603 16108470 16132138 16154088 16177323 16088344 16042474 16040301 16007535 16103301
2436 16103301 16149315 16300557 16321145 16292784 16264070 16234740 16353220 16376735 16471712 16574701 16626941
2425 16626941 16726095 16778155 16919285 16947311 16931652 16907108 16897229 17043874 17064985 17077066 17059092
2414 17059092 16997583 16998738 16975879 16998316 17071549 16927316 17000116 17001920 17025613 17107166 17185223
2403 17185223 17213887 17198733 17241633 17264758 17305342 17387894 17451173 17513134 17582617 17625634 17693006
2392A7693006R5563J18730P8058l6189M8366M2399Q7463N7411J13620J20856q751
2381A8410532j7603j7570j6383R0607j6883N2958M6940M6883O9173K998Q3596
2370A8735248O7634J31448L3172R0018R6454J15073J17484R3012R8390R2727m7240
2359A9623420O2001J39007J17109J03652N3653O6985J46304J30357P7327R7343
2349B0617158M7997J17326J27643R5396J34527J02946R5337J42344J9347J09828
2339B1609849J42630Q1173L1606Q2355J90597K29102K52057K37371K34764Q9291
2329B3180795J39665J83314J46707K91573J80922R5913K54739K44630J82890J83955
2319B5085103J84218J81854J74224L04670L44166J58512L34180L75139R5858J77823
$$ plain form
2392 17693006 17788569 17907299 17985357 17949168 17997534 18039933 18127396 18184807 18298427 18419283 18410532
2381 18410532 18392929 18375359 18358976 18449583 18432700 18485658 18532598 18579481 18648654 18651652 18735248
2370 18735248 18802882 18934330 18967502 19057520 19153974 19269047 19386531 19479543 19577933 19670660 19623420
2359 19623420 19685421 19824428 19941537 20045189 20098842 20165827 20312131 20442488 20519815 20617158
2349 20617158 20665155 20782481 20910124 21005520 21140047 21242993 21338330 21480674 21500021 21609849
2339 21609849 21752479 21833652 21865258 21947613 22138210 22367312 22619369 22856740 23091504 23180795
2329 23180795 23320460 23503774 23650481 23942054 24122976 24218889 24473628 24718258 24901148 25085103
2319 25085103 25269321 25451175 25625399 25930069 26274235 26432747 26766927 27142066 27237924 27415747
2309B7415747L27039J80930J90507K59423L20562K03446K28378K65162J80785
2300B9571979K78597L78447K19891L13262L55955L28948L72468L77601K61221
2291C2458369K28686K92910M12333L23834M04533M00524K84823K50281M35384
2282C5491677M24188M18539N42515M79467M78682M14785M48139M46729M77246
2273C9621967M44078N26296M01986N05107N47396N55499N81085N18858N61269
2264D4263541O30878O62940P76079P97427O02710O10362N97406P41638P00656
2255E0383637O65372O81092O44470O27571P19725P81539O79379P56313Q17994
2246E6757092Q36207R43052R86333J060352R60916R74773J107522R36338J088284
$$ plain form
2309 27415747 27742786 27923716 28114223 28373646 28694208 28897654 29126032 29391194 29571979
2300 29571979 29850576 30229023 30448914 30762176 31118131 31447079 31819547 32197148 32458369
2291 32458369 32687055 32979965 33392298 33716132 34120665 34521189 34806012 35056293 35491677
2282 35491677 35915865 36334404 36876919 37356386 37835068 38249853 38697992 39144721 39621967
2273 39621967 40066045 40592341 40994327 41499434 42046830 42602329 43183414 43702272 44263541
2264 44263541 44894419 45557359 46333438 47130865 47733575 48343937 48941343 49682981 50383637
2255 50383637 51049009 51730101 52374571 53002142 53721867 54503406 55182785 55939098 56757092
2246 56757092 57593299 58536351 59522684 60583036 61543952 62518725 63626247 64562585 65650869
2237F5650869J223996J174590J180011J199829J317531J270751J344853J360993
2229G5723423J422359J411678J536249J493931J567282J600590J600937J564990
2221H7921439J563922J544725J471091J626713J583012J688911J736015J794125
2213A00929953J850741J924719K029566K246518K301797K351962K385638K640431
2205A18661325K791686K931260L074187L235538L261905L448606L587915L907047
2197A44899469M043552M313424M606288M833446N251996N686822O133973O537151
2189A86306121O955933P575787Q208327Q807182R594533J0323458J1073032J1847576
2181B60691949J2636449J3503978J4173553J4643756J4834734J4586413J3854007
$$ plain form
2237 65650869 66874865 68049455 69229466 70429295 71746826 73017577 74362430 75723423
2229 75723423 77145782 78557460 80093709 81587640 83154922 84755512 86356449 87921439
2221 87921439 89485361 91030086 92501177 94127890 95710902 97399813 99135828 100929953
2213 100929953 102780694 104705413 106734979 108981497 111283294 113635256 116020894 118661325
2205 118661325 121453011 124384271 127458458 130693996 133955901 137404507 140992422 144899469
2197 144899469 148943021 153256445 157862733 162696179 167948175 173634997 179768970 186306121
2189 186306121 193262054 200837841 209046168 217853350 227447883 237771341 248844373 260691949
2181 260691949 273328398 286832376 301005929 315649685 330484419 345070832 358924839
2174C58924839J2440843J0069200O536466K255848k481146p046967j0622691j3010310
2166C57066082j3948116j3973997j3489019j2632447j1808816j0723974r992813
2159B70496900r214367q419105p885468p208282o608021o240461n616503n217766
2151B14086927m740865m385669m124913l899469l690656l513570l439886l292826
2143A82999073l097425l045820l002374k897648k865968k885065l036598k999476
2135A59168699l128567l080122l059857l142873l152952l141079l122646l101766
2127A34238837l016063k853865k828226k748229k665853k605261k382328k345918
2119A12793094k241354k262570k114927j930825j772079j708649j726012j731646
$$ plain form
2174 358924839 371365682 381434882 387971348 390227196 387746050 380699083 370076392 357066082
2166 357066082 343117966 329143969 315654950 303022503 291213687 280489713 270496900
2159 270496900 261282533 252863428 244977960 237769678 231161657 224921196 219304693 214086927
2151 214086927 209346062 204960393 200835480 196936011 193245355 189731785 186291899 182999073
2143 182999073 179901648 176855828 173853454 170955806 168089838 165204773 162168175 159168699
2135 159168699 156040132 152960010 149900153 146757280 143604328 140463249 137340603 134238837
2127 134238837 131222774 128368909 125540683 122792454 120126601 117521340 115139012 112793094
2119 112793094 110551740 108289170 106174243 104243418 102471339 100762690 99036678 97305032
2111I7305032j670553j543728j472833j463176j406331j298302j369190j309081
2103H5771838j265454j122124j218229j237397j164536j171475j080751r28001
2095G6583871r81027j039128j023615r76555r36851q60598p25616r16527q80268
2086F8243686p98479p83872q04575o91900o67694p96001o17808o37828p08374
2077F1737155n55844n70176o60994n33623n35383n84322n50645m76310o17448
2068E6652410n83811n16833n03172o25197m70360m08310n07286m02345n02288
2059E2132808n64145l81073m02113m65078m34745m00679m14652n33095m29825
2050D8107403m41609m14370k42747l78957m92706k98495l12812m16589k77169
$$ plain form
2111 97305032 95634479 94090751 92617918 91154742 89748411 88450109 87080919 85771838
2103 85771838 84506384 83384260 82166031 80928634 79764098 78592623 77511872 76583871
2095 76583871 75602844 74563716 73540101 72563546 71626695 70766097 70040481 69123954 68243686
2086 68243686 67445207 66661335 65856760 65164860 64497166 63701165 63083357 62445529 61737155
2077 61737155 61181311 60611135 59950141 59416518 58881135 58296813 57746168 57269858 56652410
2068 56652410 56068599 55551766 55048594 54423397 53953037 53544727 53037441 52635096 52132808
2059 52132808 51568663 51187590 50785477 50320399 49885654 49484975 49070323 48537228 48107403
2050 48107403 47665794 47251424 47008677 46629720 46137014 45838519 45525707 45109118 44831949
2041D4831949l42091l76888j81566j95081k42903l13008k53441k83473l56475
2032D2287023k55819k03108k57662j08109j44369k49974j42759j71000j90711
2023D0563512j72090j82001j30693j54886r5271j35927k03032j72521j49015k46329
2013C8921747q2362j08260k08140o9057o1673j40800r0147j43716l6190j20224
2003C7861178q9386p6264j53674j51632j94270k15944j29669j35216j14756n2385
1993C6547982k28550j98719k36087j63084j53181j45090k44064k17126j56726
1984C4805355j73836j84508l23649j14685k13995k49352p5867j05645j34010j22621
1974C3107187k28610J757j39852n3152r2957j74853k5134j06770j34368M8027
$$ plain form
2041 44831949 44489858 44112970 43931404 43736323 43493420 43180412 42926971 42643498 42287023
2032 42287023 42031204 41828096 41570434 41462325 41317956 41067982 40925223 40754223 40563512
2023 40563512 40391422 40209421 40078728 39923842 39828571 39692644 39489612 39317091 39168076 38921747
2013 38921747 38839385 38731125 38522985 38453928 38392255 38251455 38161308 38017592 37981402 37861178
2003 37861178 37771792 37695528 37541854 37390222 37195952 36980008 36850339 36715123 36600367 36547982
1993 36547982 36319432 36120713 35884626 35721542 35568361 35423271 35179207 34962081 34805355
1984 34805355 34631519 34447011 34123362 34008677 33794682 33545330 33469463 33363818 33229808 33107187
1974 33107187 32878577 32880334 32740482 32687330 32594373 32419520 32394386 32287616 32153248 32201275
1964C2201275j31303j98046r2656j92877n9116m3712r7350j26083j13252r6093
1954C1050787j1873j41212k9060R666k05270K5236l9078j12008J47331m624n659
1943C0684236R2159R0757J75706J24820J74840K61961J80862M03875K98061L43378
1933C2830655M17963M62236L54657N30256N75841N72677P59032Q05262Q33219
1924C8141798R72308R44729R81795P33564P98379O82636M65116L68395J00823
1915D4189543j61778p7197k34800l1431K9246l5573J54291J27806K06037K04329
1905D4370473o752r6789j59681j11375N8085O4288J84410K39612L08293M44737
1895D5295301N98039O78886R66530J109530J168993J514529J575152J872395K011786
$$ plain form
1964 32201275 32069972 31871926 31779270 31586393 31527277 31483565 31386215 31260132 31146880 31050787
1954 31050787 31038914 30897702 30868642 30878308 30673038 30698274 30659196 30547188 30694519 30689895 30684236
1943 30684236 30776395 30867152 31042858 31167678 31342518 31604479 31785341 32189216 32487277 32830655
1933 32830655 33248618 33710854 34065511 34595767 35171608 35744285 36503317 37308579 38141798
1924 38141798 39114106 40058835 41040630 41774194 42572573 43255209 43720325 44088720 44189543
1915 44189543 44027765 43950568 43715768 43684337 43713583 43678010 43832301 43960107 44166144 44370473
1905 44370473 44363721 44266932 44107251 43995876 44053961 44118249 44302659 44542271 44850564 45295301
1895 45295301 45893340 46572226 47538756 48648286 49817279 51331808 52906960 54779355 56791141
1886E6791141K132034K217301K256139K393218K060633J631807J349775O03227
1878G1435275k36194q67066j298499j418251r80040m92859j90968o895J7471j58601
1868F5803373m42414m58332p62233j151453j175378j213479j099072n00192l48530
1859E8652290j39503J14402L79577N59390P12433J024479J124600J137341J491924
1850F5056933J578336J815796K164978K292027K260602K449102K241387K050667
1842H1909828J819528J392464R71031R34869P47920Q50910O20470P89927P90568
1833I0827515M94657M93324L21641J18860J68196j49805j26182p4728m3050J96949
1823I2227377L26056P32559R75143J254752J683003J981475K307248K614343K890596
$$ plain form
1886 56791141 58923175 61140476 63396615 65789833 67850466 69482273 70832048 71435275
1878 71435275 71199081 70332015 69033516 67615265 66635225 66142366 65951398 65944503 65961974 65803373
1868 65803373 65360959 64902627 64140394 62988941 61813563 60600084 59501012 59000820 58652290
1859 58652290 58512787 58627189 59006766 59566156 60278589 61303068 62427668 63565009 65056933
1850 65056933 66635269 68451065 70616043 72908070 75168672 77617774 79859161 81909828
1842 81909828 83729356 85121820 86092851 87027720 87775640 88626550 89247020 90036947 90827515
1833 90827515 91322172 91815496 92137137 92255997 92424193 92274388 92148206 92073478 92030428 92227377
1823 92227377 92553433 93285992 94261135 95515887 97198890 99180365 101487613 104101956 106992552
1814A06992552L007075L236580L484829L587112L861012L805671L624423L271183
1806A34870437K725032J932830P68155m72012j858466k779876l064785k961842
1798A29159473k487262j886320j379236q97589l54966J79531O51913R62999J331649
1789A25280192J534499J871799K010093K189766K371163K317354K247048K077229
1781A41899143J929765J636969J130069L09580m22768j031704j623082j932074
1773A41895898k162421k395084k738698l189212l590108l685635l509735k952853
1765A17672152k573363k029760j657123j299592r32117o42199m12070k55089k30712
1756A07640127l22402m51242n54110r25926j327388j617413j987837k447532k674088
$$ plain form
1814 106992552 109999627 113236207 116721036 120308148 124169160 127974831 131599254 134870437
1806 134870437 137595469 139528299 140296454 139824442 137965976 135186100 132121315 129159473
1798 129159473 126672211 124785891 123406655 122509066 122154100 122333631 122985544 123948543 125280192
1789 125280192 126814691 128686490 130696583 132886349 135257512 137574866 139821914 141899143
1781 141899143 143828908 145465877 146595946 146905526 146482758 145451054 143827972 141895898
1773 141895898 139733477 137338393 134599695 131410483 127820375 124134740 120625005 117672152
1765 117672152 115098789 113069029 111411906 110112314 109180197 108537998 108125928 107870839 107640127
1756 107640127 107317725 106866483 106312373 105386447 104059059 102441646 100453809 98006277 95332189
1747I5332189l040030l342334l397037l357048l386540l138969k902796k704435
1739G0063000k576717k495962k322680k194711j937262j741828j662075j507095
1731E3624670j423023j385518j299967j040623r55331q83868r57822r70846r57416
1722D3750256r12819r76012j065942j092162j005408j009749r46633q76527q85654
1713C4979350q05786q96170r77761p31841p00341o35081o07342o94024o87576
1704B8243428o20378n87590o82286o22168n20054m85620n75180m10323m00866
1695B3338963l95500k78482l08647l81617j92514j96944l68417k21419k86694
1686B0708729k71385l14034k77167k85642k87180k81497l46690l76157k91956
$$ plain form
1747 95332189 92292159 88949825 85552788 82195740 78809200 75670231 72767435 70063000
1739 70063000 67486283 64990321 62667641 60472930 58535668 56793840 55131765 53624670
1731 53624670 52201647 50816129 49516162 48475539 47520208 46636340 45678518 44707672 43750256
1722 43750256 42837437 41861425 40795483 39703321 38697913 37688164 36741531 35865004 34979350
1713 34979350 34173564 33277394 32299633 31567792 30867451 30232370 29625028 28931004 28243428
1704 28243428 27623050 27035460 26353174 25731006 25210952 24725332 24150152 23739829 23338963
1695 23338963 22943463 22664981 22356334 21974717 21782203 21585259 21216842 20995423 20708729
1686 20708729 20437344 20123310 19846143 19560501 19273321 18991824 18645134 18268977 17977021
1677A7977021k80617l69502l27332j93867l63742l33592l49664l61637j79143
1668A5217925l23768k88206l60267j36911j49043j95857j54720j43408k75297
1659A3190448j44477j22310l7471p3001n7153j46262k59475j84005j89961j61930
1649A1814403j22165k00516k99994k94111j22302j90235j17533j40441j67468
1640A0159638k36753j69849p6442j13613k31965r1169k33248m4117m1779j14915
1630H805788q8244j43531k01071j25080r2567j16541j4893j09069o4153j6549
1620G834090l2978q672r5323j70437o8553k5121l7297J0274o8271j07100r2023
1609G138589j28319p1902r4334L8489N5609o0536k8129L534l4089m6878j8164
$$ plain form
1677 17977021 17696404 17326902 16999570 16805703 16441961 16108369 15758705 15397068 15217925
1668 15217925 14894157 14605951 14245684 14108773 13959730 13763873 13609153 13465745 13190448
1659 13190448 13045971 12923661 12886190 12813189 12756036 12609774 12350299 12166294 11976333 11814403
1649 11814403 11692238 11491722 11191728 10897617 10775315 10585080 10467547 10327106 10159638
1640 10159638 9922885 9753036 9676594 9562981 9331016 9239847 9006599 8962482 8920703 8805788
1630 8805788 8717544 8574013 8372942 8247862 8155295 8038754 8023861 7914792 7850639 7834090
1620 7834090 7801112 7792440 7697117 7526680 7458127 7433006 7395709 7405983 7337712 7230612 7138589
1609 7138589 7010270 6938368 6844034 6882523 6938132 6877596 6849467 6853001 6818912 6772034 6753870
1598F753870r9489L8149j9466l9234o3828N5911P4244j3190r3588P9404r8860
1587F573923n0496R2503J7857J21729K4140j49121k490L8091Q7598L7387r0166
1576F700955M7621j938K5031Q6099J08803l5508J1551k3172J33185M6497J06046
1565G205170L9460M6024R275Q0862J06423O7123L6484q844J23054J53277R9255
1554G957563J44191J44337J77746J13223J43365K14815K89755J51696K55259J63243
1544I755193K64648K01326K62596K21853K09536J82524J48669K9503J40147J21383
1534A1537378O8506j3494K4236J09294J32833J78198J69121Q7692K58111K14062
1524A2765937L16755L63151L83174L26008M16357L89182K83158J45189J35575
$$ plain form
1598 6753870 6654381 6692530 6673064 6633830 6570002 6625913 6700157 6686967 6593379 6672783 6573923
1587 6573923 6523427 6615930 6633787 6755516 6779656 6630535 6628045 6666136 6753734 6791121 6700955
1576 6700955 6748576 6746638 6771669 6857768 6966571 6931063 6942614 6919442 7052627 7099124 7205170
1565 7205170 7244630 7290654 7299929 7380791 7487214 7554337 7590821 7581977 7705031 7858308 7957563
1554 7957563 8101754 8246091 8423837 8537060 8680425 8895240 9184995 9336691 9591950 9755193
1544 9755193 10019841 10221167 10483763 10705616 10915152 11097676 11246345 11275848 11415995 11537378
1534 11537378 11605884 11592390 11616626 11725920 11858753 12036951 12206072 12293764 12551875 12765937
1524 12765937 13082692 13445843 13829017 14155025 14571382 14960564 15243722 15388911 15524486
1515A5524486J38465O2458J39177Q7015j2639j1212J52431J75434K45530J89335
1505A6690480J54304M27066L91248K97214J37365L7673O6039n0772M8649J13639
1495A8312905p2462L1542o8648o7074J22871J57180K07640K26289K25945L25230
1485A9401418N53281N64168O53638O12314M39168K94712k2911j24000j80536m03902
1475B1787350l89005n13058n93979m08216m50084m80698m02638l39983r7536j35294
1465A7976859N8496L1552L5640j80261j04793j73084J1277r097n7815j81467j50276
1454A7257031k00422q2450k34798r810j03602l8406J06752J35353J21054L81148
1444A7331850K03875J99480J03566p6089k58051m60617m62399m50422n64889o24859
$$ plain form
1515 15524486 15662951 15725409 15864586 15951601 15938962 15927750 16080181 16255615 16501145 16690480
1505 16690480 16844784 17271850 17663098 17960312 18097677 18135350 18201389 18150617 18199266 18312905
1495 18312905 18240443 18271985 18203337 18136263 18259134 18416314 18623954 18850243 19076188 19401418
1485 19401418 19954699 20518867 21172505 21784819 22223987 22518699 22495788 22371788 22191252 21787350
1475 21787350 21398345 20885287 20291308 19883092 19433008 18952310 18549672 18209689 18112153 17976859
1465 17976859 18035355 18066907 18102547 17922286 17817493 17644409 17655686 17646589 17588774 17407307 17257031
1454 17257031 17056609 16974159 16739361 16729551 16625949 16587543 16694295 16829648 16950702 17331850
1444 17331850 17535725 17735205 17838771 17762682 17504631 17044014 16581615 16131193 15566304 14941445
1434A4941445p57453p40265o16215m80500m56203l49645l19493l37413k19673
1425A0664585j84181k49515q4170j13765n6210r852O3434n3290k08408k35059
1415I533569l22402l18307j96827j18584k24443j17578p9281j80314q4348n9700
1405G831785j35156j16259j12805j30610o620l2219k64529k83339l15678k66538
1395F168032l78422k95451j99662k10521j69610q4593k05814j70021j86229j47270
1385D120439l8947q6331N3283O6000k2491l4258j68939q0675p7113j17501k00190
1374C413277o5812j61824o5829j18784j4300j17099p7220j76629P0167q4596O4148
1363B665499J1711k9563j30325J1495j5280n4644j66975k4377r5307n376L357
$$ plain form
1434 14941445 14183992 13443727 12827512 12347012 11890809 11541164 11221671 10884258 10664585
1425 10664585 10480404 10230889 10146719 10032954 9976744 9966892 10030326 9977036 9768628 9533569
1415 9533569 9211167 8892860 8696033 8577449 8353006 8235428 8156147 7975833 7891485 7831785
1405 7831785 7696629 7580370 7467565 7336955 7330335 7298116 7033587 6750248 6434570 6168032
1395 6168032 5789610 5494159 5294497 5083976 4914366 4829773 4623959 4453938 4267709 4120439
1385 4120439 4081492 3995161 4048444 4114444 4091953 4057695 3888756 3808081 3730968 3613467 3413277
1374 3413277 3347465 3185641 3119812 3001028 2986728 2869629 2792409 2615780 2685947 2601351 2665499
1363 2665499 2677210 2647647 2517322 2528817 2513537 2458893 2291918 2267541 2172234 2166858 2170215
1352B170215j1774n6356J2804p4362m0907P1805O5842n9027j9445m8148m9011
1341A961636j07949r3864n0400n5422L6919L8295j12968N545m0321p4359m7815
1330A459297L3860M6630N953j865k3106k8689K5766R548j51186n3005n5128p7760
1318A190315M5301J07433p8324J0182k4363n2575m5031P0817L7501L849o3338
1307A201767p4257k4057J2996k5951r0727K819R110n2440J6658K8137M0648r5520
1295I49183r0975J3851N9595L0434L251K1500J052j3264p0256q3489M4924r8365
1283G67441K6929r406N9673K1041M8566o7462j3367n9285O4952l8814J6848l2147
1271G84969J8518R35j9631j17814J6441m9493M6644j4270O558P323R6574m1818
$$ plain form
1352 2170215 2158441 2102085 2114889 2040527 1999620 2071425 2137267 2078240 2058795 2010647 1961636
1341 1961636 1853687 1759823 1709423 1654001 1690920 1729215 1616247 1621792 1581471 1507112 1459297
1330 1459297 1493157 1539787 1545740 1543875 1520769 1492080 1517846 1527394 1376208 1323203 1268075 1190315
1318 1190315 1235616 1343049 1264725 1274907 1250544 1197969 1152938 1223755 1261256 1265105 1201767
1307 1201767 1127510 1103453 1116449 1090498 999771 1002590 1011700 959260 975918 1004055 1044703 949183
1295 949183 858208 872059 931654 962088 965339 986839 987891 974627 904371 820882 865806 767441
1283 767441 794370 784964 844637 865678 914244 846782 833415 774130 839082 800268 817116 784969
1271 784969 803487 804422 784791 666977 683418 633925 680569 666299 672857 680180 776754 734936
1259G34936j8531K3049K7029o1147n3984m894J16169r029K3558n2737o0439q2124
1247E81856J7323n8179K9401j8696K8977M9137J4405P0376K6131O712n9538p5358
1235F12547N8776J7286o3583J1091r5892n1974J3727q420k9071N7287J2430J8029
1223E52233k3537N4936R4989p4208o3913J9048p5448Q4319j1556j38779J9679
1212D37763o8138J778p1672N4096J10190q1598j6999J11210n0773m1434J4224
1201C98647m4320P8251p9546J28425k5022j6874J9999k1817p0774K5290o6550
1190C25709K9557Q3443J7187p1061P7966m5419l0584j16575K8099N2747K4635
1179C75704L6260L491j59075J31487l8664j9519L6168n2667L2363l2493K7057
$$ plain form
1259 734936 716405 739454 766483 705336 651352 646458 762627 753598 777156 724419 663980 581856
1247 581856 599179 541000 570401 551705 580682 629819 644224 714600 740731 747443 687905 612547
1235 612547 671323 688609 625026 636117 540225 488251 501978 493558 464487 521774 534204 552233
1223 552233 528696 583632 678621 604413 540500 559548 484100 568419 556863 418084 437763
1212 437763 369625 371403 299731 353827 464017 382419 365420 476630 425857 384423 398647
1201 398647 354327 432578 353032 481457 456435 439561 459560 437743 366969 392259 325709
1190 325709 355266 438709 455896 384835 462801 417382 386798 270223 298322 351069 375704
1179 375704 411964 415455 256380 387867 349203 329684 365852 313185 345548 313055 340112
1168C40112J35316p9243J5593j22013k1877J31407l999j06736P8470j12854j6427
1157B37749M3859J13404n1702O644p9130p185K1195J09157n487o7672K1129l8620
1145C03341n2017J24805o5255n2881Q9033r7474N425n3344M584j0054k6946Q2433
1133B51650L5981L8621J48153q6345j17230P5993m2431l8610L3788m2904K5825
1122B82491L0345k8707k4320k9167P1585m7370n2095J34868p043l3026M9789p0148
1110B77202l3089O2098j23837M1569L715J04261j7421k8323K8332k2512k9358
1099B62637P1095m5921R7309N9293q5045l7525P1033n9208P6273n2869j7221l8067
1087C01784r155R9193m664j11706R0649p6494Q16L7882l3830M8482J05402r4536
$$ plain form
1168 340112 475428 396185 411778 289765 267888 399295 395296 288560 367030 254176 237749
1157 237749 281608 395012 343310 349954 270824 263639 284834 393991 388504 320832 341961 303341
1145 303341 251324 376129 310874 257993 347026 249552 254977 201633 206217 196163 169217 251650
1133 251650 287631 326252 474405 388060 270830 346823 304392 265782 299570 256666 282491
1122 282491 312836 284129 259809 230642 302227 254857 202762 337630 330587 297561 347350 277202
1110 277202 244113 306211 182374 223943 227658 331919 314498 286175 314507 291995 262637
1099 262637 333732 287811 385120 444413 359368 321843 392876 333668 409941 357072 339851 301784
1087 301784 292629 391822 387158 275452 366101 289607 290423 328305 294475 342957 448359 353823
1075C53823M9356m0296N4393L6188k1988o4845J07361l2281J14052q7538J25353
1064E93578M039r2000j9693k5517o97R6223p4826n0034P0808r168q2234J7338
1052D27817m4841J6456M588o3168P6779M0452J04838L220l9997l213K9409q3597
1040D68743P9117j6590j2882M7710n5352R71k7344m8037K4343k5549L2890Q5089
1028E53109J05067J8794p7205J2822k8449k5394J21210L8412L9316J5360J9345
1017G92387j44094N1274l7520P9492R2120Q2151k3992N168O649M1537m8775l710
1005H92687k0824k6009P5461J13748j6965M6463o672J9477K2907J29969j3380
994A216862K116Q7742L1657O0454J84542O6485O8592L0730J15661O1892J35461
$$ plain form
1075 353823 403179 362883 417276 453464 431476 366631 473992 441711 555763 468225 593578
1064 593578 597617 505617 485924 460407 459710 555933 481107 431073 501881 492713 410479 427817
1052 427817 382976 399432 404020 340852 417631 458083 562921 566141 526144 522931 552340 468743
1040 468743 547860 531270 518388 566098 510746 511717 484373 436336 460679 435130 468020 553109
1028 553109 658176 676970 599765 612587 584138 558744 679954 718366 757682 773042 792387
1017 792387 648293 699567 662047 741539 833659 915810 891818 896986 903635 945172 896397 892687
1005 892687 871863 845854 921315 1035063 1018098 1064561 1057889 1077366 1100273 1230242 1216862
994 1216862 1218978 1306720 1338377 1398831 1583373 1649858 1718450 1749180 1864841 1926733 2062194
983B062194Q7994J26836N2589K05780J43976J08157J84828K53453K37396L40297
973C803500J68999L29146L43591K27457K81523L22171L42671M77676O21094P73285
963G691113Q98593J179169J460932J493190K058151K776956L229967L494562J931215
954B6213848j180633k896066l797854l199956k190859j593935j177626j106494
946I070425j002686q40946o88601o28377m66391m44286l30031j57956l84801k84822
936C841528k60791k78130k98158k29402k17634j66598n0308l6924k29962N8184
926B131805o9409k60489l5694k2093j40381l1120P4191n7260m1648j7806r9558
915A430538j46479p0480j21256m6277j0640J5530l5703R6428M089j87057J2957
$$ plain form
983 2062194 2150188 2277024 2329613 2535393 2679369 2787526 2972354 3225807 3463203 3803500
973 3803500 3972499 4301645 4645236 4872693 5154216 5476387 5819058 6296734 6917828 7691113
963 7691113 8589706 9768875 11229807 12722997 14781148 17558104 20788071 24282633 26213848
954 26213848 25033215 22137149 18339295 15139339 12948480 11354545 10176919 9070425
946 9070425 8067739 7226793 6538192 5909815 5443424 4999138 4669107 4511151 4126350 3841528
936 3841528 3580737 3302607 3004449 2775047 2557413 2390815 2340507 2303583 2073621 2131805
926 2131805 2062396 1801907 1766213 1744120 1603739 1572619 1646810 1589550 1547902 1530096 1430538
915 1430538 1284059 1213579 1092323 1046046 1035406 1050936 1015233 1111661 1115750 928693 941650
904I41650o6390l2799P1516k9124l5688p809q9616j6121r9145L3654k5759l4171
892F10198K235J16021p707l1767r4979J350J8685j3853r3969N2925o894M9470
880F01715l8339k8470J7110m6825L6385l3766k1320K351J1554K2891n1807j12799
868C58680K2136L7369k5026m9660k3984k3439k1698R84k0963j6613J7499L107
856B58392l2065Q4330N942O07J1713n5054J7890n7833n018l7164l4055K4421k0684
843A61422j4772Q2971n643P189K0694l9136L451L2591l4174M6916M2616l0223
831B73902j06853q2744J1191o500o254K0273M9757j6624K9143q1291m4853L9303
819G8450j2139N7635N2010k9475j862k221k8462m8348j07156P8914k2258P7853
$$ plain form
904 941650 875260 842461 913977 884853 849165 841356 751740 735619 636474 670128 644369 610198
892 610198 612433 728454 720747 688980 594001 595351 614036 600183 506214 559139 552245 601715
880 601715 563376 534906 552016 505191 541576 507810 486490 488841 500395 523286 471479 358680
868 358680 380816 418185 393159 343499 319515 296076 274378 275362 254399 237786 255285 258392
856 258392 226327 310657 316599 317206 328919 273865 291755 233922 228904 191740 157685 182106 161422
843 161422 146650 229621 223978 231167 251861 212725 216176 248767 214593 261509 304125 273902
831 273902 167049 84305 95496 88996 82742 103015 152772 136148 165291 84000 39147 78450
819 78450 66311 123946 175956 146481 144619 142398 113936 65588 -41568 37346 15088 92941
807I2941Q68M7847K4166K8517j55411N0206K0811L7595J3938L6268m117m5699
795A47930q0128p0056l5413j6917Q4526l3320r597J16949M0546m7137m4046p8544
783b5207L7166R814N1855J4559p496K0477r1783o0368o536L0974l4199p012Q3230
770A5474J1974M1290K9883p4603o615R2589j003j8841l2966Q4943n6503o537j01447
757b2362r3872r975L7620J2568O2240Q0758L4519r6092K4274N5402k5114j8959
745D1007P288L03L95K4538n2750p0105m5878n1060L6683M0348O5637O7784k9590
732C4600K4825j08673j2223J14099L2266l5670O2201J5439o4419o2135m3232L3214
720i708L8332N748j18937K9331Q8309N7417j8331l4962N3743j2333J2548j5426
$$ plain form
807 92941 93809 141656 165822 194339 38928 89134 109945 147540 161478 197746 193629 147930
795 147930 67802 -2254 -37667 -54584 29942 -3378 -12975 103974 144520 97383 53337 -25207
783 -25207 11959 21773 73628 88187 80691 101168 9385 -50983 -57519 -26545 -60744 -67756 15474
770 15474 27448 68738 98621 24018 17403 109992 108989 90148 57182 142125 85622 79085 -22362
757 -22362 -116234 -126209 -88589 -76021 -13781 66977 101496 5404 29678 85080 59966 41007
745 41007 48295 48598 48993 73531 20781 -49324 -95202 -146262 -109579 -69231 -3594 64190 34600
732 34600 59425 -49248 -61471 52628 84894 49224 111425 126864 62445 310 -42922 -9708
720 -9708 28624 34372 -84565 -55234 33075 90492 72161 37199 90942 78609 91157 75731
708G5731r7716N2341j3924o6402M570k0719L1394n8408J9403M058K3280J15360
696F8968L9609M559J3368M689q7056r0660O5553O9288k0229J9222p2420M0976
684E5867l059n5434j22655n698J27798P2925L1820N3455j8472k9406P2704j18296
672F1549N951K1506Q1153n0123J3963l5040l0120p1705K3756k5328O4910l8238
660B2234k6362L9715P3927M3290n6819k0711o0016j8668M3568n88k8380m0460
648b9270j1285o9790m5451J26950j0347M6987n8l2624N1207R188p5661n321P1901
635B6426M459l5618k9154K7378k8127l1803k5389j6634L6522M4852q283k4899
623f0270Q4794R9151p0574p7807J3m3801P4501j4784m5632l1770K4771k759K2987
$$ plain form
708 75731 -21985 30356 16432 -49970 -45400 -66119 -34725 -93133 -73730 -69672 -46392 68968
696 68968 108577 113136 126504 131193 44137 -46523 19030 88318 68089 87311 14891 55867
684 55867 52808 -2626 -125281 -130979 -3181 69744 101564 155019 136547 107141 179845 61549
672 61549 67500 89006 170159 120036 133999 98959 68839 -2866 20890 -4438 60472 22234
660 22234 -4128 35587 109514 152804 95985 75274 15258 -3410 40158 39570 11190 -29270
648 -29270 -40555 -110345 -155796 -28846 -39193 7794 7736 -24888 26319 35507 -40154 -45475 26426
635 26426 30885 -4733 -33887 -6509 -34636 -66439 -91828 -108462 -71940 -27088 -35371 -60270
623 -60270 24524 123675 53101 -24706 -24693 -68494 6007 -8777 -54409 -86179 -61408 -64167 -41180
610d1180J8993l4360N2822K6004j3883o5754K3270M7863j307L6652k7012q5927
598f3819q545J2583n0097M6439K2421J612J4589R265N155k1020k6357N6968l7473
585c8279L6712K4683m0532J5039k0588j39667P4496K029N8699J22896l7662q1134
573b3308Q0895n5300L1117m3647Q6585Q560r2614m299O0114j11179P377n0670
561a06369m0927N6586M533K9166L0206K2102L224k2831q49l397J447L1797K1476
548B6164p7858m111N4039j14098J0087L768M0671P3079k1862j346O135N8691K5610
535G8969j16129L5762j8413m5174M6652L5207q359m306p5959K7354o029N4166
523C741J3111k0985l4174L6212N598M7622o0127n5147N9512l4425m6563L4843
$$ plain form
610 -41180 -22187 -56547 -3725 22279 8396 -57358 -34088 13775 12468 49120 22108 -63819
598 -63819 -72364 -59781 -109878 -63439 -41018 -39406 -24817 -15552 -10397 -31417 -57774 -806 -38279
585 -38279 -1567 23116 -17416 -2377 -22965 -162632 -88136 -86107 -27408 95488 57826 -23308
573 -23308 57587 2287 33404 -10243 76342 84902 -7712 -12011 48103 -63076 -55699 -106369
561 -106369 -147296 -90710 -86177 -57011 -26805 -4703 -1479 -24310 -25159 -28556 -27109 4688 26164
548 26164 -51694 -55805 -1766 -115864 -105777 -102009 -61338 11741 -10121 -11467 -5332 53359 78969
535 78969 -37160 -1398 -19811 -64985 -18333 16874 8515 4209 -71750 -44396 -50425 3741
523 3741 16852 -4133 -38307 -2095 3503 51125 -9002 -64149 -4637 -39062 -85625 -50782
511e0782m091q617J14747j16547m9499L5872K5692K1482N3J16144J703n2326r81
498C2850j1500n9945N096r0946O9794j022J00814l8777l2143j0207j0871m6566
486i3423R9316m5272P6274K5789m7541j17056R831k3361N2905N1618r373N0639
474C0346m8559l1738N642r9504J66499n7466m0021R3917k9285L3532L5656j44190
462h5171K8297l883N671P243R4774Q0135j0465j69666l5776M208o511L0110p6814
449a37848M4095Q1098M2704p5863P41r6910J03286m658J0214o68M7636J4236L655
436C1718n3299J12723q3118k5j8085o4544L5850M7413m5564l7074L9867p49J5473
423a9414k8618M2954N0232o3731n4776N587R5787R049j8381p2974o3359K4423
$$ plain form
511 -50782 -54873 -63490 51257 -65290 -114789 -78917 -53225 -31743 -31690 84454 86157 33831 32850
498 32850 21350 -38595 -33499 -124445 -54651 -55673 45141 6364 -25779 -35986 -46857 -93423
486 -93423 5893 -39379 36895 62684 15143 -101913 -92082 -115443 -62538 -10920 -20293 30346
474 30346 -18213 -49951 -44309 -143813 22686 -34780 -74801 19116 -10169 23363 59019 -85171
462 -85171 -56874 -60757 -55086 -47843 46931 127066 116601 -53065 -88841 -84633 -91144 -61034 -137848
449 -137848 -93753 -12655 30049 -45814 -45073 -141983 -38697 -43355 -33141 -33809 13827 28063 31718
436 31718 -21581 91142 8024 7999 -10086 -74630 -38780 8633 -36931 -74005 -34138 -34887 -19414
423 -19414 -48032 -5078 45154 -18577 -73353 -67766 28021 37070 18689 -54285 -117644 -93221
411i3221O1079m6182P5842N2976K0226l2841K4923m2137L2032q4979L9844p3218
399f5656N8946J13276m3745j04840N0567r9924r464M5266L302K6818Q0334O1760
387A16640j03627l7285O2675o8375j2733N0976J3675M6420j817j14823J4415m0999
375g4858j0190r276J00818j7806K6013l1960R6122j5836l303n0769q5015J3660
363f2400P6233o4020M2776m0542m2854P4093m4607P887l4465j7322J17954J7962
351C0695j5049N0124n9071P9774j09573k4642J33824m1979q2598Q6313q1159l0040
339f3381M5845M1971L9035L7308o6718L710P60J07964k153r1766k5967q0646l2488
326h6526J41186j28441N0298J5141m5345l6096j8118N0555N7313q2023J41999
$$ plain form
411 -93221 -32142 -78324 -2482 50494 70720 37879 62802 20665 52697 -32282 7562 -65656
399 -65656 -6710 106566 62821 -42019 8548 -91376 -100840 -55574 -52272 -25454 54880 116640
387 116640 13013 -24272 38403 -29972 -42705 8271 21946 68366 66549 -48274 -33859 -74858
375 -74858 -85048 -94324 6494 -11312 14701 -17259 78863 63027 59724 8955 -76060 -62400
363 -62400 13833 -50187 -7411 -47953 -90807 -16714 -61321 -53434 -87899 -105221 12733 30695
351 30695 15646 65770 6699 86473 -23100 -47742 86082 44103 -38495 47818 -33341 -63381
339 -63381 -17536 24435 63470 100778 34060 37770 38530 146494 144341 52575 26608 -54038 -86526
326 -86526 54660 -73781 -23483 -8342 -53687 -89783 -107901 -57346 -33 -82056 59943
315E9943M459K5686L445o9146r3345M1723p5718M3483L338N0980q587j9981j391
302c5111O8231n3265j9688K1200j2914R8842L5514j00010j4486n1134J2917k2652
290g2556J6961O942K3884N4712P7960j24626K6371q3014L872K1119L7076P7R1787
277H0565m0677o1269p0700Q3527l8985q7652K9968n185J2362R7105J20079p6058
265D3080j7890p5718p4952K4040R5660J8467j9721n3340j0352j2729P8050n7973
253f3378m1038N4964M0392k595L2731P227K0052j04404J2785q1949K3666R4301
241g246n1063m8627J2253q887R6953p5489P389p0651Q5445Q1150J661m8039O5220
228D0069o7493r748R443k0678n0977R1481j12011L4901N6170q135K8549k7141
$$ plain form
315 59943 64402 90088 93533 24387 -68958 -27235 -102953 -59470 -56132 -5152 -13739 -33720 -35111
302 -35111 33120 -20145 -39833 -18633 -31547 67295 102809 2799 -11687 -62821 -49904 -72556
290 -72556 -55595 -48653 -24769 29943 107903 -16723 9648 -73366 -69494 -48375 -11299 -11222 80565
277 80565 39888 -21381 -92081 -8554 -47539 -135191 -105223 -110408 -98046 -941 119138 43080
265 43080 25190 -50528 -125480 -101440 -5780 12687 -7034 -60374 -70726 -83455 -5405 -63378
253 -63378 -104416 -49452 -9060 -11655 21076 28303 48355 -56049 -43264 -125213 -101547 -7246
241 -7246 -58309 -106936 -94683 -103570 -6617 -82106 -74717 -145368 -59923 21227 22888 -25151 40069
228 40069 -27424 -37172 -27729 -48407 -99384 -7903 -119914 -85013 -28843 -36978 -8429 -35570
216c5570K4231N1581k6199J762P351k9571L1243q7416M001P8494j02734N3069
204b9758K3220j8254j1600J8144o2329K4517o1195R2938K8361K7056J0209k5487
192A5822n4280O7848j13246P7448j7316p5511Q3894K7038M7012N2832j01439l7001
180b6899l0693k0385Q6694Q772K4662j4944p9464j4522O985q1094J9837m6464
168a67515k4225J67091P6295k5445k2699r0734K0306p3949J0810R7810l5801L6512
156c1544j850k7194L1449k9154J6968j8099q998J1764R1558m3608J2210o3692
144f0190m8378l8118n418n620J32100n0151P6651p8245k3632j7806p4700R6383
132i7124O0524n053L7618k8872q056Q614n6780p592j2491j9938M0131K6117M3488
$$ plain form
216 -35570 -11339 40242 14043 15805 23156 -6415 24828 -62588 -58587 19907 -82827 -29758
204 -29758 -6538 -24792 -36392 -18248 -80577 -56060 -117255 -24317 4044 31100 41309 15822
192 15822 -38458 29390 -83856 -6408 -23724 -99235 -15341 11697 58709 111541 10102 -26899
180 -26899 -57592 -77977 8717 17489 42151 27207 -52257 -66779 -59794 -140888 -121051 -167515
168 -167515 -191740 -24649 51646 26201 3502 -87232 -66926 -140875 -130065 -32255 -68056 -31544
156 -31544 -33394 -60588 -29139 -58293 -41325 -59424 -68422 -56658 34900 -8708 3502 -60190
144 -60190 -108568 -146686 -152104 -157724 -25624 -75775 876 -77369 -101001 -118807 -193507 -97124
132 -97124 -36600 -41653 -4035 -32907 -40963 -32349 -89129 -96721 -109212 -129150 -89019 -62902 -19414
119a9414j7204o5903j5783N77m0423M7984K7476Q7928L3727r2389q0577M5115
107h8886n3516N0693m395R8617J5973M8790P185m3008p3207m5916q8332M9631
95a26371L8171L6509K4300m213j213l5917l0878p042j325K9549L7411K6100J435
82a3484N2068m1250p5164l738o9466M1801R0119k4411j29j7340K1002n0820P546
69h3266N5196n6465J1508J6804l7649K9855O1725n8931q5846k3232P932K3851
57a38518N8771M970N7964j8643O3406p1430m2916Q763k860P301L5351o8935O4745
44d2031k5330n6719K3462M137R308j4275L1075O9308K8812l9489m994p5270K45
31i1761M1796n2132m860L219L0257k9835N048k5641M839m0459R0064l1902k9979
$$ plain form
119 -19414 -36618 -102521 -118304 -117727 -158150 -110166 -82690 5238 38965 -53424 -134001 -88886
107 -88886 -142402 -91709 -96104 2513 18486 67276 74461 31453 -41754 -87670 -176002 -126371
95 -126371 -88200 -51691 -27391 -31604 -32817 -68734 -99612 -106654 -107979 -78430 -41019 -14919 -13484
82 -13484 38584 -2666 -77830 -81568 -151034 -109233 -19114 -43525 -43654 -60994 -39992 -90812 -83266
69 -83266 -28070 -84535 -73027 -56223 -93872 -64017 -2292 -61223 -147069 -170301 -162369 -138518
57 -138518 -79747 -74777 -16813 -35456 27950 -43480 -86396 -77633 -80493 -73192 -37841 -106776 -42031
44 -42031 -67361 -124080 -100618 -96481 -87173 -101448 -70373 -1065 27747 -11742 -16736 -92006 -91761
31 -91761 -49965 -102097 -106957 -103738 -73481 -103316 -98268 -123909 -119070 -159529 -69465 -101367 -131346
18a31346J31652K8931p0273k7212p8243K7087N277L7226p610l4897R849l8688
6a48247O368J12270J2305r2787M0767l705
0g3029
$$ plain form
18 -131346 306 29237 -41036 -68248 -146491 -119404 -114127 -76901 -84511 -119408 -109559 -148247
6 -148247 -141879 -29609 -17304 -110091 -69324 -73029
0 -73029
$$ Imaginary data points
##PAGE= N=2
##DATA TABLE= (X++(I..I)), XYDATA
16383e418827k5777k3477J20729Q7140K5445O0476J17308R6468k1719J08804R4027
16372d779403N4026J25784k7822L4858M1504M7861K0491P4481Q734m6408R1010
16361d354884J03557J2371J25204Q5681O1697L2099J20654R6032M2251L1844O7651
16350c575843K6425Q8283R723j0075J0076J35559J07591O5527M721K4179O7962
16339c045872K7749R9341N1081K2897J41295j1940Q205J59868L5232k5909p535
16328b545588J8176R1471L4159J05935J0202M1289J30932Q4093l4765R7996M8381
16317a917719M6806L4465P6978Q7876Q0440j3666m2926O5641O0557L9874J8177
16306a463497M6028M5877Q614R1890L2016Q1645J47105j9965J8404L2159M8484
$$ plain form
16383 -5418827 -5444604 -5468081 -5347352 -5260212 -5234767 -5174291 -5056983 -4960515 -4982234 -4873430 -4779403
16372 -4779403 -4725377 -4599593 -4627415 -4592557 -4551053 -4503192 -4482701 -4408220 -4399486 -4445894 -4354884
16361 -4354884 -4251327 -4238956 -4113752 -4028071 -3966374 -3934275 -3813621 -3717589 -3675338 -3643494 -3575843
16350 -3575843 -3549418 -3461135 -3451412 -3461487 -3451411 -3315852 -3208261 -3142734 -3138013 -3113834 -3045872
16339 -3045872 -3018123 -2918782 -2867701 -2844804 -2703509 -2715449 -2707244 -2547376 -2512144 -2538053 -2545588
16328 -2545588 -2527412 -2435941 -2401782 -2295847 -2285645 -2244356 -2113424 -2029331 -2064096 -1966100 -1917719
16317 -1917719 -1870913 -1836448 -1759470 -1671594 -1591154 -1604820 -1647746 -1582105 -1521548 -1481674 -1463497
16306 -1463497 -1417469 -1371592 -1362978 -1271088 -1239072 -1157427 -1010322 -1030287 -1011883 -979724 -931240
16295i31240J65166k9598j2550J4924N8477M4992N0220k1068J18776K6705j0824
16284e26020O5320J15268M0805Q4943k5028M1901P9372m1767Q0911p3711J06643
16273e1363R8210R595M1919p8800n099J85645j1024J8249J13418K5285L0623M4639
16261D21297J7710P0154J870J3683J6754J7587R0596P7472p5805K2509K1490j6644
16249F78673R0225M8107K7218J22090j3784P7177n6878O5079O7003m3385N9036
16238A120561O9410n2322Q9083n1906L1967J11484k1138J1223O2361K2053J04943
16227A497719l8506l5826J21789J1618N6916L6924p3915M9550L5988R434m4922
16216A626769J464Q1134M5466m61Q0713K8368j7508N4996l4208L107J33129l140
$$ plain form
16295 -931240 -766074 -795672 -808222 -793298 -734821 -689829 -639609 -660677 -541901 -515196 -526020
16284 -526020 -460700 -345432 -304627 -219684 -244712 -202811 -123439 -165206 -84295 -158006 -51363
16273 -51363 46847 56442 98361 19561 14462 200107 189083 207332 320750 346035 376658 421297
16261 421297 439007 509161 511031 524714 541468 559055 649651 727123 651318 673827 695317 678673
16249 678673 768898 817005 844223 966313 952529 1029706 972828 1037907 1104910 1061525 1120561
16238 1120561 1189971 1137649 1226732 1174826 1206793 1318277 1297139 1308362 1370723 1392776 1497719
16227 1497719 1459213 1423387 1545176 1556794 1613710 1650634 1576719 1626269 1662257 1671691 1626769
16216 1626769 1628233 1709367 1754833 1754372 1835085 1863453 1845945 1900941 1866733 1869840 2002969 1999829
16204A999829R825R6412J8676j2730j0954p5916L4861J3840J9189j27002J01273
16193B067303J30873K6499j178J4798k4077Q951O8181J4375L5793N3181L1917
16182B426616n5254M723L2285J0474K0899j6271n8189K0564J29841O213k6815
16171B495086J07618l3838o3023k9717O9063O1469R2758n859j43616L1205L5200
16160B616346M874K3561K3273N2226m7045L1708l2788K6993N6859L1100o9311
16149B717796J17557l1218J0268n6544K4601m1258O4058Q7351n5754R7540j1860
16138B922537l0008j2036n5574N1051L3777K1143l5608l7426J37226j2472o0399
16127B922211K5467k7288Q0779N1550l3388k8492K2291j5445m8738k1277N3945
$$ plain form
16204 1999829 2009654 2106066 2124742 2112012 2101058 2025142 2060003 2073843 2093032 1966030 2067303
16193 2067303 2198176 2224675 2223497 2238295 2214218 2223169 2291350 2305725 2341518 2394699 2426616
16182 2426616 2371362 2376085 2408370 2418844 2439743 2423472 2365283 2385847 2515688 2521901 2495086
16171 2495086 2602704 2568866 2505843 2476126 2545189 2606658 2699416 2693557 2549941 2581146 2616346
16160 2616346 2621220 2644781 2668054 2720280 2673235 2704943 2672155 2699148 2756007 2787107 2717796
16149 2717796 2835353 2804135 2814403 2757859 2782460 2741202 2805260 2892611 2836857 2934397 2922537
16138 2922537 2892529 2880493 2824919 2875970 2909747 2930890 2895282 2857856 2995082 2982610 2922211
16127 2922211 2947678 2920390 3001169 3052719 3019331 2990839 3013130 2997685 2948947 2927670 2981615
16116B981615k1690o231K3612p561k1522J19484n965o1488R2686l8485r753M2985
16104C087687k7758P8109K2848k8402r8955k3301J04672o9365k6684J12629n614
16093C125866K4104k8127J9404O1048P6982j52085j36183M0751R3205K8819l2905
16082C120879m0429r788m8896P0726n55j9228J41625K794k3520J02368M2277k1121
16070C317132q1035q9350l128k9651P6930m9191K1203K3996r650j71704J1865
16059C017417L8549P5946J01924J9495m4936O6104K8022o2566n8112P9984L3323
16048C295150q5286L3819L5983q1556P0289n1962j57718J44862J46052k3733L8494
16037C364394j4187q4830K933p1104j7275N6441M6753J1412j77369J39409k8643
$$ plain form
16116 2981615 2959925 2953694 2977306 2969745 2948223 3067707 3061742 3000254 3092940 3054455 3044702 3087687
16104 3087687 3059929 3138038 3160886 3132484 3033529 3010228 3114900 3045535 3018851 3131480 3125866
16093 3125866 3149970 3121843 3141247 3202295 3279277 3127192 2991009 3031760 3124965 3153784 3120879
16082 3120879 3080450 3070662 3021766 3092492 3091937 3072709 3214334 3217128 3193608 3295976 3338253 3317132
16070 3317132 3236097 3146747 3143619 3113968 3190898 3141707 3162910 3186906 3177256 3005552 3017417
16059 3017417 3055966 3131912 3233836 3253331 3208395 3274499 3302521 3239955 3181843 3261827 3295150
16048 3295150 3209864 3243683 3279666 3198110 3268399 3216437 3058719 3203581 3349633 3325900 3364394
16037 3364394 3350207 3265377 3268310 3197206 3179931 3236372 3283125 3294537 3117168 3256577 3227934
16026C227934j16948O2893L0659o4482J72633R0114j6083m3322K812j01512j03322
16015C141376P189P3556M3133j5329M9590j93030L3608J59160j21669L0917Q5191
16004C293692k7705K3310O4130J2689j7349p4521k3730r1745O7572L3132o4486
15993C194989N4775M9770j2176l9523J7679j576L4299N3799n2741j24178P2256
15982C247373K1957N6088q3687k6692p2265P8599O1835p0882P9578O3776q2309
15971C273371K610j268Q5660J2006R604j09804n4987Q3266n4581K8730r596L442
15959C268453k4485j47885N2883P9218J75566J0814j40356j617L2321M6095k880
15948C348127n5984L2122j27927O907n3404o9347J10039J3480l4304L26M5793
$$ plain form
16026 3227934 3110986 3173879 3204538 3140056 3312689 3402803 3386720 3343398 3346210 3244698 3141376
16015 3141376 3148565 3222121 3265254 3249925 3299515 3106485 3140093 3299253 3177584 3208501 3293692
16004 3293692 3265987 3289297 3353427 3366116 3348767 3274246 3250516 3158771 3226343 3259475 3194989
15993 3194989 3249764 3299534 3287358 3247835 3265514 3263938 3298237 3352036 3299295 3175117 3247373
15982 3247373 3269330 3325418 3241731 3215039 3142774 3221373 3283208 3212326 3291904 3355680 3273371
15971 3273371 3275981 3274713 3360373 3372379 3381983 3272179 3217192 3300458 3245877 3274607 3265011 3268453
15959 3268453 3243968 3096083 3148966 3228184 3403750 3414564 3274208 3272591 3304912 3351007 3348127
15948 3348127 3292143 3324265 3196338 3203245 3149841 3080494 3190533 3204013 3169709 3170035 3215828
15937C215828J26560M2111L8566q8415l3457L7045j19769O5666P4887l1086q8901
15926C239035r9743J2936K5116O8097q514P578N9405N0996R5122l3574l788o218
15914C406448o5999l6645p1743P6085J24586p8312j01367j15527r5455R2003J14124
15903C248198P6165K4412O2512Q29n5325P003k6688n945p3892l0166P6978O4377
15891C368458o1461j16649j08997K9875k9027J47710P6641J32405L3961M7065
15881C519981r1650J0711L3221m1485k09437k7154j8280j2413j3002O607j3637
15870C143462O2842R1609j26696R2155J96226K7828p5032L1030n2711p8309J14953
15859C427357l7602p7110k7264l2964j54639Q828R2832m7549O8189J15578m8660
$$ plain form
15937 3215828 3342388 3384499 3423065 3334650 3301193 3338238 3218469 3284135 3359022 3327936 3239035
15926 3239035 3139292 3152228 3177344 3245441 3236927 3244505 3303910 3354906 3450028 3416454 3412666 3406448
15914 3406448 3340449 3303804 3232061 3308146 3432732 3354420 3253053 3137526 3042071 3134074 3248198
15903 3248198 3324363 3348775 3411287 3412116 3356791 3363794 3337106 3331161 3257269 3227103 3304081 3368458
15891 3368458 3306997 3190348 3081351 3111226 3082199 3229909 3306550 3438955 3472916 3519981
15881 3519981 3428331 3439042 3472263 3430778 3221341 3194187 3175907 3163494 3150492 3157099 3143462
15870 3143462 3206304 3297913 3171217 3263372 3459598 3487426 3412394 3443424 3390713 3312404 3427357
15859 3427357 3389755 3312645 3285381 3252417 3097778 3106606 3199438 3151889 3220078 3335656 3286996
15848C286996K6916J51428o2674j1141N5817m3638k28651M9701O028k689M365
15837C232458l7708q0574L8704J21639k0711j8810J20792l9211P314J54204j2211
15826C465886j5135J4909j35076j32316J0Q4795n2462m7937M0450p2902J3772
15815C163994J39179o0549K3549J17634l9046j4213J60972Q763j16387q0948q6096
15804C216852n6612Q884P5910N5506l7099P7860m3815q4410O6395l6391l4659
15793C208421J44085L112O1153M0528l359p3257o6469j03794n5979J3523J09105
15782C277069L0435n206j0320n3680m6550Q9086J9206L8003N6677l1141L6850
15771C400429j2222k1654M7566j34354j5366m8989l7304J35188k8855O6770n3685
$$ plain form
15848 3286996 3313912 3465340 3402666 3391525 3447342 3403704 3175053 3224754 3230782 3228093 3232458
15837 3232458 3194750 3114176 3152880 3274519 3253808 3234998 3355790 3316579 3323893 3478097 3465886
15826 3465886 3450751 3465660 3330584 3198268 3198278 3283073 3230611 3182674 3223124 3150222 3163994
15815 3163994 3303173 3242624 3266173 3383807 3344761 3330548 3491520 3500283 3383896 3302948 3216852
15804 3216852 3160240 3169124 3245034 3300540 3263441 3341301 3297486 3213076 3279471 3243080 3208421
15793 3208421 3352506 3355618 3416771 3457299 3453940 3380683 3314214 3210420 3154441 3167964 3277069
15782 3277069 3307504 3302298 3291978 3238298 3191748 3280834 3300040 3338043 3394720 3363579 3400429
15771 3400429 3388207 3366553 3414119 3279765 3264399 3215410 3178106 3313294 3284439 3351209 3297524
15760C297524q4594O9453N1484Q1816K1819l4300n1364m4731m6442R674O7668
15749C338007p0449O8566o4814J5899J13558o3770q6872N7901o7846P3925J5746
15738C329851M3886K4756J837m1035o2899n5724R2250l5231M8133l810k1285j173
15726C319556J6460k2302o0400J989M9579r519m4265N6643J1431k7451Q5207o2484
15714C314444l0548R7199Q88m3669L9391k0205K262K0853o5041k6403n5635L5382
15702C268918n0799M2553J34177m1431j2254M8119o5515K4540L8314q0082K9933
15691C336473O031k4461m6692N2420N4887n0197j50798M8460J0126R4540M0227
15680C371016q4988L0818R3561m1426k7381P904K7114r094p1342J4841j2446M3889
$$ plain form
15760 3297524 3212930 3282383 3333867 3415683 3437502 3403202 3351838 3307107 3260665 3270339 3338007
15749 3338007 3267558 3336124 3271310 3287209 3400767 3336997 3250125 3308026 3240180 3314105 3329851
15738 3329851 3373737 3398493 3400330 3359295 3296396 3240672 3332922 3297691 3345824 3342014 3320729 3319556
15726 3319556 3336016 3313714 3253314 3255303 3304882 3295363 3251098 3307741 3319172 3291721 3376928 3314444
15714 3314444 3283896 3381095 3381983 3338314 3377705 3357500 3359762 3380615 3315574 3289171 3233536 3268918
15702 3268918 3218119 3260672 3394849 3353418 3341164 3389283 3323768 3348308 3386622 3306540 3336473
15691 3336473 3342504 3318043 3271351 3323771 3378658 3328461 3177663 3226123 3236249 3330789 3371016
15680 3371016 3286028 3316846 3410407 3368981 3341600 3349504 3376618 3367524 3296182 3311023 3298577 3342466
15668C342466N6509m3101o2962N2193l4444M9133k3195J2526P0433J2271m1599
15657C390230o6o0870Q8807l5131l1719j9328N7455n5360L298k3809l842o1160
15645C248505j7046Q2170K3807L3901Q6136p6827N464O682j2458k9601K2138J8459
15633C391330r438n4857p080k7132O2956P6082j04993M7550K6525m3799M3597
15622C400741P012N1064L012L842o7707n2743K263Q2079q0763m2039N750o3874
15610C248637M2987N5497j01733N7157L8345j4024J30150l2654o195l8625n3264
15599C326278L0669J6825j0137K5115j16146n138J8753l2959R6457J1940j8479
15588C343178J5057p396j0280j6517M5547j3659k3345P365Q3747l0610O361k5192
$$ plain form
15668 3342466 3398975 3355874 3292912 3345105 3310661 3359794 3336599 3349125 3419558 3431829 3390230
15657 3390230 3390164 3329294 3418101 3382970 3351251 3331923 3389378 3334018 3337316 3313507 3309665 3248505
15645 3248505 3231459 3313629 3337436 3371337 3457473 3380646 3386110 3392792 3380334 3350733 3372871 3391330
15633 3391330 3381892 3327035 3319955 3292823 3355779 3431861 3326868 3374418 3400943 3357144 3400741
15622 3400741 3407753 3458817 3461829 3465671 3397964 3345221 3347484 3429563 3348800 3306761 3312511 3248637
15610 3248637 3291624 3347121 3245388 3302545 3340890 3326866 3457016 3424362 3418167 3379542 3326278
15599 3326278 3356947 3373772 3363635 3388750 3272604 3267466 3286219 3253260 3349717 3361657 3343178
15588 3343178 3358235 3350839 3340559 3324042 3369589 3355930 3332585 3339950 3423697 3393087 3399448 3374256
15576C374256j9802M9201J454j38390M0217k0074J9098K0774J48247n5970l6383
15565C382628r389M7479l7474K3523j7018p6068P2385M7486o1477L2237n7123
15554C347189p9596K2528Q5525n968J4798O5964J6617l4630M3656q7367l51j4978
15542C373387k978o430J3276P0389l8383p5738K6273k5880P4215K5755l8817Q2199
$$ plain form
15576 3374256 3354454 3403655 3405109 3266719 3306936 3286862 3305960 3326734 3474981 3419011 3382628
15565 3382628 3373239 3420718 3383244 3406767 3389749 3313681 3386066 3433552 3372075 3404312 3347189
15554 3347189 3267593 3290121 3375646 3369678 3384476 3450440 3467057 3432427 3476083 3388716 3388365 3373387
15542 3373387 3370409 3363979 3377255 3447644 3409261 3333523 3359796 3333916 3408131 3433886 3395069 3477268
$$ [...]
##END NTUPLES=NMR SPECTRUM
##END=
