##TITLE=1H_EC-3242-oc
 DMSO,8 sc, 
 3.02.2021
##JCAMPDX= 6.0         $$ Bruker NMR JCAMP-DX V2.0
##DATA TYPE= NMR SPECTRUM
##DATA CLASS= NTUPLES
##ORIGIN= UXNMR, Bruker Analytische Messtechnik GmbH
##OWNER= root
$$ XWIN-NMR		Version 3.5
$$ Wed Feb  3 11:37:43 2021 Russian Standard Time (UT+4h)  she@DPX200
##.OBSERVE FREQUENCY= 200.1315066352
##.OBSERVE NUCLEUS= ^1H
##.ACQUISITION MODE= SIMULTANEOUS
##.ACQUISITION SCHEME= undefined
##.AVERAGES= 8
##.DIGITISER RES= 18
##SPECTROMETER/DATA SYSTEM= spect
##.PULSE SEQUENCE= zg30
##.SOLVENT NAME= DMSO
##.SHIFT REFERENCE= (INTERNAL, DMSO, 0, 15.9833)
##AUDIT TRAIL= $$ (NUMBER, WHEN, WHO, WHERE, WHAT)
$$ ##TITLE= Audit trail, XWIN-NMR		Version 3.5
$$ ##JCAMPDX= 5.01
$$ ##ORIGIN= Bruker BioSpin GmbH
$$ ##OWNER= she
$$ F:/spectra/data/she/nmr/H-F/1/pdata/1/auditp.txt
$$ ##AUDIT TRAIL=  $$ (NUMBER, WHEN, WHO, WHERE, WHAT)
(   1,<2021-02-03 11:36:46.59 +0400>,<she>,<DPX200>,
      <created by zg, POWCHK disabled, PULCHK disabled
       configuration hash MD5:
       00 E9 B6 7A A2 85 ED C7 34 08 36 98 17 FE 4E 26
       data hash MD5: 16K
       85 F6 57 FB E9 8D 6A D5 6D 54 95 1E 09 29 11 C8>)
(   2,<2021-02-03 11:36:48.96 +0400>,<she>,<DPX200>,
      <Start of raw data processing
       efp BC_mod = 2 LB = 0.24 FT_mod = 6 PKNL = 1 PHC0 = -10554.28 PHC1 = 8.800947 SI = 16K 
       data hash MD5: 16K
       87 27 93 CE 6E 7D 1F 02 86 87 9B B1 85 1E A0 07>)
(   3,<2021-02-03 11:37:04.71 +0400>,<she>,<DPX200>,
      <pk PHC0 = 154.2459 PHC1 = 0 
       data hash MD5: 16K
       FD 16 7A CA DB 1D 34 B5 24 CA 6F 9F 4D 7E 21 21>)
(   4,<2021-02-03 11:37:09.01 +0400>,<she>,<DPX200>,
      <abs ABSG = 5 
       data hash MD5: 16K
       66 B4 17 45 93 D8 8D 1D 58 EC 05 3B DA CA 7C 93>)
$$ ##END=
$$ 
$$ hash MD5
$$ 25 FE 41 19 54 19 46 1F 42 DE 57 94 E1 A6 29 DB
##$RELAX= 
##$RELAX= 
##$RELAX= 
##$RELAX= 
##$RELAX= 
##$RELAX= 
$$ Bruker specific parameters
$$ --------------------------
##$DU= <F:/spectra>
##$EXPNO= 1
##$NAME= <H-F>
##$PROCNO= 1
##$TYPE= <nmr>
##$USER= <she>
##$AMP= (0..31)
100 100 100 100 100 100 100 100 100 100 100 100 100 100 100 100 100 100 
100 100 100 100 100 100 100 100 100 100 100 100 100 100 
##$AQSEQ= 0
##$AQ_mod= 1
##$AUNM= <au_zg>
##$AUTOPOS= <>
##$BF1= 200.13
##$BF2= 200.13
##$BF3= 200.13
##$BF4= 200.13
##$BF5= 200.13
##$BF6= 200.13
##$BF7= 200.13
##$BF8= 200.13
##$BYTORDA= 1
##$CFDGTYP= 0
##$CFRGTYP= 5
##$CHEMSTR= <none>
##$CNST= (0..31)
1 1 145 1 1 1 1 1 1 1 1 1 1 1 1 1 1 1 1 1 1 1 1 1 1 1 1 1 1 1 1 1 
##$CPDPRG= <>
##$CPDPRG1= <>
##$CPDPRG2= <>
##$CPDPRG3= <>
##$CPDPRG4= <mlev>
##$CPDPRG5= <mlev>
##$CPDPRG6= <mlev>
##$CPDPRG7= <mlev>
##$CPDPRG8= <mlev>
##$CPDPRGB= <>
##$CPDPRGT= <>
##$D= (0..31)
0 1.2 0 0 0 0 0 0 0 0.06 0 0.03 0 0 0 0 0.0002 0 0 0 0 0 0 0 0 0 0 0 0 
0 0 0 
##$DATE= 1612337805
##$DBL= (0..7)
120 120 120 120 120 120 120 120 
##$DBP= (0..7)
150 150 150 150 150 150 150 150 
##$DBP07= 0
##$DBPNAM0= <>
##$DBPNAM1= <>
##$DBPNAM2= <>
##$DBPNAM3= <>
##$DBPNAM4= <>
$$ [...]
##$SUBNAM3= <"">
##$SUBNAM4= <"">
##$SUBNAM5= <"">
##$SUBNAM6= <"">
##$SUBNAM7= <"">
##$SUBNAM8= <"">
##$SUBNAM9= <"">
##$SW= 16.9725356469052
##$SWIBOX= (0..15)
0 0 2 0 0 0 0 0 0 0 0 0 0 0 0 0 
##$SW_h= 3396.73913043478
##$TD= 16384
##$TD0= 1
##$TE= 0
##$TE2= 300
##$TE3= 300
##$TEG= 300
##$TL= (0..7)
0 120 120 120 120 120 120 120 
##$TP= (0..7)
150 150 150 150 150 150 150 150 
##$TP07= 0
##$TPNAME0= <>
##$TPNAME1= <>
##$TPNAME2= <>
##$TPNAME3= <>
##$TPNAME4= <>
##$TPNAME5= <>
##$TPNAME6= <>
##$TPNAME7= <>
##$TPOAL= (0..7)
0.5 0.5 0.5 0.5 0.5 0.5 0.5 0.5 
##$TPOFFS= (0..7)
0 0 0 0 0 0 0 0 
##$TUNHIN= 0
##$TUNHOUT= 0
##$TUNXOUT= 0
##$USERA1= <user>
##$USERA2= <user>
##$USERA3= <user>
##$USERA4= <user>
##$USERA5= <user>
##$V9= 5
##$VALIST= <valist>
##$VCLIST= <CCCCCCCCCCCCCCC>
##$VD= 0
##$VDLIST= <DDDDDDDDDDDDDDD>
##$VPLIST= <PPPPPPPPPPPPPPP>
##$VTLIST= <TTTTTTTTTTTTTTT>
##$WBST= 1024
##$WBSW= 4
##$XGAIN= (0..3)
0 0 0 0 
##$XL= 0
##$YL= 0
##$YMAX_a= 621954
##$YMIN_a= -555545
##$ZGOPTNS= <>
##$ZL1= 120
##$ZL2= 120
##$ZL3= 120
##$ZL4= 120
##$ABSF1= 15.98335
##$ABSF2= -0.9893122
##$ABSG= 5
##$ABSL= 3
##$ALPHA= 0
##$AQORDER= 0
##$ASSFAC= 0
##$ASSFACI= 0
##$ASSFACX= 0
##$ASSWID= 0
##$AUNMP= <proc_1d>
##$AZFE= 0.1
##$AZFW= 0.1
##$BCFW= 0
##$BC_mod= 2
##$BYTORDP= 0
##$COROFFS= 0
##$CY= -3
##$DATMOD= 1
##$DC= 0
##$DFILT= <>
##$DTYPP= 0
##$F1P= 0
##$F2P= 0
##$FCOR= 1
##$FTSIZE= 16384
##$FT_mod= 6
##$GAMMA= 0
##$GB= 0
##$INTBC= 1
##$INTSCL= 2.992141e-10
##$ISEN= 128
##$LB= 0.24
##$LEV0= 0
##$LPBIN= 0
##$MAXI= 10000
##$MC2= 0
##$MEAN= 0
##$ME_mod= 0
##$MI= 1.114404
##$NCOEF= 0
##$NC_proc= -5
##$NLEV= 6
##$NOISF1= 3.799351
##$NOISF2= 2.8
##$NSP= 0
##$NTH_PI= 0
##$NZP= 0
##$OFFSET= 15.98335
##$PC= 1
##$PHC0= -10400.03
##$PHC1= 8.800947
##$PH_mod= 1
##$PKNL= yes
##$PPARMOD= 0
##$PSCAL= 0
##$PSIGN= 0
##$REVERSE= no
##$SF= 200.130006257508
##$SI= 16384
##$SIGF1= 3
##$SIGF2= 2
##$SINO= 5.538805
##$SIOLD= 16384
##$SREGLST= <1H.CDCl3>
##$SSB= 0
##$STSI= 16384
##$STSR= 0
##$SW_p= 3396.73913043478
##$SYMM= 0
##$S_DEV= 0
##$TDeff= 16384
##$TDoff= 0
##$TI= <>
##$TILT= no
##$TM1= 0
##$TM2= 0
##$TOPLEV= 0
##$USERP1= <user>
##$USERP2= <user>
##$USERP3= <user>
##$USERP4= <user>
##$USERP5= <user>
##$WDW= 1
##$XDIM= 16384
##$YMAX_p= 515910712
##$YMIN_p= -1231724
$$ End of Bruker specific parameters
$$ ---------------------------------
##NTUPLES= NMR SPECTRUM
##VAR_NAME=  FREQUENCY,     SPECTRUM/REAL,   SPECTRUM/IMAG
##SYMBOL=    X,             R,               I
##VAR_TYPE=  INDEPENDENT,   DEPENDENT,       DEPENDENT
##VAR_FORM=  AFFN,          ASDF,            ASDF
##VAR_DIM=   16384,         16384,           16384
##UNITS=     HZ,            ARBITRARY UNITS, ARBITRARY UNITS
##FACTOR=    0.207333158178281, 1,           1
##FIRST=     3198.74789551193, 0,            0
##LAST=      -197.991234922853, 0,           0
##MIN=       -197.991234922853, -1231724,    0
##MAX=       3198.74789551193, 515910712,    0
$$ Real data points
##PAGE= N=1
##DATA TABLE= (X++(R..R)), XYDATA
$$ [...]
$$ plain form
7491 3536 52330 -48367 -9007 44740 46796 61866 -44382 -118412 -97206 15517 61946 43170
7479 43170 -112351 -125627 -139300 -74403 -23867 -8798 -26068 -36581 -65026 -86896 -112700 -130271
7467 -130271 -160266 -155745 -88053 -13035 -70832 -66375 -82033 -109233 9377 24318 48344 30770
7455 30770 6201 -29900 24711 39869 13140 -28769 -43634 8385 -38293 36507 100013 110186
7443 110186 51160 97528 116903 51630 118795 79693 28170 61546 119878 -31713 -7692
7432 -7692 45715 -43587 -90901 -86911 -59149 -1031 63784 -13941 -54832 -54432 4940 -28097 -84391
7419 -84391 -65091 -102100 -79465 -36711 -38827 -123160 -25531 7328 -44493 -31407 -52072 22825
7407 22825 35360 151435 166828 19308 99081 156795 91424 28188 45912 21347 67427
$$ packed form
7491C536M8794j00697L9360N3747K056J5070j06248p4030K1206J12723M6429j8776
7479D3170j55521j3276j3673O4897N0536J5069j7270j0513k8445k1870k5804j7571
7467a30271k9995M521O7692P5018n7797M457j5658k7200J18610J4941K4026j7574
7455C0770k4569l6101N4611J5158k6729m1909j4865N2019m6678P4800O3506J0173
7443A10186n9026M6368J9375o5273O7165l9102n1523L3376N8332j51591K4021
7432g692N3407q9302m7314L990K7762N8118O4815p7725m0891M00N9372l3037n6294
7419h4391J9300l7009K2635M2754k116q4333R7629L2859n1821J3086k0665P4897
7407B2825J2535J16075J5393j47520P9773N7714o5371o3236J7724k4565M6080
$$ plain form
7396 67427 51354 24001 10213 84829 109764 132004 129046 40809 121983 95747 145672 73379
7384 73379 -25685 -15386 33612 45098 50428 10390 -59515 -136901 -88842 -136759 -154195 -40607
7372 -40607 -122363 -180193 -62331 -88418 -48189 13833 -15124 -39594 -55426 -38154 -104775 -76390
7360 -76390 -61809 -84289 -10290 129772 54607 -47694 -66879 -19706 9721 116887 225338
7349 225338 133126 117170 54044 115613 91472 42465 80734 74112 74033 62977 5288 69721
7337 69721 121065 -26791 -21903 -42171 -33502 -35197 7516 -112991 -151243 -25050 56215 56148
7325 56148 -26515 -9628 5560 -35474 65607 21425 -20165 -73715 -73582 -58662 -69501 2925
7313 2925 719 -102381 -121679 -107622 -168476 -42173 -3177 -56867 9276 131925 127939 192028
$$ packed form
7396F7427j6073k7353j3788P4616K4935K2240k958q8237Q1174k6236M9925p2293
7384G3379r9064J0299M8998J1486N330m0038o9905p7386M8059m7917j7436J13588
7372d0607q1756n7830J17862k6087M0229O2022k8957k4470j5832J7272o6621K8385
7360g6390J4581k2480P3999J40062p5165j02301j9185M7173K9427J07166J08451
7349B25338r2212j5956o3126O1569k4141m9007L8269o622p9j1056n7689O4433
7337F9721N1344j47856M888k0268Q669j695M2713j20507l8252J26193Q1265o7
7325E6148q2663J6887J5188m1034J01081m4182m1590n3550J33J4920j0839P2426
7313B925k206j03100j9298J4057o0854J26303L8996n3690O6143J22649l986O4089
$$ plain form
7301 192028 184379 15933 -32961 18248 180104 151096 26400 -38974 -73039 -20584 14267
7290 14267 35019 17672 21771 121061 121772 104255 50115 -14075 -44690 -11525 -47581 -79809
7278 -79809 -23886 -164669 -188443 -67015 -64050 -56553 16358 -106565 -145447 -126682 -27339 3211
7266 3211 15311 75645 85400 41907 8584 47410 27520 -28261 -28844 -8017 -52831 -85023 -188404
7253 -188404 -22721 9564 -64160 -40449 -17521 35097 69046 66949 92611 86459 110757 169979
7241 169979 79915 -873 -96663 -21994 -131253 -48816 -111716 -110397 5287 12018 -8011 -14584
7229 -14584 -37484 -27416 -4043 479 -31149 -6373 58647 -89651 -149352 -180833 -196627 -155720
7217 -155720 -25415 -86863 -49066 -14431 -16716 50336 119482 89864 -25746 43687 13098
$$ packed form
7301A92028p649j68446m8894N1209J61856k9008j24696o5374l4065N2455L4851
7290A4267K0752j7347M099R9290P11j7517n4140o4190l0615L3165l6056l2228
7278g9809N5923j40783k3774J21428K965P497P2911j22923l8882J8765R9343L0550
7266C211J2100O0334R755m3493l3323L8826j9890n5781n83K0827m4814l2192j03381
7253a88404J65683L2285p3724K3711K2928N2618L3949k097K5662o152K4298N9222
7241A69979r0064q0788r5790P4669j09259Q2437o2900J319J15684O731k0029o573
7229a4584k2900J0068K3373M522l1628K4776O5020j48298n9701l1481j5794M0907
7217a55720J30305o1448L7797L4635k285O7052O9146k9618j15610O9433l0589
$$ plain form
7206 13098 -4627 44525 108072 17270 -12244 -73680 -134842 -122085 36782 11577 -57324 74263
7194 74263 85634 105092 89891 -21307 -136393 -99041 -13787 12649 -106320 -119819 -246988
7183 -246988 -175953 -200119 -154763 -79183 -56450 40733 -92759 -62325 -48276 -78860 -6285
7172 -6285 1157 -99287 -92392 -68867 -69761 -122874 -130808 -157836 -151002 -3446 -39168 -88229 -87925
7159 -87925 -116058 -125176 -53741 -103026 -61163 -22883 -109686 -192534 -52378 -45259 -46970 -61784
7147 -61784 -41068 19796 83953 26584 51963 -29764 -176446 -88258 -10317 14491 -20536 -41028
7135 -41028 -123924 -72295 -93579 -19045 42930 65163 -21097 4361 27132 12177 46221 -23338
7123 -23338 -46969 -60970 -80967 -36148 9666 9734 -23051 -67101 -24101 -86882 -51709 -77760
$$ packed form
7206A3098j7725M9152O3547r0802k9514o1436o1162J2757J58867k5205o8901J31587
7194G4263J1371J9458j5201j11198j15086L7352Q5254K6436j18969j3499j27169
7183b46988P1035k4166M5356P5580K2733R7183j33492L0434J4049l0584P2575
7172f285P442j00444O895K3525q94n3113p934k7028O834J47556l5722m9061L04
7159h7925k8133r118P1435m9285M1863L8280q6803q2848J40156P119j711j4814
7147f1784K0716O0864O4157n7369K5379q1727j46682Q8188P7941K4808l5027k0492
7135d1028q2896N1629k1284P4534O1975K2233q6260K5458K2771j4955L4044o9559
7123b3338k3631j4001j9997M4819M5814O8l2785m4050M3000o2781L5173k6051
$$ plain form
7111 -77760 -58700 -58527 11902 32412 20413 23744 40731 32136 48599 39257 37758 37219 -99637
7098 -99637 -50742 -76612 -24097 -12874 10036 -89514 -62325 -977 72414 42055 11418 29104
7086 29104 -27614 4553 7266 -21183 -102687 -108555 -83196 -91656 -21731 14967 -21116 -112421
7074 -112421 -78419 -69939 47509 53861 -33961 -70928 -77039 -6252 39116 -1716 4922 -80914
7062 -80914 -26372 -19000 -45667 -49370 -28972 9558 -5536 133602 181226 123154 23674 -13090
7050 -13090 57537 100133 33907 10475 -97607 -91756 -89357 37746 5263 -20709 9203 21976
7038 21976 64166 64374 22876 -20602 -55633 -73833 85195 35031 -24138 -38459 -14277 13391
7026 13391 90289 98685 35846 -18545 -63710 -31882 39923 -36827 -10418 -40762 -71155 65130
$$ packed form
7111g7760J9060J73P0429K0510j1999L331J6987q595J6463r342j499n39j36856
7098i9637M8895k5870N2515J1223K2910r9550K7189O1348P3391l0359l0637J7686
7086B9104n6718L2167K713k8449q1504n868K5359q460O9925L6698l6083r1305
7074a12421L4002Q480J17448O352q7822l6967o111P0787M5368m0832O638q5836
7062h0914N4542P372k6667l703K0398L8530j5094J39138M7624n8072r9480l6764
7050a3090P0627M2596o6226k3432j08082N851K399J27103l2483k5972K9912J2773
7038B1976M2190K08m1498m3478l5031j8200J59028n0164n9169j4321K4182K7668
7026A3391P6898Q396o2839n4391m5165L1828P1805p6750K6409l0344l0393J36285
$$ plain form
7014 65130 44436 10028 -27469 -10580 -16912 88484 165588 168068 62459 -5885 45050 125784
7002 125784 69092 42870 -17097 -159293 -50124 42914 95958 8318 -40323 -118436 -164236
6991 -164236 -3247 25568 10974 6925 -49840 -104845 -4503 -40464 -54869 -83618 -44959
6980 -44959 -113884 -92629 -487 32958 -34180 -28800 -37519 -6474 100134 72879 7681 -34978
6968 -34978 -10646 -27431 -56236 19811 13589 -53063 45750 -29902 -34785 28367 32695 -137823
6956 -137823 -127112 -54867 -66122 44744 102311 11733 -171502 -103296 -25352 4788 -33383
6945 -33383 -90254 -198827 -153668 -100363 -34946 -27253 -172409 -154336 -210832 -66870 68599
6934 68599 57208 -14395 -113989 -235348 -119522 47618 47700 -91018 -148855 -201371 -47079
$$ packed form
7014F5130k0694l4408l7497J6889o332J05396P7104K480j05609o8344N0935Q0734
7002A25784n6692k6222n9967j42196J09169R3038N3044q7640m8641p8113m5800
6991a64236J60989K8815j4594m049n6765n5005J00342l5961j4405k8749L8659
6980d4959o8925K1255R2142L3445o7138N380q719L1045J06608k7255o5198m2659
6968c4978K4332j6785k8805P6047o222o6652R8813p5652m883O3152M328j70518
6956a37823J0711P2245j1255J10866N7567r0578j83235O8206P7944L0140l8171
6945c3383n6871j08573M5159N3305O5417P693j45156J8073n6496J43962J35469
6934F8599j1391p1603r9594j21359J15826J67140Q2j38718n7837n2516J54292
$$ plain form
6923 -47079 74488 23295 -120994 -173630 -115559 -19096 91664 52801 -6225 -100998 16980
6912 16980 -30303 101505 115969 38865 -139737 -53384 18505 37902 -5391 -115871 -200638
6901 -200638 -201999 -33944 -140212 -162891 -121784 -82421 -114431 -14624 -8276 -74334 -86058 -95369
6889 -95369 -126231 -68124 -69874 -151937 -251888 -240123 -97297 -110249 -172131 -158410 -122259 -91238
6877 -91238 -27400 -39260 48767 64086 -65994 -4116 8486 -3207 -100805 -63789 -67101 -73819
6865 -73819 2249 53983 -27925 -72236 -97186 -99019 -74790 -17093 -71126 -49911 -3665 -92670
6853 -92670 -79061 -80369 -39255 -48319 -31272 16258 -16656 -6842 80953 18859 -22674 -38033
6841 -38033 -50341 -42988 -25076 -55243 -206734 -93171 -29872 -48692 42912 72823 -53494
$$ packed form
6923d7079J21567n1193j44289n2636N8071R6463J10760l8863n9026r4773J17978
6912A6980m7283J31808J4464p7104j78602Q6353P1889J9397m3293j10480q4767
6901b00638j361J68055j06268k2679M1107L9363l2010R9807O348o6058j1724r311
6889i5369l0862N8107j750q2063r9951J1765J42826j2952o1882J3721L6151L1021
6877i1238O3838j1860Q8027J5319j30080O1878J2602j1693r7598L7016l312o718
6865g3819P6068N1734q1908m4311k4950j833K4229N7697n4033K1215M6246q9005
6853i2670J3609j308M1114r064J7047M7530l2914R814Q7795o2094m1533j5359
6841c8033j2308P353J7912l0167j51491J13563O3299j8820R1604K9911j26317
$$ plain form
6830 -53494 14100 23801 85489 121525 121871 40131 -51174 -11708 89503 -2685 -35150 -39152
6818 -39152 -28034 -23823 -13501 119743 44243 44212 5134 104487 137564 149423 -13757 -13610 29946
6805 29946 66633 117668 15302 -50044 -57190 38125 -2394 77285 -74985 -66936 -12614 22153
6793 22153 200600 196134 71389 -62404 -124205 -99116 -20667 2990 68088 -58983 -42419
6782 -42419 -88883 -11082 -17037 -23116 -47322 52219 103711 166722 152073 28975 -84834 -19018
6770 -19018 116283 98691 18803 -72812 -164479 -189650 -32754 109965 85309 8219 79225
6759 79225 109394 30428 60645 6388 -65140 -60753 33314 18088 32041 -43664 -26040 -61088
6747 -61088 -7975 87932 164285 64803 -13814 -7612 43308 164957 93610 -28838 2455 -14113
$$ packed form
6830e3494O7594R701O1688L6036L46q1740r1305L9466J01211r2188l2465m002
6818c9152J1118M211J0322J33244p5500l1l9078R9353L3077J1859j63180J47M3556
6805B9946L6687N1035j02366o5346p146R5315m0519P9679j52270Q049N4322L4767
6793B2153J78447m466j24745j33793o1801K5089P8449K3657O5098j27071J6564
6782d2419m6464P7801n955o079k4206R9541N1492O3011j4649j23098j13809O5816
6770a9018J35301j7592p9888r1615r1667k5171J56896J42719k4656p7090P1006
6759G9225L0169p8966L0217n4257p1528M387R4067j5226J3953p5705J7624l5048
6747f1088N3113R5907P6353r9482p8617O202N0920J21649p1347j22448L1293j6568
$$ plain form
6735 -14113 -53281 27058 -16570 43113 68330 113146 104905 70020 97420 78759 -16983 36741
6723 36741 50059 63114 72198 -112547 -202622 -174181 -62264 -62440 88303 65732 -45627 10193
6711 10193 8253 47601 -40574 4865 21166 -31785 -61622 7998 -60755 26129 27962 37959
6699 37959 -23278 86051 115598 6546 -4910 -33283 -22708 11238 -12266 -11930 -121991 -178885
6687 -178885 -129743 -97655 -47222 -76756 -75493 -26893 -43379 -88265 -140766 -78204 -129134 -143216
6675 -143216 -100364 -50133 -127757 -30951 26699 3747 -17958 13929 14546 -7956 -41732 -67861
6663 -67861 -149298 -28 45801 14008 -31375 -25945 -32192 -56142 64119 -1689 -42338 12012
6651 12012 -48997 -173977 -219726 -50577 -6874 -33635 38775 -50944 -84817 2907 -18412
$$ packed form
6735a4113l9168Q0339m3628N9683K5217M4816q241l4885K7400j8661r5742N3724
6723C6741J3318J3055R084j84745r0075K8441J11917j76J50743k2571j11359N5820
6711A0193j940L9348q8175M5439J6301n2951k9837O9620o8753Q6884J833R997
6699C7959o1237J09329K9547j09052j1456k8373J0575L3946k3504L36j10061n6894
6687a78885M9142L2088N0433k9534J263M8600j6486m4886n2501O2562n0930j4082
6675a43216M2852N0231p7624R6806N7650k2952k1705L1887O17k2502l3776k6129
6663f7861q1437J49270M5829l1793m5383N430o247k3950J20261o5808m0649N4350
6651A2012o1009j24980m5749J69149M3703k6761P2410q9719l3873Q7724k1319
$$ plain form
6640 -18412 -3380 67785 67570 4675 -23261 -1323 -2455 -21188 -16776 5872 10673 -2909 -50818
6627 -50818 -18527 -27128 -23450 -56759 31818 117132 35220 -124173 -82135 -73519 621 -87 73224
6614 73224 -120399 -135835 -75338 24583 66720 30592 15698 47845 34437 11771 -29468 -38923
6602 -38923 36812 88501 92655 68310 -5590 -87262 2473 15862 -12384 107429 43818 -31382
6590 -31382 -73707 -53082 -106435 -60958 -1820 13529 9132 14167 42880 -7068 -136082 -48874
6578 -48874 -31533 -4091 29190 -23199 -86802 -98502 -113712 -76548 1615 20935 -51971 -37469
6566 -37469 -1167 -8767 57302 32889 14161 28751 83148 95932 20195 15400 60103 66164
6554 66164 91844 179276 67751 -25644 -18260 -75015 10049 45072 92326 126274 106476 150318
$$ packed form
6640a8412J5032P1165k15o2895k7936K1938j132j8733M412K2648M801j3582m7909
6627e0818L2291q601L678l3309Q8577Q5314q1912j59393M2038Q616P4140p08P3311
6614G3224j93623j5436O0497R9921M2137l6128j4894L2147j3408k2666m1239r455
6602c8923P5735N1689M154k4345p3900q1672Q9735J3389k8246J19813o3611p5200
6590c1382m2325K0625n3353M5477N9138J5349m397N035K8713m9948j29014Q7208
6578d8874J7341K7442L3281n2389o3603j1700j5210L7164P8163J9320p2906J4502
6566c7469L6302p600O6069k4413j8728J4590N4397J2784p5737m795M4703O061
6554F6164K5680Q7432j11525r3395P384n6755Q5064L5023M7254L3948j9798M3842
$$ plain form
6542 150318 92291 23187 39145 59540 64967 113405 112611 45060 -28206 -30810 -3294 34999
6530 34999 39084 16511 33474 -20894 80308 4604 48365 80339 80065 7007 43385 27258
6518 27258 -5533 -2289 36909 51557 75088 57547 92645 9976 68751 114470 88689 92170
6506 92170 191089 110418 37039 57918 78528 120885 102058 115945 128925 171554 200741 102008
6494 102008 155628 175015 191285 201881 199646 104719 17701 71617 189585 205617 293534 248685
6482 248685 202425 117287 128432 89644 25300 151302 75900 3220 16229 53970 22228
6471 22228 -47710 -38059 -110768 11461 133044 78409 8025 -25831 -60803 -28245 -28002 36321
6459 36321 54470 6563 23590 53612 122616 59971 110823 38699 -43411 93279 3893 -27911
$$ packed form
6542A50318n8027o9104J5958K0395N427M8438p94o7551p3266k604K7516L8293
6530C4999M085k2573J6963n4368J01202p5704M3761L1974k74p3058L6378j6127
6518B7258l2791L244L9198J4648K3531j7541L5098q2669N8775M5719k5781L481
6506I2170R8919q0671p3379K0879K0610M2357j8827J3887J2980M2629K9187r8733
6494A02008N3620J9387J6270J0596k235r4927q7018N3916J17968J6032Q7917m4849
6482B48685m6260q5138J1145l8788o4344J26002p5402p2680J3009L7741l1742
6471B2228o9938R651p2709J22229J21583n4635p0384l3856l4972L2558K43O4323
6459C6321J8149m7907J7027L0022O9004o2645N0852p2124q2110J36690q9386l1804
$$ plain form
6447 -27911 60898 35049 206107 231276 242622 97410 62476 67813 98153 93251 126306 27484
6435 27484 29099 -2645 -3843 -62948 81641 126637 64625 48892 106799 52439 -20193 5552
6423 5552 -34764 -169754 -32935 -13934 -41313 -36605 -20558 -34676 -31784 96923 172689 217931
6411 217931 160575 -10683 -1895 39211 47600 77436 113365 11298 -129052 -59979 49644
6400 49644 74437 80128 52226 63388 127894 102564 -5886 -66093 -41216 -27415 58754 34462
6388 34462 -9537 -135940 -132415 -50888 32920 69801 75152 37907 -63416 -134886 -55287 -13036
6376 -13036 -5611 -6810 -69593 -67407 -63483 -86514 -103396 -167332 -142416 -71782 -2550 -20492 -7591
6363 -7591 -53816 -105029 -85803 -1668 -13498 -107240 -176674 -215117 -209957 -91801 16491 54459
$$ packed form
6447b7911Q8809k5849J71058K5169J1346j45212l4934N337L0340m902L3055r8822
6435B7484J615l1744j198n9105J44589M4996o2012j5733N7907n4360p2632K5745
6423E552m0316j34990J36819J9001k7379M708J6047j4118K892J28707P5766M5242
6411B17931n7356j71258Q788M1106Q389K9836L5929j02067j40350O9073J09623
6400D9644K4793N691k7902J1162O4506k5330j08450o0207K4877J3801Q6169k4292
6388C4462m3999j26403L525Q1527Q3808L6881N351l7245j01323p1470P9599M2251
6376a3036P425j199o2783K186L924k3031j6882o3936K4916P0634O9232j7942J2901
6363g591m6225n1213J9226Q4135j1830r3742o9434l8443N160J18156J08292L7968
$$ plain form
6351 54459 27731 -339 9437 18271 28737 94494 176704 171877 58320 -7996 47136 -10670
6339 -10670 -60787 -118508 12270 18101 -4310 127583 68377 18718 6399 -45398 -5238 147843
6327 147843 103556 -43336 -136435 -173724 -170446 -18177 -36180 -23633 -29958 -24437 7864 36846
6315 36846 95206 47217 3789 89013 114549 41328 -125693 -153100 -76230 -101658 21957
6304 21957 5450 -37734 -22685 -81032 -32673 114943 209402 133008 38490 37475 -47552 18814
6292 18814 -5539 -87922 -24931 -28305 91196 40984 17449 49472 50530 71460 191599 158621
6280 158621 31263 -59202 -139433 -181014 -29444 167455 124769 67056 -68364 -39014 4913
6269 4913 44296 -6859 -22922 -41790 6109 45135 294 -40672 -90760 48709 89300 35598
$$ packed form
6351E4459k6728k8070R776Q834J0466O5757Q2210m827j13557o6316N5132n7806
6339a0670n0117n7721J30778N831k2411J31893n9206m9659j2319n1797M0160J53081
6327A47843m4287j46892r3099l7289L278J52269j8003J2547o325N521L2301K8982
6315C6846N8360m7989m3428Q5224K5536p3221j67021k7407P6870k5428J23615
6304B1957j6507m3184J5049n8347M8359J47616R4459p6394r4518j015q5027O6366
6292A8814k4353q2383O2991l374J19501n0212k3535L2023J058K0930J20139l2978
6280A58621j27358r0465q0231m1581J51570J96899m2686n7713j35420K9350M3927
6269D913L9383n1155j6063j8868M7899L9026m4841m0966n0088J39469M0591n3702
$$ plain form
6257 35598 -25980 6952 -57633 53664 156751 188267 160741 128687 69340 37544 79221
6246 79221 57822 99913 112669 132044 76525 110511 80621 72726 87411 160536 119833 139323
6234 139323 145504 83853 64359 95050 170774 155793 101404 70745 87433 36470 15195 106648
6222 106648 97509 55881 35967 -22787 60777 55813 16424 47992 -6025 -44943 -23419 17313
6210 17313 -13022 32091 13424 35759 23992 77277 54830 45593 42084 34934 38658 73434 89390
6197 89390 71998 146075 131659 105322 29059 58601 110593 125248 171924 83838 87215 85808
6185 85808 71053 17925 31 106616 61803 63992 161426 95853 153235 191864 170909 118935
6173 118935 22348 28277 79706 153819 101702 5704 84110 44258 38696 29315 28788 75856 42377
$$ packed form
6257C5598o1578L2932o4585J11297J03087L1516k7526l2054n9347l1796M1677
6246G9221k1399M2091J2756J9375n5519L3986k9890p895J4685P3125m0703J9490
6234A39323O181o1651j9494L0691P5724j4981n4389l0659J6688n0963k1275R1453
6222A06648r139m1628j9914n8754Q3564m964l9389L1568n4017l8918K1524M0732
6210A7313l0335M5113j8667K2335j1767N3285k2447r237l509p150L724L4776J5956
6197H9390j7392P4077j4416k6337p6263K9542N1992J4655M6676q8086L377j407
6185H5808j4755n3128j7894J06585m4813K189R7434o5573N7382L8629k0955n1974
6173A18935r6587N929N1429P4113n2117r5998P8406l9852n562r381n27M7068l3479
$$ plain form
6160 42377 88262 10497 3524 68296 129022 186354 122052 69614 90650 67877 -23353 -81883
6148 -81883 -173601 -109086 70935 128891 77596 26998 42129 97609 204337 116958 100454
6137 100454 79788 128819 76000 74776 26446 26494 52227 86804 91951 161407 216266 193081 75110
6124 75110 24420 56338 126665 142165 68444 -29215 29387 91251 116619 162709 86855 -12376
6112 -12376 -56365 78008 102762 37826 20462 20879 -10912 484 -6837 -64377 -18959 45055
6100 45055 -6510 57250 84928 80323 107601 14223 10447 46746 122278 162853 11523 -78380
6088 -78380 10350 114871 123321 89477 41669 119054 148925 81210 93477 60470 73114 120313
6076 120313 125658 199245 218421 152490 115030 102218 167927 191243 160534 38518 86445 101271
$$ packed form
6160D2377M5885p7765o973O4772O0726N7332o4302n2438K1036k2773r1230n8530
6148h1883r1718O4515J80021N7956n1295n0598J5131N5480J06728q7379j6504
6137A00454k0666M9031n2819j224m8330M8K5733L4577N147O9456N4859k3185j17971
6124G5110n0690L1918P0327J5500p3721r7659N8602O1864K5368M6090p5854r9231
6112a2376m3989J34373K4754o4936j7364M17l1791J1396p321n7540M5418O4014
6100D5055n1565O3760K7678m605K7278r3378l776L6299P5532M0575j51330q9903
6088g8380Q8730J04521Q450l3844m7808P7385K9871o7715J2267l3007J2644M7199
6076A20313N345P3587J9176o5931l7460j2812O5709K3316l0709j22016M7927J4826
$$ plain form
6064 101271 53536 104961 138979 157335 96627 114828 115718 203237 135850 10549 647 8287
6052 8287 139561 244018 49765 4821 -41276 104312 199029 71718 60741 84364 88336
6041 88336 65908 68041 38710 -91753 -63368 -87006 -24387 128304 121658 70153 88624 59699
6029 59699 54366 69160 143131 202861 129419 119905 106203 171560 260048 220149 105774 108908
6017 108908 175270 202471 191594 152658 126801 116050 185240 240300 175019 55177 -49822
6006 -49822 -104198 -50569 71317 78206 121321 92238 89243 27273 141259 158692 78444 -29884
5994 -29884 -111290 -72349 -38221 -18073 -53995 -63034 -33102 80469 179076 166094 82972 -17103
5982 -17103 -3308 90835 162749 203709 200663 111112 60255 78661 109882 147418 89244 -10357
$$ packed form
6064A01271m7735N1425L4018J8356o0708J8201Q90Q7519o7387j25301r902P640
6052H287J31274J04457j94253m4944m6097J45588R4717j27311j0977K3623L972
6041H8336k2428K133k9331j30463K8385k3638O2619J52691o646n1505J8471k8925
6029E9699n333J4794P3971N9730p3442r514j3702O5357Q8488l9899j14375L134
6017A08908O6362K7201j0877l8936k5857j0751O9190N5060o5281j19842j04999
6006d9822n4376N3629J21886O889M3115k9083k995o1970J13986J7433q0248j08328
5994b9884q1406L8941L4128K0148l5922r039K9932J13571R8607j2982q3122j00075
5982a7103J3795R4143P1914M0960l046q9551n0857J8406L1221L7536n8174r9601
$$ plain form
5970 -10357 -43655 -22062 58479 166022 117766 34891 31241 120685 209404 137475 23665 -86239
5958 -86239 -138340 -18797 47490 3095 -52422 -150789 -185258 -91304 -2827 26329 33555 -54804
5946 -54804 -55186 -49026 -104639 -77761 -51008 -109067 -108621 -23488 49167 -35129 -120428 -131584 -31261
5933 -31261 142163 137442 46891 26364 -46639 27606 118181 120598 26540 -61256 -29463 -57738
5921 -57738 -21393 30985 25899 16701 92202 117310 50027 42617 30057 -91154 -8285 -11656
5909 -11656 -31078 -4118 -31392 -140666 -136010 12392 88315 81558 113137 44725 -10105 35968
5897 35968 41573 90496 -7825 -14839 28070 57883 123088 33489 -3271 16939 64812 124968
5885 124968 119461 127662 139908 78676 107318 57314 161229 201487 151316 50201 76930 80305
$$ packed form
5970a0357l3298K1593Q0541J07543m8256q2875l650Q9444Q8719p1929j13810j09904
5958h6239n2101J19543O6287m4395n5517r8367l4469R3954Q8477K9156P226q8359
5946e4804l82O160n5613K6878K6753n8059M46Q5133P2655q4296q5299j1156J00323
5933c1261J73424m721r0551k0527p3003P4245R0575K417r4058q7796L1793k8275
5921e7738L6345N2378n086r198P5501K5108o7283p410j2560j21211Q2869l371
5909a1656j9422K6960k7274j09274M656J48402P5923o757L1579o8412n4830M6073
5897C5968N605M8923r8321p014M2909K9813O5205q9599l6760K0210M7873O0156
5885A24968n507Q201J2246o1232K8642n0004J03915M0258n0171j01115K6729L375
$$ plain form
5873 80305 157142 164064 132526 20190 92421 183367 88872 -20551 -53186 -31939 38916 101984
5861 101984 118431 -5330 -5854 7048 20173 114788 44290 39051 -10998 -9099 -76130 -6919
5849 -6919 -5456 68847 14143 63510 89361 105206 116568 103416 39493 23017 7013 29395
5837 29395 78383 122728 42201 113230 81139 144765 145385 149456 151911 36873 535 103942
5825 103942 138152 139689 119681 51708 73775 112354 185113 207191 125433 75420 51871 91803
5813 91803 107847 136126 101098 -3324 45403 175742 282135 279072 228355 234275 162294 224204
5801 224204 251741 240381 236174 212315 160905 169845 268619 334341 346626 117114 134086 285388
5789 285388 353875 409508 345638 158220 212896 238973 363808 373602 220663 103442 105502
$$ packed form
5873H0305P6837O922l1538j12336P2231R0946r4495j09423l2635K1247P0855O3068
5861A01984J6447j23761n24J2902J3125R4615p0498n239n0049J899o7031O9211
5849f919J463P4303n4704M9367K5851J5845J1362j3152o3923j6476j6004K2382
5837B9395M8988M4345q0527P1029l2091O3626O20M071K455j15038l6338J03407
5825A03942L4210J537k0008o7973K2067L8579P2759K2078q1758n0013k3549L9932
5813I1803J6044K8279l5028j04422M8727J30339J06393l063n0717N920p1981O1910
5801B24204K7537j1360m207k3859n1410Q940R8774O5722J2285k29512J6972J51302
5789B85388O8487N5633o3870j87418N4676K6077J24835R794j52939j17221K060
$$ plain form
5778 105502 193962 334266 289209 239778 228017 213588 267976 349226 264818 147376 127193
5767 127193 61044 147102 122757 135776 170094 141886 221631 322639 355759 348792 260949 208163
5755 208163 235859 295083 396322 352639 187115 108791 172415 146306 275417 297720 188279
5744 188279 171876 254331 307160 392023 426862 330050 153035 154370 179077 197157 134306 174260
5732 174260 129180 117646 222108 226930 205873 262054 191868 237310 324292 373374 357998 219456
5720 219456 199750 165736 199166 224850 152197 115906 145257 226297 232378 268816 239734 116898
5708 116898 206851 289104 279571 223719 198294 203763 196127 278056 247812 157116 197609 200919
5696 200919 189547 159656 300601 279518 133495 163812 227077 329092 394112 226443 185683
$$ packed form
5778A05502Q8460J40304m5057m9431j1761j4429N4388Q1250q4408j17442k0183
5767A27193o6149Q6058k4345J3019L4318k8208P9745J01008L3120o967q7843n2786
5755B08163K7696N9224J01239m3683j65524p8324O3624k6109J29111K2303j09441
5744A88279j6403Q2455N2829Q4863L4839r6812j77015J335K4707J8080o2851L9954
5732A74260m5080j1534J04462M822k1057N6181p0186M5442Q6982M9082j5376j38542
5720B19456j9706l4014L3430K5684p2653l6291K9351Q1040O081L6438k9082j22836
5708A16898Q9953Q2253r533n5852k5425N469p636Q1929l0244r0696M0493L310
5696B00919j1372k9891J40945k1083j46023L0317O3265J02015O5020j67669m0760
$$ plain form
5685 185683 171455 243660 292670 273108 217471 90984 79192 204489 358936 326382 280132
5674 280132 216776 193527 260329 298166 300332 153252 62702 34497 139358 143754 179733 52976
5662 52976 149333 226807 173812 133564 132221 122845 73331 34160 156916 197459 83638 -5592
5650 -5592 23134 93423 116521 113241 56088 29761 23507 73747 59741 151264 100188 110396
5638 110396 142786 82475 87007 137655 112814 111426 154584 166406 87510 41874 139531 37629
5626 37629 87951 114976 186364 184229 129560 95811 104716 173137 151626 104443 77789 50682
5614 50682 90057 20134 6141 -24256 -28387 119876 96557 120144 100915 112444 77321 101479
5602 101479 99716 142240 148985 204401 148970 37412 90743 78116 117759 145665 188762 205709
$$ packed form
5685A85683j4228P2205M9010j9562n5637j26487j1792J25297J54447l2554m6250
5674B80132o3356k3249O6802L7837K166j47080r0550k8205J04861M396L5979j26757
5662E2976R6357P7474n2995m0248j343r376m9514l9171J22756M0543j13821q9230
5650e592K8726P0289K3098l280n7153k6327o254N0240j4006R1523n1076J0208
5638A10396L2390o0311M532N0648k4841j388M3158J1822p8896m5636R7657j01902
5626C7629N0322K7025P1388k135n4669l3749Q905O8421k1511m7183k6654k7107
5614E0682L9375o9923j3993l0397m131J48263k3319K3587j9229J1529l5123K4158
5602A01479j763M2524O745N5416n5431j11558N3331j2627L9643K7906M3097J6947
$$ plain form
5590 205709 111662 99472 111306 187282 122529 162420 234722 172895 128426 101210 89948 177513
5578 177513 150765 172198 230294 181614 115415 208957 188323 195224 137870 97117 100402 84804
5566 84804 95626 173797 206074 111957 117466 154355 225498 191249 182638 132393 109815 136087
5554 136087 235470 279136 138644 79541 58096 75283 216518 290159 205177 105287 21311
5543 21311 212208 215256 232401 235858 135590 19743 58021 176327 235813 177683 22934
5532 22934 33843 80182 159602 205853 103996 67223 129494 135729 268565 212649 82279
5521 82279 165465 270692 325616 354452 314331 179341 153240 242796 304839 325018 272375
5510 272375 294367 276846 282052 312336 372954 427549 368264 398807 470416 433761 406055 365322
$$ packed form
5590B05709r4047j2190J1834P5976o4753L9891P2302o1827m4469k7216j1262Q7565
5578A77513k6748K1433N8096m8680o6199R3542k0634O901n7354m0753L285j5598
5566H4804J0822P8171L2277r4117N509L6889P1143l4249q611n0245k2578K6272
5554A36087R9383M3666j40492n9103k1445J7187J41235P3641q4982r9890q3976
5543B1311J90897L048J7145L457j00268j15847L8278J18306N9486n8130j54749
5532B2934J0909M6339P9420M6251j01857l6773O2271O235J32836n5916j30370
5521H2279Q3186J05227N4924K8836m0121j34990k6101Q9556O2043K0179n2643
5510B72375K1992j7521N206L0284O0618N4595n9285L0543P1609l6655k7706m0733
$$ plain form
5498 365322 340690 343367 378033 335751 356557 304154 247192 320255 376073 380954 484022 431205
5486 431205 441483 417058 331433 368345 456766 479910 626451 615903 557094 453918 487073
5475 487073 545577 577198 549563 460836 423373 340070 427046 482523 510305 437423 410235 454509
5463 454509 480755 460647 504205 479331 449326 568832 569990 547141 523158 328496 304105
5452 304105 419875 440536 528122 453104 351437 419653 487211 590263 647045 562760 665235
5441 665235 537962 460207 560679 446553 397419 437694 483892 521614 629047 629428 594685
5430 594685 558710 577270 755347 811278 749038 769624 663438 745610 864393 759707 804546
5419 804546 802462 769001 790957 736336 743290 724236 813256 878536 925926 991162 910509 851193
$$ packed form
5498C65322k4632K677L4666m2282K0806n2403n6962P3063N5818M881J03068n2817
5486D31205J0278k4425q5625L6912Q8421K3144J46541j0548n8809j03176L3155
5475D87073N8504L1621k7635q8727l7463q3303Q6976N5477K7782p2882k7188M4274
5463D54509K6246k0108M3558k4874l0005J19506J158k2849k3983j94662k4391
5452C04105J15770K0661Q7586p5018j01667O8216O7558J03052N6782q4285J02475
5441F65235j27273p7755J00472j14126m9134M0275M6198L7722J07433L81l4743
5430E94685l5975J8560J78077N5931o2240K0586j06186Q2172J18783j04686M4839
5419H04546k084l3461K1956n4621O954j9054Q9020O5280M7390O5236q0653n9316
$$ plain form
5407 851193 783460 850203 890794 907597 1032453 929524 856533 828838 865233 916711 998070
5396 998070 1117001 1204693 1183053 1161563 1106735 1173359 1144804 1125794 1048721 1105138 1175344
5385 1175344 1057534 1152238 1148097 1054402 1075999 1189786 1148976 1070538 1003305 1002440 948652 958051
5373 958051 1024923 1064194 1080096 898070 817363 879545 934755 827332 902377 849341 830674
5362 830674 870132 954006 815850 647082 691127 707039 753167 743032 678659 517224 441537
5351 441537 469050 580170 667278 771251 671589 661283 609967 530674 576096 631804 580792
5340 580792 537294 584490 583194 490688 505219 599082 504828 581303 758388 716262 547000
5329 547000 582952 597493 581249 681974 766193 688778 636867 624469 604594 657129 663884 637225
$$ packed form
5407H51193o7733O6743M0591J6803J24856j02929p2991k7695L6395N1478Q1359
5396I98070J18931Q7692k1640k1490n4828O6624k8555j9010p7073N6417P0206
5385A175344j17810R4704m141r3695K1597J13787m0810p8438o7233q65n3788R399
5373I58051O6872L9271J5902j82026q0707O2182N5210j07423P5045n3036j8667
5362H30674L9458Q3874j38156j68768M4045J5912M6128j0135o4373j61435p5687
5351D41537K7513J11120Q7108J03973r9662j0306n1316p9293M5422N5708n1012
5340E80792m3498M7196j296r2506J4531R3863r4254P6475J77085m2126j69262
5329E47000L5952J4541j6244J00725Q4219p7415n1911j2398j9875N2535O755k6659
$$ plain form
5317 637225 626167 763055 665156 633048 692217 667240 619202 643568 630383 623204 614620 640843
5305 640843 676279 674984 757352 806365 896838 930156 874490 742225 718805 841862 904297
5294 904297 913367 923604 873398 838425 923811 900269 879776 952399 995960 1012974 1051544 1058225
5282 1058225 1109180 955713 1019763 1067439 1010275 1096852 1076248 944482 967266 1029887 1118118
5271 1118118 1058321 1018896 1110849 1099109 1130080 1164741 1077816 1006097 1098493 1057908 1176050
5260 1176050 1212796 1047839 1045290 1127319 1106789 1129491 1202759 1197145 1086266 1114518 1210084
5249 1210084 1228245 1311880 1408490 1334594 1215502 1284273 1321345 1268011 1322243 1264232 1183621
5238 1183621 1302519 1270677 1307748 1362612 1305413 1339554 1470406 1651170 1597362 1511438 1533814
$$ packed form
5317F37225j1058J36888r7899l2108N9169k4977m8038K4366j3185p179q584K6223
5305F40843L5436j295Q2368M9013R0473L3318n5666j32265k3420J23057O2435
5294I04297R070J0237n0206l4973Q5386k3542k0493P2623M3561J7014L8570O681
5282A058225N0955j53467O4050M7676n7164Q6577k0604j31766K2784O2621Q8231
5271A118118n9797l9425R1953j1740L0971L4661q6925p1719R2396m0585J18142
5260A176050L6746j64957k549Q2029k0530K2702P3268n614j10879K8252R5566
5249A210084J8161Q3635R6610p3896j19092O8771L7072n3334N4232n8011q0611
5238A183621J18898l1842L7071N4864n7199L4141J30852J80764n3808q5924K2376
$$ plain form
5227 1533814 1544099 1534475 1693276 1780498 1729717 1733292 1812990 1801571 1932894 2057882 2024009
5216 2024009 1968433 2019585 2058549 2085255 2128709 2145034 2034267 2063527 2240725 2263250 2326829
5205 2326829 2288687 2256593 2330942 2396231 2468489 2529988 2470415 2436096 2482549 2519313 2637806
5194 2637806 2604315 2516964 2590111 2643680 2623150 2708070 2657012 2639217 2754894 2776306 2846727
5183 2846727 2979622 2878761 2926579 2944138 2906807 2978417 3050158 3126524 3107980 3078322 3122590
5172 3122590 3267956 3312442 3408350 3394200 3436920 3461717 3538351 3567643 3715664 3738414 3765560
5161 3765560 3857858 3819765 3863920 3925183 4067109 4130314 4133385 4174165 4328358 4436813 4502153
5150 4502153 4569688 4531955 4625989 4731306 4800196 4853137 4931446 4907585 4992067 5033836 5185987
$$ packed form
5227A533814J0285r624J58801Q7222n0781L575P9698j1419J31323J24988l3873
5216B024009n5576N1152L8964K6706M3454J6325j10767K9260J77198K2525O3579
5205B326829l8142l2094P4349O5289P2258O1499n9573l4319M6453L6764J18493
5194B637806l3491q7351P3147N3569k0530Q4920n1058j7795J15677K1412P0421
5183B846727J32895j00861M7818J7559l7331P1610P1741P6366j8544k9658M4268
5172C122590J45366M4486R5908j4150M2720K4797P6634K9292J48021K2750K7146
5161C765560R2298l8093M4155O1263J41926O3205L071M0780J54193J08455O5340
5150D502153O7535l7733R4034J05317O8890N2941P8309k3861Q4482M1769J52151
$$ plain form
5139 5185987 5418218 5550623 5564648 5553189 5669398 5830887 6002818 6161272 6383215 6442209
5129 6442209 6582019 6900220 7083905 7249904 7375024 7443983 7723770 7966741 8222652 8442403
5119 8442403 8538108 8662363 8977159 9215093 9473321 9648719 9809571 9945331 10131292 10521633
5109 10521633 10772968 11060246 11219622 11384535 11589016 11920326 12392291 12671060 13052582
5100 13052582 13415899 13641471 14066967 14494089 14854683 15276366 15653830 16065670 16562897
5091 16562897 17079259 17547787 18016031 18558606 19166521 19884788 20771917 21508602 22221863
5082 22221863 22884260 23653499 24482953 25413708 26450115 27483805 28433194 29416421 30481100
5073 30481100 31569028 32807230 34138615 35522902 37112805 38886028 40689815 42858293
$$ packed form
5139E185987K32231J32405J4025j1459J16209J61489J71931J58454K21943N8994
5129F442209J39810L18201J83685J65999J25120O8959K79787K42971K55911K19751
5119H442403R5705J24255L14796K37934K58228J75398J60852J35760J85961L90341
5109A0521633K51335K87278J59376J64913K04481L31310M71965K78769L81522
5100A3052582L63317K25572M25496M27122L60594M21683L77464M11840M97227
5091A6562897N16362M68528M68244N42575O07915P18267Q87129P36685P13261
5082B2221863O62397P69239Q29454R30755J036407J033690R49389R83227J064679
5073C0481100J087928J238202J331385J384287J589903J773223J803787K168478
$$ plain form
5065 42858293 45075099 47433943 50121191 52859929 55568500 58091391 60333533 62435090
5057 62435090 64258262 65952041 67755718 69428533 70935214 72359833 73797247 75380969
5049 75380969 77073751 78818758 80680628 82557081 84403218 86351303 88396410 90468133
5041 90468133 92459482 94461591 96644531 99074179 101581824 104170933 106849520 109466975
5033 109466975 112074345 114267106 115556644 115484326 114149709 112027044 109467313 106924920
5025 106924920 104522926 102313257 100053285 97831548 95639162 93419035 91246141 89124736
5017 89124736 86951216 84717416 82523591 80616459 78780579 76921964 75090709 73382784
5009 73382784 71928904 70549086 69138686 67557983 65870741 64090173 62121728 60033579
$$ packed form
5065D2858293K216806K358844K687248K738738K708571K522891K242142K101557
5057F2435090J823172J693779J803677J672815J506681J424619J437414J583722
5049G5380969J692782J745007J861870J876453J846137J948085K045107K071723
5041I0468133J991349K002109K182940K429648K507645K589109K678587K617455
5033A09466975K607370K192761J289538p2318j334617k122665k559731k542393
5025A06924920k401994k209669k259972k221737k192386k220127k172894k121405
5017H9124736k173520k233800k193825j907132j835880j858615j831255j707925
5009G3382784j453880j379818j410400j580703j687242j780568j968445k088149
$$ plain form
5001 60033579 57617706 55042938 52357635 49510259 46817173 44294375 42019851 39905022
4993 39905022 38020857 36302037 34719384 33383553 32109923 30866972 29605588 28418765
4985 28418765 27290895 26296654 25351823 24322812 23250210 22352521 21560286 20904345 20288868
4976 20288868 19555582 18765675 18053208 17510689 16998157 16435281 15880931 15440506 14940215
4967 14940215 14492176 14116059 13758028 13331573 12853078 12403964 12130081 11914694 11566197
4958 11566197 11233570 10892967 10553426 10406257 10273876 10139370 9841178 9501926 9152490
4949 9152490 8923556 8692627 8524131 8287118 8115213 7804154 7725375 7620310 7460531 7280093
4939 7280093 7034945 6991729 6855088 6648833 6476778 6253116 6018067 5918774 5764435 5697325
$$ packed form
5001F0033579k415873k574768k685303k847376k693086k522798k274524k114829
4993C9905022j884165j718820j582653j335831j273630j242951j261384j186823
4985B8418765j127870r94241r44831j029011j072602q97689p92235o55941o15477
4976B0288868p33286p89907p12467n42519n12532n62876n54350m40425n00291
4967A4940215m48039l76117l58031m26455m78495m49114k73883k15387l48497
4958A1566197l32627l40603l39541j47169j32381j34506k98192l39252l49436
4949I152490k28934k30929j68496k37013j71905l11059p8779j05065j59779j80438
4939G280093k45148m3216j36641k06255j72055k23662k35049r9293j54339o7110
$$ plain form
4929 5697325 5652043 5570527 5326005 5155363 5141122 5050934 4906182 4903528 4806056 4714253 4635621
4918 4635621 4541989 4428986 4352718 4255039 4174527 4118135 4008119 3889415 3821486 3837371 3788164
4907 3788164 3689974 3603728 3522254 3518921 3512846 3450267 3326587 3283522 3299212 3270077 3214893 3195480
4895 3195480 3085585 2997031 3035026 3024518 2966446 2971226 2813249 2677715 2776848 2750847 2615807
4884 2615807 2567703 2551357 2480723 2442829 2491693 2443450 2362242 2371697 2293190 2256154 2290344 2303517
4872 2303517 2283822 2085956 2018228 2101477 2072614 1968454 1913458 1797183 1788650 1842836 1854588
4861 1854588 1889118 1779322 1687209 1690881 1704602 1765941 1781844 1565165 1458358 1514749 1571470
4850 1571470 1662290 1588691 1420517 1372508 1393932 1414216 1553627 1572838 1425102 1436146 1463544
$$ packed form
4929E697325m5282q1516k44522j70642j4241r0188j44752k654r7472r1803p8632
4918D635621r3632j13003p6268r7679q0512n6392j10016j18704o7929J5885m9207
4907C788164r8190q6246q1474l333o075o2579j23680m3065J5690k9135n5184j9413
4895C195480j09895q8554L7995j0508n8072M780j57977j35534R9133k6001j35040
4884B615807m8104j6346p0634l7894M8864m8243q1208R455p8507l7036L4190J3173
4872B303517j9695j97866o7728Q3249k8863j04160n4996j16275q533N4186J1752
4861A854588L4530j09796r2113L672J3721O1339J5903k16679j06807N6391N6721
4850A571470R0820p3599j68174m8009K1424K0284J39411J9211j47736J1044K7398
$$ plain form
4839 1463544 1468004 1442141 1434155 1389706 1292332 1334494 1430957 1400005 1324451 1331977 1285189 1307536
4827 1307536 1364519 1276676 1211490 1293046 1310139 1285483 1312284 1302223 1271941 1238540 1294964
4816 1294964 1335752 1319896 1289372 1274991 1258677 1189820 1212927 1202712 1208365 1277290 1194451 1246048
4804 1246048 1288114 1163359 1195342 1282599 1275118 1237927 1231061 1249778 1121377 1185772 1277693
4793 1277693 1203162 1201080 1158186 1098005 1157225 1232564 1181407 1115112 1097313 1096361 1111317 1134916
4781 1134916 1033663 1020358 996981 984802 1045412 1030619 1041236 1012920 966939 952174 1009859
4770 1009859 998977 948547 948738 930652 930461 994770 1050120 1047304 939004 911955 952718 1028811
4758 1028811 999244 986227 925066 900603 916011 919468 925849 853217 791023 757689 872039 967501
$$ packed form
4839A463544M460k5863p986m4449r7374M2162R6463l0952p5554P526m6788K2347
4827A307536N6983q7843o5186Q1556J7093k4656K6801j0061l0282l3401N6424
4816A294964M0788j5856l0524j4381j6314o8857K3107j0215N653O8925q2839N1597
4804A246048M2066j24755L1983Q7257p481l7191o866J8717j28401O4395R1921
4793A277693p4531k082m2894o0181N9220P5339n1157o6295j7799r52J4956K3599
4781A134916j01253j3305k3377j2179O0610j4793J0617k8316m5981j4765N7685
4770A009859j0882n0430J91j8086j91O4309N5350k816j08300k7049M0763P6093
4758A028811k9567j3017o1161k4463J5408L457O381p2632o2194l3334J14350R5462
$$ plain form
4746 967501 911915 808884 810982 883189 861873 970858 953602 818732 900986 825048 774034
4735 774034 867165 900236 847924 898462 1000312 977870 964360 966381 1004040 1027133 1070099 1115349
4723 1115349 1051755 944692 901786 953609 1088164 1121936 1039579 1046018 1033413 1000321 1025601
4712 1025601 1104368 1174732 1226989 1258024 1276733 1223740 1127832 1084623 1074399 1127026 1190104
4701 1190104 1211997 1151441 1195344 1223498 1278364 1408826 1518734 1500409 1433069 1353839 1325847
4690 1325847 1332629 1239324 1288338 1186237 1217638 1293327 1259383 1285532 1380616 1259200 1296183
4679 1296183 1438492 1546076 1551668 1427224 1270387 1291650 1282570 1336573 1408250 1350307 1354489
4668 1354489 1331097 1322748 1359799 1407542 1415882 1420166 1282969 1237443 1204039 1108665 1055308 1033968
$$ packed form
4746I67501n5586j03031K098P2207k1316J08985j7256j34870Q2254p5938n1014
4735G74034R3131L3071n2312N0538J01850k2442j3510K021L7659K3093M2966M5250
4723A115349o3594j07063m2906N1823J34555L3772q2357O439j2605l3092K5280
4712A025601P8767P0364N2257L1035J8709n2993r5908m3209j0224N2627O3078
4701A190104K1893o0556M3903K8154N4866J30462J09908j8325o7340p9230k7992
4690A325847O782r3305M9014j02101L1401P5689l3944K6149R5084j21416L6983
4679A296183J42309J07584N592j24444j56837K1263r080N4003P1677n7943M182
4668A354489k3392q349L7051M7743Q340M284j37197m5526l3404r5374n3357k1340
$$ plain form
4656 1033968 1060072 1124409 1196207 1172202 1107520 926601 963134 997845 1081140 1134524 1147834
4645 1147834 1076662 982965 993650 994466 1069078 1102085 1081353 1002556 912988 959139 1139090 1100463
4633 1100463 1104693 1008253 981788 1018625 1048168 978026 913753 847734 863957 892433 939773 952780
4621 952780 860677 673449 695429 830813 902050 911095 793212 749337 722007 792928 887047
4610 887047 784517 767560 760189 790427 865471 844377 774876 724412 668332 732021 868069
4599 868069 873243 818181 776254 802779 864680 879363 898657 898496 812502 825205 936382 929206
4587 929206 889673 864316 946533 903774 863197 880761 826055 776719 859406 872338 831740 843260
4575 843260 778939 698622 693197 815576 739936 764079 782339 775740 708798 705901 724856 624187
$$ packed form
4656A033968K6104O4337P1798k4005o4682j80919L6533L4711Q3295N3384J3310
4645A147834p1172r3697J0685Q16P4612L3007k0732p8797q9568M6151J79951l8627
4633A100463M230r6440k6465L6837K9543p0142o4273o6019J6223K8476M7340J3007
4621I52780r2103j87228K1980J35384P1237R045j17883m3875k7330P0921R4119
4610H87047j02530j6957p371L0238P5044k1094o9501n0464n6080O3689J36048
4599H68069N174n5062m1927K6525O1901J4683J9294j61q5994J2703J11177p176
4587I29206l9533k5357Q2217m2759m0577J7564n4706m9336Q2687J2932m0598J1520
4575H43260o4321q0317n425J22379p5640K4143J8260o599o6942k897J8955j00669
$$ plain form
4563 624187 493910 533580 605182 654492 723377 588072 559256 603462 773805 834964 824673
4552 824673 848033 874689 948953 988199 1055225 992422 959023 986444 994242 1071105 1118560 1105240
4540 1105240 1172217 1236080 1258052 1345790 1384540 1344042 1328759 1289608 1364117 1346353 1364404
4529 1364404 1314490 1212170 1251797 1380633 1433138 1431764 1404520 1356135 1429577 1520958 1576675
4518 1576675 1530597 1473101 1492602 1504751 1616480 1691912 1771880 1816059 1846288 1863299 1915510
4507 1915510 1981859 2066060 2163266 2267225 2278349 2381920 2428897 2472707 2597605 2577027 2580310
4496 2580310 2648448 2692048 2713924 2768706 2749040 2764729 2856274 2952864 3033082 3002876 2766916
4485 2766916 2707683 2634922 2693646 2733162 2665405 2625903 2636376 2579734 2624980 2751274 2780627
$$ packed form
4563F24187j30277L9670P1602M9310O8885j35305k8816M4206J70343O1159j0291
4552H24673K3360K6656P4264L9246O7026o2803l3399K7421P798P6863M7455j3320
4540A105240O6977O3863K1972Q7738L8750m0498j5283l9151P4509j7764J8051
4529A364404m9914j02320L9627J28836N2505j374k7244m8385P3442R1381N5717
4518A576675m6078n7496J9501J2149J11729P5432P9968M4179L0229J7011N2211
4507A915510O6349Q4201R7206J03959J1124J03571M6977M3810J24898k0578L283
4496B580310O8138M3600K1876N4782j9666J5689R1545R6590Q0218l0206k35960
4485B766916n9233p2761N8724L9516o7757l9502J0473n6642M5246J26294K9353
$$ plain form
4474 2780627 2777187 2737815 2871936 3018797 3136480 3032118 3034721 3055544 3119251 3191149 3161906
4463 3161906 3151460 3061617 3139851 3233384 3394870 3547580 3580473 3657414 3690635 3662579 3830923
4452 3830923 4005013 3950785 3835008 3909323 3931339 3925114 4020511 4068449 4121733 4228161 4343700
4441 4343700 4551114 4678693 4684161 4743467 4789217 4939035 5060301 5147140 5221956 5214577 5203670
4430 5203670 5357589 5482661 5444140 5514703 5498495 5527122 5581760 5634001 5694508 5708683 5751710
4419 5751710 5846639 5830712 5867292 5855760 5883148 5991276 6055529 5933406 5974696 6174408 6180991
4408 6180991 6251885 6224749 6284728 6371784 6440353 6505257 6551831 6543791 6619336 6736406 6797330
4397 6797330 7024451 7133340 7174123 7204353 7154163 7282281 7451977 7504749 7553990 7679272
$$ packed form
4474B780627l440l9372J34121J46861J17683j04362K603K0823O3707P1898k9243
4463C161906j0446q9843P8234R3533J61486J52710L2893P6941L3221k8056J68344
4452C830923J74090n4228j15777P4315K2016o225R5397M7938N3284J06428J15539
4441D343700K07414J27579N468N9306M5750J49818J21266Q6839P4816p379j0907
4430E203670J53919J25072l8521P0563j6208K8627N4638N2241O0507J4175M3027
4419E751710R4929j5927L6580j1532K7388J08128O4253j22123M1290J99712O583
4408F180991P0894k7136N9979Q7056O8569O4904M6574q040P5545J17070O0924
4397F797330K27121J08889M0783L0230n0190J28118J69696N2772M9241J25282
$$ plain form
4387 7679272 7764399 7865980 8050063 8074766 8130061 8270132 8434252 8570090 8563550 8685558
4377 8685558 8713122 8818093 9005026 9180698 9206974 9295477 9351343 9380936 9549945 9704123
4367 9704123 9765729 9867796 9969339 10030587 10128048 10258596 10438698 10654207 10727959 10979027
4357 10979027 11154774 11270711 11410239 11383163 11568106 11893489 12174052 12444491 12760906 12940272
4347 12940272 13237054 13658179 14108693 14547133 15048194 15553098 15999967 16590815 17262944
4338 17262944 17704323 18116040 18423081 18766413 19142790 19376417 19589874 19827353 20168975
4329 20168975 20663914 21107362 21467742 21807199 22137427 22487828 22913032 23349542 23756102
4320 23756102 24305298 24753591 25157829 25819834 26362668 26975876 27474205 28066025 28706478
$$ packed form
4387G679272Q5127J01581J84083K4703N5295J40071J64120J35838o540J22008
4377H685558K7564J04971J86933J75672K6276Q8503N5866K9593J69009J54178
4367I704123O1606J02067J01543O1248R7461J30548J80102K15509P3752K51068
4357A0979027J75747J15937J39528k7076J84943L25383K80563K70439L16415J79366
4347A2940272K96782M21125M50514M38440N01061N04904M46869N90848O72129
4338A7262944M41379M11717L07041L43332L76377K33627K13457K37479L41622
4329B0168975M94939M43448L60380L39457L30228L50401M25204M36510M06560
4320B3756102N49196M48293M04238O62005N42834O13208M98329N91820O40453
$$ plain form
4311 28706478 29325215 29924966 30582822 31163710 31765381 32423836 33068799 33880017 34632000
4302 34632000 35279878 36141501 37191182 38157900 39240494 40422234 41663617 42969179 44434417
4293 44434417 45984743 47549565 49234916 51082952 52961059 54859988 57000379 59229457
4285 59229457 61484665 64007741 66558549 69285030 72310707 75495383 78826830 82507203
4277 82507203 86509998 90629644 94921371 99375209 104032500 109024189 114479830 120420479
4269 120420479 126813867 133956511 141723704 150216082 159878273 171021740 183758728 198659848
4261 198659848 215596712 234535754 255357668 278759887 304866544 333844644 366007602
4254 366007602 400825095 436464206 470286609 498202638 514777916 515910712 501753917
$$ packed form
4311B8706478O18737N99751O57856N80888O01671O58455O44963Q11218P51983
4302C4632000O47878Q61623J049681R66718J082594J181740J241383J305562J465238
4293D4434417J550326J564822J685351J848036J878107J898929K140391K229078
4285E9229457K255208K523076K550808K726481L025677L184676L331447L680373
4277H2507203M002795M119646M291727M453838M657291M991689N455641N940649
4269A20420479O393388P142644P767193Q492378R662191J1143467J2736988J4901120
4261A98659848J6936864J8939042K0821914K3402219K6106657K8978100L2162958
4254C66007602L4817493L5639111L3822403K7916029J6575278J132796j4156795
$$ plain form
4247 501753917 476260846 445055285 412713852 381464567 352296645 325314906 300428638
4240 300428638 277372727 256177890 236791900 219193106 203126464 188662978 175396176
4233 175396176 163265284 152476415 142785119 134072787 126286102 119297029 112984060 107222751
4225 107222751 101938526 97045290 92445908 88317635 84375012 80662194 77293879 74057614
4217 74057614 71029713 68230505 65604776 63006409 60543522 58287162 56159397 54111594
4209 54111594 52177755 50329584 48632685 46817808 45271895 43774285 42300831 41020258
4201 41020258 39828802 38811840 37763666 36808938 35768308 34688754 33764468 32977715 32227173
4192 32227173 31432275 30589300 29850852 29152456 28560486 28051213 27546971 27037058 26515314
$$ packed form
4247E01753917k5493071l1205561l2341433l1249285k9167922k6981739k4886268
4240C00428638k3055911k1194837j9385990j7598794j6066642j4463486j3266802
4233A75396176j2130892j0788869r691296q712332p786685o989073o312969n761309
4225A07222751n284225m893236m599382m128273l942623l712818l368315l236265
4217G4057614l027901k799208k625729k598367k462887k256360k127765k047803
4209E4111594j933839j848171j696899j814877j545913j497610j473454j280573
4201D1020258j191456j016962j048174r54728j040630j079554r24286p86753p50542
4192C2227173p94898q42975p38448o98396n91970n09273n04242n09913n21744
$$ plain form
4183 26515314 26028477 25469895 25009183 24618495 24091963 23604297 23213462 22796464 22544038
4174 22544038 22128302 21642143 21200130 20838274 20428643 20152722 19713701 19387091 18960733
4165 18960733 18572331 18236454 17971103 17699479 17427930 17044194 16641592 16305597 16017549
4156 16017549 15687684 15307832 14990082 14681333 14508556 14367542 14169912 13973282 13834242
4147 13834242 13713778 13687621 13703035 13673917 13471859 13447352 13385773 13274012 13312420 13376030 13246185
4136 13246185 13169174 13059087 12967543 12992873 13056059 13027384 12911342 12867910 12918200 12835098 12759483
4125 12759483 12749736 12723746 12554113 12595773 12498600 12397911 12378175 12293027 12271255 12227058 12243368
4114 12243368 12139573 12059124 12114433 12030250 11988508 12044282 12004548 11915124 12059616 12219767 12249160
$$ packed form
4183B6515314m86837n58582m60712l90688n26532m87666l90835m16998k52426
4174B2544038m15736m86159m42013l61856m09631k75921m39021l26610m26358
4165A8960733l88402l35877k65351k71624k71549l83736m02602l35995k88048
4156A6017549l29865l79852l17750l08749j72777j41014j97630j96630j39040
4147A3834242j20464k6157J5414k9118k02058k4507o1579j11761L8408O3610j29845
4136A3246185p7011j10087r1544K5330O3186k8675j16042m3432N0290q3102p5615
4125A2759483r747k5990j69633M1660r7173j00689j9736q5148k1772m4197J6310
4114A2243368j03795q0449N5309q4183m1742N5774l9734q9424J44492J60151K9393
$$ plain form
4103 12249160 12308863 12530870 12572349 12769594 13054080 13124297 13148666 13361198 13631057 13917534
4093 13917534 14191047 14399398 14535866 14746692 15080223 15421422 15753102 15990070 16208177
4084 16208177 16374216 16724265 17050922 17183003 17308102 17516202 17720447 17945252 18193953
4075 18193953 18443768 18634238 18914298 19281164 19656779 20051618 20328384 20575990 20984274
4066 20984274 21446189 21868700 22253562 22581504 22730615 23013021 23471096 23878006 24330809
4057 24330809 24777486 25213345 25719750 26377412 27165044 27865035 28507128 29416466 30330201
4048 30330201 31283978 32342247 33467685 34581155 35753952 37074618 38486101 40011917
4040 40011917 41443505 42958849 44584531 46391456 48230866 50307066 52531877 55021919
$$ packed form
4103A2249160N9703K22007M1479J97245K84486P0217K4369K12532K69859K86477
4093A3917534K73513K08351J36468K10826L33531L41199L31680K36968K18107
4084A6208177J66039L50049L26657J32081J25099K08100K04245K24805K48701
4075A8193953K49815J90470K80060L66866L75615L94839K76766K47606M08284
4066B0984274M61915M22511L84862L27942J49111K82406M58075M06910M52803
4057B4330809M46677M35859N06405O57662P87632O99991O42093R09338R13735
4048C0330201R53777J058269J125438J113470J172797J320666J411483J525816
4040D0011917J431588J515344J625682J806925J839410K076200K224811K490042
$$ plain form
4032 55021919 57663833 60552590 63388656 66236539 69303941 72493895 76105804 80093055
4024 80093055 84292987 88914326 93903934 99459732 105779188 112988429 121648721 131944341
4016 131944341 143714900 156895798 171580990 188200282 206961709 228227114 252422079
4009 252422079 279673890 308789031 337688721 362840393 378439027 379370244 365181189
4002 365181189 341007011 313062591 285479396 260095455 237177337 216772662 198267750
3995 198267750 181392210 166050303 151896062 139199081 128001826 117982562 108772058
3988 108772058 100433886 93083828 86571983 80814852 75836186 71400953 67487028 63887507
3980 63887507 60627384 57679971 55004424 52366838 49927739 47770453 45819399 44039796
$$ packed form
4032E5021919K641914K888757K836066K847883L067402L189954L611909L987251
4024H0093055M199932M621339M989608N555798O319456P209241Q660292J0295620
4016A31944341J1770559J3180898J4685192J6619292J8761427K1265405K4194965
4009B52422079K7251811K9115141K8899690K5151672J5598634R31217j4189055
4002C65181189k4174178k7944420k7583195k5383941k2918118k0404675j8504912
3995A98267750j6875540j5341907j4154241j2696981j1197255j0019264r210504
3988A08772058q338172p350058o511845n757131m978666m435233l913925l599521
3980F3887507l260123k947413k675547k637586k439099k157286j951054j779603
$$ plain form
3972 44039796 42354364 40695954 39163790 37561331 36042993 34778552 33545468 32321069
3964 32321069 31193335 30005688 28907554 27900549 26871446 25768083 24835940 24053116
3956 24053116 23331942 22642433 22050171 21354523 20700423 20205113 19769942 19199810 18603247
3947 18603247 18071532 17535909 17067801 16655787 16251690 15866734 15573965 15181315 14718389
3938 14718389 14381993 14164810 13854825 13564994 13300071 13049538 12846641 12615698 12386008
3929 12386008 12172239 11901739 11692222 11376662 11188740 10861072 10521139 10254147 10008620
3920 10008620 9832062 9617933 9455015 9200155 8941510 8805788 8630943 8320621 8151972
3911 8151972 7889029 7666545 7415687 7191342 7016957 6752001 6578640 6528545 6485587 6381855
$$ packed form
3972D4039796j685432j658410j532164j602459j518338j264441j233084j224399
3964C2321069j127734j187647j098134j007005j029103j103363r32143p82824
3956B4053116p21174o89509n92262o95648o54100m95310m35171n70132n96563
3947A8603247n31715n35623m68108m12014m04097l84956k92769l92650m62926
3938A4718389l36396k17183l09985k89831k64923k50533k02897k30943k29690
3929A2386008k13769k70500k09517l15560j87922l27668l39933k66992k45527
3920A0008620j76558k14129j62918k54860k58645j35722j74845l10322j68649
3911H151972k62943k22484k50858k24345j74385k64956j73361n0095m2958j03732
$$ plain form
3901 6381855 6241302 6040403 6067870 6072766 6060293 5960322 5909299 5789289 5771925 5674682 5697428
3890 5697428 5654946 5530159 5524068 5505385 5412734 5298011 5198057 5114158 5052850 5075812 4994147
3879 4994147 4860801 4733468 4660510 4491285 4451235 4497901 4346488 4257433 4255693 4073252 3986481
3868 3986481 3941624 3828668 3728827 3592686 3528003 3452804 3350162 3275537 3197424 3141540 3220435
3857 3220435 3281409 3247980 3167322 3101054 3058266 3161564 3181781 3151735 3111615 3076541 3017959
3846 3017959 2989827 2989050 3096966 2991786 3017676 3091011 3068963 3011609 2984732 2952240 2926485
3835 2926485 3053830 3048757 2912881 2799640 2697442 2543120 2547795 2546755 2427571 2309578 2260203
3824 2260203 2276741 2257805 2339846 2320372 2251788 2295747 2383286 2315133 2308854 2187150 2119920
$$ packed form
3901F381855j40553k00899K7467M896j2473r9971n1023j20010j7364r7243K2746
3890E697428m2482j24787o091j8683r2651j14723r9954q3899o1308K2962q1665
3879D994147j33346j27333p2958j69225m0050M6666j51413q9055j740j82441q6771
3868C986481m4857j12956r9841j36141o4683p5199j02642p4625p8113n5884P8895
3857C220435O0974l3429q0658o6268m2788J03298K0217l0046m0120l5074n8582
3846C017959k8132p77J07916j05180K5890P3335k2048n7354k6877l2492k5755
3835B926485J27345n073j35876j13241j02198j54322M675j040j19184j17993m9375
3824B260203J6538j8936Q2041j9474o8584M3959Q7539o8153o279j21704o7230
$$ plain form
3813 2119920 2156700 2225317 2225542 2228446 2132184 2091481 2050082 2129534 2195583 2190345 2108695 2101719
3801 2101719 2089912 2004295 2008597 1963713 1884851 1859644 1821432 1758335 1711394 1726047 1693562 1684876
3789 1684876 1857451 1962939 1919617 1887995 1768139 1723142 1663129 1773489 1706343 1564034
3779 1564034 1447133 1323647 1472633 1606374 1662620 1641734 1661364 1622618 1509636 1466400
3769 1466400 1438776 1270102 1249710 1251200 1273293 1129180 1049245 946255 851456 874582 920951
3758 920951 886591 887362 903557 875727 793477 846308 844693 815248 765099 595408 563514 626578
3746 626578 500174 414713 385681 423028 453510 503836 505777 396749 403454 566156 667520
3735 667520 656137 528517 502404 454297 546219 644915 640918 505730 469724 357472 458246
$$ packed form
3813B119920L6780O8617K25K904r6262m0703m1399P9452O6049n238q1650o976
3801B101719j1807q5617M302m4884p8862k5207l8212o3097m6941J4653l2485q686
3789A684876J72575J05488m3322l1622j19856m4997o0013J10360o7146j42309
3779A564034j16901j23486J48986J33741N6246k0886J9630l8746j12982m3236
3769A466400k7624j68674k0392J490K2093j44113p9935j02990r4799K3126M6369
3758I20951l4360P71J6195k7830q2250N2831j615k9445n0149j69691l1894O3064
3746F26578j26404q5461k9032L7347L0482N0326J941j09028O705J62702J01364
3735F67520j1383j27620k6113m8107R1922R8696l997j35188l6006j12252J00774
$$ plain form
3724 458246 592418 539541 440719 465416 547060 612246 769040 733408 550125 546879 618358
3713 618358 671268 685711 642919 598093 505971 499462 588890 580681 566982 514942 542007 535166
3701 535166 587954 517248 465747 438853 397248 469958 557917 577733 562987 504275 502699 485546
3689 485546 422017 466118 553134 603633 622431 727951 730233 752333 804393 814451 834895 981634
3677 981634 1150865 1318294 1249630 1324896 1492576 1645917 1833653 1989587 2076969 2218148
3667 2218148 2204793 2103097 2014138 1933946 1707652 1587914 1385138 1245319 1170749 1140393
3657 1140393 993218 877115 751346 735549 618843 542322 491855 446285 399956 470921 362467
3646 362467 266463 305337 347062 279554 279992 212983 139955 258696 318424 284455 270018 207137
$$ packed form
3724D58246J34172n2877r8822K4697Q1644O5186J56794l5632j83283l246P1479
3713F18358N2910J4443m2792m4826r2122o509Q9428q209j3699n2040K7065o841
3701E35166N2788p0706n1501k6894m1605P2710Q7959J9816j4746n8712j576j7153
3689D85546o3529M4101Q7016N0499J8798J05520K282K2100N2060J0058K0444J46739
3677I81634J69231J67429o8664P5266J67680J53341J87736J55934Q7382J41179
3667B218148j3355j01696q8959q0192k26294j19738k02776j39819p4570l0356
3657A140393j47175j16103j25769j5797j16706p6521n0467m5570m6329P0965j08454
3646C62467r6004L8874M1725o7508M38o7009p3028J18741N9728l3969j4437o2881
$$ plain form
3634 207137 166213 184059 321301 378683 325231 379872 437679 387063 354912 394366 451553
3623 451553 433145 489572 503228 502361 506971 438276 406726 422715 492518 587204 630940 573605
3611 573605 461346 404686 511302 615285 640020 576425 538018 457658 496539 594474 495722
3600 495722 435825 485108 524326 600457 588657 659210 603704 569240 661619 722168 741097 699045
3588 699045 618950 578772 454857 551063 615047 629753 571341 592154 618408 622217 691403 734290
3576 734290 658860 656549 644161 808134 716647 627595 618239 686367 702160 760742 711989 694261
3564 694261 668538 694467 734476 764547 754133 743211 735307 699959 647431 691338 644753 624020
3552 624020 720370 732250 716574 632740 650472 686513 657764 635822 690844 802522 770151
$$ packed form
3634B07137m0924J7846J37242N7382n3452N4641N7807n0616l2151L9454N7187
3623D51553j8408N6427J3656q67M610o8695l1550J5989O9803R4686M3736n7335
3611E73605j12259n6660J06616J03983K4735o3595l8407q0360L8881R7935r8752
3600D95722n9897M9283L9218P6131j1800P0553n5506l4464R2379O0549J8929m2052
3588F99045q0095m0178j23915R6206O3984J4706n8412K0813K6254L809O9186M2887
3576G34290p5430k311j2388J63973r1487q9052r356O8128J5793N8582m8753j7728
3564F94261k5723K5929M0009L0071j0414j0922p904l5348n2528M3907m6585k0733
3552F24020R6350J1880j5676q3834J7732L6041k8749k1942N5022J11678l2371
$$ plain form
3541 770151 715421 677269 668485 675020 661958 682836 720826 782452 791025 718833 627005 557221
3529 557221 686558 786138 729351 706544 690541 721788 780913 855863 791882 771466 796931
3518 796931 864143 849091 844647 798797 819625 803059 768844 854594 910279 906644 921876 850047
3506 850047 922503 927097 986854 943797 876211 881092 898028 916771 978283 875623 857743 893801
3494 893801 870051 790822 820647 816498 882181 922233 999292 983363 897157 985188 998739 941577
3482 941577 940030 956807 960804 996172 1002272 945450 953752 949839 1049121 1133463 1169033 1105713 1164478
3469 1164478 1222407 1153770 1198541 1168264 1118491 1100433 1129757 1179122 1211272 1263309 1269266 1220827
3457 1220827 1193570 1220503 1288601 1349152 1361374 1277353 1284979 1425132 1513818 1561714 1556053 1500974
$$ packed form
3541G70151n4730l8152q784O535j3062K0878L7990O1626Q573p2192r1828o9784
3529E57221J29337R9580n6787k2807j6003L1247N9125P4950o3981k0416K5465
3518G96931O7212j5052m444m5850K0828j6566l4215Q5750N5685l635J5232p1829
3506H50047P2456M594N9757m3057o7586M881J6936J8743O1512j02660j7880L6058
3494H93801k3750p9229K9825m149O5683M0052P7059j5929q6206Q8031J3551n7162
3482I41577j547J6777L997L5368O100n6822Q302l913R9282Q4342L5570o3320N8765
3469A164478N7929o8637M4771l0277m9773j8058K9324M9365L2150N2037N957m8439
3457A220827k7257K6933O8098O0551J2222q4021P626J40153Q8686M7896n661n5079
$$ plain form
3445 1500974 1560654 1634445 1709784 1636316 1512345 1620619 1665388 1717351 1768436 1802806 1860253
3434 1860253 1962113 2096729 2173804 2196369 2213133 2239420 2218134 2349149 2432648 2446139 2426565
3423 2426565 2447097 2416198 2542091 2630965 2711711 2786042 2872114 2959243 3062786 3168504 3224725
3412 3224725 3359294 3485611 3523541 3555289 3686119 3900906 3975768 4121753 4281512 4495307
3402 4495307 4635382 4805049 4988649 5122253 5307820 5579885 5802663 6092313 6395211 6727259
3392 6727259 7085113 7418579 7780284 8188888 8693243 9238025 9837568 10465101 11120821 11822976
3382 11822976 12723114 13717064 14703360 15686510 16576488 17453978 18286625 19216664 20150266
3373 20150266 21173436 22274659 23351505 24377158 25347708 26097785 26677235 27121001 27602683
$$ packed form
3445A500974N9680P3791P5339p3468j23971J08274M4769N1963N1085L4370N7447
3434A860253J01860J34616P7075K2565J6764K6287k1286J31015Q3499J3491j9574
3423B426565K0532l0899J25893Q8874Q0746P4331Q6072Q7129J03543J05718N6221
3412C224725J34569J26317L7930L1748J30830K14787P4862J45985J59759K13795
3402D495307J40075J69667J83600J33604J85567K72065K22778K89650L02898L32048
3392F727259L57854L33466L61705M08604N04355N44782N99543O27533O55720P02155
3382A1822976R00138R93950R86296R83150Q89978Q77490Q32647R30039R33602
3373B0150266J023170J101223J076846J025653R70550P50077N79450M43766M81682
$$ plain form
3364 27602683 28135883 28711752 29382635 29825436 30055074 29921138 29523949 28934571 28350609
3355 28350609 27800953 27186495 26647701 26128486 25539355 24685328 23634449 22519043 21348703
3346 21348703 20347448 19364105 18519841 17582610 16611985 15599775 14620814 13689691 12678812
3337 12678812 11781301 10969604 10170672 9477867 8901923 8327090 7875859 7481376 7015820
3328 7015820 6635521 6282688 6013132 5724811 5368263 5083607 4893682 4650039 4488441 4232359
3318 4232359 3941920 3773536 3762382 3803341 3697226 3492524 3327154 3239011 3261483 3102532
3308 3102532 2966382 2919491 2831907 2668951 2654698 2566284 2449965 2434698 2386805 2323389 2317874
3297 2317874 2357934 2272697 2179485 2183839 2094785 2069954 2071011 1962191 1842831 1782418 1760656
$$ packed form
3364B7602683N33200N75869O70883M42801K29638j33936l97189n89378n83962
3355B8350609n49656o14458n38794n19215n89131q54027j050879j115406j170340
3346B1348703j001255r83343q44264r37231r70625j012210r78961r31123j010879
3337A2678812q97511q11697p98932o92805n75944n74833m51231l94483m65556
3328G015820l80299l52833k69556k88321l56548k84656j89925k43643j61598k56082
3318D232359k90439j68384j1154M0959j06115k04702j65370q8143K2472j58951
3308C102532j36150m6891q7584j62956j4253q8414j16319j5267m7893o3416n515
3297B317874M0060q5237r3212M354q9054k4831J057j08820j19360o0413k1762
$$ plain form
3286 1760656 1705258 1617417 1689330 1678773 1642290 1652543 1644968 1586851 1589423 1624374 1570937 1494112
3274 1494112 1452511 1449023 1367179 1340511 1335895 1341590 1281460 1286813 1245560 1200096 1128023 1081786
3262 1081786 1119669 1082632 1094717 1136447 1064408 1097950 1090069 1078280 1063072 1069766 985111 1033766
3250 1033766 960303 848475 842460 890363 729170 761747 829836 829871 830872 785536 878779 838887
3238 838887 799931 865381 736245 704843 720831 740538 770041 739885 659124 630335 664504
3227 664504 737977 680123 658413 690403 719223 678904 678611 675317 638804 692786 620530 545249
3215 545249 606575 666919 706298 755224 765866 687861 676756 791020 872358 935497 909712
3204 909712 888219 887391 857637 956221 993024 1006404 1024588 898745 936855 1054374 1016784 980659
$$ packed form
3286A760656n5398q7841P1913j0557l6483J0253p575n8117K572L4951n3437p6825
3274A494112m1601l488q1844k6668m616N695o0130N353m1253m5464p2073m6237
3262A081786L7883l7037J2085M1730p2039L3542p881j1789j5208O694q4655M8655
3250A033766p3463j11828o015M7903j61193L2577O8089L5J001m5336R3243l9892
3238H38887l8956O5450j29136l1402J5988J9707K9503l0156q0761k8789L4169
3227F64504P3473n7854k1710L1990K8820m0319k93l294l6513N3982p2256p5281
3215E45249O1326O0344L9379M8926J0642p8005j1105J14264Q1338O3139k5785
3204I09712k1493q28k9754R8584L6803J3380J8184j25843L8110J17519l7590l6125
$$ plain form
3192 980659 977142 1032201 1152606 1164287 1276849 1319524 1282971 1397011 1615535 1797524 1885270
3181 1885270 1958039 2097183 2279977 2372664 2449658 2375659 2147394 2047806 1876348 1789164 1685038
3170 1685038 1610155 1497419 1430061 1319449 1289249 1156420 1164787 1166318 1143337 1056065 954659
3159 954659 947764 1001707 1112821 1040270 977962 1010922 1011918 930783 900713 852038 674615 704970
3147 704970 762253 809710 684596 554817 494178 530169 590241 643523 632170 527289 474176
3136 474176 508255 486453 556259 434109 347699 271927 318731 440730 512709 380676 294704
3125 294704 364917 349405 405123 385844 310997 253000 368747 446842 489699 487864 474468 405004
3113 405004 363574 382161 407370 421619 421750 289269 297471 349247 404879 448699 436135 387596
$$ packed form
3192I80659l517N5059J20405J1681J12562M2675l6553J14040K18524J81989Q7746
3181A885270P2769J39144J82794R2687P6994p3999k28265r9588j71458q7184j04126
3170A685038p4883j12736o7358j10612l0200j32829Q367J531k2981q7272j01406
3159I54659o895N3943J11114p2551o2308L2960R96q1135l0070m8675j77423L0355
3147G04970N7283M7457j25114j29779o0639L5991O0072N3282j1353j04881n3113
3136D74176L4079k1802O9806j22150q6410p5772M6804J21999P1979j32033q5972
3125B94704P0213j5512N5718j9279p4847n7997J15747P8095M2857j835j3396o9464
3113D05004m1430J8587K5209J4249J31j32481Q202N1776N5632M3820j2564m8539
$$ plain form
3101 387596 342640 461086 530307 524418 501363 356908 353176 381702 358778 353993 343696 246507
3089 246507 220312 321250 463275 400752 458560 421879 309593 362451 411042 283742 206500
3078 206500 218947 118641 162032 262968 222617 180335 79825 218961 288262 333134 269354
3067 269354 241976 213496 294510 352101 398002 321364 305085 230942 304386 293926 187928
3056 187928 203103 278025 331757 336466 380755 377809 217748 150141 138834 191368 188375 214795
3044 214795 224580 166192 246028 275079 283376 235922 232219 224069 114462 167370 258029 132305
3032 132305 105963 181498 134844 153879 188525 95199 197595 245522 301223 238935 279269
3021 279269 270957 204205 252232 380885 370157 388636 336760 359491 376772 462735 409118 364520
$$ packed form
3101C87596m4956J18446O9221n889k3055j44455l732K8526k2924m785j0297r7189
3089B46507k6195J00938J42025o2523N7808l6681j12286N2858M8591j27300p7242
3078B06500J2447j00306M3391J00936m0351m2282j00510J39136O9301M4872o3780
3067B69354k7378k8480Q1014N7591M5901p6638j6279p4143P3444j0460j05998
3056A87928J5175P4922N3732M709M4289k946j60061o7607j1307N2534k993K6420
3044B14795R785n8388P9836K9051Q297m7454l703q150j09607N2908R0659j25724
3032A32305k6342P5535m6654J9035L4646r3326J02396M7927N5701o2288M0334
3021B79269q312o6752M8027J28653j0728J8479n1876K2731J7281Q5963n3617m4598
$$ plain form
3009 364520 470763 382404 423264 464143 451382 441595 379557 386857 406873 403275 428028 370433
2997 370433 285322 456991 410339 311131 366104 401369 353945 457389 471859 460272 352229
2986 352229 392174 389172 417778 344222 340487 340633 421599 443005 438822 479192 510390 473676 495843
2973 495843 446004 386770 399846 465460 527153 462025 512695 508014 474286 440908 531059 552950
2961 552950 647640 686328 669751 627195 650214 677662 675011 773054 658619 568531 600354 593171
2949 593171 594026 593222 540341 511438 559353 631291 656453 669005 660285 648548 643187 630943 676372
2936 676372 642214 533793 555743 567396 585621 631668 572998 649142 647814 699603 672367 692696
2924 692696 710371 763194 778630 788136 757627 779170 806380 857548 855828 807719 828484 860558
$$ packed form
3009C64520J06243q8359M0860M0879j2761r787o2038P300K0016l598K4753n7595
2997C70433q5111J71669m6652r9208N4973L5265m7424J03444J4470j1587j08043
2986C52229L9945l002K8606p3556l735J46Q0966K1406m183M0370L1198l6714K2167
2973D95843m9839n9234J3076O5614O1693o5128N0670m681l3728l3378R0151K1891
2961E52950R4690L8688j6577m2556K3019K7448k651R8043j14435r0088L1823p183
2949E93171Q55q04n2881k8903M7915P1938K5162J2552q720j1737n361j2244M5429
2936F76372l4158j08421K1950J1653J8225M6047n8670P6144j328N1789k7236K0329
2924F92696J7675N2823J5436R506l0509K1543K7210N1168j720m8109K0765L2074
$$ plain form
2912 860558 850339 943143 942844 975075 1040236 990570 833804 912708 967476 964525 977442 995762
2900 995762 866855 801304 810643 792953 894627 958898 827672 838420 909015 904786 951624
2889 951624 1057149 1133055 1113776 1168793 1188236 1288785 1269234 1221198 1132087 1100777 1164548
2878 1164548 1184836 1216466 1172947 1190710 1153062 1268324 1355184 1300383 1236728 1241958 1136852
2867 1136852 1156685 1171654 1226702 1284729 1292406 1288119 1218124 1262530 1342561 1317666 1267505 1407250
2855 1407250 1303343 1323249 1373782 1331025 1268006 1290576 1336447 1367278 1466158 1518034 1429362
2844 1429362 1438827 1479534 1576128 1564821 1680488 1577980 1454480 1593074 1638912 1678814 1740652
2833 1740652 1749842 1732750 1758424 1801264 1938145 1866775 1826367 1850036 1947923 2052996 2042367
$$ packed form
2912H60558j0219R2804k99L2231O5161m9666j56766P8904N4768k951J2917J8320
2900I95762j28907o5551R339j7690J01674O4271j31226J0748P0595m229M6838
2889I51624J05525P5906j9279N5017J9443J00549j9551m8036q9111l1310O3771
2878A164548K0288L1630m3519J7763l7648J15262Q6860n4801o3655N230j05106
2867A136852J9833J4969N5048N8027P677m287o9995M4406Q0031k4895n0161J39745
2855A407250j03907J9906N0533m2757o3019K2570M5871L0831R8880N1876q8672
2844A429362R465M0707R6594j1307J15667j02508j23500J38594M5838L9902O1838
2833A740652R190j7092K5674M2840J36881p1370m0408K3669R7887J05073j0629
$$ plain form
2822 2042367 1986393 1904554 1908524 1966732 2185060 2216936 2152936 2132348 2101673 2107639 2242761
2811 2242761 2355682 2368735 2221284 2221824 2255363 2334388 2381535 2333400 2324897 2396335 2474960 2589514
2799 2589514 2616684 2529328 2523945 2573515 2659704 2720569 2816713 2814590 2800582 2772698 2809478 2822658
2787 2822658 2880049 3018941 2973219 2948671 2940818 2991209 3030831 3180276 3325060 3318095 3344616
2776 3344616 3417678 3397514 3480603 3478291 3456142 3607584 3682515 3675967 3695980 3781955 3816442 3861954
2764 3861954 3912528 4007972 4005539 4036448 4123929 4198224 4231396 4390233 4504684 4563967 4605645
2753 4605645 4584784 4613078 4723984 4848669 4992722 5160263 5340026 5427609 5496046 5666523
2743 5666523 5723627 5806852 6017903 6252886 6365005 6538321 6662447 6713766 6920744 7153426
$$ packed form
2822B042367n5974q1839L970N8208K18328L1876o4000k0588l0675N966J35122
2811B242761J12921J3053j47451N40L3539P9025M7147m8135q503P1438P8625J14554
2799B589514K7170q7356n383M9570Q6189O0865R6144k123j4008k7884L6780J3180
2787B822658N7391J38892m5722k4548p853N0391L9622J49445J44784o965K6521
2776C344616P3062k0164Q3089k312k2149J51442P4931o548K0013Q5975L4487M5512
2764C861954N0574R5444k433L0909Q7481P4295L3172J58837J14451N9283M1678
2753D605645k0861K8294J10906J24685J44053J67541J79763Q7583O8437J70477
2743E666523N7104Q3225K11051K34983J12119J73316J24126N1319K06978K32682
$$ plain form
2733 7153426 7416662 7661998 7938579 8129166 8288622 8425399 8640426 8890185 9167555 9358581
2723 9358581 9487864 9642504 9798999 9983865 10225892 10454120 10703328 11033291 11413261 11693893
2713 11693893 11923835 12253671 12615065 13010627 13419673 13837769 14161868 14587084 15017955
2704 15017955 15379532 15742009 16182221 16583612 17031044 17436941 17695778 18143657 18629465
2695 18629465 19190859 19728390 20270912 20931563 21503800 22135484 22962409 23779227 24812919
2686 24812919 25865000 26861767 27924649 29051894 30168887 31434237 32684779 33994669
2678 33994669 35542491 37175883 38881328 40773251 42837079 45202681 47669004 50119657
2670 50119657 52834916 55313736 57721106 59900620 61859074 63723519 65565538 67364600
$$ packed form
2733G153426K63236K45336K76581J90587J59456J36777K15027K49759K77370J91026
2723I358581J29283J54640J56495J84866K42027K28228K49208L29963L79970K80632
2713A1693893K29942L29836L61394L95562M09046M18096L24099M25216M30871
2704A5017955L61577L62477M40212M01391M47432M05897K58837M47879M85808
2695A8629465N61394N37531N42522O60651N72237O31684Q26925Q16818J033692
2686B4812919J052081R96767J062882J127245J116993J265350J250542J309890
2678C3994669J547822J633392J705445J891923K063828K365602K466323K450653
2670E0119657K715259K478820K407370K179514J958454J864445J842019J799062
$$ plain form
2662 67364600 69110659 71024390 72906808 74911063 77031786 79376440 81663488 83827043
2654 83827043 85801151 87520388 89082891 90509913 91930164 93385377 95111204 96902603
2646 96902603 98899263 101233003 103921615 106815394 109737674 112424897 114526470 115586584
2638 115586584 115194066 113457139 110850740 107942516 105065896 102405648 99905113 97739786
2630 97739786 95731517 93841693 92249759 90760453 89271860 87565812 85689882 83614923
2622 83614923 81219312 78751203 76310336 73886907 71718273 69733131 67782150 65962181
2614 65962181 64226857 62364032 60549865 58615781 56704203 54435029 52071104 49537982
2606 49537982 46934189 44436847 42190032 40045935 38004481 36168448 34319717 32742452
$$ packed form
2662F7364600J746059J913731J882418K004255K120723K344654K287048K163555
2654H3827043J974108J719237J562503J427022J420251J455213J725827J791399
2646I6902603J996660K333740K688612K893779K922280K687223K101573J060114
2638A15586584l92518j736927k606399k908224k876620k660248k500535k165327
2630I7739786k008269j889824j591934j489306j488593j706048j875930k074959
2622H3614923k395611k468109k440867k423429k168634j985142j950981j819969
2614F5962181j735324j862825j814167j934084j911578k269174k363925k533122
2606D9537982k603793k497342k246815k144097k041454j836033j848731j577265
$$ plain form
2598 32742452 31388036 30136043 28960744 27814644 26579120 25579162 24574155 23589568
2590 23589568 22757084 21853433 21019122 20263501 19555027 19065503 18475246 17797389 17275767
2581 17275767 16770898 16345375 16115108 15831983 15435605 15000083 14655989 14393116 14112656
2572 14112656 13566368 13080462 12684770 12280137 11940092 11596651 11221009 10800546 10510976
2563 10510976 10346131 10178916 9929560 9630737 9347319 9058014 8996306 8899954 8709157 8459412
2553 8459412 8179776 7976587 7884213 7782319 7645942 7412242 7100836 6917973 6770290 6617109
2543 6617109 6483128 6224576 6024097 5962214 5903675 5827462 5645614 5317011 5114467 5039910
2533 5039910 5008352 4984398 4836713 4734842 4618282 4439609 4347585 4293114 4190076 4115949
$$ packed form
2598C2742452j354416j251993j175299j146100j235524r99958j005007r84587
2590B3589568q32484r03651q34311p55621p08474m89524n90257o77857n21622
2581A7275767n04869m25523k30267k83125l96378m35522l44094k62873k80460
2572A4112656n46288m85906l95692m04633l40045l43441l75642m20463k89570
2563A0510976j64845j67215k49356k98823k83418k89305o1708r6352j90797k49745
2553H459412k79636k03189r2374j01894j36377k33700l11406j82863j47683j53181
2543F617109j33981k58552k00479o1883n8539p6213j81848l28603k02544p4557
2533E039910l1558k3954j47685j01871j16560j78673r2024n4471j03038p4127
$$ plain form
2523 4115949 3996532 3948118 3945995 3892339 3841299 3664717 3533902 3540780 3507669 3428782 3377686
2512 3377686 3241733 3171915 3292317 3194304 3131705 3096121 2964596 2919207 2948508 2928917 2850171
2501 2850171 2746713 2700222 2763272 2725024 2611644 2632011 2549482 2490844 2582891 2527720 2464842
2490 2464842 2397116 2347818 2340740 2277042 2254377 2282360 2246392 2128584 2081358 2150552 2063816
2479 2063816 1917435 1883051 1840508 1797426 1794877 1867603 1721615 1674822 1703576 1734089 1814445
2468 1814445 1816361 1583925 1626576 1611338 1674035 1664076 1613235 1545573 1451978 1421610 1478406 1467902
2456 1467902 1354785 1387961 1356758 1297449 1284421 1327056 1267415 1322323 1230971 1220943 1164898
2445 1164898 1191762 1182061 1106755 1123126 1163165 1143741 1159861 1186523 1102680 1046138 1053450 1033341
$$ packed form
2523D115949j19417m8414k123n3656n1040j76582j30815O878l3111p8887n1096
2512C377686j35953o9818J20402r8013o2599l5584j31525m5389K9301j9591p8746
2501B850171j03458m6491O3050l8248j13380K0367q2529n8638R2047n5171o2878
2490B464842o7726m9298p078o3698k2665K7983l5968j17808m7226O9194q6736
2479B063816j46381l4384m2543m3082k549P2726j45988m6793K8754L0513Q0356
2468A814445J916k32436M2651j5238O2697r959n0841o7662r3595l0368N6796j0504
2456A467902j13117L3176l1203n9309j3028M2635n9641N4908r1352j0028n6045
2445A164898K6864r701p5306J6371M0039j9424J6120K6662q3843n6542P312k0109
$$ plain form
2433 1033341 1133094 1141285 976591 994001 1065636 1082425 1011641 915414 951228 945137 900265 852865
2421 852865 799588 704898 694143 774065 870335 971218 975635 788934 714551 802594 885857
2410 885857 971600 987933 778755 685152 788282 829771 816514 721634 733061 719131 709199
2399 709199 816872 776564 691898 676082 661740 752063 811883 745454 675812 491766 518110
2388 518110 555420 678195 689587 678092 597300 600103 631229 667835 690571 627931 572490 598926
2376 598926 661529 609600 490966 391493 432394 428872 596487 595817 539735 491980 504214 628556
2364 628556 692540 645556 633981 555833 614829 644974 496737 495231 535122 397063 358510
2353 358510 421847 327697 353986 434648 422035 416912 479852 547530 498469 407682 383565 343644
$$ packed form
2433A033341R9753Q191j64694J7410P1635J6789p0784r6227L5814o091m4872m7400
2421H52865n3277r4690j0755P9922R6270J00883M417j86701p4383Q8043Q3263
2410H85857Q5743J6333k09178r3603J03130M1489j3257r4880J1427j3930r932
2399G09199J07673m0308q4666j5816j4342R0323N9820o6429o9642j84046K6344
2388E18110L7310J22775J1392j1495q0792K803L1126L6606K2736o2640n5441K6436
2376E98926O2603n1929j18634r9473M0901l522J67615o70n6082m7755J2234J24342
2364F28556O3984m6984j1575p8148N8996L0145j48237j506L9891j38059l8553
2353C58510O3337r4150K6289Q0662j2613n123O2940O7678m9061r0787k4117l9921
$$ plain form
2341 343644 349654 400411 283781 281638 221203 320503 418573 487019 503527 453006 460611 498179
2329 498179 417100 409234 371031 430558 513596 483420 478231 385631 405310 330172 330544 379007
2317 379007 338658 321008 273358 264288 339537 305969 337313 340485 331013 311270 256779 261907
2305 261907 150504 133838 257435 264560 294014 425657 391252 446778 440755 414504 368848
2294 368848 432896 501410 384389 339978 384645 318624 289297 380989 372784 424888 399091 330280
2282 330280 254195 286787 344216 362967 368946 292556 316271 245319 228587 297224 251380 212760
2270 212760 232331 244464 203697 213700 231603 267769 245610 190455 160730 212291 185193 219305
2258 219305 223631 198548 189334 191218 238281 287516 165565 147429 160365 173142 232695 246946
$$ packed form
2341C43644O010N0757j16630k143o0435R9300R8070O8446J6508n0521P605L7568
2329D98179q1079p866l8203N9527Q3038l0176n189r2600J9679p5138L72M8463
2317C79007m0349j7650m7650r070P5249l3568L1344L172r472j9743n4491N128
2305B61907j11403j6666J23597P125K9454J31643l4405N5526o023k6251m5656
2294C68848O4048O8514j17021m4411M4667o6021k9327R1692q205N2104k5797o8811
2282C30280p6085L2592N7429J8751N979p6390K3715p0952j6732O8637m5844l8620
2270B12760J9571J2133m0767J0003J7903L6166k2159n5155k9725N1561k7098L4112
2258B19305M326k5083r214J884M7063M9235j21951j8136J2936J2777N9553J4251
$$ plain form
2246 246946 219447 181358 138348 205348 308144 247450 269136 217822 248646 329599 276108
2235 276108 176168 182966 130613 164140 300353 311988 188063 149122 226591 257883 294555
2224 294555 285914 253908 96146 132773 161782 238494 271851 235652 102199 164896 295237
2213 295237 220125 102513 135621 146884 186537 336501 371331 299372 208182 213133 256280
2202 256280 317551 332616 253640 109899 178671 256335 316475 401738 365816 254811 288027
2191 288027 395387 394778 336416 314549 200399 149774 269490 334939 347943 380958 332213
2180 332213 298865 263268 401090 313637 397557 359267 330417 374447 435731 494809 407622
2169 407622 434281 403822 388118 349460 431119 309225 271717 308710 410375 442123 485885
$$ packed form
2246B46946k7499l8089m3010O7000J02796o0694K1686n1314L0824Q0953n3491
2235B76108r9940O798n2353L3527J36213J1635j23925l8941P7469L1292L6672
2224B94555q641l2006j57762L6627K9009P6712L3357l6199j33453O2697J30341
2213B95237p5112j17612L3108J1263L9653J49964L4830p1959r1190M951M3147
2202B56280O1271J5065p8976j43741O8772P7664O0140Q5263l5922j11005L3216
2191B88027J07360o09n8362k1867j14150n0625J19716O5449J3004L3015m8745
2180C32213l3348l5597J37822q7453Q3920l8290k8850M4030O1284N9078q7187
2169D07622K6659l0459j5704l8658Q1659j21894l7508L6993J01665L1748M3762
$$ plain form
2158 485885 464281 385686 366519 402763 459068 408733 421433 459557 376204 405310 538243
2147 538243 536240 593829 618594 548483 448155 531941 584079 613250 613978 730516 765357 854860
2135 854860 1037486 959074 929420 962120 926442 804101 847729 832246 753661 718260 730935
2124 730935 667556 719813 743773 675307 535736 517065 525669 408478 407606 345293 303929 337816
2112 337816 371061 327181 250452 179106 177843 166920 247520 306063 285396 263787 324486 265841
2100 265841 218461 161933 138146 155666 209290 177655 141579 247195 242017 239412 222938 213936
2088 213936 158969 182247 224506 283753 271228 204804 171087 62545 118609 235471 176225
2077 176225 189694 162220 155300 251828 280153 209353 45869 15571 101957 150273 190718 186788
$$ packed form
2158D85885k1604p8595j9167L6244N6305n0335J2700L8124q3353K9106J32933
2147E38243k003N7589K4765p0111j00328Q3786N2138K9171P28J16538L4841Q9503
2135H54860J82626p8412k9654L2700l5678j22341M3628j5483p8585l5401J2675
2124G30935o3379N2257K3960o8466j39571j8671Q604j17191q72o2313m1364L3887
2112C37816L3245m3880p6729p1346j263j0923Q0600N8543k0667k1609O0699n8645
2100B65841m7380n6528k3787J7520N3624l1635l6076J05616n178k605j6474r002
2088B13936n4967K3278M2259N9247j2525o6424l3717j08542N6064J16862n9246
2077A76225J3469k7474o920R6528K8325p0800j63484l0298Q6386M8316M0445l930
$$ plain form
2065 186788 110861 85711 127009 187874 143164 172045 70644 -3300 119932 150765 132054
2054 132054 63846 60012 89693 107337 202439 221704 104890 107468 160137 187310 167977 153117
2042 153117 144485 115654 257613 197003 53444 17144 -19442 -9053 -5630 119 10064 19406
2030 19406 49748 143121 152088 69713 -63346 -163447 -137669 -47525 -3795 -24540 -28357 2072
2018 2072 -480 -24398 -20061 -2601 -14072 -111286 -114665 -111367 -49789 -9062 -177207 -194084 -44252
2005 -44252 46727 118413 74588 -46853 -77537 49046 98067 119128 101612 17782 -17885
1994 -17885 6684 111898 125141 150928 124593 -46996 -160482 -15422 58658 112887 126753
1983 126753 118444 92377 185380 125627 57369 -36133 -89442 -57148 -2146 121364 107427 7697
$$ packed form
2065A86788p5927k5150M1298O0865m4710K8881j01401p3944J23232L0833j8711
2054A32054o8208l834K9681J7644R5102J9265j16814K578N2669K7173j9333j4860
2042A53117q632k8831J41959o0610j43559l6300l6586J0389L423N749R945R342
2030A9406L0342R3373Q967q2375j33059j00101K5778R0144M3730k0745l817L0429
2018B072k552k3918M337J7460j1471r7214l379L298O1578M0727j68145j6877J49832
2005d4252R0979P1686m3825j21441l0684J26583M9021K1061j7516q3830l5667
1994a7885K4569J05214J3243K5787k6335j71589j13486J45060P4080N4229J3866
1983A26753q309k6067R3003n9753o8258r3502n3309L2294N5002J23510j3937r9730
$$ plain form
1971 7697 -64288 -141880 -137458 2013 49984 -48851 -158259 -110679 744 138234 204492
1960 204492 99733 17191 -60550 -35183 -10323 31444 33211 -86871 -149183 -74144 3357
1949 3357 53645 12011 -18099 24386 50441 126281 145375 37298 -88566 -115691 -78815 109005
1937 109005 101920 101097 65529 5107 -35468 23950 74638 9789 37278 -6137 43753 86566
1925 86566 122208 105178 67877 13814 52820 -1221 -76917 -51468 -91728 -27847 92686 200116
1913 200116 133361 2769 -83519 -18831 -52786 22719 41969 47554 -41904 -30287 11605 136799
1901 136799 144685 140298 20919 -39271 103782 108098 11406 33012 30105 -32881 130705 138842
1889 138842 73447 40402 36098 67992 155747 130339 141653 41705 32194 56202 80942 176549
$$ packed form
1971G697p1985p7592M422J39471M7971r8835j09408M7580J11423J37490O6258
1960B04492j04759q2542p7741K5367K4860M1767J767j20082o2312P5039P7501
1949C357N0288m1634l0110M2485K6055P5840J9094j08077j25864k7125L6876J87820
1937A09005p085q23l5568o0422m0575N9418N0688o4849K7489m3415M9890M2813
1925H6566L5642j7030l7301n4063L9006n4041p5696K5449m0260O3881J20533J07430
1913B00116o6755j30592q6288O4688l3955P5505J9250N585q9458J1617M1892J25194
1901A36799P886m387j19379o0190J43053M316r6692K1606k907o2986J63586Q137
1889A38842o5395l3045m304L1894Q7755k5408J1314r9948r511K4008K4740R5607
$$ plain form
1877 176549 190390 129026 30145 24978 -10836 8365 -24658 -74760 -41250 41212 75629 86711
1865 86711 -4653 -23213 -28106 -26688 109929 81156 4794 70192 -6954 -63620 65512 31016
1853 31016 16975 -35370 -26467 -68544 -11953 18206 -45160 28656 37155 63160 -34380 -10710
1841 -10710 -20394 -57926 -43364 2385 -4031 13433 3300 -105643 -2900 -1540 -40049 -51412
1829 -51412 -10681 -22913 -11105 -33407 30428 43163 64886 114874 99651 24734 -27111 -19462
1817 -19462 60236 80240 34119 19962 -26341 -41326 -1523 81772 124818 166679 160266 231250
1805 231250 132484 42288 80338 14411 6267 -24538 45616 43699 1501 -88630 -42356 -73003
1793 -73003 -2884 112455 82703 47093 32486 -24216 35122 53239 90695 114678 50717 108881
$$ packed form
1877A76549J3841o1364r8881n167l5814J9201l3023n0102L3510Q2462L4417J1082
1865H6711r1364j8560m893J418J36617k8773p6362O5398p7146n6666J29132l4496
1853C1016j4041n2345Q903m2077N6591L0159o3366P3816Q499K6005r7540K3670
1841a0710r684l7532J4562M5749o416J7464j0133j08943J02743J360l8509j1363
1829e1412M0731j2232J1808k2302O3835J2735K1723M9988j5223p4917n1845P649
1817a9462P9698K0004m6121j4157m6303j4985L9803Q3295M3046M1861o413P0984
1805B31250r8766r0196L8050o5927q144l0805P0154j917m2198r0131M6274l0647
1793g3003P0119J15339k9752l5610j4607n6702N9338J8117L7456K3983o3961N8164
$$ plain form
1781 108881 21293 -11934 14050 43613 61953 148124 66205 16282 131672 135086 81116 140617
1769 140617 121226 42430 33691 106509 87508 74193 59822 128379 93332 82350 105280 33982
1757 33982 56236 47679 9451 -11488 36048 38797 18920 20555 -57901 2946 92664 15250
1745 15250 -72908 -108675 -135610 -108984 -26198 53368 -11876 7452 105839 51539 -6455 -29234
1733 -29234 -104813 -144646 -31517 73789 55206 7720 44359 7507 40555 113084 116617 98382
1721 98382 76247 13597 -84521 -39156 -37344 -2472 51734 39878 83078 -7958 -24009 -46110
1709 -46110 -70010 -2358 2426 -12358 -25184 -15766 -23571 -42865 -56454 -113999 -76228 4166
1697 4166 -111971 -198692 -197064 -173993 -88908 36473 4579 -70155 -117895 -70959 -87756 -95128
$$ packed form
1781A08881q7588l3227K5984K9563J8340Q6171q1919m9923J15390L414n3970N9501
1769A40617j9391p8796q739P2818j9001j3315j4371O8557l5047j0982K2930p1298
1757C3982K2254q557l8228k0939M7536K749j9877J635p8456O0847Q9718p7414
1745A5250q8158l5767k6935K6626Q2786P9566o5244J9328R8387n4300n7994k2779
1733b9234p5579l9833J13129J05306j8583m7486L6639l6852L3048P2529L533j8235
1721I8382k2135o2650r8118M5365J812L4872N4206j1856M3200r1036j6051k2101
1709d6110k3900O7652M784j4784j2826R418p805j9294j3589n7545L7771Q0394
1697D166j16137q6721J628K3071Q5085J25381l1894p4734m7740M6936j6797p372
$$ plain form
1685 -95128 -147848 -195738 -177094 -152082 -74076 -149099 -92596 -61900 -87490 -33142 -92318 -105274
1673 -105274 -124871 -114224 -127538 -94273 -28697 39351 -17517 -74298 -142596 -129929 -23173
1662 -23173 10941 -21096 -55223 -74177 11074 43862 -15791 -64714 -155563 -116806 -51117 -15759
1650 -15759 -113423 -138674 -129097 -58958 -83383 -124287 -104629 -102421 -110553 -167903 -250445 -215967
1638 -215967 -166615 -203148 -154429 -234349 -297271 -175335 -179147 -191657 -173367 -158182 -136446 -46879
1626 -46879 -29313 -11907 -85872 -95350 -148594 -197316 -169202 -59933 -11095 12173 -77263 -140851
1614 -140851 -124194 -13236 35527 60312 15386 -11291 -35644 -27685 43461 2473 -125280
1603 -125280 -136492 -60207 -60891 -8267 -80470 -52507 -20834 21045 31705 83539 71688 -2266
$$ packed form
1685i5128n2720m7890J8644K5012P8006p5023N6503L0696k5590N4348n9176j2956
1673a05274j9597J0647j3314L3265O5576O8048n6868n6781o8298J2667J06756
1662b3173L4114l2037l4127j8954Q5251L2788n9653m8923r0849L8757O5689L5358
1650a5759r7664k5251R577P0139k4425m0904J9658K208q132n7350q2542L4478
1638b15967M9352l6533M8719p9920o2922J21936l812j2510J8290J5185K1736Q9567
1626d6879J7566J7406p3965r478n3244m8722K8114J09269M8838K3268q9436o3588
1614a40851J6657J10958M8763K4785m4926k6677k4353P959P1146m0988j27753
1603a25280j1212P6285o84N2624p2203K7963L1673M1879J0660N1834j1851p3954
$$ plain form
1591 -2266 -75962 -153180 -77997 38607 -36658 -128615 -214862 -166350 -68548 -30038 2745 -61985
1579 -61985 -146113 20422 2613 -43499 -93090 -84054 -21850 1685 -30519 -69460 -14665 28277
1567 28277 20750 -27990 36009 79811 81120 77107 47381 -9084 108744 86573 29988 -46289
1555 -46289 -85387 -83023 6103 73199 17683 -35097 -19517 169529 109969 35320 2880 -62439
1543 -62439 -10375 85184 -35601 -20163 -70839 -105202 -92048 -48285 -49316 -1824 65477 -33578
1531 -33578 -41848 -86803 -31346 84046 -29173 -7148 17840 -22325 18262 -24345 -53290 -42631
1519 -42631 -40093 -1790 65798 127697 159215 54076 -31020 9563 83181 42409 94432 56437
1507 56437 33314 -6383 29133 50741 56498 63937 29937 160292 150924 70145 67769 21166
$$ packed form
1591b266p3696p7218P5183J16604p5265r1957q6247M8512R7802L8510L2783o4730
1579f1985q4128J66535j7809m6112m9591R036O2204K3535l2204l8941N4795M2942
1567B8277p527m8740O3999M3802J309m013k9726n6465J17828k2171n6585p6277
1555d6289l9098K364Q9126O7096n5516n2780J5580J89046n9560p4649l2440o5319
1543f2439N2064R5559j20785J5438n0676l4363J3154M3763j031M7492O7301r9055
1531c3578q270m4955N5457J15392j13219K2025K4988m0165M0587m2607k8945J0659
1519d2631K538L8303O7588O1899L1518j05139q5096M0583P3618m0772N2023l7995
1507E6437k3123l9697L5516K1608N757P439l4000J30355r368q0779k376m6603
$$ plain form
1495 21166 19305 79329 175708 169967 106464 121751 70449 -4234 36169 16272 7448 -33529
1483 -33529 -26505 46477 3138 -24624 -58803 -119865 -26116 80001 40858 26589 20760 -27499
1471 -27499 -43501 54839 74643 38040 31256 -4044 -53035 -34189 -10847 -91285 -122453 -84096
1459 -84096 -76099 -30154 -25569 -116934 -45838 42238 84076 99389 66112 -69583 -100913 -4505
1447 -4505 98863 58398 8573 46489 49072 18037 68545 36993 -11939 51479 29727 -31299
1435 -31299 42035 40230 -34828 -57265 -113148 -76983 -81592 -103504 -145823 -165535 -104484 -81910
1423 -81910 2787 40825 10878 -44292 5449 21034 -116872 -147084 -156688 -188514 -90491 -11193
1411 -11193 -72260 -132037 -126922 -159189 -177208 -108532 -70617 -154154 -140254 -50694 -118755 4136
$$ packed form
1495B1166j861O0024R6379n741o3503J5287n1302p4683M0403j9897q824m0977
1483c3529P024P2982m3339k7762l4179o1062R3749J06117l9143j4269n829m8259
1471b7499j6002R8340J9804l6603o784l5300m8991J8846K3342q0438l1168L8357
1459h4096P997M5945M585r1365P1096Q8076M1838J5313l3277j35695l1330R6408
1447d505J03368m0465m9825L7916K583l1035N0508l1552m8932O3418k1752o1026
1435c1299P3334j805p5058k2437n5883L6165m609k1912m2319j9712O1051K2574
1423h1910Q4697L8038k9947n5170M9741J5585j37906l0212r604l1826R8023P9298
1411a1193o1067n9777N115l2267j8019O8676L7915q3537J3900Q9560o8061J22891
$$ plain form
1399 4136 56118 -3824 -44695 -3276 -8212 -77338 -67890 -90993 -82600 -89563 -96161 -20787 -118542
1386 -118542 -142853 -110311 -152835 4887 69923 27075 -15451 -45195 -28197 -36264 -67160 -177063
1374 -177063 -169130 -128087 -186487 -191672 -98585 -94738 -164353 -206289 -141662 -103857 -118980 -84180
1362 -84180 -31043 -106897 -181391 -135351 -60893 -134859 -108539 -66812 -137153 -120091 27181 101184
1350 101184 -13184 16209 -53816 -179730 -131298 -45049 -99182 -98955 -54814 -173618 -139609
1339 -139609 -119812 -78874 -67499 -81525 -36906 -6754 -83000 -70819 -130945 -103351 -12518 74635
1327 74635 14137 -146469 -185708 -151297 -56958 20924 15542 -58425 -159260 -65469 30745 -38207
1315 -38207 3364 -53793 -58607 -97433 -51880 4524 -72889 -123249 -37470 -12299 9346 4693
$$ packed form
1399D136N1982n9942m0871M1419m936o9126R448k3103Q393o963o598P5374r7755
1386a18542k4311L2542m2524J57722O5036m2848m2526k9744J6998q067l0896j09903
1374a77063P933M1043n8400n185R3087L847o9615m1936O4627L7805j5123L4800
1362h4180N3137p5854p4494M6040P4458p3966K6320M1727p0341J7062J47272P4003
1350A01184j14368K9393p0025j25914M8432Q6249n4133K27M4141j18804L4009
1339a39609J9797M0938J1375j4026M4619L0152p6246J2181o0126K7594R0833Q7153
1327G4635o0498j60606l9239L4411R4339P7882n382p3967j00835R3791R6214o8952
1315c8207M1571n7157m814l8826M5553N6404p7413n0360Q5779K5171K1645m653
$$ plain form
1303 4693 -19980 -33295 -76231 -42549 -7734 -47654 -99583 -64016 -49421 -127172 -125814 -72438
1291 -72438 -36912 -99643 -145471 -118436 -88320 -165263 -99069 -177232 -117427 -50634 -100749 -135716
1279 -135716 -77511 -153888 -49928 -101626 -202049 -155614 -138637 -85548 -118916 -114834 -58437
1268 -58437 -55114 -69333 7803 -32865 -96378 -54914 -57930 -8678 69550 6135 -9501 -33859
1256 -33859 -9735 43317 72897 30396 -46248 -133905 -108719 -31862 -12248 9730 -16318 -116038
1244 -116038 -121891 9363 -51907 37554 -13510 -156075 -37864 -38653 -47576 -19879 -105902 -210464
1232 -210464 -165549 -48425 2078 -99757 -80286 -90115 -89479 -13533 88963 57155 14647 50602
1220 50602 -92868 -38640 50542 -61791 -84127 -152564 -27810 65501 118990 190101 79431
$$ packed form
1303D693k4673j3315m2936L3682L4815l9920n1929L5567J4595p7751J358N3376
1291g2438L5526o2731m5828K7035L0116p6943O6194p8163N9805O6793n0115l4967
1279a35716N8205p6377J03960n1698j00423M6435J6977N3089l3368M082N6397
1268e8437L323j4219P7136m0668o3513M1464l016M9252P8228o3415j5636k4358
1256c3859K4124N3052K9580m2501p6644q7657K5186P6857J9614K1978k6048r9720
1244a16038n853J31254o1270Q9461n1064j42565J18211p89q923K7697q6023j04562
1232b10464M4915J17124N0503j01835J9471r829O36P5946J02496l1808m2508L5955
1220E0602j43470N4228Q9182j12333k2336o8437J24754R3311N3489P1111j10670
$$ plain form
1209 79431 40482 116753 150692 155487 149650 -19436 -65870 -1431 34957 100560 39992 -66243
1197 -66243 -104033 14342 29256 69957 -19260 -44799 -39648 3566 61420 62591 -147686 -104446
1185 -104446 -24389 -12840 26371 -821 -29850 9224 50391 49403 128702 91106 44119 -73031
1173 -73031 -122673 -31546 -23607 -120084 -104438 -121432 -102030 78120 74657 8168 -52195 11616
1161 11616 79859 114641 72162 -19752 -56685 -556 35280 -919 -79752 -79665 -47406 23359
1149 23359 137698 167880 140488 -23882 26473 135305 71794 5136 62306 -50487 -79441
1138 -79441 -35922 1771 -46505 -53056 -50337 27865 142511 152438 108129 59957 59583 109353 135960
1125 135960 14222 -40756 -114320 50115 51543 16516 22515 -28585 87552 102621 109590 116540
$$ packed form
1209G9431l8949P6271L3939M795n837j69086m6434O4439L6388O5603o0568j06235
1197f6243l7790J18375J4914M0701q9217k5539N151M3214N7854J171k10277M3240
1185a04446Q0057J1549L9211k7192k9029L9074M1167r88P9299l7596m6987j17150
1173g3031m9642R1127P939r6477J5646j6994J9402J80150l463o6489o0363O3811
1161A1616O8243L4782m2479r1914l6933N6129L5836l6199p8833Q7L2259P0765
1149B3359J14339L0182k7392j64370N0355J08832o3511o6658N7170j12793k8954
1138g9441M3519L7693m8276o551K719P8202J14646R927m4309m8172l74M9770K6607
1125A35960j21738n4978p3564J64435J428l5027N999n1100J16137J5069O969O950
$$ plain form
1113 116540 107857 -63626 8707 101732 127762 10207 -31726 -62396 -12735 34843 75064
1102 75064 58510 19093 47370 82943 -22988 -36078 -29117 -77516 -74758 -39960 30357 -35324
$$ packed form
1113A16540q683j71483P2333R3025K6030j17555m1933l0670M9661M7578M0221
1102G5064j6554l9417K8277L5573j05931j3090O961m8399K758L4798P0317o5681
$$ [...]
##END NTUPLES=NMR SPECTRUM
##END=
