##TITLE=1H_EC-3242(22)
 CDCl3,8 sc, 
 10.02.2021
##JCAMPDX= 6.0         $$ Bruker NMR JCAMP-DX V2.0
##DATA TYPE= NMR SPECTRUM
##DATA CLASS= NTUPLES
##ORIGIN= UXNMR, Bruker Analytische Messtechnik GmbH
##OWNER= root
$$ XWIN-NMR		Version 3.5
$$ Wed Feb 10 11:29:22 2021 Russian Standard Time (UT+4h)  she@DPX200
##.OBSERVE FREQUENCY= 200.1315066352
##.OBSERVE NUCLEUS= ^1H
##.ACQUISITION MODE= SIMULTANEOUS
##.ACQUISITION SCHEME= undefined
##.AVERAGES= 8
##.DIGITISER RES= 18
##SPECTROMETER/DATA SYSTEM= spect
##.PULSE SEQUENCE= zg30
##.SOLVENT NAME= CD3CN
##.SHIFT REFERENCE= (INTERNAL, CD3CN, 0, 15.9875)
##AUDIT TRAIL= $$ (NUMBER, WHEN, WHO, WHERE, WHAT)
$$ ##TITLE= Audit trail, XWIN-NMR		Version 3.5
$$ ##JCAMPDX= 5.01
$$ ##ORIGIN= Bruker BioSpin GmbH
$$ ##OWNER= she
$$ F:/spectra/data/she/nmr/H-F/1/pdata/1/auditp.txt
$$ ##AUDIT TRAIL=  $$ (NUMBER, WHEN, WHO, WHERE, WHAT)
(   1,<2021-02-10 11:27:43.34 +0400>,<she>,<DPX200>,
      <created by zg, POWCHK disabled, PULCHK disabled
       configuration hash MD5:
       00 E9 B6 7A A2 85 ED C7 34 08 36 98 17 FE 4E 26
       data hash MD5: 16K
       53 4D 47 9B 34 A8 B0 67 AC EE F9 E4 7F 1C A6 5A>)
(   2,<2021-02-10 11:27:45.96 +0400>,<she>,<DPX200>,
      <Start of raw data processing
       efp BC_mod = 2 LB = 0.24 FT_mod = 6 PKNL = 1 PHC0 = -10758.43 PHC1 = 10.40095 SI = 16K 
       data hash MD5: 16K
       2E D9 ED 26 1B FB 49 EA EE 73 75 39 77 E0 FE 42>)
(   3,<2021-02-10 11:28:12.59 +0400>,<she>,<DPX200>,
      <pk PHC0 = -3.420849 PHC1 = 6.199999 
       data hash MD5: 16K
       5A 4C E0 BA E4 DC 0C F7 A9 D6 22 37 01 A0 66 E8>)
(   4,<2021-02-10 11:28:15.79 +0400>,<she>,<DPX200>,
      <abs ABSG = 5 
       data hash MD5: 16K
       BC C8 FD E4 21 ED 9C D7 26 A2 35 F3 C6 61 7A 44>)
(   5,<2021-02-10 11:28:48.96 +0400>,<she>,<DPX200>,
      <pk PHC0 = 3.284966 PHC1 = -2.4 
       data hash MD5: 16K
       DE 99 D2 CA 82 A4 64 EF 0B 90 0B B0 E8 0F B4 E7>)
(   6,<2021-02-10 11:28:52.26 +0400>,<she>,<DPX200>,
      <abs ABSG = 5 
       data hash MD5: 16K
       C7 89 09 BB B4 50 E6 E2 0D C2 59 0D 53 77 11 CE>)
$$ ##END=
$$ 
$$ hash MD5
$$ 24 5E 5F B4 AE B4 D7 E0 BA 37 75 05 C1 E5 62 2B
##$RELAX= 
##$RELAX= 
##$RELAX= 
##$RELAX= 
##$RELAX= 
##$RELAX= 
$$ Bruker specific parameters
$$ --------------------------
##$DU= <F:/spectra>
##$EXPNO= 1
##$NAME= <H-F>
##$PROCNO= 1
##$TYPE= <nmr>
##$USER= <she>
##$AMP= (0..31)
100 100 100 100 100 100 100 100 100 100 100 100 100 100 100 100 100 100 
100 100 100 100 100 100 100 100 100 100 100 100 100 100 
##$AQSEQ= 0
##$AQ_mod= 1
##$AUNM= <au_zg>
##$AUTOPOS= <>
##$BF1= 200.13
##$BF2= 200.13
##$BF3= 200.13
##$BF4= 200.13
##$BF5= 200.13
##$BF6= 200.13
##$BF7= 200.13
##$BF8= 200.13
##$BYTORDA= 1
##$CFDGTYP= 0
##$CFRGTYP= 5
##$CHEMSTR= <none>
##$CNST= (0..31)
1 1 145 1 1 1 1 1 1 1 1 1 1 1 1 1 1 1 1 1 1 1 1 1 1 1 1 1 1 1 1 1 
##$CPDPRG= <>
##$CPDPRG1= <>
##$CPDPRG2= <>
##$CPDPRG3= <>
##$CPDPRG4= <mlev>
##$CPDPRG5= <mlev>
##$CPDPRG6= <mlev>
##$CPDPRG7= <mlev>
$$ [...]
##$SUBNAM3= <"">
##$SUBNAM4= <"">
##$SUBNAM5= <"">
##$SUBNAM6= <"">
##$SUBNAM7= <"">
##$SUBNAM8= <"">
##$SUBNAM9= <"">
##$SW= 16.9725356469052
##$SWIBOX= (0..15)
0 0 2 0 0 0 0 0 0 0 0 0 0 0 0 0 
##$SW_h= 3396.73913043478
##$TD= 16384
##$TD0= 1
##$TE= 0
##$TE2= 300
##$TE3= 300
##$TEG= 300
##$TL= (0..7)
0 120 120 120 120 120 120 120 
##$TP= (0..7)
150 150 150 150 150 150 150 150 
##$TP07= 0
##$TPNAME0= <>
##$TPNAME1= <>
##$TPNAME2= <>
##$TPNAME3= <>
##$TPNAME4= <>
##$TPNAME5= <>
##$TPNAME6= <>
##$TPNAME7= <>
##$TPOAL= (0..7)
0.5 0.5 0.5 0.5 0.5 0.5 0.5 0.5 
##$TPOFFS= (0..7)
0 0 0 0 0 0 0 0 
##$TUNHIN= 0
##$TUNHOUT= 0
##$TUNXOUT= 0
##$USERA1= <user>
##$USERA2= <user>
##$USERA3= <user>
##$USERA4= <user>
##$USERA5= <user>
##$V9= 5
##$VALIST= <valist>
##$VCLIST= <CCCCCCCCCCCCCCC>
##$VD= 0
##$VDLIST= <DDDDDDDDDDDDDDD>
##$VPLIST= <PPPPPPPPPPPPPPP>
##$VTLIST= <TTTTTTTTTTTTTTT>
##$WBST= 1024
##$WBSW= 4
##$XGAIN= (0..3)
0 0 0 0 
##$XL= 0
##$YL= 0
##$YMAX_a= 502964
##$YMIN_a= -412039
##$ZGOPTNS= <>
##$ZL1= 120
##$ZL2= 120
##$ZL3= 120
##$ZL4= 120
##$ABSF1= 15.98749
##$ABSF2= -0.9851742
##$ABSG= 5
##$ABSL= 3
##$ALPHA= 0
##$AQORDER= 0
##$ASSFAC= 0
##$ASSFACI= 0
##$ASSFACX= 0
##$ASSWID= 0
##$AUNMP= <proc_1d>
##$AZFE= 0.1
##$AZFW= 0.1
##$BCFW= 0
##$BC_mod= 2
##$BYTORDP= 0
##$COROFFS= 0
##$CY= -3
##$DATMOD= 1
##$DC= 0
##$DFILT= <>
##$DTYPP= 0
##$F1P= 0
##$F2P= 0
##$FCOR= 1
##$FTSIZE= 16384
##$FT_mod= 6
##$GAMMA= 0
##$GB= 0
##$INTBC= 1
##$INTSCL= 2.992141e-10
##$ISEN= 128
##$LB= 0.24
##$LEV0= 0
##$LPBIN= 0
##$MAXI= 10000
##$MC2= 0
##$MEAN= 0
##$ME_mod= 0
##$MI= 1.114404
##$NCOEF= 0
##$NC_proc= -7
##$NLEV= 6
##$NOISF1= 3.799351
##$NOISF2= 2.8
##$NSP= 0
##$NTH_PI= 0
##$NZP= 0
##$OFFSET= 15.98749
##$PC= 1
##$PHC0= -10758.56
##$PHC1= 14.20095
##$PH_mod= 1
##$PKNL= yes
##$PPARMOD= 0
##$PSCAL= 0
##$PSIGN= 0
##$REVERSE= no
##$SF= 200.13000542681
##$SI= 16384
##$SIGF1= 3
##$SIGF2= 2
##$SINO= 5.538805
##$SIOLD= 16384
##$SREGLST= <1H.CDCl3>
##$SSB= 0
##$STSI= 16384
##$STSR= 0
##$SW_p= 3396.73913043478
##$SYMM= 0
##$S_DEV= 0
##$TDeff= 16384
##$TDoff= 0
##$TI= <>
##$TILT= no
##$TM1= 0
##$TM2= 0
##$TOPLEV= 0
##$USERP1= <user>
##$USERP2= <user>
##$USERP3= <user>
##$USERP4= <user>
##$USERP5= <user>
##$WDW= 1
##$XDIM= 16384
##$YMAX_p= 387163838
##$YMIN_p= -1155606
$$ End of Bruker specific parameters
$$ ---------------------------------
##NTUPLES= NMR SPECTRUM
##VAR_NAME=  FREQUENCY,     SPECTRUM/REAL,   SPECTRUM/IMAG
##SYMBOL=    X,             R,               I
##VAR_TYPE=  INDEPENDENT,   DEPENDENT,       DEPENDENT
##VAR_FORM=  AFFN,          ASDF,            ASDF
##VAR_DIM=   16384,         16384,           16384
##UNITS=     HZ,            ARBITRARY UNITS, ARBITRARY UNITS
##FACTOR=    0.207333158178281, 1,           1
##FIRST=     3199.57640048559, 0,            0
##LAST=      -197.162729949193, 0,           0
##MIN=       -197.162729949193, -1155606,    0
##MAX=       3199.57640048559, 387163838,    0
$$ Real data points
##PAGE= N=1
##DATA TABLE= (X++(R..R)), XYDATA
$$ [...]
4832A2143339l17048p11963l5572m73222k03818j70516j07480L46746K1511k37775
$$ 12143339 11826291 11114328 11078756 10605534 10401716 10231200 10123720 10470466 10491977 10254202
4822A0254202j48963Q4456K9234p8029j93339k76154L5433o3619N97816j03196
$$ 10254202 10105239 10189695 10218929 10140900 9947561 9671407 9706840 9643221 10241037 10137841
4812A0137841j84845k96270m08367k8944L60975L05388j4180L86774m15145R8999
$$ 10137841 9952996 9656726 9248359 9219415 9580390 9885778 9871598 10258372 9843227 9942226
4802I942226K18963k12798J11180K5417k99802o3667M30483O5719L38354m1473
$$ 9942226 10161189 9948391 10059571 10084988 9785186 9721519 10152002 10217721 10556075 10514602
4792A0514602l50634p2838m9129l62457J70533J39299m90983j21459j48255J49124
$$ 10514602 10163968 10091130 10042001 9679544 9850077 9989376 9498393 9376934 9228679 9377803
4782I377803j58852K16621P8521j13121k23197k18406j84208L21453l158k08043
$$ 9377803 9218951 9435572 9514093 9400972 9177775 8959369 8775161 9096614 9093456 8885413
4772H885413k1520j1579k9931J78609l6566j1641n5258m16664m63144N60381K97531
$$ 8885413 8863893 8852314 8822383 9000992 8964426 8952785 8897527 8480863 8017719 8578100 8875631
4761H875631R1636k21624j02160p5283j04744J16488M9298J03710J1767j01976
$$ 8875631 8967267 8745643 8643483 8568200 8463456 8579944 8629242 8732952 8744719 8642743
4751H642743k14642J90619J28678l38594r2274R4624j71801L43960K8111J44776
$$ 8642743 8428101 8618720 8747398 8408804 8316530 8411154 8239353 8583313 8611424 8756200
4741H756200L82822j66355m4254n87392j71875M74465m3490K29393K28268N7322
$$ 8756200 9139022 8972667 8928413 8341021 8169146 8643611 8600121 8829514 9057782 9115104
4731I115104k20535K12475j11788l915p4574l61223L19449R9330L20304J50064
$$ 9115104 8894569 9107044 8995256 8991341 8916767 8555544 8874993 8974323 9294627 9444691
4721I444691l37968l44155o8545j29578J60551J03093k91243K17720q8058j60984
$$ 9444691 9106723 8762568 8694023 8564445 8724996 8828089 8536846 8754566 8666508 8505524
4711H505524K13890M52250o74038m59185L55172n9574M64351N9794o6704J73558
$$ 8505524 8719414 9171664 8497626 8038441 8393613 8334039 8798390 8858184 8791480 8965038
4701H965038j0557Q6751l9101K5592m57604L09922J48324K63749k29604l22992
$$ 8965038 8954481 9041232 9002131 9027723 8570119 8880041 9028365 9292114 9062510 8739518
4691H739518J20439j72415K61483O2182R9205n3722k75791q6011o4704J46065
$$ 8739518 8859957 8687542 8949025 9011207 9110412 9056690 8780899 8694888 8630184 8776249
4681H776249j05962M3622K89558r1059n1595L24725L46n6552K823l57444L13969
$$ 8776249 8670287 8713909 9003467 8912408 8860813 9185538 9185884 9129332 9132155 8774711 9088680
4670I088680O98245J31143l57009M4413J95487l51425k04133q4832N66547L12386
$$ 9088680 9786925 9918068 9561059 9605472 9800959 9449534 9245401 9160569 9727116 10039502
4660A0039502l51722L80427J52004R0385j50470k3084J02283p3234o1188N3536
$$ 10039502 9687780 10068207 10220211 10310596 10160126 10137042 10239325 10166091 10104903 10158439
4650A0158439M32940M19559n0596k94318k18223n1394J27481o2278P702L71404
$$ 10158439 10591379 11010938 10960342 10666024 10447801 10396407 10523888 10461610 10469312 10840716
4640A0840716p328O6525K75444K50157j19646Q8534k57989K25106M35111J61978
$$ 10840716 10833388 10899913 11175357 11425514 11305868 11394402 11136413 11361519 11796630 11958608
4630A1958608J07407O4037N8625J93666J08370J40096J93666J46556L34432R2233
$$ 11958608 12066015 12130052 12188677 12382343 12490713 12630809 12824475 12971031 13305463 13397696
4620A3397696N3115l2813Q65097J72294J66465L61489Q3554M10657J10925K64727
$$ 13397696 13450811 13417998 14283095 14455389 14621854 14983343 15066897 15477554 15588479 15853206
4610A5853206O47433m9904K18120M36341O55616L88641J45966j2326K3060L37848
$$ 15853206 16500639 16450735 16668855 17105196 17760812 18149453 18295419 18283093 18306153 18644001
4600A8644001N14646N51421K99377K64806L46964L33443K95363J05751J34300
$$ 18644001 19158647 19710068 20009445 20274251 20621215 20954658 21250021 21355772 21490072
4591B1490072L8940K26932N19803M94771k1672k48874k11095K7841J01093j65567
$$ 21490072 21529012 21755944 22275747 22770518 22748846 22499972 22288877 22316718 22417811 22252244
4581B2252244n5016J1831K32079J70401K85426k4482O2165p067L8590P9539R5767
$$ 22252244 22197228 22209059 22441138 22611539 22896965 22872483 22934648 22927581 22966171 23045710 23141477
4570B3141477J28037L80307J63179L98368L96694p0337J90203J67874L97582M86004
$$ 23141477 23269514 23649821 23813000 24211368 24608062 24537725 24727928 24895802 25293384 25779388
4560B5779388J56118K60172k6537j6961l00905m58530j64960l90385k4951m6613
$$ 25779388 25935506 26195678 26169141 26152180 25851275 25392745 25227785 24837400 24812449 24765836
4550B4765836J14031N04629K44083J41051J94060M54699R5294N66996K17641L79520
$$ 24765836 24879867 25384496 25628579 25769630 25963690 26418389 26513683 27080679 27298320 27677840
4540B7677840K90778L82408N91255M31209M04411J093064M50010N09378J033295
$$ 27677840 27968618 28351026 28942281 29373490 29777901 30870965 31320975 31830353 32863648
4531C2863648M71516Q45787R96623J332392J061469R00869M12438P3537q91798
$$ 32863648 33335164 34180951 35177574 36509966 37571435 38472304 38884742 38958279 38066481
4522C8066481p30574o21622m91892Q0433Q2899N11477Q00365N89276P24719P55511
$$ 38066481 37335907 36714285 36222393 36302826 36385725 36897202 37697567 38286843 39011562 39767073
4512C9767073Q56877J619347J207088J279706J388637J179118K184499K799339
$$ 39767073 40623950 42243297 43450385 44730091 46118728 47297846 49482345 52281684
4504E2281684J984230K081677J975373J885487K494502K442530K259336J895090
$$ 52281684 54265914 56347591 58322964 60208451 62702953 65145483 67404819 69299909
4496F9299909J972873J785207J459562M82002l24706j008570k226202l297107
$$ 69299909 71272782 73057989 74517551 74999553 74674847 73666277 71440075 68142968
4488F8142968l466578l200852k629602k605988k008199k014034j852509j506807
$$ 68142968 64676390 61475538 58845936 56239948 54231749 52217715 50365206 48858399
4480D8858399j417433j538242j356674j296736j048440p52315n90237j25036n81439
$$ 48858399 47440966 45902724 44546050 43249314 42200874 41448559 40858322 40733286 40151847
4471D0151847m49050n87811m81966l25689o00298j83788j09849k7969L25419M63582
$$ 40151847 39702797 39114986 38633020 38307331 37707033 37523245 37413396 37385427 37710846 38174428
4461C8174428K0917j39463L59340J80143N64123J69307j23907J54517k63605k28808
$$ 38174428 38195345 38055882 38415222 38595365 39159488 39328795 39204888 39359405 39095800 38866992
4451C8866992o3139M25484N85635j46321L06432Q3634n00777k6529q8841J13748
$$ 38866992 38803853 39229337 39814972 39668651 39975083 40058717 39557940 39531411 39442570 39556318
4441C9556318m31010k03631j59464q3003P5735L6313j00174K48982M54666L20170
$$ 39556318 39125308 38921677 38762213 38679210 38754945 38791258 38691084 38940066 39394732 39714902
4431C9714902P34910J94127k65370M68594N74007O99662Q15539M47622K31324
$$ 39714902 40449812 40643939 40378569 40847163 41421170 42120832 42936371 43383993 43615317
4422D3615317K12488L25852R89203Q42703N67718P85469O37201R07268P09212
$$ 43615317 43827805 44153657 45142860 45985563 46553281 47338750 47975951 48883219 49592431
4413D9592431Q94184M75546N66355M84748L2498l60189o17201q16186p97108n16879
$$ 49592431 50486615 50962161 51528516 52013264 52045762 51685573 51068372 50252186 49455078 48938199
4403D8938199r95651p20763o01091p48722j37810l31721q00406n84418l44612
$$ 48938199 47942548 47221785 46620694 45871972 45734162 45402441 44602035 44017617 43673005
4394D3673005j63377K20329l76586m05381j88209j35109J76450L38793K67068
$$ 43673005 43509628 43729957 43353371 42947990 42759781 42624672 42801122 43139915 43406983
4385D3406983J85745J94833m6133K892L76483K01095L09421L8323N75831R13474
$$ 43406983 43592728 43787561 43741428 43744320 44120803 44321898 44631319 44669642 45245473 46158947
4375D6158947L97937J04279j31206l01163l84875q88256r46725j126000j317363
$$ 46158947 46556884 46661163 46529957 46228794 45843919 44955663 44008938 42882938 41565575
4366D1565575j093066r97160p08444k87755o53102p68847r96305q56465n55048
$$ 41565575 40472509 39475349 38766905 38479150 37826048 37057201 36060896 35204431 34649383
4357C4649383q25413q76255n45452j87003M883l54685o21035p61749o18068l52095
$$ 34649383 33823970 32947715 32402263 32215260 32220143 31865458 31244423 30482674 29864606 29512511
4347B9512511j33968J14170N7523j59530J11024M23104k07505l05884m45613j71479
$$ 29512511 29378543 29492713 29550236 29390706 29501730 29924834 29717329 29411445 28965832 28794353
4337B8794353J56996N9145k77121m61499n29685m00076k73424n06918n43035n17616
$$ 28794353 28951349 29010494 28733373 28271874 27742189 27342113 27068689 26561771 26018736 25501120
4327B5501120p15330L03995N34427K49608n649l09224l18155N2803k32926l05941
$$ 25501120 24785790 25089785 25624212 25873820 25868171 25558947 25240792 25293595 25060669 24754728
4317B4754728l16259R0366k06852q4466l24207j42516m10381m26966r8253l29436
$$ 24754728 24438469 24528835 24321983 24237517 23913310 23770794 23360413 22933447 22835194 22505758
4307B2505758p3517R2510J49816j89045R2081K22254k04386Q8571m53842m55023
$$ 22505758 22432241 22524751 22674567 22485522 22577603 22799857 22595471 22684042 22230200 21775177
4297B1775177p5858l64356l0964K55908L14407M9678l15343r9698J25359j11477
$$ 21775177 21699319 21334963 21303999 21559907 21874314 21923992 21608649 21508951 21634310 21522833
4287B1522833J17810J14902r129J74452J87440K15023J89111O32102j13313K63011
$$ 21522833 21640643 21755545 21746416 21920868 22108308 22323331 22512442 23144544 23031231 23294242
4277B3294242Q59152O90415J016305P81603J115061J653884J653044J497815K028174
$$ 23294242 24153394 24843809 25860114 26641717 27756778 29410662 31063706 32561521 34589695
4268C4589695J571103J281275l25128k541304l907125l204091k543129j671886
$$ 34589695 36160798 37442073 37116945 34575641 30668516 27464425 24921296 23249410
4260B3249410j158426q91275p39645n05108m93090o11914l30901o56415p2375
$$ 23249410 22090984 21199709 20460064 19954956 19461866 18849952 18519051 17862636 17790261
4251A7790261M90911j51321q7671o02510l14364J24407j48379j6069M6014j71302
$$ 17790261 18281172 18129851 18042180 17439670 17125306 17249713 17101334 17085265 17131279 16959977
4241A6959977k19070j33265n84936R649R6505k07065j2535n92778j19999J46793
$$ 16959977 16740907 16607642 16022706 16032355 16128860 15921795 15909260 15316482 15196483 15343276
4231A5343276K01074j81857K30313l87485j26103K13575J38417j10436N0386k01815
$$ 15343276 15544350 15362493 15592806 15205321 15079218 15292793 15431210 15320774 15371160 15169345
4221A5169345j88897L51038J42907K84462k07228k38061j40884j255K15268L62486
$$ 15169345 14980448 15331486 15474393 15758855 15551627 15313566 15172682 15171427 15386695 15749181
4211A5749181j38126n6180j03749L9142O94288k02351k76254J30246k33570J30935
$$ 15749181 15611055 15554875 15451126 15490268 16184556 15982205 15705951 15836197 15602627 15733562
4201A5733562j4712P7916L30880J32626n62305q9688l82558k57078J4100j72741
$$ 15733562 15718850 15796766 16127646 16260272 15697967 15608279 15225721 14968643 14982743 14810002
4191A4810002j00882J32846p4559J56713M43394J81849k41316l66079k28023M37301
$$ 14810002 14709120 14841966 14767407 14924120 15367514 15549363 15308047 14941968 14713945 15151246
4181A5151246K81426L6651j89443j48880J7840K09006j44041m1415k87115J0946
$$ 15151246 15432672 15469323 15279880 15131000 15148840 15357846 15213805 15172390 14885275 14896221
4171A4896221m6227p8947J26891L28621k86748k02019k60096j97708k6091M2585
$$ 14896221 14849994 14771047 14897938 15226559 14939811 14737792 14477696 14279988 14253897 14296482
4161A4296482L34931k81080k67112Q689Q826M05865L7637J81012k5118K79270
$$ 14296482 14631413 14350333 14083221 14091910 14100736 14506601 14544238 14725250 14700132 14979402
4151A4979402k5925J81744J15073o49829j11124j00526j22749n510k41172j52648
$$ 14979402 14953477 15135221 15250294 14600465 14489341 14388815 14266066 14260556 14019384 13866736
4141A3866736J83196j7996q5066j30781J86463P2634Q5901L7395K4038J53609
$$ 13866736 14049932 14031936 13946870 13816089 14002552 14075186 14161087 14198482 14222520 14376129
4131A4376129L89762J60195m2958l04489j39574J78196P3291j20060L72379r1236
$$ 14376129 14765891 14926086 14883128 14578639 14439065 14617261 14690552 14570492 14942871 14851635
4121A4851635k35065M9829j25468J68009K54457l87130L9974K00754o8421j50763
$$ 14851635 14616570 14666399 14540931 14708940 14963397 14576267 14616241 14816995 14748574 14597811
4111A4597811J74592m51242j78048p8385p3542K17706K44506l53159K95199J16925
$$ 14597811 14772403 14321161 14143113 14064728 13991186 14208892 14453398 14100239 14395438 14512363
4101A4512363K75148l40959K97577J35837l00650J04986j31962J8171R8394l43878
$$ 14512363 14787511 14446552 14744129 14879966 14579316 14684302 14552340 14570511 14668905 14325027
4091A4325027n5032K29014M0771M12897m485Q5472L76472l20806j6387L06012
$$ 14325027 14269995 14499009 14539780 14952677 14948192 15033664 15410136 15089330 15072943 15378955
4081A5378955j5038p3307Q9626M0620L57571n7456m27915K08370k13695J76817
$$ 15378955 15363917 15290610 15380236 15420856 15778427 15720971 15293056 15501426 15287731 15464548
4071A5464548J61968n105M67731j97719K5161K59001K39930j6296j10096K37105
$$ 15464548 15626516 15621411 16089142 15891423 15916584 16175585 16415515 16399219 16289123 16526228
4061A6526228M14355K50846l31168j02919L10555L94029k59127J7098M37262N09147
$$ 16526228 16940583 17191429 16860261 16757342 17067897 17461926 17202799 17219897 17657159 18166306
4051A8166306M9445J9192L21881M08414k35777k43359K01696K86718M2031J89886
$$ 18166306 18215751 18234943 18556824 18965238 18729461 18486102 18687798 18974516 19016547 19206433
4041A9206433M81883O23058j98706j1108L7861j45825K79172J51175k1846N64360
$$ 19206433 19688316 20311374 20112668 20101560 20139421 19993596 20272768 20423943 20402097 20966457
4031B0966457K79743K7932N77791M78011K49246N76887K25667L56660L97903O52583
$$ 20966457 21246200 21274132 21851923 22329934 22579180 23156067 23381734 23738394 24136297 24788880
4021B4788880M90327N92108M04177L13010M52281M09585Q07572M56390J89879
$$ 24788880 25279207 25871315 26275492 26588502 27040783 27450368 28257940 28714330 28904209
4012B8904209R16004N60453N73158N09258P34594M90485L14048K28091L69693
$$ 28904209 29820213 30380666 30953824 31463082 32197676 32688161 33002209 33230300 33599993
4003C3599993M77004r494l76870J55144l4054j89463M91809M47130J03488J80937
$$ 33599993 34076997 34067503 33690633 33845777 33811723 33622260 34114069 34561199 34664687 34845624
3993C4845624n5097K71392M70040k34416j15413Q8437o9932L57181K09900Q8055
$$ 34845624 34790527 35061919 35531959 35297543 35182130 35270567 35200635 35557816 35767716 35855771
3983C5855771O59002K8303L00822J23558Q56458J135615O80812P66000R35016
$$ 35855771 36514773 36543076 36843898 36967456 37823914 38959529 39640341 40406341 41341357
3974D1341357R20290O98982P97550J248569J134649N72263Q38843J027906J122766
$$ 41341357 42261647 42960629 43758179 45006748 46141397 46713660 47552503 48580409 49703175
3965D9703175Q89686J64451J06111L26520J64995k46789N2172k85152k22745o17454
$$ 49703175 50592861 50757312 50863423 51189943 51354938 51108149 51160321 50875169 50652424 50034970
3955E0034970n11993K57187k08442l27140l12394n47824m60630o36112o02866
$$ 50034970 49522977 49780164 49571722 49244582 48932188 48384364 47923734 47287622 46684756
3946D6684756p83662l11378l35508m94640k34532R3460L9051l51896j66043J08321
$$ 46684756 45901094 45589716 45254208 44759568 44525036 44618496 44657547 44305651 44139608 44247929
3936D4247929J33689L34461L06857P13243L91528J82968O21166O28551J40237
$$ 44247929 44381618 44716079 45022936 45736179 46127707 46310675 46931841 47560392 47700629
3927D7700629N23409N10007J90096J25063j63336j78055l9992o3223m32268J18203
$$ 47700629 48224038 48734045 48924141 49049204 48885868 48707813 48667821 48604598 48172330 48290533
3917D8290533q8199m35493K68538J92539K58067K42530J57220J70628l07257k08314
$$ 48290533 48202334 47766841 48035379 48227918 48485985 48728515 48885735 49056363 48749106 48540792
3907D8540792l81408m79228J46591L76545j30787L00794P23277M83160Q84387
$$ 48540792 48159384 47680156 47826747 48203292 48072505 48373299 49096576 49579736 50464123
3898E0464123J124149P74561Q35826Q85797J113061J816143J466881J294610J440746
$$ 50464123 51588272 52362833 53198659 54084456 55197517 57013660 58480541 59775151 61215897
3889F1215897J567275J875766J810423J933237K193149K524875K794607L875339
$$ 61215897 62783172 64658938 66469361 68402598 70595747 73120622 75915229 79790568
3881G9790568L771716L918182M425626M791225N784739O271013P073811R034132
$$ 79790568 83562284 87480466 91906092 96697317 102482056 108753069 115826880 124861012
3873A24861012J0648251J2651944J5400862J7889440K1398348K3203693K3005786
$$ 124861012 135509263 148161207 163562069 181451509 202849857 226053550 249059336
3866B49059336K1979345J5145224n982034k8973744l8554468l3667014k3648347
$$ 249059336 271038681 286183905 280201871 251228127 212673659 179006645 155358298
3859A55358298j7019846j2295082r080391o814957n562139m930558l695409k763942
$$ 155358298 138338452 126043370 116962979 110148022 104585883 99655325 95959916 93195974
3851I3195974k367161k150705j565747j007560j070287o01342l17753l34422K12081
$$ 93195974 90828813 88678108 87112361 86104801 85034514 84433172 84115419 83780997 83993078
3842H3993078n21089o77656p45085j988707j813628j321092j561174j857097j530233
$$ 83993078 83471989 82794333 82049248 80060541 78246913 76925821 75364647 73507550 71977317
3833G1977317j837638j299411p46147q57687p26121m61571p8830J6942L5581L46193
$$ 71977317 70139679 68840268 68094121 67236434 66510313 66048742 65969912 65986854 66022435 66368628
3823F6368628R9754K02849J63809O9186L25197K96736n07911o25941k67904n02083
$$ 66368628 66468382 66671231 66835040 66904226 67229423 67526159 67018248 66392307 66124403 65622320
3813F5622320n48861n04371K1520l5480N50991O80643Q16350J280827J278978
$$ 65622320 65073459 64569088 64590608 64555128 65106119 65786762 66603112 67883939 69162917
3804F9162917J396769J465763K173514K276986L098271L581360M123777M786969
$$ 69162917 70559686 72025449 74198963 76475949 79574220 83155580 87279357 92066326
3796I2066326M921388L030614k85763l268324m751003n603615m881526k816910
$$ 92066326 96987714 100018328 99732565 96464241 91713238 86109623 81228097 78411187
3788G8411187j768224p31885J95091M44102J030728J182966J717504J523432K360589
$$ 78411187 76642963 75911078 76106169 76550271 77580999 78763965 80481469 82004901 84365490
3779H4365490L050167L586000M302030M466923N397300P077128Q135990Q797201
$$ 84365490 87415657 91001657 95303687 99770610 105167910 112245038 120381028 129178229
3771A29178229Q515605Q182635N709993k279260j1100034j4525807j2849875r516916
$$ 129178229 137693834 145876469 151586462 149307202 138207168 123681361 110831486 101314570
3763A01314570o319935m625015l036533j816658j175969n60911J60790j24731
$$ 101314570 94994635 90369620 87333087 85516429 84340460 83779549 83940339 83815608
3755H3815608k61216K57258m99341q23040j409217j980578j698265k122135k203661
$$ 83815608 83554392 83811650 83312309 82489269 81080052 79099474 77401209 75279074 73075413
3746G3075413j618038j101087j172118p71419l72111P93432Q81974O16222J413364
$$ 73075413 71457375 70356288 69184170 68412751 68040640 68834072 69716046 70332268 71745632
3737G1745632J123316J191368J795061K147090L058051L312444L918616L980645
$$ 71745632 72868948 74060316 75855377 78002467 81060518 84372962 88291578 92272223
3729I2272223M750241M927278N176125M561957K599860O59233n21523j446905
$$ 92272223 97022464 101949742 107125867 111687824 114287684 114946917 114425394 112978489
3721A12978489j896497k080137r02592K49381J274186K103352K886363L518502
$$ 112978489 111081992 109001855 108099263 108348644 109622830 111726182 114612545 118131047
3713A18131047L681771M380250M944149M998224N281285N069778L621858L087170
$$ 118131047 121812818 126193068 131137217 136135441 141416726 146486504 150108362 153195532
3705A53195532K187376K3317j016541k895464l712075m431430n887371p506921
$$ 153195532 155382908 155406225 154389684 151494220 147782145 143350715 137463344 129956423
3697A29956423p645138p452107p616755p031939o593679n636850n155169m177241
$$ 129956423 122311285 114859178 107242423 100210484 93616805 87979955 82824786 78647545
3689G8647545l601766l246618k521941k341735j967355j680408j437480j647466
$$ 78647545 75045779 71799161 69277220 66935485 64968130 63287722 61850242 60202776
3681F0202776j060831r49949j146177q51551j116441o34329r85577j250999j341198
$$ 60202776 59141945 58191996 57045819 56194268 55077827 54443498 53457921 52206922 50865724
3672E0865724j312806j296331r83445j028305n41203j64174m99279j62424k28108
$$ 50865724 49552918 48256587 47273142 46244837 45703634 45539460 45040181 44877757 44649649
3663D4649649K55699k78172o13837K31413K82973M40104m0671N7623J99086J48449
$$ 44649649 44905348 44627176 44013339 44244752 44527725 44967829 44927158 44984781 45183867 45332316
3653D5332316K88874L43473j21002k88939p22457l87482n03850p98464q22785
$$ 45332316 45621190 45964663 45843661 45554722 44832265 44444783 43940933 43142469 42319684
3644D2319684p39686j369796o97784n64314p70859n31603n45000n83247j68652
$$ 42319684 41579998 40210202 39512418 38948104 38177245 37645642 37100642 36517395 36348743
3635C6348743m67185p3764K9368M55402o4729m4082q8036L51282L14979N7408
$$ 36348743 35881558 35807794 35837162 36292564 36227835 36183753 36095717 36446999 36761978 36819386
3625C6819386O60260J44040N58501Q33964L23793M59240J044952N02730N56811
$$ 36819386 37479646 37623686 38182187 39016151 39339944 39799184 40844136 41346866 41903677
3616D1903677Q59867Q36144J529096R97148Q71834J530203J633598J694075J619732
$$ 41903677 42763544 43599688 45128784 46125932 46997766 48527969 50161567 51855642 53475374
3607E3475374J829706J484157P90699j198483k459049l608487l388041k791707
$$ 53475374 55305080 56789237 57579936 56381453 53922404 50313917 46925876 44134169
3599D4134169k336689j970873j880062j685275j405756q17427r0224m67699p19463
$$ 44134169 41797480 39826607 37946545 36261270 34855514 34038087 33947863 33480164 32760701
3590C2760701p266j25476q83870l75493j59513l55313j97118l57234o04303l41132
$$ 32760701 32753435 32627959 31744089 31368596 31209083 30853770 30656652 30299418 29695115 29353983
3580B9353983r15327q75799o88050N850n47513n17718l66653l11801j02152j74457
$$ 29353983 28438656 27562857 26874807 26880657 26333144 25815426 25448773 25136972 25034820 24860363
3570B4860363k41060J86593k17367k92697J12752j4984L44621j41260k62848O05224
$$ 24860363 24619303 24805896 24588529 24295832 24408584 24393600 24738221 24596961 24334113 24939337
3560B4939337k35748j42634l71494o71474k86426k63914l38441K82654j87832
$$ 24939337 24703589 24560955 24189461 23517987 23231561 22967647 22629206 22911860 22724028
3551B2724028m42926l02862j23364J90937p0955n4451j15573L00910j96984J36792
$$ 22724028 22281102 21978240 21854876 22045813 21974858 21920407 21804834 22105744 21908760 22045552
3541B2045552j48352k51879k03113J6640K95043N55468L33265L6722M71414M12672
$$ 22045552 21897200 21645321 21442208 21458848 21753891 22309359 22642624 22679346 23150760 23563432
3531B3563432l11195K70954K1664K08881J00488j42356n67779k76712K32016m8642
$$ 23563432 23252237 23523191 23544855 23753736 23854224 23711868 23144089 22867377 23099393 23050751
3521B3050751K39030J07198j5217K08854q2512K83583K15570L2640o83718j63153
$$ 23050751 23289781 23396979 23381762 23590616 23508104 23791687 24007257 24039897 23356179 23193026
3511B3193026J9494j41434J10258J38591K2248N15661J57703J93301O8676j20224
$$ 23193026 23212520 23071086 23181344 23319935 23342183 23857844 24015547 24208848 24277524 24157300
3501B4157300O9553L34452K22688K19599L99011M07394Q1634O2501K65144L52128
$$ 24157300 24226853 24561305 24783993 25003592 25402603 25809997 25891631 25954132 26219276 26571404
3491B6571404O43063M01582O56214M87268K48541M71406L96108P22300O50777
$$ 26571404 27214467 27616049 28272263 28759531 29008072 29479478 29875586 30597886 31248663
3482C1248663L88118O46208M96769K91342M03851L18270j32045P01925M22050
$$ 31248663 31636781 32282989 32779758 33071100 33474951 33793221 33661176 34363101 34785151
3473C4785151M05747J011959L52774M57368L30995J117281R87916J086002J049349
$$ 34785151 35190898 36202857 36555631 37012999 37343994 38461275 39449191 40535193 41584542
3464D1584542K77973J121532J134801J208638J859683J824737J138999J535266
$$ 41584542 41862515 42984047 44118848 45327486 47187169 49011906 50150905 51686171
3456E1686171J093774J443843J277515Q46298Q74270Q75737R41788N28061j84392
$$ 51686171 52779945 54223788 55501303 56347601 57221871 58097608 59039396 59567457 59383065
3447E9383065l20314p97016n24085n42667J61889P02078R91135N26380J216096
$$ 59383065 59062751 58265735 57741650 57198983 57360872 58062950 59054085 59580465 60796561
3438F0796561J942715J718192K686411K957333L196715M161133M266201N110005
$$ 60796561 62739276 64457468 67143879 70101212 73297927 77459060 81725261 86835266
3430H6835266N701175O147439O325153O844303O609062N687207K958953p20696
$$ 86835266 92536441 98683880 105009033 111853336 118462398 124149605 127108558 126387862
3422A26387862m598893p574604p531380p157241o117479m650842m430358l832324
$$ 126387862 121788969 114214365 106682985 99525744 93408265 88757423 84327065 80494741
3414H0494741k999350k948520k297945j110400j268959j044569o05239j000904
$$ 80494741 77495391 74546871 72248926 71138526 69869567 68824998 68219759 67218855
3406F7218855p04542J42609L93844j32562m54341n95354o25015r62251j131791
$$ 67218855 66514313 66656922 67050766 66918204 66463863 65868509 65243494 64281243 63149452
3397F3149452l41910j139240r60086l00575n50911J98868J55867l15597j67189
$$ 63149452 62807542 61668302 60708216 60407641 59856730 60055598 60211465 59895868 59728679
3388E9728679l65371J01022Q18905O18253L32711N64178Q43050J373808K167448
$$ 59728679 59363308 59464330 60283235 60901488 61234199 61798377 62641427 64015235 66182683
3379F6182683J750327K163719J924252K012259K430164K846170K214901K386359
$$ 66182683 67933010 70096729 72020981 74033240 76463404 79309574 81524475 83910834
3371H3910834K149162J130197K25806j428197k864264l335635m127759l374497
$$ 83910834 86059996 87190193 87415999 85987802 83123538 79787903 75660144 72285647
3363G2285647l531202k985982k231167j819500r06305p42765j389244o57534j02289
$$ 72285647 68754445 65768463 63537296 61717796 60811491 60068726 58679482 58021948 57919659
3354E7919659k46183R1200J38813L3626Q5490K64813N72316J020721J134198M52994
$$ 57919659 57673476 57764676 57903489 57937115 58022605 58287418 58859734 59880455 61014653 61467647
3344F1467647L33925M13376J054698J033400P17228M83381R67990J228485J057277
$$ 61467647 61801572 62214948 63269646 64303046 65020274 65503655 66471645 67700130 68757407
3335F8757407J514498J444693J315804J286796J547466K012764J833928J728662
$$ 68757407 70271905 71716598 73032402 74319198 75866664 77879428 79713356 81442018
3327H1442018J763411K254837K192842K219261K272723J292286J65584j074746
$$ 81442018 83205429 85460266 87653108 89872369 92145092 93437378 93602962 92528216
3319I2528216k001324k343545k867625k487568j961501j412690j024593p30160
$$ 92528216 90526892 88183347 85315722 82828154 80866653 79453963 78429370 77699210
3311G7699210p41864p12684p40040n39077n32788l20903J79847l33773j35836
$$ 77699210 76957346 76244662 75504622 74965545 74432757 74111854 74291701 73957928 73822092
3302G3822092m0090O54737K51536N53720O93085N13544O26654L81821K71815R00819
$$ 73822092 73782002 74436739 74688275 75241995 75935080 76448624 77075278 77457099 77728914 78629733
3292G8629733K87259L81200L47267K48208Q26176J081766J009483J492695P76014
$$ 78629733 78916992 79298192 79645459 79893667 80719843 81801609 82811092 84303787 85079801
3283H5079801M56054O50965Q96847Q76097J119493J207798J198802J790847K389051
$$ 85079801 85535855 86186820 87083667 87959764 89079257 90287055 91485857 93276704 95665755
3274I5665755K855191L468381L268378L180422L917024M630732N264106O198895
$$ 95665755 98520946 101989327 105257705 108438127 112355151 116985883 122249989 128448884
3266A28448884N479898M442830K360433j144991m432243p251668p544148o044555
$$ 128448884 133928782 138371612 140732045 139587054 135154811 127903143 120358995 114314440
3258A14314440m707276k812600o36024k30805P28020J935596K231950K720841
$$ 114314440 109607164 106794564 106158540 105927735 106655755 108591351 110823301 113544142
3250A13544142L184878L538650L775229L881596M775923O496787Q027900R821504
$$ 113544142 116729020 120267670 124042899 127924495 132700418 139197205 147225105 157046609
3242A57046609J1307722J2001903J1510123R850676N908464r66101q618723j3520164
$$ 157046609 168354331 180356234 191866357 201717033 207625497 206659396 198040673 184520509
3234A84520509j5148354j2588589r083697o323510k676190j231743o75624l36694
$$ 184520509 169372155 156783566 147699869 141376359 138700169 137468426 136792802 136456108
3226A36456108j715907k990396n239197o774362p549851p684635o533696n962535
$$ 136456108 134740201 131749805 126510608 119736246 112186395 104501760 97968064 92005529
3218I2005529m634358m144935l489091l812297l581191l044709k827654k686062
$$ 92005529 87371171 83226236 79737145 75924848 72343657 69298948 66471294 63785232
3210F3785232k236208k057425k043861j572096j633159r20616n69482r63510n13583
$$ 63785232 61549024 59491599 57447738 55875642 54242483 53321867 52752385 51788875 51275292
3201E1275292r34320l40695r57031j514942j371675j185927j280387j045478q62322
$$ 51275292 50340972 50000277 49043246 47528304 46156629 44970702 43690315 42644837 41782515
3192D1782515q50053n62670q11907l76311m99818n08778o21430q73343j39802
$$ 41782515 40932462 40369792 39557885 39181574 38681756 38172978 37551548 36678205 36538403
3183C6538403o67053m87315l60517k76353m92104n34522k57612m37488J04873
$$ 36538403 35871350 35384035 35023518 34747165 34255061 33720539 33462927 33025439 33130312
3174C3130312J69896Q1053j97635j68590j36914q5631J04922O8820j41214j54707
$$ 33130312 33300208 33381261 33183626 33015036 32878122 32792491 32897413 32966233 32825019 32670312
3164C2670312k22634m06788k6513j84142m07968K33294n58630J4200j74532n50451
$$ 32670312 32447678 32040890 32014377 31830235 31422267 31655561 31096931 31111131 30936599 30386148
3154C0386148o50706j171758o28698k33233m51050J655k69405j13749l82898n65363
$$ 30386148 29735442 28563684 27934986 27701753 27250703 27252358 26982953 26869204 26486306 25920943
3144B5920943m80052r2586k46476m70261p3919n80111j56376K62327l14636K31987
$$ 25920943 25440891 25348305 25101829 24631568 24557649 23977538 23821162 24083489 23768853 24000840
3134B4000840j25380k55644j85577P7015L07658K81820j24917j05570L10531l03260
$$ 24000840 23875460 23619816 23434239 23511254 23818912 24100732 23975815 23870245 24180776 23877516
3124B3877516J7607r0887j90193k35346l3890k1001K38838M21444K27784L45726
$$ 23877516 23895123 23804236 23614043 23378697 23344807 23323806 23562644 23984088 24211872 24557598
3114B4557598P5335M45077L50756J83046N81444K31750L12127k11093K5017k01850
$$ 24557598 24632933 25078010 25428766 25611812 26193256 26425006 26737133 26526040 26551057 26349207
3104B6349207O332M9529K27369J08700K3908p1511j50384J26899j72009k40427
$$ 26349207 26355539 26405068 26632437 26741137 26765045 26693534 26543150 26670049 26498040 26257613
3094B6257613l94413p88176j75853m49486l78893l57011o10849k15341j12781
$$ 26257613 25863200 25075024 24899171 24449685 24070792 23713781 23102932 22887591 22774810
3085B2774810j89664M09991k82649K56364L11091l85789P0962K73262r1386L82453
$$ 22774810 22585146 22995137 22712488 22968852 23279943 22894154 22965116 23238378 23146992 23529445
3075B3529445M00726M72430M87042L66041O66087K45989j21403k30899o39085
$$ 23529445 23930171 24402601 24889643 25255684 25921771 26167760 26046357 25815458 25176373
3066B5176373j2556J66469K20567K96187K03856K18753K93012M07652J17344L93789
$$ 25176373 25163817 25330286 25550853 25847040 26050896 26269649 26562661 26970313 27087657 27481446
3056B7481446L91122L01719l06555J22072M65317O04119O86173J031988P90491
$$ 27481446 27872568 28174287 27867732 27989804 28455121 29059240 29745413 30777401 31567892
3047C1567892N43013Q55826M38545K10606L32119n24192n01760l53478k40658
$$ 31567892 32110905 32966731 33405276 33615882 33948001 33423809 32922049 32568571 32327913
3038C2327913J04890J27032K45957J44392j95428N93476k41448J28163k8303j146359
$$ 32327913 32432803 32559835 32805792 32950184 32754756 33348232 33106784 33234947 33206644 32060285
3028C2060285j231729o53203j038573o28995m47501j034393n65209l45496n8307
$$ 32060285 30828556 30175353 29136780 28507785 28060284 27025891 26460682 26115186 26056879
3019B6056879L62224M80965K14920j50819K51440r625N26042O42685N33355L71699
$$ 26056879 26419103 26900068 27114988 26964169 27215609 27205984 27732026 28374711 28908066 29279765
3009B9279765Q54087O85382R23550P6041k63711n8192n31412o32633k50985O5810
$$ 29279765 30133852 30819234 31742784 31818825 31555114 31496922 30965510 30332877 30081892 30147702
2999C0147702J27512P7016j62271K49235J36958k74537L70801m47036l43588j04518
$$ 30147702 30275214 30352230 30189959 30439194 30576152 30301615 30672416 30225380 29881792 29777274
2989B9777274r24960p10792m44161q03359k67034l70245o10113K87179o20256
$$ 29777274 28852314 28141522 27697361 26894002 26626968 26256723 25646610 25933789 25313533
2980B5313533L1549L82539J7341p1870K25965N7352l6154L39690r173M7693m4609
$$ 25313533 25345082 25727621 25744962 25673092 25899057 25956409 25920255 26259945 26250772 26298465 26253856
2969B6253856l34257l7377k20309J81950J0433n90402j12492Q47838j19103L17916
$$ 26253856 25919599 25882222 25661913 25843863 25854296 25263894 25151402 25999240 25880137 26198053
2959B6198053R9406M34004N60259K64328N93798J045876N15938N62650N41389
$$ 26198053 26297459 26731463 27291722 27556050 28149848 29195724 29711662 30274312 30815701
2950C0815701K88617P6617L26030J94447k43631n12709k64301l27079k3878l3878
$$ 30815701 31104318 31180935 31506965 31701412 31457781 30945072 30680771 30353692 30329814 30295936
2940C0295936n1504j83835J41942N52597O82850M76845M69384M25763K22937L03024
$$ 30295936 30244432 30060597 30202539 30755136 31437986 31914831 32384215 32809978 33032915 33335939
2930C3335939J22152k63660l97326J47808J04213k82951K11865p6090K88136L51230
$$ 33335939 33458091 33194431 32797105 32944913 33049126 32766175 32978040 32901950 33190086 33541316
2920C3541316j70607J90597N98927O28173Q01021J150279P25309Q05985O47932
$$ 33541316 33370709 33561306 34160233 34788406 35589427 36739706 37465015 38271000 38918932
2911C8918932N11584O79301N99455O5386J87999O2708M54590N96887q57887P7730
$$ 38918932 39430516 40109817 40709272 40774658 40962657 41025365 41479955 42076842 41218955 41296685
2901D1296685m16964j024030n60804j282086n86373k63492p41818q81517o9400
$$ 41296685 40879721 39855691 39294887 38012801 37426428 37162936 36421118 35539601 35470201
2892C5470201j26729r369K82138K60499j77963n3124J92324L27625M2956J90741
$$ 35470201 35343472 35334103 35616241 35876740 35698777 35645653 35837977 36165602 36208558 36399299
2882C6399299o63885j00948n5537p7477K34328J06777n29964M2072N88234J58599
$$ 36399299 35735414 35634466 35578929 35501452 35735780 35842557 35312593 35354665 35942899 36101498
2872C6101498j94085M54485N91987Q21900P01040M85294L08307j3753l29662j67844
$$ 36101498 35907413 36361898 36953885 37775785 38476825 38962119 39270426 39256673 38927011 38759167
2862C8759167m89077n26330l51009j67712m1461j27099J67320p21880m31263M09153
$$ 38759167 38270090 37743760 37392751 37225039 37183578 37056479 37223799 36501919 36070656 36479809
2852C6479809N51673N47623L95385M16367N48771N87726L12892J35572K01534
$$ 36479809 37031482 37579105 37974490 38390857 38939628 39527354 39840246 39975818 40177352
2843D0177352k73843L1974M99733N43132k40400Q1402m66570o32173k35937j90585
$$ 40177352 39903509 39935483 40435216 40978348 40737948 40819350 40352780 39720607 39484670 39294085
2833C9294085k91423L00797K25132m70730J55997L8197J92017L24716r7560K82302
$$ 39294085 39002662 39303459 39528591 39057861 39213858 39252055 39444072 39768788 39671228 39953530
2823C9953530O03555M11558O0917P48883J057312R76779N47357J076195P50343
$$ 39953530 40557085 40968643 41029560 41778443 42835755 43812534 44359891 45436086 46186429
2814D6186429J100386J413448J194558R85597K45176P15586Q95813R44754R04857
$$ 46186429 47286815 48700263 49894821 50880418 51125594 51841180 52736993 53681747 54586604
2805E4586604Q10857P11080P91584J200632J145769P57286L97485M01024m841
$$ 54586604 55397461 56108541 56900125 58100757 59246526 60003812 60401297 60802321 60797480
2796F0797480K65749Q8096r4967L24809L84363M76680Q47454J374174J289969
$$ 60797480 61063229 61151325 61056358 61381167 61765530 62242210 63089664 64463838 65753807
2787F5753807J581506J431852J233187J440283J004294K67125n75735k65335J45452
$$ 65753807 67335313 68767165 70000352 71440635 72444929 72712054 72136319 71870984 72016436
2778G2016436N05449P84083J209338J337509Q37821J027625R88900J439899J045524
$$ 72016436 72521885 73305968 74515306 75852815 76690636 77718261 78707161 80147060 81192584
2769H1192584J310489R14293R10438M19037O57806Q16695P21197P92968O94755
$$ 81192584 82503073 83417366 84327804 84746841 85404647 86221342 86942539 87735507 88430262
2760H8430262P31928J092223J475985J650089J828401J582608J084107J094438
$$ 88430262 89162190 90254413 91730398 93380487 95208888 96791496 97875603 98970041
2752I8970041P4926l39509p05000p75366n47965j64073n5067M84550P70961O42228
$$ 98970041 99044967 98705458 98000458 97225092 96677127 96513054 96457987 96942537 97713498 98355726
2742I8355726Q08261K49615R20637J054228J087999J000222Q90001O27090O248
$$ 98355726 99163987 99413602 100334239 101388467 102476466 103476688 104366689 104993779 105000027
2733A05000027m87918j082270q78735j069361j130925r21495m72204L63472P2671
$$ 105000027 104512109 103429839 102551104 101481743 100350818 99429323 98957119 99320591 99393262
2724I9393262M2719j90150l24256r83793j619824j828608j865346k563891k527522
$$ 99393262 99435981 99245831 98921575 97937782 96317958 94489350 92624004 90060113 87532591
2715H7532591j790378j739665j136580q59724r14576m96484q46910m84564J16052
$$ 87532591 85742213 84002548 82865968 82006244 81091668 80595184 79748274 79263710 79379762
2706G9379762j42277l80480m72947r96223o92213p17149j012023m55295q70334
$$ 79379762 79237485 78857005 78384058 77387835 76695622 75978473 74966450 74511155 73640821
2697G3640821n32544k53634p04330M5268k27411o10084p16769k60424p03247o84625
$$ 73640821 73108277 72854643 72150313 72195581 71968170 71358086 70641317 70380893 69677646 68993021
2687F8993021n08349k61557o50454r93381p40214o34263p11521m73914n68010
$$ 68993021 68484672 68223115 67572661 66579280 65839066 65204803 64493282 64019368 63451358
2678F3451358l44667k00736n85310k76765J48122m09257m85494o28252p95020
$$ 63451358 63106691 62905955 62320645 62043880 62192002 61782745 61297251 60668999 59873979
2669E9873979l19583m1987n02395q25867p48677o27181j46866j10237j43550q5603
$$ 59873979 59554396 59512409 59010014 58184147 57435470 56808289 56661423 56551186 56407636 56322033
2659E6322033m08426k42102L26544k07602k5987J56508k34008R8297o1253m51191
$$ 56322033 55913607 55671505 55998049 55790447 55764460 55920968 55686960 55785257 55724004 55272813
2649E5272813k21006n31887r48982j83039j60795n96264k002k11337l93359p05754
$$ 55272813 55051807 54519920 53570938 53387899 53227104 52630840 52628838 52417501 52024142 51318388
2639E1318388o40653n92788o09217q89663n43604l70788M6130K94986j49663J2395
$$ 51318388 50677735 50084947 49475730 48586067 48042463 47671675 47717805 48012791 47863128 47875523
2629D7875523L29228j94627m64238k43416l87467k66512J91300n3114j73858o77837
$$ 47875523 48204751 48010124 47545886 47302470 46915003 46648491 46839791 46786677 46612819 45934982
2619D5934982m95000j36384l08213j50552m38234j50100L70190N34098k22415
$$ 45934982 45439982 45303598 44995385 44844833 44406599 44256499 44626689 45160787 44938372
2610D4938372k40191m26955p07089j20523m31214k57035o52639k76484k13366
$$ 44938372 44698181 44271226 43564137 43443614 43012400 42755365 42102726 41826242 41612876
2601D1612876M24067N65498O6503m32430n98164k36973l93924n08337p26565o87314
$$ 41612876 42036943 42602441 42668944 42236514 41638350 41401377 41007453 40499116 39772551 39085237
2591C9085237l82646n15818k75915n87936o13528l14322J78389K70537p1252k04415
$$ 39085237 38702591 38186773 37910858 37322922 36709394 36395072 36573461 36843998 36772746 36568331
2581C6568331p5285K70423j63335o9505L33575o32424J74718N00102j75371L09071
$$ 36568331 36493046 36763469 36600134 36530629 36864204 36231780 36406498 36906600 36731229 37040300
2571C7040300l60338n24711l40958j26187j59733l57336p03373m15819j89243
$$ 37040300 36679962 36155251 35814293 35688106 35528373 35171037 34467664 34051845 33862602
2562C3862602l43804n35447n23596k64855k60020k80672r6275K46669j79977o93582
$$ 33862602 33518798 32983351 32459755 32194900 31934880 31654208 31557933 31804602 31624625 30931043
2552C0931043K0485J77837j30541j04472K93243k68684m7850j65302p0624M71319
$$ 30931043 30951528 31129365 30998824 30894352 31187595 30918911 30871061 30705759 30635135 31106454
2542C1106454m71621p89110L0366l73473j07572k82806l25876j14098l17322j81816
$$ 31106454 30634833 29845723 29876089 29502616 29395044 29112238 28786362 28672264 28354942 28173126
2532B8173126n6760m6118j56920n19982k95494K57705j96947m91109l6743r7046
$$ 28173126 28116366 28070248 27913328 27393346 27097852 27355557 27158610 26667501 26630758 26533712
2522B6533712k46348n6139j67081j323m6282J92523j4315L8438n8182j81465l95784
$$ 26533712 26287364 26231225 26064144 26062821 26016539 26209062 26194747 26233185 26175003 25993538 25597754
2511B5597754k8877K86885j705j5877j82782l85457l05713j4120J50238R708j77175
$$ 25597754 25568877 25855762 25854057 25838180 25655398 25269941 24964228 24950108 25100346 25110054 24932879
2500B4932879q7893j68341k9762j65750k57242J59853L7230P5659j82435j01389
$$ 24932879 24844986 24676645 24646883 24481133 24223891 24383744 24420974 24496633 24314198 24212809
2490B4212809J45335J140J68136j29291R3348L7783M3588K4899R2108M5753J66650
$$ 24212809 24358144 24359284 24527420 24398129 24491477 24529260 24572848 24597747 24689855 24735608 24902258
2479B4902258l7799R6389j16431k36079N7657m20692M299J77680n35131K11193
$$ 24902258 24864459 24960848 24844417 24608338 24665995 24245303 24249602 24427282 23892151 24103344
2469B4103344N16041l43040n32256j08068O2542Q2971K84520r3196K126m2047
$$ 24103344 24619385 24276345 23744089 23636021 23698563 23781534 24066054 23972858 23974984 23932937
2459B3932937j35776J8985k115k75288j692j45448K36129N17835K54243J42456
$$ 23932937 23797161 23816146 23814031 23538743 23537051 23391603 23627732 24145567 24399810 24542266
2449B4542266o6599L2711M35597p882o35364j99080J35236J17045J82699m33057
$$ 24542266 24475667 24508378 24943975 24936093 24300729 24101649 24236885 24353930 24536629 24103572
2439B4103572Q2759j29571l03336k0118l62075j80509L388J71535K42064J69678
$$ 24103572 24186331 24056760 23753424 23733306 23371231 23190722 23194110 23365645 23607709 23777387
2429B3777387k03945j64271l43101j75897K63198p137l2595J69666J97070K8977
$$ 23777387 23573442 23409171 23066070 22890173 23153371 23146234 23113639 23283305 23480375 23509352
2419B3509352j10288j22930K34007k2563L5404J42147k88648M9495O7323M21184
$$ 23509352 23399064 23276134 23510141 23487578 23522982 23665129 23376481 23425976 23493299 23914483
2409B3914483j56365k81534k06809j51302k4147J30995l82328k67516o932r3809
$$ 23914483 23758118 23476584 23269775 23118473 23094326 23225321 22842993 22575477 22568545 22474736
2399B2474736L34979L34146n1942n7265k78774K6276K40124K22450K5986J8229
$$ 22474736 22809715 23143861 23091919 23034654 22755880 22782156 23022280 23244730 23270716 23288945
2389B3288945J46857l65421Q4456M6363r2599M9007J45282Q7432J43194N6265
$$ 23288945 23435802 23070381 23154837 23201200 23108601 23157608 23302890 23390322 23533516 23589781
2379B3589781K7252k7591O2399j27823m48193k16794L04201M38357q1114j16540
$$ 23589781 23617033 23589442 23651841 23524018 23075825 22859031 23163232 23601589 23520475 23403935
2369B3403935j85548q6839L72002j08387o4878Q3669j70876J75788K7926Q0561
$$ 23403935 23218387 23131548 23503550 23395163 23330285 23413954 23243078 23418866 23446792 23527353
2359B3527353M68960L29497k69603m757j9358k81146J47681M6845K12614J18164
$$ 23527353 23996313 24325810 24056207 24051450 24032092 23750946 23898627 23945472 24158086 24276250
2349B4276250k13130K04061L61623Q6220m50698o6533L50292p6218J26720p9759
$$ 24276250 24063120 24267181 24628804 24715024 24264326 24197793 24548085 24471867 24598587 24518828
2339B4518828J72714K8132J56037L6831M4244P0010R9465K29809K17318J49444
$$ 24518828 24691542 24719674 24875711 24912542 24956786 25026796 25126261 25356070 25573388 25722832
2329B5722832L45221J07478K4810J07659J96851l2415k49934K76061O82812J72432
$$ 25722832 26068053 26175531 26200341 26308000 26504851 26472436 26222502 26498563 27181375 27353807
2319B7353807J84239N32471K72839Q3092l8549J28236K12489j31477L80067K03508
$$ 27353807 27538046 28070517 28343356 28426448 28387899 28516135 28728624 28597147 28977214 29180722
2309B9180722M61680M55666j65168M92741J77567m2981M34606J71033J89830M89340
$$ 29180722 29642402 30098068 29932900 30425641 30603208 30560227 30994833 31165866 31355696 31845036
2299C1845036k71585L92187P72617J28445L42721p2162L83188O07446N8479O8507
$$ 31845036 31573451 31965638 32738255 32866700 33209421 33137259 33520447 34127893 34186372 34254879
2289C4254879O52141L83297K01858N52577K46032M37011M45091J66035K07659
$$ 34254879 34907020 35290317 35492175 36044752 36290784 36727795 37172886 37338921 37546580
2280C7546580O48351K99169K37759P40959P10595K5756K03494N92247P63279N06135
$$ 37546580 38194931 38494100 38731859 39472818 40183413 40209169 40412663 41004910 41768189 42274324
2270D2274324J81374R5830O08721L81608L51593O55389Q32082M02139M73450N13490
$$ 42274324 42455698 42551528 43160249 43541857 43893450 44548839 45380921 45783060 46256510 46770000
2260D6770000Q68819Q00214L63589P38372N80691N24927Q53900P94326P11705
$$ 46770000 47638819 48439033 48802622 49540994 50121685 50646612 51500512 52294838 53006543
2251E3006543O35219N94207J5977O72290J286354J067492O70513O29511O71717
$$ 53006543 53641762 54235969 54251946 54924236 56210590 57278082 57948595 58578106 59249823
2242E9249823P83302P55240R68931J098929Q79648L70714P35212J312779J182759
$$ 59249823 60033125 60788365 61757296 62856225 63735873 64106587 64841799 66154578 67337337
2233F7337337J154255J179340J206861J120963P45835J295445J186562J095336
$$ 67337337 68491592 69670932 70877793 71998756 72744591 74040036 75226598 76321934
2225G6321934J432999J035553J497890J447654J482890J416297J719879J252505
$$ 76321934 77754933 78790486 80288376 81736030 83218920 84635217 86355096 87607601
2217H7607601J284566J575549J417841J664963J671191J192766J075412J536911
$$ 87607601 88892167 90467716 91885557 93550520 95221711 96414477 97489889 99026800
2209I9026800K188546J970046K105381J857698J753786J889778K271773K933543
$$ 99026800 101215346 103185392 105290773 107148471 108902257 110792035 113063808 115997351
2201A15997351K565171K129424K501863K937967L094603L082395L348944L680253
$$ 115997351 118562522 120691946 123193809 126131776 129226379 132308774 135657718 139337971
2193A39337971L392843L522174L956265M473614M326524M677746N178445N362249
$$ 139337971 142730814 146252988 150209253 154682867 159009391 163687137 168865582 174227831
2185A74227831O036818O474413O815863P619446Q055466Q648340R646767J0026558
$$ 174227831 180264649 186739062 193554925 201174371 209229837 217878177 227524944 237551502
2177B37551502J1294610J1710556J2408086J3127219J3743969J3900009J4584128
$$ 237551502 248846112 260556668 272964754 286091973 299835942 313735951 328320079
2170C28320079J3891386J3194220J2007246R608881O849167L292859m25306m965562
$$ 328320079 342211465 355405685 367412931 377021812 383870979 387163838 386738532 381772970
2162C81772970r060511j2618160j4331028j5199236j5701623j4966940j3789718
$$ 381772970 372712459 360094299 345763271 330564035 314862412 299895472 286105754
2155B86105754j2255601j1144289j0068473q551438p929885p360623p098507n897275
$$ 286105754 273850153 262705864 252637391 244085953 236156068 228795445 221696938 215799663
2147B15799663n411281n221202m318129l918054l661979l244093l552488k998820
$$ 215799663 210388382 205167180 200849051 196930997 193269018 190024925 186472437 183473617
2139A83473617k146690k556013k448192k334324j902211j538764j377110j472729
$$ 183473617 181326927 178770914 176322722 173988398 172086187 170547423 169170313 167697584
2131A67697584q04813q19116j032514j119174j174577j404887k881905m900529
$$ 167697584 166892771 166073655 165041141 163921967 162747390 161342503 158460598 153560069
2123A53560069n895278n448716m692460m192618l810024l348849l320144l033733
$$ 153560069 147664791 142216075 137523615 133330997 129520973 126172124 122851980 119818247
2115A19818247k608172k367872k243550k507658k239290k368059j943334j716544
$$ 119818247 117210075 114842203 112598653 110090995 107851705 105483646 103540312 101823768
2107A01823768j970563j286950j544347j661282j098690j191839r59149q70966
$$ 101823768 99853205 98566255 97021908 95360626 94261936 93070097 92110948 91239982
2099I1239982j454073q40241l25723m77959m09440k44976m16278m01705j151774
$$ 91239982 89785909 88945668 88619945 88141986 87732546 87487570 87071292 86669587 85517813
2090H5517813k235080k325053k230742k296901j366921j205361j208688r95242
$$ 85517813 83282733 80957680 78726938 76430037 75063116 73857755 72649067 71653825
2082G1653825j232630r80084q31651j143144o15419n29710o87566o35662r17512
$$ 71653825 70421195 69441111 68609460 67466316 66850897 66321187 65633621 64997959 64080447
2073F4080447q98413o32720q15916o78709m52773p63223n73702k85941o94605
$$ 64080447 63182034 62549314 61733398 61054689 60601916 59838693 59264991 58979050 58284445
2064E8284445m31275n04938m87155p65273l96123m72962n88123j23942m79062
$$ 58284445 57853170 57348232 56861077 56095804 55699681 55226719 54638596 54514654 54035592
2055E4035592m13646p78621n89730k16816m33793k75161m22453q95982l79243
$$ 54035592 53621946 52843325 52253595 52036779 51602986 51327825 50905372 50009390 49630147
2046D9630147j19485o03088n38051l14990l81205n68686n6632k54481k76352l39898
$$ 49630147 49510662 48907574 48369523 48054533 47673328 47104642 47048010 46793529 46517177 46177279
2036D6177279k98916j96516m38822o32923m53396k93719p9291j76312p1164k26429
$$ 46177279 45878363 45681847 45243025 44610102 44156706 43862987 43783696 43607384 43536220 43309791
2026D3309791n83126l17031q6797n5243m60268P9821o06730l03042L48697J29282
$$ 43309791 42726665 42409634 42322837 42267594 41807326 41887147 41280417 40977375 41326072 41455354
2016D1455354m20995n73120l69036j60248j35968l7247l83801k02282l3477k08712
$$ 41455354 41034359 40461239 40092203 39931955 39795987 39758740 39374939 39172657 39139180 38930468
2006C8930468l14768r6135k72741P2937k2683k09483j12738j07695l00083L35018
$$ 38930468 38615700 38519565 38246824 38319761 38297078 38087595 37974857 37867162 37567079 37902097
1996C7902097l2719k39871j14246j78465j02211j97444k61492l336p74482k66449
$$ 37902097 37869378 37629507 37515261 37336796 37234585 37037141 36775649 36772313 35997831 35731382
1986C5731382K17639K3659J42847o22936l46647J20982N1613m83289j05320k03636
$$ 35731382 35949021 35972680 36115527 35492591 35145944 35266926 35318539 34835250 34729930 34526294
1976C4526294p4406k47154l27074K6106M2400m04469m31010j94323R3003Q9666
$$ 34526294 34451888 34204734 33877660 33903766 33946166 33541697 33110687 32916364 33009367 33099033
1966C3099033j51444j613j4848k54967j67419k9715q319k70977m31097j18554
$$ 33099033 32947589 32945976 32931128 32676161 32508742 32479027 32470708 32199731 31768634 31650080
1956C1650080K01734J9129p3908o4327P0019j92020p12680o45283J11461j30924
$$ 31650080 31851814 31870943 31797035 31732708 31802727 31610707 30898027 30252744 30364205 30233281
1946C0233281K2158j34879j98804M03721K8654p25776N3079N6972r9583k39554
$$ 30233281 30255439 30120560 29921756 30325477 30354131 29628355 29681434 29738406 29638823 29399269
1936B9399269r373J15355L82394J69908j56117K11618j72992l62884o1875M70036
$$ 29399269 29389896 29505251 29887645 30057553 29901436 30113054 29940062 29577178 29515303 29985339
1926B9985339L95360J71851K38548M59737O26528J73571J87549K22165L23172
$$ 29985339 30380699 30552550 30791098 31250835 31877363 32050934 32238483 32460648 32783820
1917C2783820J74757N29795N73066M73642R22624Q96848Q00343K01192K19278
$$ 32783820 32958577 33488372 34061438 34535080 35457704 36354552 37154895 37356087 37575365
1908C7575365M52128j91020N35575j37454j29822L58120k07689L28808N0140j36595
$$ 37575365 38027493 37836473 38372048 38234594 38104772 38462892 38255203 38584011 38634151 38497556
1898C8497556j5925P120l65745K50405j21598q4294K51003J70766J36607J53224
$$ 38497556 38481631 38488751 38123006 38373411 38251813 38167519 38418522 38589288 38725895 38879119
1888C8879119K36528N88708K29225O97993R38041J139685R99969R70775Q15025
$$ 38879119 39115647 39704355 39933580 40631573 41569614 42709299 43709268 44680043 45495068
1879D5495068J075914J445039J355439Q75352J329584J555748J357384J564829
$$ 45495068 46570982 48016021 49371460 50246812 51576396 53132144 54489528 56054357
1871E6054357J615781J086225N34439k16568k89068n66154p08195p59029p52091
$$ 56054357 57670138 58756363 59290802 59074234 58785166 58219012 57510817 56751788 55999697
1862E5999697J39578l4448l04208j76152j45415m22167o50537j99070n06594k46644
$$ 55999697 56139275 56104827 55800619 55624467 55479052 55056885 54406348 54207278 53700684 53454040
1852E3454040L06674M91573O35964Q47987R01212N78337J153863J104265J448622
$$ 53454040 53760714 54252287 54888251 55736238 56637450 57215787 58369650 59473915 60922537
1843F0922537J445575J350254J681724J979048K012294K347524K216634K080883
$$ 60922537 62368112 63718366 65400090 67379138 69391432 71738956 73955590 76036473
1835G6036473K182743J931230J890742J576159Q13339R07058N39699L46746J68436
$$ 76036473 78219216 80150446 82041188 83617347 84430686 85337744 85877443 86224189 86392625
1826H6392625M73981O3543J46130K49030L46849M66663L63722M54797P95026J007066
$$ 86392625 86866606 86930149 87076279 87325309 87672158 88138821 88502543 88957340 89752366 90759432
1816I0759432J109074J492327J602445K224297K804921K365866L359523L651338
$$ 90759432 91868506 93360833 94963278 97187575 99992496 102358362 105717885 109369223
1808A09369223K872313L660747L542768L598054L701170K539332K363522J986524
$$ 109369223 112241536 115902283 119445051 123043105 126744275 129283607 131647129 133633653
1800A33633653Q42845l49859j533046k345667l444118m025528l373648k850785
$$ 133633653 134476498 134126639 132593593 130247926 126803808 122778280 119404632 116553847
1792A16553847k112386j076580q69274K41940N63615R50133J182873J669144K103178
$$ 116553847 114441461 113364881 112495607 112737547 113301162 114251295 115434168 117103312 119206490
1783A19206490K181937K245808K591898K766083K456768K375363K206126K013627
$$ 119206490 121388427 123634235 126226133 128992216 131448984 133824347 136030473 138044100
1775A38044100J721778J440739Q55563m46674j358959j803670k403022k800557
$$ 138044100 139765878 141206617 142062180 141615506 140256547 138452877 136049855 133249298
1767A33249298l063818l719602m073620m025954m229600l132938k817592k766948
$$ 133249298 130185480 126465878 122392258 118366304 114136704 111003766 108186174 105419226
1759A05419226j777240j670167j362884m04621o37098m10311J74316N014O5142
$$ 105419226 103641986 101971819 100608935 100204314 99567216 99156905 99331221 99336235 99401377
1750I9401377n8420l70334l58840j013710j265632j704010j937559j828918k813547
$$ 99401377 99342957 98972623 98613783 97600073 96334441 94630431 92692872 90863954 88050407
1741H8050407l391124l524201l376809l701015l021098k668461l060026k245784
$$ 88050407 84659283 81135082 77758273 74057258 71036160 68367699 65307673 63061889
1733F3061889k418252k026663j793027k054649j518040j600019j446598j130005
$$ 63061889 60643637 58616974 56823947 54769298 53251258 51651239 50204641 49074636
1725D9074636j208862j057483j015283j169910j109684r41251m16068q48117j020940
$$ 49074636 47865774 46808291 45793008 44623098 43513414 42572163 42156095 41307978 40287038
1716D0287038n70980j006909j047614o44332j440037n60270j010251j063331m56622
$$ 40287038 39716058 38709149 37661535 37017203 35577166 35016896 34006645 32943314 32486692
1707C2486692q59664r67640m94814o78572q33596q02971q71335M9543p15816q15430
$$ 32486692 31627028 30659388 30164574 29486002 28652406 27849435 26978100 27027643 26311827 25496397
1697B5496397m91867q94419k93713l48613p41891l31543l02966l31705j04801
$$ 25496397 25004530 24110111 23816398 23467785 22725894 22394351 22091385 21759680 21654879
1688B1654879j77323m44280l33211n95602j25362l74611j67273j39161Q2852k05307
$$ 21654879 21477556 21033276 20700065 20104463 19979101 19604490 19437217 19298056 19380908 19175601
1678A9175601m45920l12087m27178J90133r6624m07439o83666o04278J27306j53809
$$ 19175601 18729681 18417594 17990416 18180549 18083925 17676486 16992820 16388542 16515848 16362039
1668A6362039Q2544n12580l59598l55148r28191K23943K40589o19900R2416l48998
$$ 16362039 16444583 15932003 15572405 15217257 14289066 14513009 14753598 14133698 14226114 13877116
1658A3877116l85070K74060k64033k22955r856l84316k35460J02035j39748P9570
$$ 13877116 13492046 13766106 13502073 13279118 13269262 12884946 12649486 12751521 12611773 12691343
1648A2691343m93265n61468J08065k89150k35644N97227l13677k63610J80865
$$ 12691343 12198078 11636610 11744675 11455525 11219881 11817108 11503431 11239821 11420686
1639A1420686o67853n7418J00223n29211J18274j14482J45249j90750l73505j72933
$$ 11420686 10752833 10695415 10795638 10266427 10384701 10270219 10415468 10224718 9851213 9678280
1629I678280l926J0999p1699Q7670P4284j43797m74317K7397n97951m73012j13932
$$ 9678280 9674354 9685353 9613654 9701324 9775608 9631811 9157494 9184891 8586940 8113928 7999996
1618G999996j99439M51958j28876j56986R0631l05358l51986j16369O2860M4963
$$ 7999996 7800557 8252515 8123639 7966653 8057284 7751926 7399940 7283571 7346431 7391394
1608G391394J20977j85917l02199j2238L55673K62511l93292m55658l09708l03041
$$ 7391394 7512371 7326454 7024255 7012017 7367690 7630201 7236909 6781251 6471543 6168502
1598F168502K32191M76928r9693j4197l69393L1390N13683J78509l07544p0770
$$ 6168502 6400693 6877621 6777928 6763731 6394338 6425728 6939411 7117920 6810376 6739606
1588F739606j15446Q880J30733L79180j58907k16301l79319n2064J40997K76790
$$ 6739606 6624160 6633040 6763773 7142953 6984046 6767745 6388426 6336362 6477359 6754149
1578F754149R0690j17103J96182j65841j49658k38096M31000J69928j95762j42090
$$ 6754149 6844839 6727736 6923918 6758077 6608419 6370323 6801323 6971251 6775489 6633399
1568F633399k05584J89568L44750k67601l20493L67298j01762r4721K74760K85477
$$ 6633399 6427815 6617383 6962133 6694532 6374039 6741337 6639575 6544854 6819614 7105091
1558G105091K11634l07573l11610K8296L18376j11344J63025k5726N07112j38448
$$ 7105091 7316725 7009152 6697542 6725838 7044214 6932870 7095895 7070169 7577281 7438833
1548G438833m75216N16125R2354l22537J46141k75699M31533O40939K4722J9510
$$ 7438833 6963617 7479742 7572096 7249559 7395700 7120001 7551534 8192473 8217195 8236705
1538H236705K30655k12283K47420k95293n7393L99186k31970j06065M56448k8808
$$ 8236705 8467360 8255077 8502497 8207204 8149811 8548997 8317027 8210962 8667410 8638602
1528H638602k39575L45721k74692K9199M03689k08445j6813N13849J5323l33719
$$ 8638602 8399027 8744748 8470056 8499255 8902944 8694499 8677686 9191535 9206858 8873139
1518H873139J85496J02585Q0463K68464l81317J95309M16116L00147L22921M20794
$$ 8873139 9058635 9161220 9241683 9510147 9128830 9324139 9740255 10040402 10363323 10784117
1508A0784117L22374L71715j67905j1886N02042P5060j71424P183k90143K14302
$$ 10784117 11106491 11478206 11310301 11298415 11800457 11875517 11704093 11711276 11421133 11635435
1498A1635435N31832k57559J97081J03458k23457J48067K58217K08388J55466
$$ 11635435 12167267 11909708 12106789 12210247 11986790 12134857 12393074 12601462 12756928
1489A2756928l60479j3689K8254K35758J24614k77385j44813J30554N0888p5575
$$ 12756928 12396449 12382760 12411014 12646772 12771386 12494001 12349188 12479742 12530630 12455055
1479A2455055L53943J77914J77774n141j34877N87330L06227N70202J26115j91512
$$ 12455055 12808998 12986912 13164686 13159545 13024668 13611998 13918225 14488427 14614542 14423030
1469A4423030O66780p5171J15965k43186o31584l09651m95894l11971j37492j58924
$$ 14423030 15089810 15014639 15130604 14887418 14255834 13946183 13450289 13138318 13000826 12841902
1459A2841902L4027q4244l83542j2705R2991R1825K5730l03468m50204L3855p4239
$$ 12841902 12875929 12791685 12408143 12395438 12488429 12580254 12605984 12302516 11852312 11886167 11811928
1448A1811928k23413O6686k64235j42595m04652j09980r132q8156m6839k05816
$$ 11811928 11588515 11655201 11390966 11248371 10843719 10733739 10724607 10636451 10589612 10383796
1438A0383796m404N48038j35520k6079J89925J12869J72643M9540K4345J19944
$$ 10383796 10379392 10927430 10791910 10765831 10955756 11068625 11241268 11290808 11315153 11435097
1428A1435097J82228q12832n51236k91832n55777k60822p26046K2750j1463n01489
$$ 11435097 11617325 10804493 10253257 9961425 9405648 9144826 8418780 8441530 8430067 7928578
1418G928578k61671J60151j33861k41616k39777l64169J9022K852l23276j78119
$$ 7928578 7666907 7827058 7693197 7451581 7211804 6847635 6866657 6869509 6546233 6368114
1408F368114L52675N9400k58450m2285k53833J0154j08597l79122j55657Q396
$$ 6368114 6720789 6780189 6521739 6479454 6225621 6235775 6127178 5748056 5592399 5600795
1398E600795Q1132Q7431Q0782K3883J07282l86629O2488M4070m14291q5672k21545
$$ 5600795 5681927 5769358 5850140 5874023 5981305 5594676 5657164 5701234 5286943 5201271 4979726
1387D979726j13878J64005j90261k87554k0311l54878j30098k72473r4455k46833
$$ 4979726 4865848 5029853 4839592 4552038 4531727 4176849 4046751 3774278 3679823 3432990
1377C432990m18979K48657J04011m0707m28176j80914L6868J03555K47397o4772
$$ 3432990 3014011 3262668 3366679 3325972 2897796 2716882 2753750 2857305 3104702 3039930
1367C039930l8372J20067k14574P8689M9329m55425k08424P1679j24934J02912
$$ 3039930 3001558 3121625 2907051 2985740 3035069 2579644 2371220 2442899 2317965 2420877
1357B420877L29735L5361j54632j24542k36046J76531N8302J46762j95957l19778
$$ 2420877 2750612 2785973 2631341 2506799 2270753 2447284 2505586 2652348 2456391 2136613
1347B136613R7571o1708Q8149P0002k07387r4785K7711j21375k21100L07069R6904
$$ 2136613 2234184 2172476 2260625 2330627 2123240 2028455 2056166 1934791 1713691 2020760 2117664
1336B117664p8206Q6773q6177J64701O0775n3390j78743k48140L0236k29199P004
$$ 2117664 2039458 2126231 2040054 2204755 2265530 2212140 2033397 1785257 1815493 1586294 1593298
1325A593298N0511K14114Q8522o3817l72J70917K64734j94140m85688p3797L299
$$ 1593298 1643809 1857923 1946445 1882628 1882256 2053173 2317907 2123767 1638079 1564282 1567581
1314A567581j08117K84046L03026j86910j58509j92714J19676K6821k35139l08159
$$ 1567581 1459464 1743510 2046536 1859626 1701117 1508403 1628079 1654900 1419761 1111602
1304A111602R369J99384R4871J74013l11659M45847k62661n05706M57930M4963
$$ 1111602 1120971 1320355 1415226 1589239 1277580 1723427 1460766 955060 1412990 1457953
1294A457953k24520M1699J49292j75024J03419k79450p8434L50509j5581j14395
$$ 1457953 1233433 1275132 1424424 1249400 1352819 1073369 994935 1345444 1329863 1215468
1284A215468k56333Q6581M62887K139j97801k30596j26107L08266k67332o3474
$$ 1215468 959135 1045716 1508603 1510742 1312941 1082345 956238 1264504 997172 933698
1274I33698L15947j81579o6960K29028J1939k47591P7828K79083l21709J68786
$$ 933698 1249645 1068066 1001106 1230134 1242073 994482 1072310 1351393 1029684 1198470
1264A198470Q2116J61012K17302m56861k96630J38077j52740N31535m6690k47523
$$ 1198470 1280586 1441598 1658900 1202039 905409 1043486 890746 1422281 1375591 1128068
1254A128068O3762j58682k19399K59111K21323j52685J64033k75996N95979k8461
$$ 1128068 1191830 1033148 813749 1072860 1294183 1141498 1305531 1029535 1625514 1597053
1244A597053m89838K75685K03870p2730N6409J7057K81938K62972n80941k75160
$$ 1597053 1107215 1382900 1586770 1514040 1570449 1587506 1869444 2132416 1551475 1276315
1234A276315M04566j63364j88600k12758j1380L01282K29461n61933K1102K62383
$$ 1276315 1680881 1517517 1328917 1116159 1104779 1406061 1635522 1073589 1094691 1357074
1224A357074k97042R6640j57888R3600k26924M4146K9862j3713J21888l99742
$$ 1357074 1060032 1156672 998784 1092384 865460 909606 939468 925755 1047643 647901
1214F47901k37870M30319M08886j63349k56609L9720j55506J20848j9861k3510
$$ 647901 410031 840350 1249236 1085887 829278 868998 713492 834340 814479 790969
1204G90969j29629P0200O060L8334L48416j28226m72443o894L73235L66594J183
$$ 790969 661340 731540 737600 775934 1124350 996124 523681 516787 890022 1256616 1257799
1193A257799j34101l27591R0846Q1369o1120r4996J3626R4153q995J9527J0882
$$ 1257799 1123698 796107 886953 968322 907202 812206 825832 919985 910990 930517 941399
1182I41399l4487k09041J86547k1981L9072K29787j4302K20400J37872l36576
$$ 941399 906912 697871 884418 862437 901509 1131296 1116994 1337394 1475266 1138690
1172A138690k44106K19054P6554n14401K48671j06060j41799J88929K70819J35006
$$ 1138690 894584 1113638 1190192 675791 924462 818402 676603 865532 1136351 1271357
1162A271357j9990K07854n3509l58134j33897J53170l10862J26964L21093l17873
$$ 1271357 1251367 1459221 1405712 1047578 913681 1066851 755989 882953 1204046 886173
1152H86173O3621M3398j13866O8223R7930j23388o0894J73188K9904k8273l3517
$$ 886173 949794 993192 879326 947549 1045479 922091 861197 1034385 1064289 1036016 1002499
1141A002499k25544K6494L80179k2196K3263k94471M2937K14989k02964K8640
$$ 1002499 776955 803449 1183628 1161432 1184695 890224 933161 1148150 945186 973826
1131I73826r9942l27361J25472K29539N7892P2789l16822q7699K73271J91809
$$ 973826 873884 546523 671995 901534 959426 1032215 715393 627694 900965 1092774
1121A092774K00509J40690j02909n51717j2241M3375J82218J52521o9111J54652
$$ 1092774 1293283 1433973 1331064 779347 767106 810481 992699 1145220 1076109 1230761
1111A230761l68839k34740N14703M68818q0613J33485m98139k7821O77m03908
$$ 1230761 861922 627182 1141885 1610703 1530090 1663575 1165436 1137615 1138292 734384
1101G34384K52257N39634l43843J94210M86663L3966o6462j52345l08645j84054
$$ 734384 986641 1526275 1182432 1376642 1863305 1897271 1830809 1678464 1369819 1185765
1091A185765L70969J03949o9580P9154N3170M8543k63397l8477K32518M27388
$$ 1185765 1556734 1660683 1591103 1670257 1723427 1771970 1508573 1470096 1702614 2130002
1081B130002l07653n9244m9521J88217J46350k25964L23467R452k40107m1726
$$ 2130002 1822349 1763105 1713584 1901801 2048151 1822187 2145654 2155106 1914999 1873273
1071A873273L45051M521L77904L33051P8465K60598k49667l18105l12957j59840
$$ 1873273 2218324 2222845 2600749 2933800 3012265 3272863 3023196 2705091 2392134 2232294
1061B232294J57346M5431K4058p8438J27170j2114J533k01329k66785J020j32626
$$ 2232294 2389640 2435071 2459129 2380691 2507861 2495747 2497280 2295951 2029166 2030186 1897560
1050A897560J19931M81001j78070k50730J81985j69389L02013Q7173j23787N2562
$$ 1897560 2017491 2498492 2320422 2069692 2251677 2082288 2384301 2471474 2347687 2400249
1040B400249j83946J25552L77501K52849O9844J60230J25239j01211m06874P9793
$$ 2400249 2216303 2341855 2719356 2972205 3042049 3202279 3327518 3226307 2819433 2899226
1030B899226M1733p4941n0625L67410K48970j09027l55529M12369M46577J00691
$$ 2899226 2940959 2866018 2815393 3182803 3431773 3322746 2967217 3379586 3826163 3926854
1020C926854J52068l17682O2359N06677M5921k9935j48942k66319Q0725L70090
$$ 3926854 4078922 3761240 3823599 4330276 4376197 4346262 4197320 3931001 4011726 4381816
1010D381816K1766r5837k30478k1014l48044K17263P35008K31834K01861J76725
$$ 4381816 4403582 4307745 4077267 4056253 3708209 3925472 4660480 4892314 5094175 5270900
1000E270900K23167l73468J95355j6076J10190L45690N1097o6149J09221P59066
$$ 5270900 5494067 5120599 5315954 5299878 5410068 5755758 5806855 5740706 5849927 6608993
990F608993J68921J96096J51894M81522N81780J16818M3623N11619R71252K92742
$$ 6608993 6777914 6974010 7125904 7607426 8189206 8306024 8349647 8861266 9832518 10125260
980A0125260K43982N83943P17207O08721N41875P98166M79958R94730Q67209J161196
$$ 10125260 10369242 10953185 11670392 12279113 12820988 13619154 14099112 15093842 15961051 17122247
970A7122247J182220J158987J356495J534905K110724J868112J767759J546639
$$ 17122247 18304467 19463454 20819949 22354854 24465578 26333690 28101449 29648088
962B9648088K142947L107190L694439M414637N296603O756981P518599R141485
$$ 29648088 31791035 34898225 38592664 43007301 48303904 55060885 62579484 71720969
954G1720969J0847653J2359585J1960670J1614631P468355o933140j9993103k2114049
$$ 71720969 82568622 94928207 106888877 118503508 125971863 119038723 99045620 76931571
946G6931571j5706746j0380315p157442n576526m426568l601792k616019k332459
$$ 76931571 61224825 50844510 43687068 38110542 33683974 30082182 27466163 25133704
938B5133704j896259j346443r34378j046306j068104j401589j380912p68987j080439
$$ 25133704 23237445 21891002 20956624 19910318 18842214 17440625 16059713 15290726 14210287
929A4210287j560776q49600l47639p25724m66064n24673l85275l40989n70839
$$ 14210287 12649511 11799911 11452272 10726548 10260484 9735811 9350536 9009547 8438708
920H438708k39065l1850k45719n69096j00152l33223j64758r2004k66966o0548
$$ 8438708 8199643 8167793 7922074 7352978 7252826 6919603 6754845 6662841 6395875 6335327
910F335327l89801J21608k11750k60153o10293l15654J75452l01074M01574r7750
$$ 6335327 5945526 6067134 5855384 5595231 4984938 4669284 4844736 4543662 4945236 4847486
900D847486k74615k30630l78076m4665k98870j82127R6543o8842k2019K78904
$$ 4847486 4572871 4342241 3964165 3919500 3620630 3438503 3535046 3466204 3444185 3723089
890C723089m6833m95207j96485l12039L40941n8377m37676O2701J14637j22403
$$ 3723089 3676256 3181049 2984564 2672525 3013466 2955089 2517413 2580114 2694751 2572348
880B572348J10072J93780k0437j24125n26098K24209J87465m08605R9408j0200
$$ 2572348 2682420 2876200 2855763 2731638 2205540 2429749 2617214 2208609 2308017 2297817
870B297817n1699K68988l21290r3265K3938n5743n1797J00492r9778R5709q2335
$$ 2297817 2246118 2515106 2193816 2100551 2124489 2068746 2016949 2117441 2017663 2113372 2031037
859B031037l8607r2107J03337L3510l50942j80291J26054j08764j92432k53466
$$ 2031037 1992430 1900323 2003660 2037170 1686228 1505937 1631991 1523227 1330795 1077329
849A077329j4226K86007o1116L97356M27070m19703k62313k93603l6760K84036
$$ 1077329 1063103 1349110 1287994 1685350 2112420 1692717 1430404 1136801 1100041 1384077
839A384077K23065k4672J1853l69145j99054L47333j94875l28354Q0787k40762
$$ 1384077 1607142 1582470 1594323 1225178 1026124 1373457 1178582 850228 931015 690253
829F90253l1590j34901L44144N19995j82587k31126J56933n9317k63469J24119
$$ 690253 658663 523762 867906 1387901 1205314 974188 1131121 1071804 808335 932454
819I32454K08846j660k69644J2318K41541J35157o8632q5894k48759l14038j64939
$$ 932454 1141300 1139640 869996 882314 1123855 1259012 1190380 1104486 855727 541689 376750
808C76750R9889N51768k18112j25987J19412l54126p1774J83384r275J852k54515
$$ 376750 476639 1028407 810295 684308 803720 449594 377820 561204 551929 553781 299266
797B99266j28919M71602o231L45438k45350l84527J06808j25982j03363P6568
$$ 299266 170347 641949 635718 981156 735806 351279 458087 332105 228742 305310
787C05310k48304J15524J17217k437O28411R8928o63298o7869l10753J93283J22152
$$ 305310 57006 172530 289747 287310 915721 1014649 351351 283482 -27271 166012 288164
776B88164K1621L13761J80884l02846K02238j80231m4471M97010l50983m21508
$$ 288164 309785 623546 804430 501584 703822 523591 479120 976130 625147 203639
766B03639J95412p897J79383L02260k63039O664K04935m17266J11629J13560o9247
$$ 203639 399051 391154 570537 872797 609758 616422 821357 404091 515720 629280 560033
755E60033j48251L8349M26597J09164m14763l30486o4992p280O0920J98812l5923
$$ 560033 411782 450131 876728 985892 571129 240643 175651 168371 229291 428103 392180
744C92180q9466M5192k08759J70473M99653n5873m38348K96758K6613M7932j64290
$$ 392180 302714 347906 139147 309620 809273 753400 315052 611810 638423 686355 522065
733E22065k25903K65046k65968j39398M59155l1846J76728l71600k60608J2605
$$ 522065 296162 561208 295240 155842 614997 583151 759879 388279 127671 140276
723A40276k10260o855K16531n3582K77283j1829j74327K746J00587l16379o9052
$$ 140276 -69984 -76839 139692 86110 363393 351564 177237 179983 280570 -35809 -104861
712a04861K96793O7108K5502J04523M707l39880k14621L49273k24822J00908K13046
$$ -104861 191932 259040 284542 389065 393772 53892 -160729 188544 -36278 64630 277676
701B77676k01892L31690j37671l65665N03975k22282J00873L05029m52168j99243
$$ 277676 75784 407474 269803 -95862 408113 185831 286704 591733 139565 -59678
691e9678L76215j38886J16220r9772l92856M07242j74409Q6572M19825k86441
$$ -59678 316537 177651 293871 194099 -198757 208485 34076 120648 540473 254032
681B54032j56804K23730L2419l6998j50986j22107K73882p8510J1371N25739j50392
$$ 254032 97228 320958 353377 316379 165393 43286 317168 238658 250029 775768 625376
670F25376K01486k61172K9449J06795k69858j46749L24096K81532j12050J90130
$$ 625376 826862 565690 595139 701934 432076 285327 609423 890955 778905 969035
660I69035l52490l48848r1213J45983J87567l99499o6176Q0444J06895m2069j0175
$$ 969035 616545 267697 176484 322467 510034 110535 44359 124803 231698 189629 179454
649A79454J25689k97205k40715J09366K00070J80896L6933j23531r9446L53888
$$ 179454 305143 7938 -232777 -123411 76659 257555 294488 170957 71511 425399
639D25399q4803n3355P7808L1001J52457L2844j24923l9876J21308k48263m24590
$$ 425399 340596 287241 365049 396050 548507 581351 456428 416552 537860 289597 -134993
628a34993K55194L7008l65145N3847K34431p2680Q2793P09j25041L9009j20930
$$ -134993 120201 157209 -207936 -154089 80342 7662 90455 91164 -33877 5132 -115798
617a15798Q195J84635j83669k02862J00797M41852k44255j25002P0823Q0245k23107
$$ -115798 -107603 77032 -106637 -309499 -208702 233150 -11105 -136107 -65284 14961 -208146
606b08146K83129p4367q6221P48144m06003j64258M0714M9501j36306q7979Q1854
$$ -208146 74983 616 -85605 662539 256536 92278 132992 182493 46187 -41792 40062
595D0062K48457m9468K6653N75m9290n2249l91025j11027L27146R8428Q1030J61593
$$ 40062 288519 239051 265704 266279 216989 164740 -226285 -337312 -10166 88262 169292 330885
583C30885L40850n3940k41317m05654j41222k72841j65113P28922n7431p2154
$$ 330885 671735 617795 376478 -29176 -170398 -443239 -608352 120570 63139 -9015
573i015L04903k41367m2461J22l27828J39995L22108j79076j91170M28763R2429
$$ -9015 295888 54521 12060 12182 -315646 -175651 146457 -32619 -223789 204974 297403
562B97403k57902J16392J45751n73680J06375J19728k23267L02666K8817j34728
$$ 297403 39501 155893 301644 -272036 -165661 -45933 -269200 33466 62283 -72445
552g2445K03780J02990r6635j61515p8457k1751J14424N8541j21107j24978J43414
$$ -72445 131335 234325 137690 -23825 -102282 -124033 -9609 48932 -72175 -197153 -53739
541e3739l6643l07824L05337J50550k06615J8290N2446q7460K35778O5090R0781
$$ -53739 -90382 -398206 -92869 57681 -148934 -130644 -78198 -165658 70120 135210 225991
530B25991L1566k49867J6307K01389N1991m61772l39026m8003n6812K38417J19536
$$ 225991 257557 7690 23997 225386 277377 -184395 -523421 -571424 -628236 -389819 -270283
519b70283J74867J85425K05447m69746J12621P1990n16538M58684j21625j28683
$$ -270283 -95416 90009 295456 -174290 -61669 10321 -506217 -47533 -169158 -297841
509b97841J22689k16102M3146K90739j04752k39589J36218j30058K50794j26568
$$ -297841 -175152 -391254 -348108 -57369 -162121 -401710 -265492 -395550 -144756 -271324
499b71324O7593K58942J00037j85778m78624Q924K47816o0423l58517K81805J29588
$$ -271324 -203731 55211 155248 -30530 -509154 -500230 -252414 -312837 -671354 -389549 -259961
488b59961k58848L18664K11018j13949J08578l91989j28889M63024J88273m14845
$$ -259961 -518809 -200145 10873 -103076 5502 -386487 -515376 -52352 135921 -278924
478b78924J13132L28876L847j72410j90270N37893R1868m38418l50890k66772
$$ -278924 -165792 163084 166931 -5479 -195749 342144 434012 -4406 -355296 -622068
468f22068L36721K07667k86237K77487J9202j23891j09604J60921l46527M828
$$ -622068 -285347 -77680 -363917 -86430 -67228 -191119 -300723 -139802 -486329 -481501
458d81501m11352k62753O52290J87545k31086Q2914J51335k79345K32807m4066
$$ -481501 -892853 -1155606 -503316 -315771 -546857 -463943 -312608 -591953 -359146 -403212
448d03212L69412M9990k87315m421L0045L62664j56793J70028l32279k83159K9312
$$ -403212 -33800 16190 -271125 -275546 -245501 117163 -39630 130398 -201881 -485040 -455728
437d55728m18219L73760O95929J01407j02283l4034j65918m4753M5011L5137j88169
$$ -455728 -873947 -500187 195742 297149 194866 160832 -5086 -49839 -4828 30309 -157860
426a57860j32999j62525k2945L75455j12077m10648P4438K22739M975K27249J30398
$$ -157860 -290859 -453384 -476329 -100874 -212951 -623599 -549161 -326422 -321447 -94198 36200
415C6200Q1830k16088k54426M1461j03766M38442k13665k16833K5411L46736j65581
$$ 36200 118030 -98058 -352484 -311023 -414789 23653 -190012 -406845 -381434 -34698 -200279
404b00279J66199J25532k42002j69916j14381k95007P21747M13334m64500K11469
$$ -200279 -34080 91452 -150550 -320466 -434847 -729854 -8107 405227 -59273 152196
394A52196J38315n05238P6584l21198k14487L18959J63871l27176M6805K59281
$$ 152196 290511 -214727 -138143 -459341 -673828 -354869 -190998 -518174 -471369 -212088
384b12088j88232m3553j57084j30796J75337J21788K68471L78386o6996l46570
$$ -212088 -400320 -443873 -600957 -731753 -556416 -434628 -166157 212229 145233 -201337
374b01337l75268j06974L94768L52065l15528L7649K14802k35073J42940K54642
$$ -201337 -576605 -683579 -288811 63254 -252274 -214625 177 -234896 -91956 162686
364A62686j03310l39768l29712j73007J89420L58885M1785j69432j30939L34201
$$ 162686 59376 -280392 -610104 -783111 -593691 -234806 -193021 -362453 -493392 -159191
354a59191l21k27714J11036l3168m17399K81232L6394K00011J69711K12536k30680
$$ -159191 -159512 -387226 -276190 -309358 -726757 -445525 -409131 -209120 -39409 173127 -57553
343e7553j16452L6826q5041j06921O6607j13031K8854J74764L7720M0498K4234
$$ -57553 -174005 -137179 -222220 -329141 -262534 -375565 -346711 -171947 -134227 -93729 -69495
332f9495j6635j78965j44458O4770L82269o541l04471j07332L5684J5984j42034
$$ -69495 -86130 -265095 -409553 -344783 37486 30945 -273526 -380858 -345174 -329190 -471224
321d71224m5024Q9260J69314l06345q2578J6789L39134L70896J0481k67730K32493
$$ -471224 -516248 -426988 -257674 -564019 -646597 -629808 -290674 80222 90703 -177027 55466
310E5466k76721k5797Q4600l2194L0436r1222J34566p1355P264J9718j80168j45469
$$ 55466 -221255 -247052 -162452 -194646 -164210 -255432 -120866 -192221 -184957 -165239 -345407 -490876
298d90876L52217j52712n09419K96906L01597J84407L2464l79880k71225r3356
$$ -490876 -138659 -291371 -800790 -503884 -202287 -17880 14584 -365296 -636521 -729877
288g29877J37789J4985o5290j19698K43856J5826M134L19912j75463k86465o9961
$$ -729877 -592088 -577103 -642393 -762091 -518235 -502409 -498275 -178363 -353826 -640291 -710252
277g10252k33365M03013N10915K31445m59100k39855L04392M6647j88172j5249
$$ -710252 -943617 -540604 -29689 201756 -257344 -497199 -192807 -146160 -334332 -349581
267c49581k48159K874k04544l5643L78944N56702j45357j85331r8973m87357j23911
$$ -349581 -597740 -594866 -799410 -835053 -456109 100593 -44764 -230095 -329068 -816425 -940336
256i40336L03060R8626L01379k27133l54389j4115N02685J39951l25777q6969
$$ -940336 -637276 -538650 -237271 -464404 -818793 -832908 -330223 -190272 -516049 -603018
246f03018R7529R5726K44045L7734L7856J6762m35847j53220L77124J28800K6151
$$ -603018 -505489 -409763 -165718 -127984 -90128 -73366 -509213 -662433 -285309 -156509 -130358
235a30358l9357m81105K04396N4257R5548J28972k44162k77431o276Q71K84182
$$ -130358 -169715 -650820 -446424 -392167 -296619 -167647 -411809 -689240 -695516 -694645 -410463
224d10463K06467m1262m33778j58623P6175P1718L68867K05803l13928l20003
$$ -410463 -203996 -245258 -679036 -837659 -761484 -689766 -320899 -115096 -429024 -749027
214g49027o3494M13197K1490K74216j84454k91783K492l698L90766J60090l65568
$$ -749027 -812521 -399324 -377834 -103618 -288072 -579855 -577363 -581061 -190295 -30205 -395773
203c95773j34849k02711J6579J30200O2438M07688k22558j87226j01978R046O09220
$$ -395773 -530622 -733333 -716754 -586554 -524116 -116428 -338986 -526212 -628190 -619144 -9924
192i924m8511j89068j83192J13466j59712J65012m9011q7148k909m96969L41326
$$ -9924 -58435 -247503 -430695 -317229 -476941 -311929 -360940 -448088 -450997 -947966 -606640
181f06640L90289J9979J9552j5656k59835Q9783q834k25838M72302j68038k95793
$$ -606640 -216351 -196372 -176820 -192476 -452311 -362528 -371362 -597200 -124898 -292936 -588729
170e88729l2846k95446N30569L44516m69932j56754l55673n18R77843L4842J1180
$$ -588729 -621575 -917021 -386452 -41936 -511868 -668622 -1024295 -1024813 -46970 -12128 -948
159i48j95200l32870k62262J45903Q2417J83991q5859k21234J94613L07919J36558
$$ -948 -196148 -529018 -791280 -645377 -562960 -378969 -464828 -686062 -491449 -183530 -46972
148d6972l68665j59631k91748k16740L05558J19676J7837n2451J4255l05402L32095
$$ -46972 -415637 -575268 -867016 -1083756 -778198 -658522 -640685 -693136 -678881 -984283 -652188
137f52188p2228P4459L92335k61044m0051K31324k38024J40330P2806M3177j23125
$$ -652188 -724416 -649957 -257622 -518666 -558717 -327393 -565417 -425087 -352281 -309104 -432229
126d32229l66893k9172L36865P6379m5245j72639j90091K00656P1568K83100q5918
$$ -432229 -799122 -828294 -491429 -415050 -460295 -632934 -823025 -622369 -550801 -267701 -353619
115c53619r7370J42910k64626J14762K00300l59387j77362j6312m8263L13807
$$ -353619 -450989 -308079 -572705 -457943 -257643 -617030 -794392 -810704 -858967 -545160
105e45160P5157n9770j2151l23984o1435k3577J96749L34378J02128j98683L1876
$$ -545160 -470003 -529773 -541924 -865908 -927343 -950920 -754171 -419793 -317665 -516348 -484472
94d84472J53060j52491K42005k75099k70781O2258j35530L48948o5955j1208K15193
$$ -484472 -331412 -483903 -241898 -516997 -787778 -725520 -861050 -512102 -578057 -589265 -374072
83c74072j55142l58404Q9809J89677K12608l28681j10668K29565m7782P8428L45647
$$ -374072 -529214 -887618 -797809 -608132 -395524 -724205 -834873 -605308 -653090 -574662 -229015
72b29015j30863k88751j15073N1453K48251J04863k43517j18251q9680J14893
$$ -229015 -359878 -648629 -763702 -712249 -463998 -359135 -602652 -720903 -810583 -695690
62f95690Q1330k20173J64301M8737j84443J425J8009L28269j6047r4052k06806
$$ -695690 -614360 -834533 -670232 -621495 -805938 -804513 -786504 -458235 -474282 -568334 -775140
51g75140n8822J31628L61775k2674L7658k04644l75655J3358K51654P8587p4183
$$ -775140 -833962 -702334 -340559 -363233 -325575 -530219 -905874 -892516 -640862 -562275 -636458
40f36458k32587K02114j0420J94103O595M5536l2080k47089j7210N9523O3112
$$ -636458 -869045 -666931 -677351 -483248 -476653 -431117 -463197 -710286 -727496 -667973 -604861
29f04861o2476J35458j35598j11439P5789n7156j05184K80001k3653j13279P7314
$$ -604861 -667337 -531879 -667477 -778916 -703127 -760283 -865467 -585466 -609119 -722398 -645084
18f45084J49294K7839q7173j03576k3251j62931L9176k6850J28895K62540k32685
$$ -645084 -495790 -467951 -555124 -658700 -681951 -844882 -805706 -832556 -703661 -441121 -673806
7f73806j10839J15915M6835r2335l1813P3897l3972
$$ -673806 -784645 -668730 -621895 -714230 -746043 -672146 -706118
0g06118
$$ -706118
$$ Imaginary data points
##PAGE= N=2
##DATA TABLE= (X++(I..I)), XYDATA
16383g524159J71066J62406L2915Q3782p6973O72J76616L0535o4461J85822K07427
$$ -7524159 -7353093 -7190687 -7157772 -7073990 -7150963 -7150291 -6973675 -6943140 -7007601 -6821779 -6614352
16372f614352J07714K26748J80202J50485j83032J11609J11815J10156J75383
$$ -6614352 -6506638 -6279890 -6099688 -5949203 -6132235 -6020626 -5908811 -5798655 -5623272
16363e623272L1998K36361K04836j473k63540J82835L6195J7027J39554k7013
$$ -5623272 -5591274 -5354913 -5150077 -5151550 -5415090 -5232255 -5196060 -5179033 -5039479 -5066492
16353e066492J61399J96041L9374M2108J19624R2105o6698K12455R3154J46231
$$ -5066492 -4905093 -4709052 -4669678 -4627570 -4507946 -4415841 -4482539 -4270084 -4176930 -4030699
16343d030699k0281k1156K89697J730j7551m990o2072J40903L02787K32083J00490
$$ -4030699 -4050980 -4072136 -3782439 -3780709 -3798260 -3803250 -3865322 -3724419 -3421632 -3189549 -3089059
16332c089059j96020j06245M60958J98346J18171j96649M0143R7120K41087O1590
$$ -3089059 -3285079 -3391324 -2930366 -2732020 -2613849 -2810498 -2770355 -2673235 -2432148 -2370558
16322b370558k4953l9446J44317j71210J81327M17768Q5719n9048o8433m8259
$$ -2370558 -2395511 -2434957 -2290640 -2461850 -2280523 -1862755 -1777036 -1836084 -1904517 -1952776
16312a952776O44J04951Q0068J62372L94910P7063q5248j3218L56926L06283q796
$$ -1952776 -1952132 -1847181 -1767113 -1604741 -1209831 -1132768 -1218016 -1231234 -874308 -568025 -576821
16301e76821j82357k52620J37093N9047K91072K09408J31910J25101L6651k08156
$$ -576821 -759178 -1011798 -874705 -815658 -524586 -315178 -183268 -58167 -21516 -229672
16291b29672J63332M7425p4669L7984N909M55622J44152K69182l7895k34013k5257
$$ -229672 -66340 -18915 -93584 -55600 -49691 405931 550083 819265 781370 547357 522100
16280E22100M3021j50676K24717L35266J76750M7911l33477M144J24364l3292
$$ 522100 565121 414445 639162 974428 1151178 1199089 865612 869756 994120 960828
16270I60828J99589P7382J06134J91179j00590K94148M93077j33871j37381k43692
$$ 960828 1160417 1237799 1343933 1535112 1434522 1728670 2221747 2087876 1950495 1706803
16260A706803j68011K19187o3887M0608J90074K40175j92711O5729K31981K12345
$$ 1706803 1538792 1757979 1694092 1734700 1924774 2164949 1972238 2037967 2269948 2482293
16250B482293q5592m00051K6865K06974J48141L21824J1970q8556n8287j06192
$$ 2482293 2396701 1996650 2023515 2230489 2378630 2700454 2712424 2623868 2565581 2459389
16240B459389k05718K51537L37808l37634Q2123J1325l1823N44640k15622j6687
$$ 2459389 2253671 2505208 2843016 2505382 2587505 2598830 2567007 3111647 2896025 2879338
16230B879338K1657r8595L58289p4061J2966Q0057J04448L09904j1396j73265
$$ 2879338 2900995 2802400 3160689 3086628 3099594 3179651 3284099 3594003 3582607 3409342
16220C409342p007j31848l5965n3060J65826K34428M30665K03900l95047j40773
$$ 3409342 3402335 3270487 3234522 3181462 3347288 3581716 4012381 4216281 3821234 3680461
16210C680461k10672m4030J15775P3998P1512r0744L05567L40155J98211K5799
$$ 3680461 3469789 3425759 3541534 3615532 3687044 3596300 3901867 4242022 4440233 4466032
16200D466032O0880o6l4657J47435k55918k26109J32112K78960p7703J67624M25187
$$ 4466032 4526912 4526846 4492189 4639624 4383706 4157597 4289709 4568669 4490966 4658590 5083777
16189E083777k62322n35074M75411j29176K85062M6325N5311N13832k44842k91079
$$ 5083777 4821455 4286381 4761792 4632616 4917678 4964003 5019314 5533146 5288304 4997225
16179D997225n620j89738m0985j00346l15590K65567N77404k3824j63922j1786
$$ 4997225 4991605 4801867 4760882 4660536 4344946 4610513 5187917 5164093 5000171 4988385
16169D988385J3667L1712l73501K12281l9068o5527J46458j07585L44702L54954
$$ 4988385 5002052 5033764 4660263 4872544 4833476 4767949 4914407 4806822 5151524 5506478
16159E506478k90698Q9807j89231l41360q8911r2837L54436K60997j50830O4026
$$ 5506478 5215780 5305587 5116356 4774996 4686085 4593248 4947684 5208681 5057851 5121877
16149E121877p0656Q5245O8478O5648M63261J00218k99525j32372j21001K63861
$$ 5121877 5051221 5136466 5204944 5270592 5733853 5834071 5534546 5402174 5281173 5545034
16139E545034J31122r9622m06442O0577j842N02359R320k54225k09951M1490L18748
$$ 5545034 5676156 5576534 5170092 5230669 5228827 5731186 5740506 5486281 5276330 5317820 5636568
16128E636568K59977j26248K19775k69769j79414K04730k40898M4595K40059j07132
$$ 5636568 5896545 5770297 5990072 5720303 5540889 5745619 5504721 5549316 5789375 5682243
16118E682243k01745K47412l20016K59277M5888k16501N61123L07150p24770K46554
$$ 5682243 5480498 5727910 5407894 5667171 5713059 5496558 6057681 6364831 5640061 5886615
16108E886615j46271j21101L98021n9622J83575K47479j70589L439J72935j80767
$$ 5886615 5740344 5619243 6017264 5957642 6141217 6388696 6218107 6221546 6394481 6213714
16098F213714l92736J81042L24903J08375j98399j79063k62171L87485j63225
$$ 6213714 5820978 6002020 6326923 6435298 6236899 6057836 5795665 6183150 6019925
16089F019925j63206J21524n9587j50489j58961J8130L87050r9983n3937q0348
$$ 6019925 5856719 5978243 5918656 5768167 5609206 5627336 6014386 5914403 5860466 5780118
16079E780118M0021L34320j5289n19854J52691K68801j29002L12041p5063r9114
$$ 5780118 5820139 6154459 6139170 5619316 5772007 6040808 5911806 6223847 6148784 6049670
16069F049670j33337n49177J28902L86035O2264j02426N7833M7982Q9950R218
$$ 6049670 5916333 5367156 5496058 5882093 5944357 5841931 5899764 5947746 6037696 6046914
16059F046914l87646j27980o7839K21213j61886k0914K63972j44849Q6059L62124
$$ 6046914 5659268 5531288 5463449 5684662 5522776 5501862 5765834 5620985 5707044 6069168
16049F069168j61819K3236R1572p4512r4252K08039j5026J68392N0203n8520N3542
$$ 6069168 5907349 5930585 6022157 5947645 5853393 6061432 6046406 6214798 6265001 6206481 6260023
16038F260023j30090m20644r5668J50030K084L65620m6243J6762K29996r3224
$$ 6260023 6129933 5709289 5613621 5763651 5765735 6131355 6085112 6101874 6331870 6238646
16028F238646J17482k37856M29967l9202j71102j66299q6562L50507l18805m69576
$$ 6238646 6356128 6118272 6548239 6509037 6337935 6171636 6085074 6435581 6116776 5647200
16018E647200K36388P5894M26516L62972j16851j18664l6580n06750M08995K63097
$$ 5647200 5883588 5959482 6385998 6748970 6632119 6513455 6476875 5970125 6379120 6642217
16008F642217J15581j40579m79727j69096M3793J91353l31049L16691J77752K1240
$$ 6642217 6757798 6617219 6137492 5968396 6012189 6203542 5872493 6189184 6366936 6388176
15998F388176l50845P2479L87100l78633j98046k05468J31564L18864p9116K6004
$$ 6388176 6037331 6109810 6496910 6118277 5920231 5714763 5846327 6165191 6086075 6112079
15988F112079n8520r3169n0513m2695P559J97089l17756K43450q2748J21662J47745
$$ 6112079 6053559 5960390 5909877 5867182 5874741 6071830 5754074 5997524 5914776 6036438 6184183
15977F184183l03929L88092j54057l89814j26659J61524K65611N60515P1867m84603
$$ 6184183 5880254 6268346 6114289 5724475 5597816 5759340 6024951 6585466 6657333 6172730
15967F172730j51469l09561K55703K64654k20894N6760R5019N0134O3485P8429
$$ 6172730 6021261 5711700 5967403 6232057 6011163 6067923 6162942 6213076 6276561 6354990
15957F354990k75779l3064n5106l78144P79794J16983p7027j4486k41858R7302
$$ 6354990 6079211 6046147 5991041 5612897 6392691 6509674 6432647 6418161 6176303 6273605
15947F273605k27328k76985N05669L61125p4083K60737n33488k84377M28031j8240
$$ 6273605 6046277 5769292 6274961 6636086 6562003 6822740 6289252 6004875 6432906 6414666
15937F414666j34795j35226J12691k69094L95206R5484R2461M74282r73088l00212
$$ 6414666 6279871 6144645 6257336 5988242 6383448 6478932 6571393 7045675 6072587 5772375
15927E772375Q4154j68696K05556L40006q7207M389O6603k85618R9168j84864
$$ 5772375 5856529 5687833 5893389 6233395 6146188 6150577 6217180 5931562 6030730 5845866
15917E845866j25709J08827L6540M63043J38332J58363j31680l22970m73056q3228
$$ 5845866 5720157 5828984 5865524 6328567 6466899 6625262 6493582 6170612 5697556 5614328
15907E614328m4767K74632M46947l2885L52796k87936l74958J36997M4402K20833
$$ 5614328 5569561 5844193 6291140 6258255 6611051 6323115 5948157 6085154 6129556 6350389
15897F350389j12313l59542n4257o3432K33908K98628M1876m40838l51117j363
$$ 6350389 6238076 5878534 5824277 5760845 5994753 6293381 6335257 5894419 5543302 5541939
15887E541939O54174J77958L9327J76211l11880l2437l5037j41609K38748n0504
$$ 5541939 6196113 6374071 6413398 6589609 6277729 6245292 6210255 6068646 6307394 6256890
15877F256890J0602L2178J54557j29634K74280k95106l04266P0693j51697p6211
$$ 6256890 6267492 6299670 6454227 6324593 6598873 6303767 5999501 6070194 5918497 5842286
15867E842286L68851L82696O1234l32608m59136O4968J66435J95748K76995l47733
$$ 5842286 6211137 6593833 6655067 6322459 5863323 5928291 6094726 6290474 6567469 6219736
15857F219736L7451j78221P521L75287l898j89903l16382N6599L71780L20566
$$ 6219736 6257187 6078966 6086487 6461774 6457876 6267973 5951591 6008190 6379970 6700536
15847F700536j16896J34057l69806o07846J12279L64029K86691J92852l25776
$$ 6700536 6583640 6717697 6347891 5740045 5852324 6216353 6503044 6695896 6370120
15838F370120j74667M81245j50413l30312K19966k66732j97812k61620J38302
$$ 6370120 6195453 6676698 6526285 6195973 6415939 6149207 5951395 5689775 5828077
15829E828077K74964L79975k36233j61072j6504k4803j51169K39460J61908j46939
$$ 5828077 6103041 6483016 6246783 6085711 6069207 6044404 5893235 6132695 6294603 6147664
15819F147664r074j07761K11469K04477q0766j42253k72375j5176M6799O87609
$$ 6147664 6138590 6030829 6242298 6446775 6366009 6223756 5951381 5936205 5983004 6670613
15809F670613J29049k53315m91417r4016N1893J29354N7253K23577p7923j45616
$$ 6670613 6799662 6546347 6054930 5960914 6012807 6142161 6199414 6422991 6345068 6199452
15799F199452m509N7127L843J85552j06886P2526q1205n6657L57624m05142p2226
$$ 6199452 6194943 6252070 6255913 6441465 6334579 6407105 6325900 6269243 6626867 6221725 6149499
15788F149499K8945m21142L47899L79729o8166n6205j00488k7233J04757r600
$$ 6149499 6178444 5757302 6105201 6484930 6416764 6360559 6260071 6232838 6337595 6327995
15778F327995L0616q3413j90680M554K285K66316J2273J02176k52689q1039q9815
$$ 6327995 6358611 6275198 6084518 6089072 6091357 6357673 6369946 6472122 6219433 6138394 6048579
15767F048579O6547K17798l32177N70613j6140n56736J89457j73108R2991J50851
$$ 6048579 6115126 6332924 6000747 6571360 6555220 5998484 6187941 6014833 6107824 6258675
15757F258675j53460l07170K64001K27492J02519k84007j44968k5137K5039P9709
$$ 6258675 6105215 5798045 6062046 6289538 6392057 6108050 5963082 5937945 5962984 6042693
15747F042693K96204K81764m36744l45310L73202j38504K19683J90644k01122
$$ 6042693 6338897 6620661 6183917 5838607 6211809 6073305 6292988 6483632 6282510
15738F282510j97638J3884m3010R3299K90032k53412J2961K52966l16262Q3682
$$ 6282510 6084872 6098756 6055746 6149045 6439077 6185665 6198626 6451592 6135330 6219012
$$ [...]
##END NTUPLES=NMR SPECTRUM
##END=
